##TITLE=1H_DE-80H_X3
 200.13MHz, d2o
 8 sc
 
 19ns.26.2.2025
##JCAMPDX= 6.0         $$ Bruker NMR JCAMP-DX V2.0
##DATA TYPE= NMR FID
##DATA CLASS= NTUPLES
##ORIGIN= UXNMR, Bruker Analytische Messtechnik GmbH
##OWNER= pz
$$ XWIN-NMR		Version 3.5
$$ Fri Dec 19 10:50:08 2025 Russian Standard Time (UT+4h)  Yarkov@DPX200
##.OBSERVE FREQUENCY= 200.1313
##.OBSERVE NUCLEUS= ^1H
##.DELAY= (6, 6)
##.ACQUISITION MODE= SIMULTANEOUS
##.ACQUISITION SCHEME= undefined
##.AVERAGES= 8
##.DIGITISER RES= 18
##SPECTROMETER/DATA SYSTEM= spect
##.PULSE SEQUENCE= zg30
##.SOLVENT NAME= DMSO
##.SHIFT REFERENCE= (INTERNAL, DMSO, 0, 14.3821)
##AUDIT TRAIL= $$ (NUMBER, WHEN, WHO, WHERE, WHAT)
$$ ##TITLE= Audit trail, XWIN-NMR		Version 3.5
$$ ##JCAMPDX= 5.01
$$ ##ORIGIN= Bruker BioSpin GmbH
$$ ##OWNER= Yarkov
$$ C:/Bruker/XWIN-NMR/data/yarkov2/nmr/H-C/1/audita.txt
$$ ##AUDIT TRAIL=  $$ (NUMBER, WHEN, WHO, WHERE, WHAT)
(   1,<2025-12-19 10:49:28.51 +0400>,<Yarkov>,<DPX200>,
      <created by zg, POWCHK disabled, PULCHK disabled
       configuration hash MD5:
       00 E9 B6 7A A2 85 ED C7 34 08 36 98 17 FE 4E 26
       data hash MD5: 16K
       E9 73 32 F8 BE F3 CF 70 F4 67 A2 3A ED 2F 47 3B>)
$$ ##END=
$$ 
$$ hash MD5
$$ 28 D3 23 9B 55 9C 12 3A 26 9D A1 FD CE 7D D9 67
##$RELAX= 
##$RELAX= 
##$RELAX= 
##$RELAX= 
##$RELAX= 
##$RELAX= 
$$ Bruker specific parameters
$$ --------------------------
##$DU= <C:/Bruker/XWIN-NMR>
##$EXPNO= 1
##$NAME= <H-C>
##$PROCNO= 1
##$TYPE= <nmr>
##$USER= <yarkov2>
##$AMP= (0..31)
100 100 100 100 100 100 100 100 100 100 100 100 100 100 100 100 100 100 
100 100 100 100 100 100 100 100 100 100 100 100 100 100 
##$AQSEQ= 0
##$AQ_mod= 1
##$AUNM= <au_zg>
##$AUTOPOS= <>
##$BF1= 200.13
##$BF2= 200.13
##$BF3= 200.13
##$BF4= 200.13
##$BF5= 200.13
##$BF6= 200.13
##$BF7= 200.13
##$BF8= 200.13
##$BYTORDA= 1
##$CFDGTYP= 0
##$CFRGTYP= 5
##$CHEMSTR= <none>
##$CNST= (0..31)
1 1 145 1 1 1 1 1 1 1 1 1 1 1 1 1 1 1 1 1 1 1 1 1 1 1 1 1 1 1 1 1 
##$CPDPRG= <>
##$CPDPRG1= <>
##$CPDPRG2= <>
##$CPDPRG3= <>
##$CPDPRG4= <mlev>
##$CPDPRG5= <mlev>
##$CPDPRG6= <mlev>
##$CPDPRG7= <mlev>
##$CPDPRG8= <mlev>
##$CPDPRGB= <>
##$CPDPRGT= <>
##$D= (0..31)
0 0.7 0 0 0 0 0 0 0 0 0 0.03 0 0 0 0 0 0 0 0 0 0 0 0 0 0 0 0 0 0 0 0 
##$DATE= 1766126968
##$DBL= (0..7)
120 120 120 120 120 120 120 120 
##$DBP= (0..7)
150 150 150 150 150 150 150 150 
##$DBP07= 0
##$DBPNAM0= <>
##$DBPNAM1= <>
##$DBPNAM2= <>
##$DBPNAM3= <>
##$DBPNAM4= <>
##$DBPNAM5= <>
##$DBPNAM6= <>
##$DBPNAM7= <>
##$DBPOAL= (0..7)
0.5 0.5 0.5 0.5 0.5 0.5 0.5 0.5 
##$DBPOFFS= (0..7)
0 0 0 0 0 0 0 0 
##$DE= 6
##$DECBNUC= <off>
##$DECIM= 32
##$DECNUC= <off>
##$DECSTAT= 4
##$DIGMOD= 1
##$DIGTYP= 9
##$DL= (0..7)
0 120 120 120 120 120 120 120 
##$DP= (0..7)
150 150 150 150 150 150 150 150 
##$DP07= 0
##$DPNAME0= <>
##$DPNAME1= <>
##$DPNAME2= <>
##$DPNAME3= <>
##$DPNAME4= <>
##$DPNAME5= <>
##$DPNAME6= <>
##$DPNAME7= <>
##$DPOAL= (0..7)
0.5 0.5 0.5 0.5 0.5 0.5 0.5 0.5 
##$DPOFFS= (0..7)
0 0 0 0 0 0 0 0 
##$DQDMODE= 0
##$DR= 18
##$DS= 0
$$ [...]
##$SUBNAM2= <"">
##$SUBNAM3= <"">
##$SUBNAM4= <"">
##$SUBNAM5= <"">
##$SUBNAM6= <"">
##$SUBNAM7= <"">
##$SUBNAM8= <"">
##$SUBNAM9= <"">
##$SW= 18.0517328524113
##$SWIBOX= (0..15)
0 0 2 0 0 0 0 0 0 0 0 0 0 0 0 0 
##$SW_h= 3612.71676300578
##$TD= 16384
##$TD0= 1
##$TE= 0
##$TE2= 300
##$TE3= 300
##$TEG= 300
##$TL= (0..7)
0 120 120 120 120 120 120 120 
##$TP= (0..7)
150 150 150 150 150 150 150 150 
##$TP07= 0
##$TPNAME0= <>
##$TPNAME1= <>
##$TPNAME2= <>
##$TPNAME3= <>
##$TPNAME4= <>
##$TPNAME5= <>
##$TPNAME6= <>
##$TPNAME7= <>
##$TPOAL= (0..7)
0.5 0.5 0.5 0.5 0.5 0.5 0.5 0.5 
##$TPOFFS= (0..7)
0 0 0 0 0 0 0 0 
##$TUNHIN= 0
##$TUNHOUT= 0
##$TUNXOUT= 0
##$USERA1= <user>
##$USERA2= <user>
##$USERA3= <user>
##$USERA4= <user>
##$USERA5= <user>
##$V9= 5
##$VALIST= <valist>
##$VCLIST= <CCCCCCCCCCCCCCC>
##$VD= 0
##$VDLIST= <DDDDDDDDDDDDDDD>
##$VPLIST= <PPPPPPPPPPPPPPP>
##$VTLIST= <TTTTTTTTTTTTTTT>
##$WBST= 1024
##$WBSW= 4
##$XGAIN= (0..3)
0 0 0 0 
##$XL= 0
##$YL= 0
##$YMAX_a= 52582
##$YMIN_a= -32007
##$ZGOPTNS= <>
##$ZL1= 120
##$ZL2= 120
##$ZL3= 120
##$ZL4= 120
##$ABSF1= 10
##$ABSF2= 0
##$ABSG= 5
##$ABSL= 3
##$ALPHA= 0
##$AQORDER= 0
##$ASSFAC= 0
##$ASSFACI= 0
##$ASSFACX= 0
##$ASSWID= 0
##$AUNMP= <proc_1d>
##$AZFE= 0.1
##$AZFW= 0.1
##$BCFW= 1
##$BC_mod= 2
##$BYTORDP= 1
##$COROFFS= 0
##$CY= 83.5205535888672
##$DATMOD= 1
##$DC= 2
##$DFILT= <>
##$DTYPP= 0
##$F1P= 10.8118882576601
##$F2P= -7.23987719738617
##$FCOR= 0.5
##$FTSIZE= 0
##$FT_mod= 4
##$GAMMA= 1
##$GB= 0.15
##$INTBC= 1
##$INTSCL= 1
##$ISEN= 128
##$LB= 0.25
##$LEV0= 0
##$LPBIN= 0
##$MAXI= 10000
##$MC2= 0
##$MEAN= 0
##$ME_mod= 0
##$MI= 1.114404
##$NCOEF= 0
##$NC_proc= 0
##$NLEV= 6
##$NOISF1= 3.799351
##$NOISF2= 2.8
##$NSP= 1
##$NTH_PI= 0
##$NZP= 0
##$OFFSET= 14.38212
##$PC= 1
##$PHC0= -5306.755
##$PHC1= 10.82193
##$PH_mod= 1
##$PKNL= yes
##$PPARMOD= 0
##$PSCAL= 0
##$PSIGN= 0
##$REVERSE= no
##$SF= 200.129724274929
##$SI= 16384
##$SIGF1= 3
##$SIGF2= 2
##$SINO= 400
##$SIOLD= 16384
##$SREGLST= <1H.CDCl3>
##$SSB= 0
##$STSI= 0
##$STSR= 0
##$SW_p= 3205.1282051282
##$SYMM= 0
##$S_DEV= 0
##$TDeff= 0
##$TDoff= 0
##$TI= <>
##$TILT= no
##$TM1= 0
##$TM2= 0
##$TOPLEV= 0
##$USERP1= <user>
##$USERP2= <user>
##$USERP3= <user>
##$USERP4= <user>
##$USERP5= <user>
##$WDW= 1
##$XDIM= 8192
##$YMAX_p= 0
##$YMIN_p= 0
$$ End of Bruker specific parameters
$$ ---------------------------------
##NTUPLES= NMR FID
##VAR_NAME=  TIME,          FID/REAL,        FID/IMAG
##SYMBOL=    X,             R,               I
##VAR_TYPE=  INDEPENDENT,   DEPENDENT,       DEPENDENT
##VAR_FORM=  AFFN,          ASDF,            ASDF
##VAR_DIM=   8192,          8192,            8192
##UNITS=     SECONDS,       ARBITRARY UNITS, ARBITRARY UNITS
##FACTOR=    0.0002768,     1,               1
##FIRST=     0,             0,               0
##LAST=      2.2672688,     0,               0
##MIN=       0,             -32007,          0
##MAX=       2.2672688,     52582,           0
$$ Real data points
##PAGE= N=1
##DATA TABLE= (X++(R..R)), XYDATA
0@%%%%%%%%%%%%%%%%%%%%%%%%Mj2J6j6J6j6J6j6K0k8L2l2L6m4M8n2O0o8P5q3R2
45D8j00J12j27J39j51J66j83K01k21K44k71L00l30L68m11M58n16N87o74P83r22
66e00J112j386J778m174M0059j6738m9083l075J7010J5597j4716l579K3175L182
80H662n199N520n462R801J1835r044o250j1083m083K3067n982k8023N57Q238J077
95f369n533p691J4260L507j5056J2227J1006o925O426J586p54N920o029K126N097
110A3798j1067K058J939j2636K579K702m414m7r228M719J5507j3508p391J5276
124B87M296r39m537k0J3050o668r929J2869q12q084K179m614J008J015o365Q731
140A467M44j2108P118N315l121L339j967L632L367j1940M321R663q437r35q52
$$ y = [0, 0, 0, 0, 0, 0, 0, 0, 0, 0, 0, 0, 0, 0, 0, 0, 0, 0, 0, 0, 0, 0, 0, 0, 0, 4, -8, 8, -8, 8, -8, 8, -8, 12, -16, 16, -16, 20, -24, 24, -28, 32, -36, 39, -44, 48, -52, 60, -67, 72, -79, 87, -96, 105, -116, 128, -143, 157, -173, 195, -216, 242, -274, 313, -361, 422, -500, 612, -774, 1004, -3170, 36889, 20151, -28932, -32007, -14997, 600, -14116, -17695, 5480, 8662, 3463, 8983, 3521, 13322, 25157, 16113, 9863, -1220, -5303, 17764, 11782, -16241, -15684, -7446, -6369, -11902, -19593, -5333, -1826, -16882, -4655, 6351, -574, 5852, 7438, 6684, 12604, 6575, 8701, 13798, 2731, 4789, 6728, -5908, -3329, -627, -5041, -5088, -14316, -9597, 5910, -7598, -14989, 287, 4583, 3644, -893, -913, 12137, 5469, -4460, 8409, 7597, -487, 1692, -2922, -1914, -899, -7264, 1467, 1911, -10197, -3079, 2236, -885, 2454, 487, 4119, 7486, -4454, -133, 9530, 1093, 158, -694]
155f94n237O403j482l974M270n365K514P125q558K136Q630l364m42l592L72J3058
171A1800o377j1093O413O62P28J020q593K721L490l803N016m687n439J2947o3
186D742r378J301K334P938j167j4428O359R515o499j472j840N92O968o946k376
201d357P430n068J006M922o407J915K885j772L723n361j899R350o136m379P093
216B945k962j385k99k883P010k103p928P757J703m621K767j777L953L473q746
231c096K713N489n238L232m7n540L785j064l87K591p590K622P398q192j271M430
247a65m27L468m595l519R245k011m274L928k562K388K256o561L114J356m219N944
263C366j782n536N258q27j185J983m358M148K978q065K560L559k734L083l854
$$ y = [-694, -5931, 472, -1010, -4984, -714, -6079, -3565, 3560, -4998, -2862, 5768, 2404, 1962, -1630, -1258, 11800, 5423, -5670, 743, 1405, 2133, 3153, -5440, -2719, 771, -3032, 1984, -2703, -8142, 4805, 4742, -4636, -3335, -1001, 6937, 5770, -8658, -2299, 7216, 717, -755, -2595, -2003, 4965, -1981, -4357, 3073, -1995, -989, 3933, -2474, -559, 2326, 554, 4277, -1084, -2983, 6367, 231, -4148, 2945, -17, -1402, -1701, -4584, 2426, 323, -7605, 152, 1855, -2766, 1, -1776, 2177, 5650, -3096, -383, 5106, -132, 3100, 3053, -2487, 1298, 234, -153, 2438, -5152, -2530, 4868, -3324, -4595, -165, -592, 2876, -1719, -5238, 4007, 1996, -2278, 1650, -912, 1476, 3732, -2829, 285, 1641, -2578, 3366, 1584, -3952, 1306, 479, -706, 1277, -3081, 1067, 4045, -4020, -1460, 2099, -635, 2448, -1406]
278a406k600O961k683j499L497m539K131K069m975M123J325m034L301l473j628
293c430P279k839k019J918l929L760K128n374M043N81m061L333k517j21N914n337
309f71j836L453k676K880k76n155N280r6m063M143j698l49L832m923J328M179
325C352l844K364l17m345N600qm049K543k769O78L871n890O51M318m288R61m42
342a614j033O188l146m293N060o82L75K621m792J507K221m155L558k97l224M070
358B364l186l440M954p80J031N78o358L365M117l747K184K6k130L473l733n04
374a786O047l749j491J519l772L262J975l885K539j808k024N230k424q13M118
389B938l378l8J783k925M637L45o105K723N56j139K584l680L15L409m905J104
$$ y = [-1406, -4006, 2955, 272, -1227, 2270, -2269, -138, 1931, -3044, 1079, 2404, -1630, 1671, -1802, -3430, 3849, 1010, -1009, 909, -3020, 740, 2868, -2506, 1537, 2118, -1943, 1390, -1127, -1248, 4666, -671, -2507, 946, -1730, 1150, 874, -4281, 999, 903, -3160, 983, -715, -1064, 2768, -2155, -827, 3352, -492, 1872, 1555, -2790, 2810, 2802, -1247, 1296, -1473, -795, 3076, -2814, -2163, 2155, -2133, -1172, -1614, -2647, 3541, 395, -3898, 1162, 480, 855, 3476, -1316, 191, 2412, -1743, 1815, 1518, -1706, 2364, -822, -4262, 692, -88, 943, 1521, -4837, -1472, 2645, -1102, 1082, 1108, -1022, 2451, -1282, -1786, 4261, 512, -979, 540, -3232, 30, 2005, -1880, 659, -1149, -3173, 2057, -367, -1180, 2938, -440, -478, 1305, -1620, 3017, 3362, -2743, -20, 536, -603, 1981, -1699, -1384, 2025, -2880, -1776]
405a776L299l223K543j93l664M102m34j074L439m082l04L786k900J188K93l507
421b507M196o79m153M429o10k143K495k735J549K511m272K144J262l631L272l69
437G59k312L587l134j302M590k884j95K034l125K525Q17k757L280j767j740M622
453B998k855j731L629k387O71N93m113L269J598l593J583j092j07M096l573o90
469a704L615k607J802J177m206L006J435l011J345k130q7M425m145j396K703k149
485a927K329L71l789L811M88l007L444r78r08K625k582O89J381l934K911R77m469
502b568K004j98j485L300k382p22L379k891N58L006k116J500o69j626M134j927
518A297l012M271j661k126J334k148K203R60m518K122J242j986K716r31p13K881
$$ y = [-1776, 1523, -1700, 843, 650, -3014, 1088, 654, -420, 3019, -1063, -1367, 2419, -481, 707, 1000, -2507, 1689, 1010, -3143, 1286, 676, -1467, 1028, -1707, -158, 2353, -1919, 225, 1487, -2144, 1128, 759, -1553, 2034, -1100, -2402, 2188, -696, -891, 1143, -1982, 543, 1360, -1397, 1883, 116, -1624, 2998, 143, -1588, 2041, -346, 325, 918, -3195, 74, 1672, -1921, -338, -1430, -1537, 2559, -1014, -1704, 1911, -696, 1106, 2283, -1923, 1083, 2518, -493, 852, -1278, -1365, 3060, -1085, -2481, 222, -1927, 402, 773, -3016, 795, 1283, -1724, 1720, 742, -166, 2459, -123, 566, 1947, -1987, 924, 1901, -2568, -564, -762, -2247, 1053, -1329, -2051, 1328, -1563, -1005, 2001, -115, 1385, 716, -910, 3224, 1297, -1715, 2556, 895, -1231, 103, -2045, 158, 1118, -3400, -1278, -36, -2022, 694, -237, -950, 1931]
534A931k972P75M059l651j19J995k299J654r09k127K969j940j395L053k891R2
550a775K750k738J802Q88l129L446N93k332K016j414M99J823l846P42K585l152
566a242J447j97l485L514R01k341J520j537Q87K778l087R57J773k477K279m32
582A258l039L236n10k281K276k294k70K547j743J94J66j583L740m91l720L637
598A123J60j364J871k318K85K369k827O98R23k434J666p01r85L190k851j092M023
615A736k356l19K382j703J070J43k272K933m18j964K102k197k89K786k903N48
631g21J455l199K108J649k410J183k07m08K533k311Q8K686l108M83J578k199J841
648A041l92l067K782l16j528J973j485q5J458j961K187J090l163K362O7k101K787
$$ y = [1931, -1041, -266, 3793, 142, 23, 2018, -281, 1373, 464, -1663, 1306, -634, -2029, 1024, -1867, -1775, 975, -1763, 39, 927, -2202, 1244, 1837, -495, 1521, 107, 606, 2429, -1417, -675, 1910, -1242, 205, 8, -3477, 37, 938, -1403, 117, -1420, -533, 2245, -842, 115, 1888, -589, 1690, 1258, -1781, 1455, 945, -1336, 940, -1354, -1624, 923, -820, -626, -460, -2043, 1697, 1206, -2514, 1123, 1283, -81, 1790, -528, -243, 2126, -701, -3, 920, -1514, 152, -549, -1534, 1656, -1195, -2287, 1736, -620, -939, 1443, -260, 810, 953, -1319, 1614, 1196, -768, 1334, -863, -1152, 1634, -1269, -721, 734, -2465, -357, 1292, -1118, 65, -142, -550, 1983, -328, -240, 2446, -662, -179, 1399, -800, 1041, 649, -2418, 364, 48, -1480, 493, -992, -1077, 381, -1580, 607, 1697, -1466, 896, 963, -1138, 1649]
665A649o59j376J564k249N69K181k678O83N37j949K021p09j128L217k014j423
681a764L014j438K07J519k067J333r5j975K779q25j945K260j488l73J723k292
697a427J189J509l028J462J183j829J853q54o24J925k083K23K507k543K12J238
713I13j759J437l42j733K410j001j361K324j374J00J170k101J573Q55k583K101
729F29K92j962J850q37m64J943k293M57J909k622J064Q59k106J841m70j292K373
746A171j652n98K331j709J25J150j915J763J09k243K590m97j679K022j044l49
762d25J386k024R85J128k434J636J93j775J912q15p55K286j916k76K192j887O71
779H2R36j773J527m37j415K414j319j080K068j467p4J437j844R89N38k117K025
$$ y = [1649, 990, -386, 1178, -1071, -502, 1679, -999, -316, 221, -1728, 293, -416, -1544, 1673, -341, -1764, 1250, -188, 19, 1538, -529, 804, 709, -1266, 1513, 688, -1257, 1003, -485, -858, 865, -1427, -238, 1271, -1757, -295, 888, -941, 912, 58, -566, 1359, -724, -501, 2006, -537, -325, 913, -846, 591, 249, -1484, 926, -75, -1436, 888, -486, -386, 784, -1317, 256, 1111, -1472, 629, 921, -1041, 809, -28, -492, 1451, -842, -385, 1524, -1098, -34, 825, -1281, 560, 90, -1202, 1171, -481, -1079, 1252, -457, -332, 818, -1097, 666, 775, -1468, 1122, 625, -1054, 968, -76, -425, 961, -1063, -78, 1050, -1384, 252, 445, -1330, 582, -233, -988, 1298, -618, -894, 1298, -589, 82, 1018, -755, 772, 335, -1080, 1334, 15, -1065, 1003, -464, -538, 899, -945, 44, 582, -1535, 490]
796D90J65j629J780r77j65J745k139O34J647k450R36P30j594J556p46j119K082
813I46j608m50K141j676K16J064j899J672J82j718K303o53j425J868j018N7J041
830A043j955J104P02k408J633N41j594J360j018l62K096j662j20J825k016N63
846b68J016j396J647o75j341K168j096q29J859j416k1J016j747J308M03j979J877
863E26r2j486J683p50l3J406k235P31J623k153R29M62j308J457q03r41K112j393
881b65m26J726j728M97P40j535J482j03j607J950m66j171J672j017P7J103j958
898a029J100Q66k040J280L86j487J583r26m30J745j602q6J424j564P85M94j404
915i05J529m62j139K123j214p72J885j505K79J080j582J182J04j746J747k84j062
$$ y = [490, 655, -974, 806, -171, -336, 1409, -730, -96, 1551, -899, 37, 767, -827, 729, -17, -1136, 946, -662, -1112, 1029, -647, -431, 633, -1266, 406, 588, -1130, 1173, 520, -905, 963, -55, 2, 1043, -912, 192, 894, -1514, 119, 660, -934, 426, -592, -954, 1142, -520, -640, 1185, -831, -268, 748, -648, 999, 324, -1017, 1151, 55, -774, 1085, -331, -352, 664, -1083, 225, 628, -1351, 526, 434, -1052, 631, -119, -152, 1254, -981, -250, 1373, -780, 149, 611, -697, 760, -43, -984, 1128, -265, -691, 1035, -693, -196, 544, -991, 491, 388, -1219, 731, 265, -906, 766, -251, -174, 929, -1029, 71, 937, -1103, 177, 563, -924, 659, -267, -697, 1048, -554, -640, 784, -780, 5, 499, -905, 624, 162, -977, 1146, -68, -840, 1045, -460, -181, 899, -683, 499, 603, -1143, 604, 320, -742]
932g42J536j343l8J534j771O06J105j832J002N08j325J515o55q22J979j607k71
949f21J771j595L79O21j523J322J36j414J592o32q46J451j000K07J004j998J246
966A00Q90k012J198L33j008J290j013m88J714j403J71R81j520Q46N42j495J569
983F95n10j210J909r82q36J537r85M45L79j593J397N12j803J560k89r80J623j036
1001a67k02J272j426K59J081j367R40j00j148J501r34m72J922j505l98J444j269
1018e69N27O36j219Q89o8j128J914o58q19J191j201L62J074j707Q02O78j829J182
1036E7L02r59R80p63j37J368j588N82J258j656N71M54r00J259o24q71J417r21
1054a71m17J151r31K91M31j428J484P1j674J596k9j135J277p69O6J012j226N73
$$ y = [-742, 794, -549, -587, 947, -824, -218, 887, -945, 57, 565, -760, 755, 100, -722, 1257, -350, -621, 1150, -445, -66, 555, -968, 354, 490, -924, 668, 36, -810, 641, -359, -152, 852, -1146, 100, 990, -1022, 176, 509, -499, 791, -222, -710, 1004, -399, -228, 753, -767, 79, 621, -874, 695, 185, -1025, 884, -98, -934, 603, -382, 63, 442, -1151, 246, 758, -1045, 515, 226, -754, 869, -167, -369, 903, -523, -264, 817, -550, 390, 290, -858, 643, -291, -763, 1159, -346, -744, 700, -569, -42, 594, -625, 264, 196, -932, 982, 324, -495, 696, -505, -143, 931, -776, 26, 704, -1125, 57, 359, -600, 380, -383, -520, 848, -740, -158, 1100, -556, 15, 469, -431, 828, 204, -667, 750, -171, -588, 563, -368, -77, 354, -1074, 410, 481, -1193, 403, 374, -761, 516, -253, -187, 825, -401, 172]
1072A72O44j419R04O4r51J241q59o13J646j220l92J234r23L09M95j201J588j82
1090E37j358J432n93m84J487j221m0R82j334O73N63j351Q95l23n85J348j026k24
1108f22J511j517Q7J231j123O64L09j199J130j76n67J241j168l72J144j290P52
1125C5O14j573Q56M22j271J133p7o11Q87q56K18J113j462O03O78j260R99M7j240
1144g45J171l20o74J164q40k55P76q69P80K04j287J386l01j073J587l94o93R19
1162E36q69J56R67j264N08L20j209J252j64q00J287j100l70J480j024j32J004
1179E78j007N48J02o65J123n50o74J373j047k06J166j163K55P22j311R88J85j074
1197f57R67m31l31Q79q86K18R84j398P01P44j229N00K42p40Q59m94m00J093q79
$$ y = [172, 816, -603, 301, 365, -586, 655, -204, -817, 829, -391, -783, 451, -472, -163, 332, -869, 719, 537, -821, 611, 18, -466, 1021, -200, -240, 742, -592, 81, 644, -707, 188, -135, -720, 628, -398, -622, 889, -628, -541, 690, -433, 231, 540, -659, 471, 295, -272, 969, -199, -571, 573, -717, 35, 649, -924, -68, 354, -917, 216, 139, -472, 415, -441, -223, 890, -572, 31, 709, -551, 448, 495, -745, 426, 106, -568, 596, -244, -499, 277, -592, 188, 392, -895, 491, 190, -883, 704, 310, -383, 536, -333, -177, 790, -474, 34, 354, -855, 397, 233, -567, 720, -380, -750, 730, -294, -426, 578, -429, 119, 221, -444, 679, 129, -545, 828, -219, -425, 741, -422, -167, 555, -756, 232, 417, -657, 310, -121, -452, 427, -459, -241, 743, -655, 46, 790, -439, 61, 303, -437, 422, -72, -472, 621, -258]
1216b58j9Q19r93M66L18j232J333j20j134J313l09n97R39p04J68O42j311Q84K93
1235D98j133R04k19n69J002p49k78J056r78R6P90q25O14J04q03R33l67n08J188
1254G56p52k52P36q03L84L24j100Q02K27j077R78k38m18Q61q88J93J045j076K51
1273d7O37j036P45o7o25R51n30n64J127j021Q5P71r17N46K63r54J022r8q44R97
1293D41m28k34P71q43K84O38j091N63M13j060O60j34m28Q99p90j20J001q20M1
1312b37O66q16M73K04p34R10l06o55R66n09k03N40p62M30N11j263Q44L49j025
1331f17Q89l69j85R42p98P4O39r90N28L85q51O92l36m58Q31m89l17R39p95m1N68
1352B41p16P16J05r94Q94m6o15Q56m83k47P25q53L18N87r69M97K87p33O50k94
$$ y = [-258, -277, 542, -451, 15, 333, -899, 434, 314, -820, 493, 184, -413, 526, -178, -10, 632, -679, 205, 498, -635, 269, 50, -519, 483, -266, -544, 512, -466, -370, 420, -405, 209, 313, -490, 443, 76, -432, 756, 4, -248, 488, -315, 69, 393, -707, 95, 322, -755, 223, -15, -433, 428, -460, -267, 778, -298, -47, 590, -446, 299, 232, -393, 558, 28, -536, 591, -430, -345, 426, -491, 55, 318, -636, 386, 288, -556, 441, 13, -221, 550, -293, -9, 629, -462, 101, 514, -546, 114, -20, -448, 451, -339, -459, 542, -278, -237, 429, -387, 86, 290, -444, 466, 160, -495, 471, -38, -241, 299, -463, -33, 478, -785, 59, 408, -617, 272, -97, -282, 660, -138, -64, 575, -415, 113, 498, -353, 339, 3, -455, 376, -113, -430, 509, -286, -327, 241, -475, 241, 346, -648, 246, 200, -415, 441, -42, -289, 436, -417, -99, 488, -481, 16, 303, -430, 220, -74]
1372g4l86Q87o78n1Q32p84L01L63p05L93P5m78P59m50l13O77n27k2N89q42L70
1393f4L45q39Q06J8p10Q85l43l58P58p04J21N97q84L48L70p83O06n8m31O77n24
1414a67k67P73m77k2M16n93M08J63o13P67k42n55P96m54j70O10p68L19N40r97
1434e33N86L04p51N42r2l66O79n36j20Q44p70M3O57q61N88m5n74O93j74o31Q66
1455C49l49k22N24o49L50K69q67Q21J1o12N30j56k08O48p02K54M17p45M49J92
1475C04n80N93l66l46Q42n28j64N32m41M4K87m67M23J05o17O51r2m70O28k54k13
1496a29M16n55J52M12n67L51N9n28O34l61J7N30o13m1O73o98K06L25n38M08j19
1517C4l78P79l51l12L86l03J36L60o70L54K91p97N10J46m24L38j90j80O09m41
$$ y = [-74, -460, 427, -251, -302, 530, -254, 47, 410, -295, 98, 173, -305, 454, 4, -309, 368, -159, -181, 408, -434, -64, 281, -558, 248, 266, -444, 441, 98, -260, 498, -206, -85, 512, -372, -24, 346, -437, 169, 111, -320, 357, -167, -434, 339, -138, -160, 256, -337, 71, 234, -379, 388, 146, -409, 387, -67, -237, 373, -395, -76, 464, -533, 53, 357, -394, 148, 56, -310, 369, -167, -287, 557, -213, -170, 487, -374, 214, 169, -405, 288, 114, -517, 349, 0, -222, 302, -347, 3, 272, -595, 226, 237, -375, 155, -1, -209, 439, -263, -9, 408, -337, 112, 304, -276, 317, -49, -395, 447, -81, -245, 287, -154, -110, 177, -290, 133, 238, -379, 272, 180, -290, 338, 84, -129, 287, -268, -116, 296, -271, 80, 139, -389, 245, -116, -99, 431, -182, -223, 450, -248, -42, 283, -255, 153, 34, -344, 435, 84, -228, 158, -145, -9, 351, -319, 35, 326, -471, 39, 185, -239, 99, -91, -271, 338, -103]
1537a03J15L13n82L27K29n82M23o1m03N69k66j54L36k16J0K29m79M70l5n56O21
1558B05j07m09N01j76k53L26l35L07J77n57M60j21l09N92l22k55N87m61q7O20
1578C83n66J22K33l55K44L6l74N65m33j65O78m66n3M39o52M29K16m99K95j4k87
1599b24L84j45j53M73o33L05L51o77K85K45n25L25J22k94N19m97r3M34k19Q6K50
1620C19n69L61M5n44N40J62n59N33m15j30M97n40K90J83n27M66R9m65K56O7k16
1641a47M39k75k70N06l09QJ67k21L00j70l68N20j63k46N19n29Q0L83m27J80J15
1662I2l18L55J6l56M60m28M4M51m49j3M31n18K73R1k96K92k40j31M92k03k48M40
1684B37l51K06J90n71L60R7m30M12j44j24K75k84q3M78n54K53M03o70K08K38k75
$$ y = [-103, 12, 325, -257, 70, 299, -283, 140, 79, -324, 245, -21, -175, 161, -55, -45, 184, -295, 175, 140, -416, 205, 98, -311, 190, 14, -239, 87, -248, 59, 236, -321, 139, 18, -291, 301, -21, -276, 311, -150, -237, 383, -183, -61, 172, -183, 61, 97, -277, 288, -145, -310, 368, -98, -151, 288, -364, 65, 281, -218, 77, 63, -224, 160, 15, -138, 335, -298, 7, 358, -319, -34, 211, -314, 11, 133, -161, 358, -139, -232, 202, -17, 69, 319, -250, 111, 156, -388, 152, 314, -245, 288, -127, -257, 240, -300, -10, 173, -354, 112, 211, -254, 2, 69, -147, 292, 17, -253, 253, -56, -48, 119, -102, 198, 28, -340, 180, 17, -229, 290, -239, -159, 224, -203, -23, 92, -226, 129, 145, -211, 249, -179, -135, 316, -133, -146, 285, -233, 40, 131, -165, 127, -113, -244, 248, 45, -203, 237, -114, 92, 282, -289, 71, 168, -262, 150, 6, -118, 157, -127, -210, 268, -286, -33, 370, -300, -92, 146, -129]
1705a29L01m1k15K93l22N1K58m15K17J67l76M16q4l52L69j38k96N38l64K0K94
1726A92l36K54M7l79M12Pm37M10p3j62L24l82J8L22l37K30n5k20L34j21k65M99
1748B82k29j90M27m26J06K52m22L60j29l86N04j86j98L62k19j1K56l98K08L19
1768B82m67K71J29m10M02j88j92L21k11N1J98l33J66J50l78K58M8l11N01k89k54
1789b56M52l20P8J10k71L29J68n13K95kk21J37j75P3L48l27n0K98l29K37R2j51
1811BJ49j12k24L99k16j34L83l40K0J21k49K55N1m42M57M1m34M22m23J70L03l30
1833a31L6L90n38L94j8j88J67j13j07K14k60N3L25m25J75R8j98K54q2l13M76j22
1855H7l24L77k73J68J74l55J21J37l01K63k8l60L86o4j63K95k79J33K23m24L27
$$ y = [-129, 172, 131, -84, 209, -113, -62, 196, -219, -2, 165, -211, 205, 121, -231, 138, 0, -296, 242, -122, -102, 192, -144, 110, 157, -222, 190, 197, -240, 170, 97, -65, 259, -123, -105, 217, -120, 110, 55, -165, 169, 48, -217, 282, 53, -137, 290, -136, -30, 222, -200, 160, 31, -355, 149, -37, -235, 127, -92, -103, 153, -245, -37, 282, -185, 86, 215, -195, 207, 19, -173, 148, -63, -12, 186, -147, 19, 169, -209, 49, 97, -214, 287, -2, -256, 196, -124, -46, 64, -207, 122, 290, -223, 72, 70, -151, -14, -189, -116, 232, -95, -145, 153, -176, 61, 153, 2, 151, 39, -185, 214, -2, -136, 247, -93, -73, 48, -201, 54, 105, -337, 120, 161, -273, 149, -274, -104, 199, -131, -95, 295, -243, 151, 133, -55, 112, -1, -108, 106, -154, -101, 224, -201, -26, 72, -126, 128, 46, -267, 209, 87, -237, 140, -133, 35, 209, -146, -25, 112, -189, 74, 46, -314, 72, 8, -155, 140, -139, -6, 217, -207, 120]
1876A20q1j98K95n5k14L62j17j99K10k12J01R8l88L80J01l28K51k1l04M23l49
1897a25O7J60k04J30J70l57K66R3l61K26j49j35M63l09k7K46j78Rn1j53L10m8
1919D3k45K70l1k8J95l39J30K78k99N1P3k50J44N0j01M8M8k1J09k72J29K03k41
1942e6J84j71pK38j33l44L73m3j33K54k30PL56m63J48O4k17L09p7k32L41j86p6
1965i4J80k59K08K52m57K13K3k71M15l43J2L13k92j56K80k20K51l3j14K33m4k11
1987a14J99k05R4K70k30o9J77l16K99J08l36j6R9j13K99k45L8L23k26j52L27l93
2009a82K48N0k78K50J25l17J74j70N3J92l15J99Q2k58J98R5k19K09r2j67J09j11
2031a25O2K22l78J70J57k18K38j00j19K87j64k37K35j54J19J63l18K12Q5l12K35
$$ y = [120, 39, -159, 136, 81, -133, 229, 112, -87, 123, -89, 12, 110, -278, 102, 203, -125, 126, 105, -199, 224, -125, -58, 102, -102, 28, 198, -159, 107, 200, -161, 65, -84, -219, 244, -65, -92, 154, -24, -15, -66, -219, 91, 43, -202, 68, 37, 9, 204, -135, -5, 273, -26, 25, 98, -152, -8, 42, -59, -11, 37, 16, 125, -147, -18, 185, -56, 128, -43, -50, 188, 55, -289, 84, 41, -92, 162, -68, -61, 295, -168, -20, 44, -173, 136, 59, -173, 168, -18, -94, 86, -173, 35, 287, -170, 43, 66, -205, 210, -133, -121, 192, -100, -256, 24, -196, 55, 22, -92, 141, 97, -114, 85, -120, -26, 244, 14, -55, 122, -194, 105, 213, -123, -139, -40, -153, 146, -99, -61, 262, 36, -116, 211, -182, 66, 116, -162, 88, 213, -104, 70, -100, -47, 145, -170, 29, 111, -147, 51, 146, -73, 136, 44, -123, -14, -125, -63, 159, -219, -49, 108, -110, 128, 28, -91, 196, 32, -205, 30, -124, -5, 158, -160, 52, 137, -175, 60]
2052F0n0j35L38j85j19K04k62J72M7l05K57J11k01J00P7j45J75j64j38L37j35
2073C9j1Lj71K60Rj85J28m9j10L21m31PL30k59m7K61k49K18l5j63J82L0j68K12
2097A22k31M0K85l93K12j5j66K43n1r0Q5K0r6P2k07J15N1l6N8m9r9K70j40p0N9
2122a1J9q0K53l62K33J51l40J29J21k71J55r0j11L73k50l2K54j50oK45k41J08
2144I7p1q3K40k42p5K13L9j31P7j20Q9J31k51J85O0k60J71j00j04K67j42PM7j74
2168a30J66K7k08J44M9k00L36k36l4K82j81j06J40k9oJ03j62J04l2k5Q4j05J1
2191hJ22k30K8J58n9N0Pj34J63K6l09L50r7j45P6K3l3Q6j73J76j56J2J53j50j60
2216b24K70n1j1J6j12O0O4r2R1J21k91J75Qj45J46j36Q7J84k51K6J31r0o8J52
$$ y = [60, 10, -125, 213, 28, -91, 113, -149, 23, 70, -235, 22, 133, -68, 32, 109, -36, 139, -25, -163, 174, 39, 28, 31, -140, 120, 129, -56, 72, 23, -87, 234, -197, -190, 140, -119, -166, 95, -154, 64, 29, -134, 48, 78, -90, 122, -109, -69, 216, -177, 35, 20, -146, 97, 46, -44, 41, 61, -35, 37, -170, -55, -4, -40, 18, -31, -130, 140, 0, -70, -11, 8, -72, 181, -181, 52, 203, -137, -8, 113, -158, -3, -93, -204, 169, -81, -113, 141, -9, -15, 230, -11, 97, 26, -57, 183, -59, -134, 79, 118, -13, 64, -56, 33, 164, -87, 98, 158, -102, 69, -31, -135, 132, -10, -3, 44, -130, 36, 63, -145, -1, 48, -152, 184, -52, -86, 196, 15, -91, 49, 20, 14, 117, -45, 59, 27, 2, 86, -19, -8, 114, -116, -88, 70, 11, 61, 68, -66, 97, 123, -186, 164, 67, -78, -2, 21, -12, 74, -99, 77, -79, -67, 86, -64, -224, 46, -5, -16, 0, -112, -52, 12, -80, 11, 132, -159, 16, 24, -121, 25, -111, -24, 160, -91, -65, 66, -24, -92, 60]
2240F0j10J69j08j29K57j38L0P8j03n2K1j11P1J02j91K51j27r3J41r0N3N1j29
2263i7R1P1j14K8J9o1J22Po0J14j39JQ9k21J94j8k20K63j04p3J22m2J44j78pJ1
2289e8K13j10PK1j23j9J27o1R5k59l4L23k22j2J02l3N1K3p4J18l7mO8o3q3J42
2315I8p8p4J78k38J31N4r7o4K11j73K31j46l2J30k29J51K1p3N3l6j19K46j83k8
2339f6R6j59K38p1j67J55k6k04J58L2m4K6q7J75N1j42l5K03k24n7K35k87K89k9
2363F0k60J62K4O9J18k10K4M4j41J51M6k48J96Q7k56K58j33q9J56j18J0K9m5J03
2387C7l3j73O0J13nJ01k00Q3P7l0q1M4j46J97j31l1Q8J11j25J65p1j05J09j53
2411i9J03L9j33N3J1P4j7j2j17L5N0M6K9o2k8J20j07N1n5o6P4j2j09L00k18J10
$$ y = [60, -50, 119, 11, -118, 139, 1, 31, 109, 6, -46, -25, -136, -65, 37, -154, 97, -30, -123, 18, -72, -19, 32, -97, -6, 65, -49, -21, -2, -63, 59, 66, 6, 120, -19, -18, 71, -150, 44, 26, -194, 69, -35, -108, 14, -28, 116, -62, -69, -58, 155, 45, 52, 73, -50, -69, 58, -3, 92, -167, -201, 122, -100, -112, -10, -43, 8, 31, -43, 75, 38, 34, 102, 39, -44, 98, 20, -54, 124, -114, 17, 71, -26, -90, 121, -52, 179, 33, 1, 131, -98, 53, 74, 1, 54, 18, -101, 145, -38, -66, 30, -129, 109, 38, -129, 26, 0, -204, -46, -14, -58, -32, -119, 56, 107, -35, -70, 133, -91, -148, 87, -200, 89, 60, -200, -38, -14, 55, 173, -37, -13, 31, -110, 41, 87, -161, 35, 122, -134, 124, -9, -98, 58, -60, -50, -21, -66, 37, 4, -169, -109, 4, -1, 100, -100, -17, 60, 30, -51, -7, -153, 44, -87, -118, -30, 81, -44, 121, 50, -55, 54, -99, 4, 43, -90, -37, -26, 48, 31, 19, -98, -63, -13, 33, 62, 0, -28, 92, -15, 36, -19, -85, -11, -23, -132, 168, -50, 60]
2437F0M2j33mQ0k4N8j25j17K35j29K8m3J1m2J25mk8J8%p6P1K6J41j57n8J1o3P3
2465b4M8l6M2m6M1J10p0j57J33J9j08J87o3K4R4l32J51K4k1J58j82Q4j47J8l4
2490h7J69j38l8J79p6J30m7k12J66J3j26J12kM8n7n4lN1p0Q7Mq8J17j18O9J4r0
2517d7J1J63j93m9J91j09J22p0l5km0K0O2M%L2n9o7J61j68M6L4m1J00j18k1J85
2544A12k04N7R8Ln9P4j92J49n8k5P6o9N4J35k23J62o5j10j1M8p5J53k4j82K06
2569C0o8j2J96j75N6oo2J16K6j50l8k1M1J82j85J6N5Kl1j9N1j3O6l1%o4L1L2J34
2598A59j72Lo7Q2n5LJ15k6q3R9m1R3J9k67J40N3j00k3j9N5K3J48k18P4L8n6J08
2625H5o2J48j74mP1m1r9O6J29r4lK2n6L5Q3j09J50j81M8P2j40r7R0J8K8k6o3M7
$$ y = [60, 102, -31, -35, 45, 21, 79, -46, -163, 72, -57, -29, -72, -61, -103, 22, 18, -10, 8, 8, -68, 3, 29, 170, 13, -45, -34, -97, -24, 24, -12, 30, -16, 25, 135, 65, -92, 41, 60, -48, 139, 76, 100, 194, -138, 13, 37, 16, 174, -8, 76, -71, -53, -87, 82, -56, -94, 85, 9, 139, 92, -120, 46, 59, -67, 45, 43, 91, 34, -20, -23, 28, -42, 45, 49, -39, 78, -40, 29, 43, -47, -36, 127, -66, -115, 76, -33, 89, 19, -16, -18, -58, -38, 24, 28, 28, 60, 1, -66, 95, -73, -27, 7, -34, 66, -52, -73, 112, -92, -35, 63, 66, 7, 81, -111, 38, -20, -45, 31, -38, 16, 151, -72, 90, 25, -85, -96, -48, -123, 30, 6, -176, 30, -38, -50, 146, -29, 27, 21, -41, 75, 101, -49, -87, -108, -67, 115, -70, -54, 1, 3, -28, -47, 4, -9, 57, 26, 26, -38, -7, 25, 159, -13, -10, -77, 5, -50, -47, 68, 42, -41, 58, 17, 110, 129, -138, 2, 55, -45, -68, -87, -32, -9, 139, -79, -5, 33, -23, 85, 23, 171, -3, -7, 64, 23, -76, -10, 119, 25, 22, 44, -12, 23, 106, -3, 147, -34, 14, 86, -54, -151, -61, -43, -15, -41, -104, -57]
2653e7Q2j31J10NLll7K8J7K4J4j2r7K02j43k1M3NR8j62q9K13j11qR3k6j09L0O
2682c3q4J64q6p5J03j68K44qp4n6j08J09J93j86L8Q3j17J7M2O3n2l1l3Rp1N6J92
2709A31j85O7k4J0M4l3q5J64j60N4m1N0L1P1q8j9R7j07N2K1j02R0p0j3R7j04N0
2736bk2O4l6oP4Mm3j02J17r2k2Q5j23N6J00j6q7l6J41j7l2l8N9m9M7J15k30J24
2764C3p9J0J18j56j8J37o5j03J71Qj31M5MJ9R0l5j06J52j80R7N8k6k3r0J5O4j46
2791a37J32j6m0J53p9Jj01J7R6M9q7N8m0jO2o6j84J57Q1j13QP5LJ7m9j4M3o5l6
2820g6O7LK02m0j24Kk7k7Q5m4L4l6j26K47o8j00k0K04k36J05Ro9P4r0O3l9N0j18
2848i5P8J31o4k1l1L1J30j90l9P6M4K6p8J00j13j36K53j60o9K10j25Q7J02k05
$$ y = [-57, 25, -106, 4, 9, 12, 9, -28, 0, 17, 41, 55, 43, -54, 148, 5, -16, 27, 32, 130, -32, -121, 92, -19, -27, 66, 40, -69, -39, -33, -117, 47, -39, -114, -11, -179, 65, 57, -17, -73, -181, -72, 121, -65, -27, 56, -61, -44, -2, 61, 9, -22, -55, -46, -117, -61, 131, -54, 13, -11, -1, 43, 10, -75, 89, -71, -17, -58, -8, 23, 94, 6, -13, 84, -23, 29, 50, -52, 38, -32, -45, 52, -52, -2, -24, 40, 4, -2, 72, 76, 33, -69, 48, -44, -66, 19, -104, -48, 52, 36, -51, -87, 54, 37, 5, -33, 26, -23, 24, 139, -91, 33, -46, -36, 82, -74, -92, 45, -20, -123, 48, 56, -75, -30, -26, -7, 83, 48, -58, 94, -86, 11, 69, 43, 20, -70, -55, 9, -137, -5, -21, -61, 92, 13, 14, -87, -70, 26, 75, -12, 46, 6, 5, 67, 1, -183, -26, 55, -58, -50, 25, 28, 45, -4, -18, 25, -40, -76, -9, -6, 196, 156, 32, 34, 7, -20, 65, 21, 55, 19, -107, 140, 72, -28, -48, 156, -80, 25, 34, -35, 39, -51, 12, -27, 23, -95, -17, 114, 50, 29, -2, 29, 159, -31, -70, 6, 50, 76, -2, 98, -15, -151, 102, -58, -127, 83, -42, 45, 147, -58]
2872e8K7r6M4K2L1oj9k6Q0O0j04L9k9J05j93K08r9J5J81j98J49r6n9N9q9m6K26
2899A28k21J00L7n4j8N2k8j4J4k1M2j41J01k0k7J38j28R6J8j33MO1K5J6O4j36
2925d5N6Q8k32J77L0j80M8O4k3Q2o2J8lm1k1J1l9J6J26j07J59r1j64K94j70M8
2951C9m2m0L6K2l7M9j4j23J47k2j41K52q7j3Q3r1M5K1j48M7p3N6N5j8KM1o8K4
2979BN7l6r9J13m5OJ10k05K12l6r1m0m9N9K19k64J90m7j02J31p4o7K9k9J31J8
3005I3k41J89l5o9J8P3qjo7L6N3J8m3O4r4J30m5k07K15jl5K6j62oK06k20K00n9
3033B8j09M7M4l9N3J6J5q3L8l5L7p3M5J8l2P5l3j03O9N6QJ4L0j93R0k3L3K7j40
3062a20J22Qj2L1q5P9Nl2j72K27j10J04k2Jn7P5j8l9p0k4K14l5j31J03r0P0L9
$$ y = [-58, -31, -127, -83, -61, -30, -36, -55, -81, -1, 59, -45, -6, -35, 70, -123, 85, -14, 1, 182, -16, 133, 37, -22, 37, -52, -98, 128, -93, 7, 44, -10, -28, 24, -4, -18, -4, -25, 17, -124, -23, -43, -70, 68, -60, 36, 54, -79, -75, -14, 11, 27, 91, -45, 11, 99, -133, 44, 74, -106, -58, 6, -17, 65, 3, 21, 18, -23, -44, -33, -72, -56, 70, -37, 122, 31, -133, 161, -9, 39, -3, -43, -7, 15, -22, 27, 13, -110, 37, 15, -126, 126, 39, 26, 109, 18, 63, 84, -64, -17, -90, -34, 21, 3, 5, 46, -22, 2, 59, 23, -76, 37, -8, -2, 108, -97, 115, 79, -12, -52, -101, -42, 177, -87, 103, 56, -46, 85, 11, -56, -27, -56, 75, 93, -148, 41, 6, -63, -45, 28, 20, 19, -48, -12, 41, 59, 16, 80, -14, 116, 71, -136, 79, 78, 43, 69, -93, -99, 107, -113, 87, 28, -81, -34, 10, -29, 24, 40, 55, -28, 10, -25, 12, -61, -16, 2, -30, 45, 12, -91, -22, 34, 42, 56, 86, -107, -17, -40, -7, 20, -120, 2, 10, -2, 29, -56, 23, 28, -4, -176, 51, -59, 45, 23, 24, -33, 42, 24, -15, -85, -109, 105, 70, -61, 42, -48, 22, 61]
3089F1j12J37J4j81J44p5n9j7N0K8K7K5Q6m8n2k0Jq8R4j39R1J57p9l5L2j1J6P8
3117A25n0p4m4n5K02n0p1l7JPL5jNN2j26L2R2r8O9N2j81Q3J3Q9pj99J60l4o2J34
3147F2n4n4OJ70j52Q2k6%Mk48K97K6j20j5j0K3R2j09n0P2kj21K40j13J2r3J7J26
3175F2r6J3O6p5l0J14q9K1J14o5l9P1l07L38p2j4K9Nj76J69j17J26n1j51J93q0
3201d1j1Q6j55J08R6j49O9J6mj27J27j29J87p2l4J21j89J04K3M9k0l7j2P7j09
3226b6j2J08o5j6J33k30P5lo8j0J77n3k1M7j9%p6o7J11j16L0L7m5K29j07k6K5
3253A2qj18J63r1J6mJ41l9l1j24O8K3j52K28r6K9jl7j4j9J03P2r9J5l4km4J29
3281H6M8j86K8O6j31J67o0P8K2j67O5K0j36J53l8l5J0L2k9k3M9M0k7JN4L7j78
$$ y = [61, -51, 86, 100, -81, 63, -12, -71, -88, -38, -10, 17, 42, 128, 80, 28, 8, 9, -79, 15, -124, -33, 124, 45, 10, 42, 31, 47, 125, 75, 1, -43, -98, 104, 54, -17, -54, -53, -46, -11, -12, -7, 45, -81, -49, 43, -55, 14, 66, -115, -32, -19, 70, 63, -136, 24, -10, -72, 62, 8, -46, -40, 130, -22, 60, 34, 34, 38, -210, 87, 113, -7, -22, -32, -9, 83, -26, -76, -4, -6, -127, 113, 0, 12, -81, -64, 62, -34, -21, 45, -30, -60, 54, -35, -14, 100, 35, -4, 67, -240, 98, 26, 12, 41, 46, -130, 39, -78, 48, -3, -154, 39, -41, -52, 34, -121, -13, 83, -66, 3, 19, 15, -112, 15, -114, 73, 1, -33, 88, -101, 3, 26, 75, 55, 18, 6, 83, -26, -38, 70, 5, -11, 122, -108, -33, -36, -104, -114, 63, 10, -11, 36, 17, 17, -59, -126, -15, -131, -101, -64, -109, 120, 13, -13, 12, 4, -114, 49, -42, -26, -30, 111, 72, 41, -83, -15, 8, -144, 84, -12, 17, 16, -21, -35, -54, 49, 121, 22, 37, 3, 1, -43, 86, 134, -52, -24, 42, -89, 78, 18, 96, 118, -49, 16, 36, -100, 53, 15, -20, -10, 22, -7, -30, 19, 59, 32, 33, 87, 124, -54]
3308e4J59j18P2%j19J19P7j70P8L0l02K27R1j95R5J22j20N2p1kR6r4k4N7l0L2
3334Hko8J70r3n4O5l0L1K3k7m2J7k0M7j10K0J65o4m1L2p2J05N5k08J21l4k4J8
3362a2j9mJ69j10Pqm5l1J08q2MJ19q7L7j23R7Q9j41Oj0ON4r6jN0R9l6Q2j54o5
3392i7K50k24m7J42j08J17r8M9J38j27kR9j17o5N2O4J08o2j15Q4Q6k36J96K7k20
3417a06N0nn0J72j88J69N6j76O8J54p2p7J32j93J16p3k4J05n1K5K9j06J32k5j35
3442g3Q0M8k07K46k4k10J63o9M9J2nj3kK8L7l5j10QJ25m0N0n5J27p0K7k4k9j89
3470a55J86j10O6Q5j71k7J92l2K6M9j41Q7p6J2O6q2j5K0nQ0j8k8j06J34j10P3
3496@R7j86J26o6K2O1n6o9J72j43L5N5j52RN6l7J38J9q6p0J62j23RP9k3J0j21
$$ y = [-54, 105, -13, 59, 59, -60, 59, 136, -34, 44, 74, -228, -1, 90, -105, -10, 112, -8, 44, -27, -29, 67, -27, -51, 6, -24, 8, 6, -62, 108, 15, -39, 26, -4, 27, 50, 23, -19, -2, -22, 25, -85, -65, 100, 36, -5, 27, -45, 60, 115, -93, 28, -6, -30, -12, -31, -35, 134, 24, 31, 23, -22, -53, 55, -27, -23, 96, 9, 46, -77, 20, 109, -32, -26, -36, -30, 24, -72, -73, -23, 76, 40, 122, -32, -97, 153, -71, -118, 24, -84, 33, -65, -16, 122, -5, -7, 92, -25, -90, -38, 26, 134, 72, -43, 41, 127, -109, 87, 114, -106, -56, -61, -111, 61, -127, 42, 98, -78, -10, 144, 72, -5, 127, -66, 50, -23, -47, 58, 7, 32, 61, -45, 87, 62, -73, 7, 55, -152, 94, 70, -140, 23, -46, 3, 15, 10, -3, -5, 23, 60, 25, -85, -77, 48, 8, 58, 3, 130, 60, 87, 63, 34, -155, 31, -79, -13, 72, -99, -126, 66, 34, 60, 109, -32, 55, -21, -9, 57, -25, -40, -20, -25, 55, 37, 9, -97, 37, -73, 0, 97, -89, 37, -29, -7, 54, -2, -71, 101, -42, -7, 48, -104, -95, -39, -76, 62, 81, -5, -75, 87, -36, -27, 52, 29, 39, -82]
3523h2P0K9n2J37r7r1J83j00J60n6k45K29p5q4L1RLP1j04J05o2n7J02j89M5J52
3549C2o9M3o0L0R0m1p4K8m0O0n3R5k00J41m7k6K07k27J80l7j63K23j3o0j3n0j8
3576f2J24k9l4R6q7p1N4L8m5j5L5nll7J29j46J05N6j01L0o6k0P3l8Q7J6n1j17
3604h4R9k4l0J31q4q5J52j24J07k5j43K16j55j1L1K4L0J3p0L5J07j84K30j21j17
3629h2J1k8R0j0j9K5RNn1J13k6r7J57j79J44j79O2M5p4J18n7o7M3J18m0L4n1j50
3657a36J58p3j7J40j32O1mN6k4M1j33P2j39K3K10n1l1m7R5j34pk0M4P7l4J03j
3684I7k42J54M5q0Q0j51K3K34j76K1j9K7l9Q7r4R8m3M7L3j52Nm6MJ18j0K0O9j51
3712d1O6N3K4q6O0p7%J8p5R2L3j68LK8j1O5J1q4J89j42m0R6p4O0n9P1O4q5R7N6
$$ y = [-82, -12, 17, -35, 102, 5, -86, 97, -3, 157, 101, -144, 85, 10, -74, -43, -34, -31, 40, -64, 41, -21, -78, 24, -165, -120, 32, -37, 6, -54, -24, 66, 25, -49, -21, -61, -1, -54, 41, -159, -18, -65, -91, 116, -111, 69, 32, -131, 92, 79, 19, 6, -44, -62, 62, 33, -1, 95, 8, -63, -9, 29, -16, -31, 4, -1, -4, -41, 88, -58, 47, 103, 2, 32, -34, -54, 19, -19, 68, 84, 33, -84, 15, -9, -39, 92, 8, -77, 75, -49, 58, 33, -110, 106, -49, -60, -29, -5, 25, 38, -32, 3, 110, -74, 156, 35, -82, -71, -99, -9, -19, -38, -13, -4, 1, -50, 63, 37, -60, 97, -82, 62, -117, -55, -10, -84, 34, -23, -90, -47, 71, 31, 65, 14, -136, 22, -51, -68, 72, -60, 1, -3, 53, 29, 70, -63, 9, -130, -107, 103, 52, 21, -26, 69, -65, -72, -92, -48, 29, -5, 98, 97, -145, 9, 54, -26, 54, -97, -74, 160, -16, 5, -14, 13, -26, 61, -33, 65, 22, 69, 102, -50, -45, -91, -87, 31, 21, 41, 110, -41, 25, 78, 102, 16, 76, -1, -1, 17, -58, 34, 67, -101, -98, -70, -81, -16, -5, -89, 100, -42, -82, 14, -60, 0, -59, 12, 76, -9, 88, 144]
3742A44j68J03n3q6J37p1qj0N5j49J85j49LL0p6K02lr6l0rj4N1n3l0J01N2q2J60
3770A36j92J38q0Mkp6k0J13N9j47K08j48n7R5rM4k6k7o5J55n9q8lL1k5j7J3P6
3798C1q6M1mK4k0L2J3j33J56j36J05q5R1O6j24m0P3o1J94j18j11J19j41J49m4
3823iml6R2p2L9J59j62pLqJ8l9K5j9K8J06m4j48P7J7q9N0P6K4j46J22n5r7KJ11
3853A4J44j97J01n5q9K00j91o9J63o2j9J58j12O7p5l9K1M4j20J47n3J14Lo5l8
3878ho6J46qj51Q4M2p7j49K65o0n5O3l9N1m5m9J44p5j28Q7J15j21J67j13L5o1
3904flrK3jO3k7k6l9P2r4R8q2K0R2j44O9k9l4k1P5m4J38q4Q2o0o8l5MM9o1K45
3935A63k96J74M9j08k8P2p0N1L7j5P3r7L4q9LJ6j2N9Q6j12o7JO8J04k3j03k0J9
$$ y = [144, -24, 79, 26, -60, 77, 6, -2, -12, 43, -106, 79, -70, -67, -37, -113, 89, 86, -10, -40, -49, -63, -12, -65, -95, 6, 58, -24, 136, -56, 82, 2, 6, 4, -72, -92, 21, 80, -67, 141, -7, -64, 31, 22, 66, 40, 13, -52, 103, 44, -44, -47, -16, -41, -58, -45, 31, -55, -14, -18, 6, -14, 18, 31, -102, 54, -82, 23, -62, 29, 95, -29, -69, 4, -57, 137, 19, -92, 27, -114, 35, -9, -13, -49, 43, -29, 10, 169, 7, 0, 3, -5, 13, -26, -1, -20, 8, 114, 70, -78, -1, 16, -73, -23, 53, 77, -69, 53, -2, -99, -97, 14, 158, -39, 62, 7, -82, 118, -73, -142, 21, -41, -60, 98, -14, 53, -22, -61, -40, 4, -116, 31, -22, 92, 95, 30, -8, -74, 72, 64, -87, -3, 39, -38, -187, 78, 18, -37, 26, -13, 38, -7, -56, 88, 13, -115, -28, 87, -34, 133, 20, 55, -6, -9, -18, 5, 4, 67, 40, 14, -25, 47, -47, 51, -31, -11, 81, -63, 6, -23, -57, -78, -3, -47, 91, 7, 89, 29, -39, -74, -70, -21, -82, 163, -133, 41, 90, -18, -46, 26, -44, 7, 44, 29, 102, 5, 39, -50, -47, -31, -43, 16, 102, -10, -77, -76, -8, 96, 73, -30, -50, -31]
3963c1J05k17Q4O5n0QO5j9k8l8J29o0l6jk7qJ25j32M7N1m4J18j64O5O4q9O7J1
3991F0l4K1j41J56p3K5j19K50k42J67K5m8q2R4j00K9Nj5O5r0mQ9o2J4K2p1K21
4018A62j92O8o4l6K9Q2l1o8J6Ml4P0p4O0K7K1Pj63j8J02MP7jRj1J5j19J52k5m2
4048B7j17J24q1N7l7J09j44q8K16l7l0j1J8qR3j01l2N4K7nn6rJ4k8j10K64j26
4075a7m2J44j07j5J76j65j6N9j06M0Q0j21P6O4j12L3l0L5Q2o7p5K08k21J84o6
4100B1q2J00o2N7m9M2n1J01j58J41q6j5J6K8J8r8R5l7J14j72P1N6j72J68j69K6
4126i7PM7mQ0n2k3K2OOlq3q4K11l6lLo6O0k9KJ8N2nj15%O7k5Q8m4l9m3J10q5Q
4160d9P2p6J14J3o6N9m9o2N8r0J78j91OK3L6m0Q9l1M0q4R1j78K93j20n5N3j06
$$ y = [-31, 74, -143, -59, 6, -44, -36, 29, 10, -18, -56, 73, 13, -23, -24, -51, -59, 66, -66, -19, 32, -12, 106, -58, 7, 71, -18, 49, 60, 26, 47, -94, 62, -11, 14, -105, 145, -97, 70, 95, 47, -35, 59, -41, -12, -7, -22, 43, -47, -51, 38, -24, -10, 12, -59, 162, -30, 38, -26, -62, -33, 49, 18, -50, -34, -30, -64, 6, -68, -8, 19, 40, 47, -116, -134, -32, -28, 49, 48, 57, 46, 61, -58, 94, 69, 27, -90, 34, -47, 10, -27, 82, -62, -150, 66, 29, -1, -12, 6, -2, 91, -10, -42, 12, 39, 34, -22, -31, -17, -45, -155, 109, -17, -59, 85, -22, -37, 139, -26, -42, 17, -89, -49, 31, -90, -14, 50, -62, -29, -59, -24, 58, -9, -84, 124, -97, 87, 21, -61, 39, -23, 34, -15, 27, -24, 77, -81, 60, -26, -41, -25, 3, 21, -77, 18, -19, 95, -77, -6, 50, -122, 46, -123, -97, -90, -43, -47, 33, -19, -42, -20, -14, -8, -11, -94, -178, 33, -3, -6, -3, -69, -9, -38, -36, -18, 34, 29, -86, -86, -19, -44, 44, 0, -39, -82, 28, -57, -49, 23, -53, 61, 74, 8, 67, 18, -44, 14, -76, 102, -89, -83, -60, -24, -64, 25, -6, 34, -50, 41, -137, 156, 36, -19, 34, -72]
4187g2J75r9M1M4m7k5K5qj7l6l6pJ20k4pl7N5m5P3n1J41p7j82K30j25q0J66M8
4215A43k29Q7J4R9o2l6m8M9N4l4l3j04R7K0p5J01J3l9N0r1J27l8q3M7p2j9j7O1
4243a8j2R2PQl1q6J22k04R0Q7j33P5L2M1j42J88j72J42p1p2N5M3m3n4N2O4p5M
4271a1Rl3n9J32Mj33R0K3JJ4n4PP9o2M0p7R8j71op4J78N4j60Q2m8J21J7j71O1
4300d9%J2J8lo8J63j18m6J15j12M6O4K0K4P2j79o7J39j8N2j31K4J37q3P7q3l6
4327c0N5on4O4k8n3J11l4j09J66j42J42j82Q2L4J9j6l0p8J31k7n9J50j20M7n8
4353b5J23k3k8j10J2P3o8J61p3l2M4k8j1j1k2j03K59k11O3L5l0M3M1l5m4K7JP9
4381A07j56L7kq2LJ30p2M6q2M8M6M0q5l7j2N9O7o9nk5o8Q1P9p2m6M1Q1k8j16p
$$ y = [-72, 103, 4, 45, 89, 42, 17, 42, 34, 17, -19, -55, -62, 58, 34, 27, -10, 45, 0, 73, 22, 163, 86, -96, 134, 9, -71, 95, 143, -86, 1, 15, 114, 52, 16, -32, 17, 71, 37, 4, -100, -3, 17, -58, 43, 56, 17, 67, -24, 103, 65, -18, 29, -43, -62, -79, -18, -30, 62, 69, 77, 46, -40, 82, -122, -32, 55, -78, -3, 29, 70, -72, 116, -56, 86, 15, -57, -2, 41, -2, -56, -4, 60, -15, -11, -2, -35, -94, 38, 42, -91, -1, 22, 23, 37, -17, -10, 69, 7, 47, -30, 68, -103, -109, -183, -5, 49, -111, -29, -77, 44, 61, -110, -49, -49, -37, -19, -22, -90, 73, -45, -91, 24, -88, -42, 22, 42, 66, 138, -41, -108, 31, 13, 65, -66, -42, 95, 12, 89, 6, -30, 25, 19, -35, 29, 1, -52, 59, 25, -84, 82, -60, 82, -100, -18, 16, 35, 19, -11, -89, 42, 15, -44, 106, -14, 33, -25, 98, 75, 47, -63, -51, 22, -46, 115, 42, 10, 54, 26, 15, 4, -18, -121, 138, -73, -10, 25, -5, 38, 79, 44, 0, 27, 28, 107, -49, -12, -14, -96, -93, 37, -35, 11, -71, -23, 23, 63, -22, -59, -71, -12, 55, -14, -19, -44, -112, -31, 48, -24, -70, -29, 52, 24, -92, -99]
4411i9K18l1n1Qj75J34K4o7J5L7j19R1j6K7O1k21J76L7j06K5J8o7J36p6k9J57
4437A07J1j80O9L0r3j9L4J62q8q3J34j44N1P8r9l3J87p2p9J10j41R5M2j10P0j2
4463B7J0nP1k39P1J16m8k4N4J6k2j9p2J18n3Qj5r1J35N4k8o4p7J21k7n2N8N4o6
4492A1M5j10O4n6PJ14j1p4L6p1P8j1Np0O7q5j2J50m6lM2m0o4OQO3q2J34j15ok
4523b8M0J8o8l4mR8r2PJ27o5q2K04o9Nl0p9O0n9N0o9J04j6K1m5m5Q9p0nQ6J3p4
4554a2rn4L1oJ20j07R5j8K3j56N6M5r5Q1p6q7K80p5j04L0O3k9M3j33O3J29k98
4581b00K33j9p6J63j39K4ln8J01M0n7M0n6p0J17m9k5J4K2Q3p5NK5K5j93J62M4
4608G8k06J74p9n0K09j33l1J16j00J30n9n2p6Mp1K03k5l9J67k46N3L3p7J33j25
$$ y = [-99, 119, 88, 37, 45, -130, 4, 28, -39, -24, 13, -106, -15, -31, -4, 57, -164, 12, 49, -57, -32, -14, -81, 55, -21, -50, 107, 118, -62, 7, 37, -56, -75, -41, 121, 33, -50, 84, -60, -9, 69, -30, -63, 124, 52, -27, 83, -58, 37, 79, -31, 39, 27, 37, 32, 103, -136, -65, 51, 3, -21, 33, 49, 27, 8, -64, 54, 1, 9, -6, -97, 38, 92, 64, 0, -77, 44, 17, -35, 23, 77, 11, 56, -54, 10, -46, -39, 75, 64, -10, 26, -45, 33, 22, 27, -43, 24, -61, -73, 77, 31, 28, 70, 30, -34, -28, -20, 43, -39, 95, -20, -26, -28, 12, 30, -38, -72, -76, 22, -70, -63, 64, -1, -83, 121, 52, 57, 27, -52, 8, -51, -1, -70, 34, 18, 39, -6, -51, 38, -32, -37, 49, 62, -12, -21, -75, -44, -50, 70, -37, 58, 40, 63, -93, -37, 8, -87, -6, -82, -169, 111, 36, -68, -38, 25, -4, 39, -94, -31, 98, -200, 33, 14, -62, 101, -38, -14, -17, -75, 26, 66, 9, 49, -7, -77, 40, -9, -34, -20, 2, 85, 10, 15, 40, 65, -128, 34, 78, -128, 46, -33, -83, 126, -7, -38, 78, -22, 108, 49, -3, -79, -75, -146, 57, 32, -7, 160, -86, -33, 0, -77, 56, -69]
4633f9J44n0nJ25j12mn8O2K9m6o9M4J01j47OO5K2ll1N8r6mlO2ljO2j06o5O5m3
4664g0M0Q4O6j58J25r2k3J67k65J65o4k2R3l4J1k4K7n1M6k8l3P5r5J29m1j24J22
4691B6q5L2Nj3j5O1p9nQ5l1j2J2L2o5M3l3J65j15j8l6M1O4o1J2r4M6O6Lj4m2R
4722a6j5J5K4j8J0J5l7N7j58M4R3J1o5J13j44J51r7N2m8M5r4K7J12k15J62l5J31
4749A20j38J3Nj6J4k5J26j11N6Kr8J33j04n2J12O2J3j67O4N3m9K5L4o4j8K3J1
4776B4j05O8N7oj22P6j03J14k0O2r3J55j13P6p2L3j6L9j29N2R5n4n3J68k68N7
4802g8J08r0rnP7j09J13PP9p8o5J51j92J64l8o1J53j38NN1J2r0P9n3p8P1J29j01
4830A4JL6j09J6o4J43M6j16J9M1j22J00p4J16QM7j26P5J8k7r0j0J83j01o9K7l7
$$ y = [-69, 75, 25, 20, 145, 33, 29, -29, 33, 62, 16, -53, -9, 92, -55, -49, 16, 38, 35, 4, 62, -34, -38, -41, 21, 18, 17, 79, -27, -92, -27, -70, -30, 54, 120, -38, 87, -5, -28, 139, -126, 39, -25, -47, 46, 12, 23, -1, 26, -25, 21, -7, -40, 35, -60, 69, 28, -96, 26, -59, -27, -22, -35, -50, 11, -68, -73, 12, -19, -31, -19, 13, -52, -9, -42, 123, 8, -10, -46, -5, 59, -2, 10, -84, -38, 28, 31, 17, -25, -16, -31, -16, 8, -10, 0, 15, -22, 35, -123, -79, 14, 25, -40, 73, -71, 80, -17, 35, -13, 32, -62, -35, 77, -138, 24, -11, 120, -18, -5, 0, -16, -2, -27, 99, -12, 44, 46, -52, 81, -23, -75, 37, 99, 112, -55, 9, 62, 13, 38, 72, 8, -10, 13, 24, -81, -13, 44, 38, -84, -8, -111, 3, -17, 45, -48, 107, -6, 70, -2, 31, 15, 54, -75, -23, 72, 18, -35, 133, -135, -78, 30, -60, -69, -74, 3, -106, 7, 14, 93, 15, -50, 101, -91, 73, 35, -26, 127, -11, -6, 45, 57, -33, 46, -7, -85, -14, 115, 14, 15, 51, -58, -42, -106, 37, 83, -33, -14, 27, -95, 5, -69, 47, 55, 102, -24, 51, 69, 42, -48, -58, 125, 24, -45, -18, -55]
4857e5M3OL8P9j03k5q8K00j53R5n1k3K38k48O5m4j49K21K4k9l0j01N8M7j28N4
4883e9J15r4m1O7M4m4O9j56J60j53J16k9NL9M8l9j62J21j06J37j19j9J25n0k2
4908d7l6O9R5ko6K0%n3Jj9J7Q5n7K3p8l1R8Q1j15J28j2j44P7m8m9Q6o7J05p0l2
4938d1O1Kr5J49L8j83J34k12J37J00j1l9j06nJ35m9j17P4P9q9K0J4k5L4o8J4m7
4965i6J65j51l3K0J8J30K0j65K5R6r9K0O7j2k3j8J20r8lJ7K3p5J40q9or6J31K7
4993E5j32L7o2J37j5P6r8o2J5R0L5j93K12Lo5N7j41k9J11P1j75J78j02k1R3q5
5019a0j8L2LN2m1j13J72j83m6K44q4m3k1L6O6j06P5m9rK6J0r0N4R2q4pJ29j02
5047a5n1J05K6m6j51J68q2M5nM7L9p1M3j10J48j04O7j22O1j00R2j5P9j02k9M5
$$ y = [-55, -12, -6, 32, 111, 8, -17, -105, 95, -58, 37, -14, -37, 201, -47, 18, -26, -175, 46, 70, 41, 11, -90, -32, 15, -113, -59, 56, -38, -79, -12, 32, -12, 57, -99, 61, -92, 24, -5, 0, 39, 87, 48, -114, 7, -99, 38, -81, -100, 25, -25, -47, -83, -14, 81, 79, 13, 33, 33, -20, -19, -38, -21, 64, 7, 30, -48, -79, 19, 100, -15, 113, 101, -43, 34, -14, -63, 23, -44, 61, -9, -41, 20, 22, -73, 76, 114, -69, 65, -147, -10, 90, 79, 40, -66, -71, 64, 15, -102, -28, 51, -38, -18, -4, -29, 5, -63, -49, -96, 69, -82, -115, -95, -77, 53, 73, -92, -67, 29, -70, -50, 17, 5, -18, -36, 84, -14, -17, 0, 23, -52, 88, -1, -7, -103, 28, 55, -77, -40, -102, 35, 20, 96, -2, -64, -49, 41, 76, -117, 95, 98, 33, 90, -51, -80, 31, 102, -73, 105, 3, -18, 75, -10, -28, 4, 7, 59, 18, -95, 77, -106, -152, 92, 8, -35, -56, -20, 46, -60, 15, -34, -43, -17, -7, -97, -43, 49, -35, -42, 87, -15, -66, 39, 65, 19, -132, 36, -46, -1, -6, 41, 80, 9, 52, -58, 90, -14, 53, -69, -8, -108, -16, -31, 48, -54, -83, -38]
5073c8K9j09J87rj29J70m2k2j15J49o6m0R4l9l5J26j35l3R5N7q0r4J50j02p7K9
5099g9O8K3r5k2J39j16O2J24j61Nm0L7O2J03k26n8K93j65J2J3P2L4o5k3J25j92
5125g0P8P4q8k4KK7N4r3J03J5k9j55J06j5m8P3o6P4j10N1M9qkJ11q7q3J02q2K9
5154a2L6r0QL7OQ3q9J1N9q7O2M3j22m8k0M5J18j05O5m9O5k2O5j44L2NR1j1j5P
5184B4O0l7l5j8M7j59J48k3nP5K1j02O4m5J10j21M0J10j44J29j20k9l9J2m5J14
5210C2m7K8M9j13M6m1J4mJ23k13J47K0m9N5j31Lj0R3L8K8j32J10m3M1k3l9J9j1
5238a0P8n8J9o8J30l9Rr5l8R0O1p6l5Kp8M4Q6j3q8OK3K3M2j35J79p0P8q1J96j00
5268H2P7p0n6J8p0L8M3j3m1QK7l0N9p6q4J43n4m0O8J2j27Q3N7p5m0J87j38K7n2
$$ y = [-38, -9, -118, 69, 60, -69, 101, 59, 37, -78, 71, 5, -35, 59, 20, -15, 111, -24, -57, 38, 95, 15, -79, 71, -31, -108, -79, -11, 12, -83, -105, 34, -82, -20, 104, -57, -52, -92, -55, 7, 110, -116, -174, 119, -46, -34, -21, 51, 85, 20, -3, 122, -70, 8, 82, -6, -30, -28, -1, 53, -40, 63, 78, 49, -106, 0, -15, -63, 10, -56, 18, -92, -41, 8, 0, -2, 109, 22, -61, 41, -41, -12, 24, -66, -58, -21, -15, 68, -21, -10, 49, -38, 24, 67, -55, -103, -123, -78, 40, -65, 0, -49, 16, -6, 59, -85, -53, -48, 43, 32, 17, 24, 84, 47, 12, -6, 41, -118, 30, 7, 2, 77, 98, -4, 60, 15, 125, 4, 44, 154, 10, 139, 19, -10, -49, -37, -82, 32, -15, 13, 62, -51, -5, -46, -32, -36, 87, -126, 21, 41, -8, 47, -84, -81, -91, 2, 40, 68, -64, 46, 3, 44, 21, -18, 1, -10, 68, 10, 29, -39, 91, 52, 61, -34, -72, 18, 79, 3, -32, -30, -108, -64, 22, 9, -79, -73, -50, -27, 15, -120, 59, -11, 67, -14, 182, 82, 159, 89, 33, 51, -19, 19, 62, 49, 8, 16, 43, 13, 72, -4, -88, 55, 1, -39, 29, 41, -86, -3, 54, -21, -61, 126, -12, 15, -37]
5297c7O6r3J01M8l9N6j9p8JL4j12J49q6P1q9O7o3R7j62J05l9%J5J9r6Nj6K16j45
5326b4rM7mk7M6J8n6Mj31R3N0J1nP5q1M8j88K10n0k9l7N1J30j59j1M2J09j51j64
5355a92K27j04M2O7m9l5N8l6n0J3J18kj16J12m0o9Q9J23j47K1j1j4q1P8j30J65
5381C7l7jJ00j60J6N3R2j35k5J15p4J2J36j45K6l5K8n4J76j92K7J60j30N0n8J3
5407eM0j09P4L8j18J71K9n2r6J40q2j88K02q1N9n9m5J06o4o3Q4l5j13K35n6j7
5433eQ1j98J36K3j10o7J28P9m6qj95K41j98J50nj1J26q4j14K00o4m1p1j0M5NK8
5460A5l4P2k43K44p6ooO2o4P0L6j01n4O4J07j54K6N9n3m1J20o5N8n3p8P6L9j37
5488a17N4J34j08J1L9nn5J15mr3J68p8Pj91P6L4L0M6j27n3P0M1K6Pp2j2J33j68
$$ y = [-37, 29, -64, 37, 85, 46, 102, 83, 5, 6, 40, -72, 77, -9, 62, -27, 40, -23, 74, -88, 17, -22, -22, -7, 12, -84, -79, -95, 121, -24, -33, 14, 10, -17, 29, 47, -9, -5, -136, -43, 7, 18, 13, 88, 7, 55, -133, 77, 27, -2, -39, 12, 142, -17, -28, 14, 123, -28, -192, 35, -69, -27, 40, -9, -44, 14, -22, -72, -59, 59, 57, -59, 53, 13, -56, 33, 156, 9, 30, 19, 5, -76, 2, -128, 37, 0, -1, 99, -61, -45, 8, 100, -35, -60, 55, -19, -7, 129, -16, 10, -25, 3, -51, 125, -67, -40, 120, -10, 40, -18, -5, 35, -74, 0, 38, -80, 91, 120, 68, -28, 112, 30, -158, 44, -37, 22, -37, -82, 24, -40, -103, -19, -54, -167, 68, 12, -5, 76, -122, 14, 37, -73, -140, -12, 67, 21, 13, -182, 59, -139, 11, 6, -5, 121, 37, -77, 123, 59, 18, -53, -63, -18, -13, 15, -19, 53, -190, 54, -22, -28, -34, 28, -36, 34, 70, -31, -85, -21, 86, -68, -42, 17, -36, -77, 43, -22, 36, -17, -95, -19, 20, -117, -63, 71, -37, -26, 13, 8, -47, 68, 64, -29, 139, 61, 68, -123, -47, -13, 17, 63, -64, -117, -47, -6, 20, 27, -45, -57, 76, -92]
5516i2J43r1Q9o9J09j82N1K7N2Q2p9mj25J0J19J1j19M5J4L1o8K00j40j48K35k13
5542a12J66q5k1O1pK4j03J58q3J6r2R3n3M8p0K3m1qM3Q3oo1N2L5p6O3m5J16j11
5571G%k5N1m8L4M2j30N4N7j15K2k7R2j0j21J34o8O3N5j24N8k3K2j5l8J0K0%K2
5600aJ16j22M4q1j5J64j17p2J37mr8J59p0r0J70p8k0J06j64m1K0LJ02r4O7K8k9
5627B0m9m9J27q3P9m4KJ6m2P7r1J3q7R2pQ9k3L4l6k0j49R1L0J6M3j54M7J57p8
5656B1l0j3M4j5MO9k8j62P1po0J03O0j47N1QJ0R4j18K1l8j51K38P2j8j45J16K2
5684G2n2m9L5n6J07l2k4J9K5pk3O4n2k4M0o9R7r1K1n1O6rnq2J1J14q5J6j6P7r6
5715e9P0n2LJ17n0o4j02Q8J81j06Om8J7N7r5N2j1lR5j07oQ7k0%j12J17l7L3j39
$$ y = [-92, 51, -40, 49, -20, 89, -93, -42, -15, 37, 119, 40, 36, -89, -79, 40, 51, -68, -23, -9, 22, -46, 154, 14, -134, 101, -112, 54, -31, -52, 9, 2, 26, -77, 81, -2, 14, -78, 15, -38, 10, -60, -37, -78, -86, -43, 40, 34, -27, 25, 60, -16, 47, 2, 118, 7, 7, -18, 33, -15, 19, 61, -69, -15, 42, -73, -51, -78, 14, 4, -117, 17, -51, 12, 67, -57, 1, -22, 0, -15, -53, -43, -23, -23, -1, 115, -7, 37, -44, -59, 105, -12, -84, 53, 49, -49, 110, 40, -50, 120, 42, 22, 128, -36, -77, -57, -54, 48, -46, 21, 49, 20, -29, -78, 49, -34, 45, 1, 3, 19, -23, 54, -37, -24, -111, -19, -26, 63, 40, 74, 38, 18, -131, -40, -10, 6, 49, -105, -58, 99, 21, -9, -22, 22, 7, 11, 80, 52, -110, -39, -46, -106, -3, 57, -90, -39, -31, -21, 73, -45, -24, -62, -213, 25, 97, 79, -66, 50, 72, 20, -29, 6, -50, 57, 25, 1, 20, 45, 38, 15, 79, 27, 3, 43, -26, 71, -20, 1, -50, 16, 7, 2, -80, -69, 45, -40, -24, -40, 37, -59, 11, -41, -38, 79, 29, -35, -137, -49, 132, 26, 32, -16, 1, 58, -37, 15, 4, 1, 96, -11, -17, 70, 50, 50, -62, 55, 18, 51, -88]
5744h8L3M4M3j35Q2j7n6J31l3M5j3k8m7J1m8N8J7p7J57j10P5j26K2M0O0p8m5R9
5772A6p7P3p4k9L9M7%P2j15J00p2j21J06L9JL5r2JJ8N5n2p6J28p5P7j13M9Q3o1
5801a8R3o7M5p3p4J05l0Oj5r5K02l8k2q3Q8R2j71J24j18Q1p5nj8O7R0r2r%j7l3
5831f0J16rj03J9R2P5j48L7j2ro0J1n4N6Q3j6j03Q2q0J07M1j63J46K6q2pL9ln6
5860c5L8o1J49M0k09K3K7L6J0K4n7K0L8oj37J18Mm5M7k3J5Jm4M5m6n0N4r8J61
5889C9l4m3L8j4J8N2o6j00J27r2k7J18m4J51j07k9P2p6J5L6p7J41k34J78j7j48
5915a23N6P8r3Q1P7n0r8l2J38K9p2j31J03N9k4J14j47l5N8k9J8krP6j73K39j9
5942H9j45J3R8k0j9n7j4O4L1j13J09J2j22R1q3R0o5J01j27J1L3J06k13K4M5n5
$$ y = [-88, -55, -11, 32, -103, -21, -38, -94, 37, 4, 49, 36, 8, -39, -28, -76, -18, -1, -78, 79, -31, 44, -82, -60, -20, 40, -38, -83, 16, -61, 12, -62, -91, -52, -5, -5, 67, -48, 52, -20, -141, -35, 4, 5, 40, -52, -51, -33, 22, -30, -106, 22, -53, 24, -89, -40, 43, -18, 75, 8, 53, -20, -94, 11, -19, -13, -28, -123, 79, 41, 19, -64, 24, 116, -55, 69, -49, 32, -43, -48, -66, 1, 91, -1, -10, -10, -27, -60, 56, 47, -56, -37, 55, 130, -18, 19, 7, -2, -62, -51, -105, -49, 34, 18, -85, -3, -83, 24, 65, -98, 48, 74, -8, -15, 24, 21, -35, 3, -58, 91, 131, -78, -55, -28, 8, 18, 42, -15, 5, 43, 37, -100, 18, 22, -23, 24, 1, 16, 17, -27, 18, -28, -78, -24, -122, 39, 5, -38, 0, -14, 4, 56, -10, -110, 17, -75, -102, 16, -28, 123, 16, -13, 59, -17, -2, 34, -43, 98, -136, 42, 25, -123, -67, 11, -82, -1, 76, 26, -72, -104, 34, 63, -9, -140, -37, 22, -2, 112, -35, -70, -12, -41, -23, -25, -34, 42, -131, 108, 89, -56, -43, 55, 35, 16, -41, -55, 9, 40, -73, 36, 48, -74, 17, -66, 24, -41, 60, -67, -56, -23, 83, -130, -106, -61, -116]
5968a16J22k1m5J43j78O5Jn1J02p7P8Lr7J1J9P3k4r4J09o6L2J3j9m5N0J9q0R7
5996B4m9r1O8p0P7R2ro8L0k3J9q0Q2r4J13P6j19N4j7J02n6k03J33l2M5P0j8p8
6024b2%J5N6j72k8K14j01p4K09p9l9J07K2l6p9J54j32p7O0m9M2M9p4J63j06O9
6050I2n1q1jJ54j68N6O6n0n4M7n5K3mL0k8l0R2L9j28J02m8m2K3M6J4j16MQ2k3
6079iL0P3n5n9P2j03K2Q0q9P8M4o6JJ7n6m9R9M1Qn1n1kj5p5P7m3P5M9O7j13n1
6110e4l1J96p5o6JO2r1N8nJ0k6n2K6L0j09Q9m1J2N2R7q1J22m7q2J10j33O1Q7j34
6139a4L6n8J09j39J37K8o9r4j1K02j38N0K2j01K29k43pJ08j69R8O0k5K6L6j54
6164h1L6J6k9P4r1O2n1J5KN0j25O2M8P5k8r1NN2r0Q1K7pJ03p9m4j6J68j62j38
$$ y = [-116, 6, -15, -60, 83, -95, -30, -29, -80, 22, -55, 23, 26, -71, -60, -41, 32, 8, -86, 23, -43, -11, 2, -17, -62, -12, 7, -73, 24, -25, -116, -48, -118, -41, 51, 42, -26, 4, -19, 0, -80, 2, -92, 21, 97, -22, 32, 15, 117, 61, -142, -9, -41, 4, 74, 56, -22, -22, -7, 49, -123, -151, 63, -38, -112, 97, 18, -21, 86, 108, 72, -7, 147, 15, -62, -2, -51, -9, 40, -34, 129, 23, 92, 41, -40, -41, 113, -55, 1, 67, 17, -37, 10, -45, -22, -26, 4, -24, -54, 38, 77, -51, 51, 3, -39, -16, 30, 44, -72, -68, 14, -9, 21, 94, 39, -20, 52, -51, -29, 51, -38, 40, 84, 18, 19, 36, -20, -69, 30, 71, 79, 28, -23, -25, -40, -115, -38, -81, -6, 43, 110, -3, -54, -85, 111, 36, -30, -29, 33, -58, 0, -5, 5, -21, -73, -47, -17, -126, -37, -78, -66, -14, 83, 2, 124, 77, -5, 105, -28, 33, 120, -14, 22, -36, 73, -66, 71, 99, 30, -64, -75, 127, -11, 39, 61, -40, 189, -54, -61, 47, -122, -24, 36, 11, 37, 73, -81, -45, -29, -58, 16, -75, -13, -64, -49, -47, 3, -122, -60, -12, 63, 35, -56, -51, 1, -89, -8, 19, 12, 115, 36, -8, -24, 144, -18, -156]
6193a56J85r2J22j08J40o8q9L9l8N5L8J1P5J4q5o4p4N6J85j19N0o9K9n5k7J2N1
6220A8p1L2P3m1j26J38M0n8j5mO6L1n6j17R8Kl6L1J16j40N5r6qQ8jn6J19p5J25
6249A32j32L0L9j15N0K9q1J04m3n6J08p2n3R6M1n7mo3Rj6l8J69r6k1J04k1j1p3
6277d1M3rk1K5Q7o4o8L1n6J42j3j67J01J61k29J48j30M6q4K1J24o0m4M1k7J13
6303G0j26M7l0O8Km6O5L2q3J9L6Q5j24j18O3J1j6J35k11J54K1o1r1K09p4q1M9
6330Ej99J64Pj5J14M8j06J8r9J68j74J34j19O0ok0Oq1K9OO2M8R8j53rJ49j56J82
6358A61j15p0L9m0nJ0j4m3L8J8L8j28N8R4o7P2j12J21m1l0J6J23m2j9P2j10n7
6385c3n8J31o0k5M6n4J02q7PK1K7nl4M7L8q0K5j4oN0q1N3L8k6j7j36R3j24Q6R
$$ y = [-156, 29, -63, 59, -49, 91, 23, -66, -27, -65, -10, 28, 39, 114, 128, 43, -21, -95, -39, 146, 27, 77, 8, 37, -18, -45, -33, 18, -53, -21, 52, 11, -115, 23, 63, 5, -10, -14, 52, 83, 27, -90, 8, 10, -26, 5, 121, -19, 36, -60, -68, 20, 19, -37, 82, 7, 132, 0, 30, 69, -46, 4, 33, -48, 56, 13, -43, 65, -7, -60, 36, 77, 20, 16, -47, -38, -54, -92, 77, -19, -40, 64, 43, 32, -41, 2, -7, -28, -3, 84, 20, -48, -17, -73, 69, 56, -111, -10, 151, -78, 70, -60, -14, -98, -77, 47, -13, -57, -16, -43, 70, -56, -9, -39, 29, 31, -15, 50, 82, -1, 18, 54, 139, 15, -103, -40, -29, -45, 90, -121, 33, 54, -7, -98, 111, 37, -44, 5, -194, -30, -23, -38, 76, 124, 18, 36, -63, 105, -69, 65, -54, 6, 0, -20, -14, -95, -66, -60, 2, 50, 148, -5, -14, 135, -21, 161, 46, -24, 15, -25, -30, -20, -34, -77, -39, -21, 17, -111, -53, 41, -26, 46, -66, 55, 14, -16, 0, 123, 81, 62, 134, 24, -33, -91, 40, -20, -45, 1, -53, 49, -38, -31, -10, 17, 12, -22, 25, 63, -17, 8, -6, -12, 38, -43, 10, 48, 22, 5, -131, -38, -162, -76, -67]
6415f7Q3J62r6L7p6o0P0kj19N7j36J19N5m9N1M5m7j08N7j8L5l0l3J13j06P6Pm8
6443b8N1n6P7O0r6l6P5j19J31J07j55j0o7r9J65O0m3mK0O1j25MK8K4K3j01L2p5
6471i6J31Q0n3J4j3o7M6m8R7l2j07j7P6p0L6M0k00J96m5j2J37k38J83J8m1K6k9
6498A2nm0KL9J37k57J45N2o2l1K8K3j07k4J62k7j4j00l2L3J53j76O4P2l3J28j87
6525d5Q9o0J1L7r2J29q8P5LnK9j37Q9K2j6o5j2PJ14j27J66j16O5j67p4J53PL1
6553B3K8j01L3J28j33N3l8rK4qKKO3m0Kj50J48l6M4j42L9P8rN0j1rN6o3P4%j86
6584h8R7j26J07OO1q7J17j8j21K04j82K6%M8j13J14Oj5l4p2P6r5J9q7J93l9M6
6611D3k2k7K7p2R1J8j15J4L2K6j32J66j6r6J12r2rM1L3r1P4PK9j45k4K54j54J3
$$ y = [-67, 16, 178, 82, 119, 43, -17, 53, 51, -68, -11, -147, -28, 27, -22, 29, 74, 27, -81, -24, -42, -7, -37, -70, 43, -63, 13, 20, -28, 23, -33, 44, 104, 8, -28, 47, -72, 59, 166, 11, 1, -66, -165, 0, 60, 17, 13, 33, 94, -31, -27, 1, 25, 48, -53, -21, -96, 35, 115, 62, 76, 63, -4, 42, -6, 91, 59, -48, -65, 11, -59, -23, 17, -183, 13, -32, -44, 93, -145, 38, 56, 15, 41, 12, 7, -33, -31, 8, 145, -112, 33, 85, 23, -8, 20, 43, -64, -88, 74, 47, 33, -67, -99, -66, 87, -89, -25, 47, 14, 142, -45, 44, -16, -5, 32, -60, 69, -19, 56, 59, 54, 83, -54, 35, 57, 41, -24, -36, -29, 85, -42, 124, 8, 73, -94, -168, -15, -8, 23, 51, -50, -17, 111, -22, 31, -7, -16, 8, 0, 2, 4, 67, 27, 29, -121, 27, -9, 35, -107, -68, 10, 1, 51, 40, 31, 87, 24, 98, 98, -88, 9, -117, -10, -4, 57, -30, 87, 69, -52, 152, -30, -4, -4, 44, -69, 45, 51, 36, 2, -70, 6, -89, -70, -157, 36, -3, 43, 21, -6, 21, -51, 40, 58, -57, -43, -11, 15, -117, 49, 33, -63, 49, -43, -52, -11, 22, -69, 5, 12, 41, -104, -128, 126, -28, -15]
6639a5L7j18J08koJ8o8J01m3KN8k44J40LJ7k6L5J26o1k5r7M2J8m1P6m8J6p3R5
6668B5o8J18q0j33J78j5l7o7J4qM2l5rN9J4MP0r7Q2j10N1OJ0Rn6J3J50q3l0n2
6698c5Q3o0o2N7Q9m5o5p5J1M2J02K2j07kJ1Lp6M0J01O8L8k24J84j99P7Rq0P0J21
6727I8l9j11L4l3O7j0j0r5J51p3K4O2m6m3n5M9K9O7Rj03j7L4L2q0J35q7j0Or0
6756a05J50k16J72J03p5m3k5j0lJ19j62O0R4m5Qk0l3L6p3J16j19J0J14o4n8L9
6782c0J52j82J52m3j45P9O1M6j07J3K8m7p5J36O7o0k9j10J13J24p2j27J93j14
6806B3j2m4Q1L1j43J45p6K5N3o2q6J2lP6k6n8J30N8q9k9j17J32k5k0J33o7J44
6833A86j92q7M2R4O4j45J20j34J05L3l6K6m1M1r6J14j47J34Ko8J08op0o6J4jJ33
$$ y = [-15, 22, -96, 12, 10, 4, 22, -46, 55, 12, 14, 72, -172, -32, -29, -12, -38, -3, 123, 62, 37, -60, -18, 0, -41, 35, -13, 3, -70, 25, -43, 75, -5, -138, 40, 25, -12, -79, -65, -73, -31, -66, -75, -16, -2, 2, 72, -25, 57, -53, -2, 4, 14, 23, -33, -20, 130, 47, 17, -35, 48, -12, -74, -17, 72, 27, -38, -113, -102, -60, 42, 64, -43, -45, -34, -31, -107, -67, 34, 102, 140, -84, 100, -99, -22, -13, -93, -23, 98, 59, -52, -18, -51, 16, 6, -4, -99, 52, -21, 3, 65, 19, -24, -79, -30, -1, 66, 75, -28, -45, -11, 21, -59, 76, -11, -21, -15, -105, 45, -171, 1, 104, 29, -14, -39, -49, -52, 67, -95, -35, 59, 14, 22, 2, -31, 5, -68, 48, -71, -61, 53, -11, -69, -30, 122, -60, 92, 49, -96, -17, 44, 90, -17, -4, 24, -23, -98, 38, 105, 45, 16, -94, 19, 143, 71, -56, 137, 23, 11, -33, 48, 79, -64, 81, 5, 30, 83, 21, -65, -53, -56, 20, -6, -64, 66, 124, 35, 6, -111, 21, -4, -24, 109, 42, 186, -6, -93, -51, 43, 107, -38, 82, -52, 53, 86, 50, 76, 35, 76, -20, 94, -53, 81, 83, 15, 123, 117, 47, -19, -5, -6, 127]
6860A27j72J52k16L8O2O8mm2N8p3Jo6m8J25L9q8M4k2J19m2m4l9P1j20N3j34J68
6887A5Jq4Q3M8j3Jn6J6N3k9j59K5J12KK0m2j29J16kK6J24j64O2k7o4Q1M2j70J3
6916i9J23l2l5mJ2P3j6M3p6P1j31k3Q1K0K1m5jo4K03l8j40N2Q9j93N9N1O9j11
6944d1J7R7p2Q0r8J13o6o1j1j36J69L0l7J01o9M2Pj02k0M8M7j33L4P0J0p2K8P6
6972E1j21R0R7q5j20J24j27J95j91Q0k1K0N5j19j9M7N8j09N6J26o2M5L8j66Q7
6997B9m3N3j5Qp0%R6j43J20j72J31r3J38o1R2p2N1p0PL2j00J30o5L0M8jr8o6J69
7026F5j42L1R9j2j3n5L2M2r5m9J01Mj9N2o9J15q8O7N0m9q8L4Mo6QO2J5kj30J62
7056F6j52M4K5m1J13j56P8l1P8o1J05j74J49l6j06J34K3loo8O4l4k2O1j10L3J3
$$ y = [127, -45, 107, -109, -71, -9, 59, 55, 13, 71, -2, -1, -67, -115, 10, 49, -39, 5, -17, 102, 60, 16, -23, 48, -72, -19, -153, 15, 16, -68, 15, 63, 50, 51, -5, 11, 64, 35, -124, -99, 13, 15, 35, -7, -136, -20, -22, 4, 128, -36, 26, -1, -65, 16, 58, -112, -99, 24, -8, -43, -47, -35, 38, 22, 65, -11, 60, -71, -94, -13, 7, 28, -17, -18, -82, 121, 83, -57, -5, 84, -109, -50, 1, 70, -41, -24, 73, 1, 81, -17, 96, 30, -31, -42, -178, -9, 21, -16, 85, 16, 58, 65, -37, -57, -9, 38, -95, -61, 9, 19, -53, -25, 51, -70, 20, 117, 32, -88, 36, -91, 104, -87, -7, -28, -8, 47, -72, -91, -44, 14, -95, -39, 87, 25, 70, 108, -58, 29, -14, 39, 24, 32, -38, -38, 58, -85, 35, -137, -6, -99, 39, -22, 70, -2, 49, -21, -14, 18, -82, 48, -17, 13, 61, 60, -38, -104, 65, -77, -46, 53, 41, 28, -27, 5, 47, -48, -97, 4, 8, -11, 41, -28, 87, -1, 66, 116, 67, -21, 13, 17, -49, -41, 21, 36, 34, -96, 66, -86, -42, -17, -58, 55, -101, -23, -54, 24, -37, 68, -106, 43, 7, -99, 35, 58, 55, 49, -19, 45, 11, -11, 50, -60, -27, -14]
7083a4M6j20J30q1j01M8R9Q3k3o0j0L8r9lJ78j66qO9m0K2L4nl9J00k7o3k0Q7q1
7112b6J44j95J10lj1R4j71M9O9o4j02R0kM4J12j42%k0j3J5kK7P9j95O7Jj9K10
7140A46k59J46r1M4K9n4J39M2j18O1k4J2M0j24l6J57j11M7m3%j8k4l8K0J47l7
7166E3k4k1k1J0p1J4J24Nq6k6R5r3P0j30J60mk05K17rj43K10j85J30M7j10N8n1
7193A4j5M2OK2k5j38R6N8p4n3m5J2M3J17r4J17j00J16j46Q1j18J78j45J45p0n9
7219c5Q6m3n7O4M5j12P6l4N7q6O0j1M5m0Q1o4j41J09k6Q4j9Q5j18k3J38j72Q5
7246C4r9L4N6K7l9QP3l6m7r2J32r6R4n3j8m1j9J26O7k24k4K21j3p6j4j05J20l7
7274d1J09n4l7N8L2q5N9j08J07j14J09oJ26k76R6QL3j69J05J21q9J02k1p9Q5L5
$$ y = [-14, 32, -88, 42, -39, -140, -92, 7, 90, 67, 7, -3, 35, -64, -67, 111, -55, -63, 6, -34, -12, 22, 17, -22, 78, 51, -12, -32, 55, -26, 118, -77, 33, 30, 19, 113, -58, -9, 60, -4, -106, -16, -18, 26, 138, -4, -4, -24, -37, -22, -24, 3, 82, -113, -46, -45, -64, 146, -113, 33, -58, -14, 15, -39, 100, 142, 24, 85, 61, 73, 113, -11, -47, 110, -1, 46, 3, 3, -15, -39, -77, -57, 90, 53, 29, 8, -13, -3, -74, -60, 64, 69, -17, -43, 52, -41, 29, -101, 59, 55, -150, 67, 58, -85, 125, -60, 70, 117, 7, 65, 14, -1, 41, 47, 69, 44, -94, 2, 60, -14, -67, -112, -100, -57, 60, -34, 83, -17, 99, -47, 34, -84, 94, -51, 94, 24, -35, 51, 8, -49, 15, 60, -52, 24, -10, 47, -39, 21, 10, 55, 15, 96, 32, -109, 0, -26, 58, 39, 124, 6, -17, 121, -51, 34, -65, -31, 25, 52, 13, 21, 94, 58, 11, -81, 51, -45, 49, -4, -22, -63, -82, 44, 111, -113, -137, 84, 71, -5, -19, -124, -4, -41, 68, 14, -23, 35, 67, -18, 41, -67, 40, -74, 35, 29, 155, -121, -25, -17, 16, -153, -48, 73, -16, 86, 65, -14, 71, 106]
7300A06j20M1J1K0j98O5J08R1p3o5L6M1l1l5J9m6N7l1MR5j92Q3O9J%L1j33l1O8
7329im9J6L2L4j8o8R8l4K7l8k0J06n7l7J7L5Kk5L2M9j17RJ11q2p2P1M0M3j26j0
7359d0J9n1q1J8L4J51o6j6j0n9J37o2jn9J43K9q7Kj09J13N0j05J14L1k9M4j50
7386d0L4pJ08k9K0m7j40P3j4J04j47K6k7K4R1M6r5L9q6K4k8J27j46N7N5k6J03
7413I9o6%Mj43N2J42r4n6OL0PP1p8L3K7n9J9J03j47l3J83j4j3j19P8nkn6oJ36
7443I9j86M5l3N8N2M1j56L7P3j6o8QJ16p7k7j23P3J1O2q5J01l4J15j04l5L8j7
7470c2J58j19Rpj61J17n6Q3n3J29J8N3j72L6o5J7M3n3Q7Kk2j69K44j77L8M4q0
7497h8J18Rm9o5J20o8J0K9M1j25j5R1k7K0mp5N3N4n0Q0q3l1J0j7N3r4R4L4l1O
$$ y = [106, -14, 27, 38, 58, -140, -75, 33, 124, 51, -14, 22, 63, 32, -3, 16, -30, 27, -4, 0, 95, -97, -14, 55, 56, 56, 87, -46, -77, -9, -58, -42, -10, 24, 6, -62, 36, 2, 29, -9, -29, 77, 20, -17, 0, 35, 37, 12, 44, 93, -24, -15, 96, 14, -58, 13, 53, 96, -30, -40, -21, -72, -153, -135, -101, 50, -16, -32, -42, -101, 36, -26, -27, -86, 57, 86, -1, 1, -108, 5, 55, -50, 64, 95, 66, 110, -40, -6, -13, 95, 66, 86, 39, -101, -28, -42, 62, -85, -59, -86, -62, 29, 75, -20, 19, -67, -43, -71, 56, -90, -33, 22, -4, 99, 33, 33, 37, -106, -54, 88, -6, -62, -56, -26, -19, 52, -26, 7, 34, -25, -6, 97, -50, -83, 100, 86, 73, -46, 32, 27, 25, -31, -37, 99, -87, -42, -75, -17, 35, 76, -80, -43, 30, 14, -54, -46, 70, -7, -34, -157, -84, -73, -11, -96, 5, -29, 86, -18, -53, -15, -32, 126, 7, 16, 9, -152, -35, -91, -8, -61, 68, 86, 139, -33, 3, -62, -45, -2, -55, 32, 34, 12, -157, 87, -90, -52, -8, -88, 30, 39, -10, -75, 45, -23, -13, 16, 57, -68, -83, 8, -19, 1, -3, -78, -25, 29, -21, 59, -24, -55, -45, -62, -9, -103, -9, 25, -6, 0]
7527@j23K17j04RM2J3j18M7r2Q4m7K3m2J04M6MP0j56J04m7OkM4m1n8kP1n8j2j2
7557c0L3Rm8N9Q7o9r0Q0N6J1Jl7pj7j11R4l7m9l4j3N5N5J03j30m6R0k3n3J19j5
7587D3k01P0O9M8O8j07L2J9J3n2J9n1QP5r1k2Q3n5kJ56j19k2Kl2n9P3J7n7l4J95
7617H6o0K5J06j72M6k4P1m2o0J6L8n5Ml9N5J9K6NK4j03mP7k5n3J80j48nO1nM4
7647H8jM4j19m1m1J43j06J7L6m3M3j11J06ln8o1O6L1m7J79l4k3j22O6P3n6k1M6
7675E1p8p5J13m3oK8N6j41J02L9K3j10R5j1K9n9L4L2k28J50K4p6N4o4J08m3J8
7702B2l5K5k6j16J99n6J7l5r9K28j01l4m1P8m8q2J8L1J13j41Q0J53j19j20J80
7727I1m9l7n7L1L8j27J03n0l2J35r4j4qQ3M5o4l5j1n5J11J5j48N7J39j99O5J45
$$ y = [0, -123, 94, -10, -1, 41, 54, -64, -17, -109, -25, -72, -49, -91, 13, 59, 63, 133, -23, 81, 34, 40, 38, 82, 41, -17, -19, 52, -6, -18, -30, 3, 12, -36, 23, 110, 41, -49, 31, 87, 98, 99, 62, 55, 38, -73, 21, -16, -65, -99, -112, -57, -2, 101, -29, -75, 15, -8, -61, 58, 43, -158, -88, -19, 29, 97, -10, 22, 41, 54, 2, 21, -30, -22, 53, -38, -60, 23, -32, -34, 122, 3, -19, -17, -49, -108, -35, -18, -75, -109, 86, 26, 51, 157, -15, 31, 7, 78, 36, -24, -8, 30, -25, -21, -60, -5, 14, 40, 45, 69, -34, -38, 39, 14, -39, 141, -7, -12, 49, 44, 88, 87, 131, 12, -29, -70, 73, -33, -16, 20, -23, 20, -91, 15, 12, -46, -107, -41, -10, -57, 122, 88, 65, -57, 9, 82, 26, 5, 51, -27, -102, 11, -32, -38, -10, 46, -95, 7, 46, 69, -41, 54, 43, 72, 13, 47, 79, -149, 1, 25, -51, 3, -61, 47, 4, 22, -13, 12, -14, -130, 69, 13, 30, -5, -104, 124, 23, -11, -52, 26, -22, -104, -86, -55, 58, -83, -3, 150, 31, -89, 91, 42, 5, -52, -21, 17, -110, -7, -57, -89, 46, -48, -62, -70, 13, 58, -6, -41, -52, -107, 4, 19, -129, -72, 67, -132, -67, 78]
7754G8MO7k38P7lL6l3J17l5j18J26j00KK4m6M2M6J4l1l3Q8n7p5R5k9J19j3j22
7782Bj6m1q2J73r3Q9nk8J5J42r7n7R9m5Qk9N1o0k3j04R8J9Pp6OJ1O3K2r0M4j5
7813a2J5q1J54j60L1L9rK5P1M1j10m5K3L3q4O6j02J74k21J27%J3P3r9p7j7J37
7840Em6Q5Rl8j6K2K1p0J8O5j09J30j63J73j36J03l6l0Ko3J56j22J13m5Jj8j3k1
7868b3J15n0r6K2M7q5K0J3J15o7J29j44m2M1k2n1O7j9M7q9J32j02P4j8p0J29m1
7895C2kj4p0O2l6o7J19j9l4o4J15J0o1l8Q9k8p2J15o6j1M8m1K7J0J8K0p8nnP1
7925B5k8k3J14j04P7j22Q9p0K8N2k5Ro4J52j15O4n9j08J52ON9j2j58N0mJ16l5
7952F6r2L7m8K3m3l1J98j14J0J4l4O7l3j2k9J6O%m3N5j18J11N7Pj05K3n9O3o3
$$ y = [78, 82, 149, -89, -12, -15, 21, -12, 105, 70, -48, 78, -22, -20, 4, -42, 0, 46, 60, 29, -4, 84, 27, -48, 47, 18, 137, 124, 2, -14, -55, -137, 36, -57, 32, 27, -1, 14, 156, 59, 2, 101, 56, 64, 35, 86, 26, 3, -101, -3, 16, 23, -53, -47, -36, 27, 49, -41, 3, -12, 3, -78, 76, -84, -53, -14, -23, 2, 73, 114, 4, -41, -18, 15, -69, -3, -105, 69, -152, -25, -25, -12, 61, -38, -115, -132, 5, -41, 44, 53, 15, -1, 21, 42, -28, -10, 55, -54, 76, -87, 86, -50, 53, 17, -13, -11, -74, 82, -40, 73, 28, 29, 11, -2, -23, 92, 42, -54, -32, 15, -70, -50, -37, 78, 11, 140, -4, -46, -5, -27, -78, -11, -30, 17, -72, 60, -42, 32, 14, -56, 73, 32, 30, 16, -54, 8, -28, -95, 24, 5, -29, -93, 22, 32, -29, -67, 22, -6, -78, 37, -29, -40, 8, -33, -6, 4, 22, 42, -36, -41, -46, 25, -3, -26, 88, -16, 61, -61, 28, -42, -14, 38, 13, 22, -42, 110, -5, 59, 0, -108, 44, 50, 109, 97, -61, -11, -15, 101, 66, -26, 11, -37, -14, -57, -88, 110, -4, 6, 20, -14, 53, 20, 8, -21, -5, 1, 1, -42, 13, -105, 6, 63, 70, -35, -12, -71, -8, -71]
7981g1R5qJ55j13q4L3n0L6o1J44%L2k12J09K8j21M5K07k67J09L4k42J61J31p2
8006A8J35o3n6K4j51k6R6rpJJ4P9l1N7K4p7r0J49m5K0j20QJ43j16P9jr6P3j38
8035a06P0j3J33j13P2n9L6M4j59J82q7N0k0p8L9N1q4M8j53Q0K1l6J31n4n5J9J25
8062H4m2k0J3o3N6J5L1p0K2P1n9N6j05k9Nj4J37j4K5j86j8J08ON8n4n6Q5l2Jq
8092CnpM4J03p6n4l6j6j1L4R1j00%R0j1k5J3l2l2M7o1J01J0m2Jj9q1L6j9kl9N5
8124d0J45j71O0N5j4m6lr6J58l3J1n0M2p9P5J8n9J22j21pJ02r5n5N1O5q1j2j3
8152g1J20l6J05j54K4J18j97L1J37o8j8P6K3m9Nq5m2QK1J25n8Q8k07O5j7M8pj1
8180b6j06K86j18N0j50J66j43J15J9j07j0
$$ y = [-71, 24, 16, 171, 58, -26, 7, -43, -7, -68, 76, 76, 108, -104, 5, 33, -88, -43, 164, -103, 6, 40, -202, -41, 90, 18, 153, 90, 34, 58, -93, -119, -23, -32, -39, -38, -24, 55, 24, 81, 105, 28, -62, 87, 42, 62, -58, -50, 93, -23, 56, 55, -41, 32, -106, -36, -49, 84, -29, 43, -16, 20, 64, -95, 87, 0, 50, 30, -48, -9, 42, -42, 6, -147, -67, -46, -82, 49, -5, -60, -41, 84, 42, 22, 35, -28, 28, 43, 74, 4, 26, 97, 38, 94, -11, -40, -35, -49, 88, 74, 99, -87, -105, 3, 9, 67, 13, -43, 42, 10, 11, 3, -2, -9, 35, 138, 62, 8, -28, -44, -55, -21, 70, -30, -30, 60, 49, 24, 37, 5, -27, 20, -41, 60, 70, 28, 29, 10, -71, -35, -54, -56, -95, -40, 105, -66, -6, 49, 35, -11, -14, -110, 48, 15, 26, -24, 18, -61, 14, 32, -27, 95, -26, -33, 69, -26, -81, -30, 35, -46, -58, -71, 49, 13, 118, -36, -12, 106, -91, -60, 77, 9, -9, 67, 90, 41, 46, -39, -81, -73, -52, 73, 15, 103, -104, -39, -56, -8, -15, -26, -132, 154, 36, 86, -64, 102, -41, 74, 93, -14, -24]
8191b4
$$ Imaginary data points
##PAGE= N=2
##DATA TABLE= (X++(I..I)), XYDATA
0@%%%%%%%%%%%%%%%%jRj6J6j6J6j9K7l2L3m1M8n6O5p3Q7r6J06j22J38j54J72j96
39a05K19k43K73l04L36l69M06m48M94n44O00o62P30q04Q88r82J086j203J336j495
59g91J681j899K164k498K929l506M326n600P861j3061M8636J2340p4673R339J8379
74E627R730k2575j3000J3736L056j8581N542j78O413J3730n831n991N971K894
88E43K2071Q74k7326L008J7070l685p450r344N834L431j8500K615J3420j1891
102i330q77N827l137O012J24p0R801n516j37Q802q627N40P965p039k654m511j685
119d512J1781j1713j4397J5252M791p886k216M11J1270L4j0590J3343O489j0756
133A301L595J327j798L647o317J787K578j4127K208Q428p455o9L78q21M857p098
$$ y = [0, 0, 0, 0, 0, 0, 0, 0, 0, 0, 0, 0, 0, 0, 0, 0, 0, -1, 8, -8, 8, -8, 8, -11, 16, -16, 17, -24, 24, -32, 33, -40, 47, -49, 57, -65, 73, -81, 91, -105, 114, -129, 144, -160, 176, -193, 213, -235, 259, -285, 315, -347, 383, -421, 467, -515, 571, -632, 704, -791, 890, -1009, 1155, -1343, 1586, -1920, 2406, -3194, 4667, -8394, 40242, 52582, -22091, -12752, 5627, 15357, -7218, -20218, -6482, -3426, -22007, -16465, -16643, -10230, 3500, -2331, -8322, -2351, 543, 22614, 23488, -3838, -830, 16240, 12555, 5105, -4239, 1595, 5026, -13474, -10859, 2561, -9330, -10207, -4380, -7517, -1505, -1381, -1451, 8350, 2834, 2697, 11499, 2872, 3412, 11377, 4338, 1684, -2827, -4512, 7269, -4444, -18841, -3589, 1202, -6684, -8900, -8489, 2781, 2815, -7775, 5568, 12057, 1301, 4896, 6223, 4425, 8072, 1755, 3542, 6120, -8007, -5799, 2629, -4826, -4895, -4517, -5338, -481, -7579]
149g579J587J4053o490m363N548l030M750K144p349L226j789l002P074o996l394
164e610R733m066m134J535k11R962k562j3135Q118N952l658J206o194J57O761
179C854n054O49l95o704R650K715j2401K527O089L271O1j1664M260J3709p380
194C187m909K996o70N454m131o512P770k435m362N875n190j721N709k933J280
209e92j217l640R121j781p275Q246N32m578K555j696L514J025r051N134M643p678
225b738J345R28l00M016p146m51Q811m680n42L584n447K940K565l199K834m279
241a759q89Q229o590m736P266j078l3j579m548P946J259p487M413Q44j284L869
257C843n345M07N039m739K507J549p189M098K185m195K601k401K97M749p070k43
$$ y = [-7579, -5992, 8061, 1571, -2792, 2756, -274, 4476, 6620, -729, 2497, 708, -2294, 4780, -2216, -5610, 4123, 57, -4077, -2542, -2753, 7209, 4647, -8488, -370, 5582, 1924, 3130, -3064, -2907, 3854, -1200, -551, -946, -7650, 2000, 4715, -7686, -5159, 930, 4201, 4262, -7402, -3142, 10567, 3187, -1722, 1274, 604, 6058, 1927, -4585, 3185, 750, -3612, 2263, -2927, -4648, 1061, -1872, -592, -1809, -5449, 3672, 1891, -5384, 2862, 3394, -1184, 1371, -325, 3189, 4214, -4837, 297, 4940, -2738, -1393, -465, -765, 3251, -3895, -4346, 4465, -215, -757, 2827, -2620, 320, 2885, -314, 2520, -1759, -2648, 5581, -1009, -5745, 1521, 443, 410, -1169, -5717, 2229, 3488, -3999, 414, 1258, -26, 3843, -1502, -1095, 3944, -795, 1712, 3261, -3928, 170, 2355, -1840, 761, -1640, -1343, 3406, -3664, -3907]
273c907O988l709M02k64l777O518Q2m909M114j944r72M581m336J328L801n262
289a266J450N61l504O388j032n626L110j905O90M136n546R04L537m943K231J170
305C55k277N292k814m359N651r60l91K248n181L077K975n969K626J128l327L572
321A646k723j790N584l328r57K696m139L690K776n753K368N45j474M339l875k012
337b407N782l497j861K465k029L507r36o442N216J908k883K965l030o81M684l259
353d98J092K726m410K578L6m686M847P86l006J248m657R04O296m410p32K312k959
370b533K665j91k339O083j596m370L686j720R16L679m884L07J095l391M174l63
386A218l962L995j904k362L739k064J821K396o137J582M156k570J853j442k009
$$ y = [-3907, 3081, -628, -226, -490, -4267, 2251, 2333, -2576, 1538, -406, -1378, 3203, -1133, 195, 3996, -1266, 184, 745, -2759, 3629, 2597, -3029, 81, -1824, -1134, 3002, -2544, -1640, 1897, -3046, -815, 355, -1922, 3370, 556, -3803, 1848, 888, 497, 2745, -2436, 641, 3616, -2353, 273, 1401, -1926, 1646, -1077, -2867, 2717, -611, -1568, 1128, -3011, 679, 3455, -2298, 70, 615, -859, 3480, -395, -2407, 3375, -122, -1983, 482, -1547, 1960, 1024, -5418, -202, 1706, -1177, 1788, -1242, -1923, 2761, -498, 594, 3320, -1090, 1488, 1524, -3162, 1685, 2471, -535, 713, -3944, -3040, 3256, -1154, -1886, 426, -2533, 132, -59, -2398, 3685, 2089, -2281, 1405, -315, 601, 4280, -604, -297, 798, -2593, 1581, 1218, -2744, 1251, -653, -3015, 724, -1340, 481, 2877, -3260, -1678, 2478, -92, 1761, 319, -1690]
401a690M288l192j465M846l163l59J834l995K629K047l107K623j498k372N075
416B501j858j435K467l325K213J819n142L062J924m339K177o05r31L516l350m05
432a711L643l402J349K351l714K616k38l054M472j160k869L051k317K10K567l514
448a720J436J036l301M112o38l533M224p59j701K396k961J351L346m487J44J325
464B70j699L073j987l014M379j296r23K777l443J293L583l426N79O44j281L958
480C487k489l621L897j074n16J380l823J653K370m106J975J316k541K766p13r42
496i81L145k568R41L133m402P63K168k676J975q50l070L326j674j936L591j895
512a010o48J481k016L187O32m030M099O55l456K340l49P2J864m252K20K913k979
$$ y = [-1690, 2598, -594, -2059, 2787, -376, -735, 1099, -2896, -267, 1780, -1327, 1296, -202, -2574, 2501, 643, -792, 1675, -1650, 563, 2382, -2760, 302, 2226, -2113, 64, -541, -1472, 2044, -1306, -1711, 1932, -1470, -121, 2230, -1484, 1132, 894, -2160, 2312, 1152, -1717, 1334, -983, -773, 1794, -1720, -284, 752, -2549, 1563, 925, -2608, 1616, 857, -844, 1552, -1409, -58, 3288, -1199, -1055, 270, -1429, 1644, -343, -3357, 1022, -274, -1197, 1580, -1863, -570, 3013, -413, 166, 810, -471, 3487, 998, -2623, 1274, 200, -316, 1064, -2759, -1106, 1264, -2842, -867, 449, -2092, 674, -39, -981, 2164, -404, 537, 3670, -732, 31, 2199, -477, 1498, 648, -2422, 904, -770, -2706, 885, -1010, -1658, -177, -2193, 994, 1626, -2404, 1695, 2350, -1106, 1234, 885, 957, 2821, -1431, -1211, 1702, -1277]
529a277J036K14k353K551j212j475M653k381j910L739j458N08J134k350K454k11
545A662k878K867j371j886L107k277p28K048l138J514K310l179J403R99j207K646
561A892k117o86M030k479o23J833l443J863K337l915N68J3p98K621k127j131L134
578I72j970O54J776l155K541J464l222J765L5j913K979j474j587J321j567J735
594C54Q32m407K780K135l119J612l19j023L204j725q47K391k209N25J017k182
610i81K157j037k796L871r22k711L067j058n72J437j988J911J414k804J724j50
626E62j289L058j735j570K677k731M9K794k991rJ070j190J862r23j460L182j674
643c18r16L026j800K86J444l132K050J346k693J413l67j819J922j330K31J858
$$ y = [-1277, -241, -27, -2380, 171, -1041, -2516, 2137, -244, -2154, 1585, 127, 635, 1769, -581, 1873, 1662, -1216, 1651, 280, -1606, 1501, -776, -1504, 544, -2594, -1080, 1230, -1949, -546, 453, -754, 1892, -225, -911, 3119, 640, 17, 1850, -1593, 270, 2607, -1308, -740, -727, -1525, 1096, -1031, -2162, 972, -998, -344, 1432, -1723, 818, 2282, -940, 825, 860, -1053, 1926, 452, -1135, 186, -1381, 354, 1186, -3221, -441, 1694, -1425, 187, -132, -1155, 2049, 324, -523, 1868, -341, 184, 1201, -981, 1176, 139, -2657, 1214, 292, -2419, 648, -410, -982, 455, -1533, 378, 1792, -1012, 712, 562, -727, 2331, 596, -974, 1703, -1028, -979, 1815, -1176, -1185, -115, -1305, 557, -366, -1826, 1356, -318, -1234, 1792, -8, 278, 1722, -1410, 640, 1986, -707, 706, 339, -1480, 442, -888, -657, 1201]
659A201l156Q62K100k536J866J194k705J711l79n35K633k008q96J969k025Q51
675A47P22k187K036m31k822L003q4j704K175j536rJ658j995J809R05k890J824
692F21K57j778K224j205q90K504k764j00K297k085O66N10j697K002o94j189L019
709A698j810j133K529j536K96J162k225J740K48k385K164k03j497J713j382QJ895
726A282k492P21J600k431J235P37j691J982j038q16K484j867n33K271k116N83
742h9J020k028J756j41k040K503q07j336J977j424J90J567k428J426R48k496J770
759C68L40j422J655j046n33K168k049Q8J586k026J041N50j822J875p78j449K381
776I27j074o96J648j610N55J037j926J875Q0k078K059j47j453J921j334k66J555
$$ y = [1201, -1955, -1093, 1007, -1529, 337, 1531, -1174, 537, 158, -377, 2256, 248, -648, 1321, -704, 147, 869, -1318, 718, 287, -2535, 468, 384, -1320, 855, -681, -690, 968, -1027, 782, 1687, -1203, 621, 878, -900, 1324, 119, -771, 1733, -1031, -1131, 1166, -919, -253, 257, -1440, 562, -132, -1321, 1698, -112, -1245, 1284, -252, 44, 1206, -1019, 721, 969, -1416, 748, 545, -952, 761, -621, -613, 1282, -1210, -489, 1111, -1320, -85, 652, -1039, 943, -95, -911, 1573, -294, -827, 1444, -672, -89, 931, -1097, 659, 518, -1522, 981, 174, -1162, 815, -609, -419, 1148, -1280, 146, 1094, -1402, 368, 708, -714, 941, -105, -638, 1530, -519, -431, 1155, -871, 170, 720, -1102, 773, -5, -1454, 927, -147, -843, 805, -805, -250, 787, -1139, 736, 816, -1262, 797, 650, -803, 1118, -216, -482, 1073]
793A073k174R41J307k339J133L66j362J795r95p30K272j745l35K101j732O50N63
810G89j717J862m20j691K266j067r97J649j446M14J188k006J318O55k236J724
826B85L20j315J601j236j96J942k052N48J537k172O23N13j376J935p94j398K086
843H51j251n51J781j266M15O50j878J725M57k091K118n60j272J689j096J72J171
860A064k095P67J224k092J214L18j103J360j118o30K484j702l93J675j581Q65
876B57L53j622J881l14j624J957q38p67J533j276K51J133k050J300N82j963J574
893C67m6j060J538j187k40J884j955L43J310j621Q99L06j278J698p29j342K021
910I08j007m54J338j432N77O64j673J513L2j672J797l55j117J612j078J27J227
$$ y = [1073, -1101, -160, 1147, -1192, -59, 307, -1055, 740, -255, -985, 1287, -458, -793, 1308, -424, 226, 789, -928, 934, 514, -1177, 1089, 22, -975, 674, -772, -358, 830, -1176, 142, 797, -1439, 285, 605, -710, 891, -345, -541, 1401, -651, -103, 1434, -738, -115, 398, -978, 957, 163, -1235, 851, -400, -951, 830, -436, -21, 629, -1249, 476, 933, -1158, 960, 400, -872, 817, -279, -107, 1064, -1031, -264, 960, -1132, 82, 400, -703, 657, -461, -1091, 1393, -309, -702, 973, -608, 257, 610, -1012, 869, 555, -1069, 888, 50, -717, 816, -460, -209, 924, -1126, 174, 756, -1207, 367, 321, -739, 799, -388, -628, 1256, -699, -356, 954, -667, 232, 538, -740, 958, 229, -1113, 908, -99, -553, 785, -647, -70, 594, -1079, 434, 466, -1206, 591, 236, -881, 731, -347, -220, 1007]
927A007j945R68J018j738J055n7j110J748r52p31J753j577p4J488j417O57L19
944D12j390J512k98j282J967p54q57J509j437N45J124j796Q49M86j498J331k30
961A93q33J394j475L1J877j936K04J567j564O66P5r88J493n31r02J506j242J29
979c36J262j570O84O56j641J325L00j737J550k34o54J016j321M94J240j802N01
996b67Q15j538J504n9j296J357o23o47J818j142j76J012j413Q53L13j309J540
1013G42l99j471J692m88p08J329j152P8Q97j482J328K69j608J276l20o05J755
1030A133j272j99J452j690M05J185j351L81O9q50J449r60n71J686j228m55J355
1047E39j055P27L39j211J096Q0j117J294n36n06J107j251L99J098k095Q75J013
$$ y = [1007, -938, 30, 1048, -690, 365, 308, -802, 946, -6, -737, 1016, -561, -635, 853, -564, 93, 412, -978, 534, 236, -1046, 921, 167, -690, 819, -618, -73, 1051, -745, 104, 590, -908, 423, 193, -640, 754, -721, -690, 1187, -749, -545, 1022, -542, 124, 199, -789, 704, 173, -729, 777, -465, -336, 926, -644, 40, 696, -945, 380, 680, -1057, 493, 259, -395, 621, -700, -206, 1034, -768, -267, 548, -990, 514, 455, -841, 516, -107, -754, 1064, -78, -254, 758, -655, 198, 511, -798, 742, 343, -1128, 564, 76, -632, 697, -455, -377, 520, -962, 366, 635, -973, 303, -17, -622, 1133, -139, -338, 1114, -576, -171, 1014, -337, 44, 113, -737, 712, -248, -819, 867, -361, -816, 539, -516, 211, 550, -661, 435, 515, -602, 692, 156, -350, 757, -494, -95, 1003, -1092, -217, 796]
1064G96j692Q80j6p01J368p95n36J450j124K44R55j335Q67K14j340J506l23j267
1082h49J393o10n43R35r79P36N29j682J039M70j298J487m51q65J393o96j62J165
1100A012j192J89O13j213J018k10j075J435q14q60J836r05n06J200j335P34O70
1117E97j116J009k14r80J356n14m93J285j282JJ191j440M51P18j346Q86k26n34
1135f51J309j029k27J407j242L20Q23j342Q50M23j195Q92mq29R80n60l2O29j341
1154h19O59Q99j661J086M63j537J118r6o39J255q08j92Q33r94M75P99j376R68
1172D33l04r48J472m24r60J199o17l76Q76p76M82K33j074J112m2j008J461o19
1190A20o34J215r18Q2Q15j278O60M95j027P15n15l23J269r33k84J329j067K0Q85
$$ y = [796, -896, -16, -32, -733, 635, -160, -696, 754, -370, -126, 829, -506, 361, 575, -765, 741, 418, -849, 544, -66, -609, 326, -653, 83, 612, -1070, -31, 439, -859, 628, 177, -688, 705, 9, -153, 1012, -180, 9, 622, -591, 427, 217, -858, 577, -237, -1097, 739, -166, -672, 528, -807, -73, 597, -519, 490, 276, -704, 652, 138, -355, 930, -352, -351, 840, -600, -149, 569, -777, 109, -117, -651, 658, -371, -598, 809, -433, -113, 710, -632, 218, 641, -554, 338, 334, -495, 485, -75, -107, 522, -819, -160, 739, -922, 164, 627, -910, 208, 112, -527, 728, -80, -272, 561, -433, 42, 841, -535, 433, 129, -819, 653, 229, -731, 468, -149, -525, 351, -425, 57, 290, -784, 328, 286, -722, 739, 120, -514, 701, -217, -135, 680, -598, 62, 557, -470, 245, -270, -593, 676, -257, -541, 788, -279, -259, 626]
1209F26r95N59K00r49J044m07n23J015o43k24Q04j019M26O28j357P77L89r68P12
1228I5m4m12Q08p47N9R23j007L72L59r23R51j15q74J010m19o35J024n94k61P07
1248B77q42N89L52r41Q36J9q91R52l17l39Q76r61K71P74j259P02L19q84O99k81
1268d9m78J140p79l88J149j033K72O39p07M65J47r27J017l18n32Q16n06p3M61
1287C16q87O04N22j275Q52J24p32Q55l94l39R76r20l5R68r80L24M78r14Q11k74
1307H0p32J219p72m24J014o92k1O64q25O45K23r19P71J4o64R33o57j20Q97j082
1327d48L02O81r24M13K02p17P03k79m42Q53n61k14J032q06M3N19p51O89N1q00
1347d54Q50l03n46Q89n03k23O78j027N82M49r54P00N3n22P44l93k50Q00q24J36
$$ y = [626, -369, 190, 390, -559, 485, 78, -445, 570, -73, -297, 507, -512, -86, 542, -815, -38, 351, -617, 95, 51, -361, 447, -300, -241, 682, -325, 47, 406, -517, 434, 319, -555, 455, 36, -599, 425, -169, -430, 277, -565, 24, 376, -565, 271, 290, -601, 351, 34, -305, 571, -390, -119, 655, -604, 98, 417, -467, 232, -49, -527, 613, -166, -554, 595, -438, -166, 473, -234, 231, 378, -549, 468, 150, -382, 434, -72, -145, 316, -571, 33, 555, -720, 132, 256, -476, 379, -15, -354, 622, -298, -333, 635, -345, -21, 457, -457, 354, 80, -652, 567, -205, -629, 385, -307, -328, 336, -489, 156, 379, -540, 231, 245, -419, 514, -143, -263, 634, -448, -146, 535, -389, 24, 226, -491, 212, -67, -509, 344, -217, -431, 601, -205, -162, 357, -394, 295, 346, -454, 396, 93, -453, 436, -67, -290, 388, -639, -57, 392, -562, 138, 191, -331, 413, 20, -230, 570, -254, -118]
1367a18O74q17J67L97o91O08r8o41Q87m00m41Q42n88R6M73p39N44J65p46P17m5
1388B46n32O18m01j80O66p62K31M98q84M80L40o81M82j19l80R06o51j64Q29p33
1408a91Q6N05p76N17P4n91P56k00o76P66m53j28O58p01M22K40p65N35K11n83P68
1429D74m98k17O21o23K1Q91r19J54K82n30O27k84m66P61l11m15Q38o44J44M69
1449C75p12N11Q9q10Q72j39m94N60m51M6N87p66K27M71p52L65J99m62M57qm39
1470b74P18n07k31O67n69K15K53n91M20P0o76P46m6m88N07l60R0K94n40K77L18
1491B93o73M68J32o83O76j81j64N39m19j48L66n44L39J39n84P73j72o67P60k67
1511a7k87N69l35o9M76o06M70J24o00N01k60j81N06m92N2N00p14J23N92m99J02
$$ y = [-118, 556, -261, -94, 303, -388, 220, 122, -519, 368, -32, -473, 369, -219, -123, 350, -389, 155, 320, -426, 291, 246, -286, 332, -69, -249, 417, -345, -114, 384, -500, -20, 320, -361, 121, 2, -378, 528, -123, -287, 542, -191, -105, 400, -376, 141, 215, -376, 380, 180, -496, 270, -183, -311, 347, -354, 68, 308, -457, 78, 289, -294, 474, -24, -241, 380, -243, -222, 669, -250, -96, 186, -344, 283, -1, -467, 294, -17, -432, 406, -238, -94, 375, -337, 174, 263, -547, 325, 186, -308, 252, -199, -153, 434, -332, -105, 366, -386, -21, 178, -284, 173, 165, -274, 444, -63, -294, 373, -196, 19, 272, -319, 101, 171, -505, 241, 195, -293, 214, -146, -56, 238, -302, -25, 293, -380, 88, 220, -463, 213, 32, -132, 407, -12, -160, 206, -338, 1, 140, -444, 329, 157, -510, 250, -17, -304, 265, -70, -139, 337, -269, 201, 325, -275, 226, -34, -215, 291, -201, -149, 351, -363, -240, 352, -147, -45]
1532d5R8k89L89j99j12O24n82r6O07n97J75M13o93M67P3o12O39j97l00M21k83
1553i9N9L66n98J80M31o89M02R1m64N36k36q5M84m88l1L97n50M40k6m67N04p5
1575H2l89N63l77k07O46l25m8K98n20N24j03m16N70k45l07N41m57j2M58m53QL98
1597B29m77K85O1k28L23k55k00O41l51k81N53n03J55K57l93K96p2l88M65j16k49
1618b48M45m40J13M48n88K50M30o44L75n2l30N56l60p3L36m56J91L25n58K33K02
1639A55n01M72q6m27N67k19j17M02l56J26O0l64K55L05n69M63p1l98M92k76j68
1660b55M06m46L28J36m46L31P7l47L78l8m61O15l61n6M16l75L3J32l38M53q5l13
1682b16L80k46k23N99m71J13L82m11Q3L05m49L78j25k51K68k22J4M27m96p8M81
$$ y = [-45, 53, -236, 153, -46, -158, 466, -116, -212, 395, -202, -27, 386, -307, 160, 233, -379, 260, 63, -237, 184, -99, -40, 326, -272, -92, 339, -350, 52, 143, -321, 215, -21, -106, 378, -110, -141, 256, -294, 146, 120, -347, 157, 82, -307, 256, -121, -328, 318, -7, -55, 243, -277, 247, 144, -272, 298, 53, -254, 287, -170, -182, 276, -177, -169, 229, -248, 37, 98, -130, 193, -62, -262, 379, 28, -253, 300, -203, -48, 209, -184, 112, 40, -348, 117, 1, -248, 197, -243, -130, 318, -270, -20, 410, -234, 141, 89, -241, 315, -45, -118, 218, -238, -47, 278, -280, -47, 155, -346, 126, 40, -387, 180, -39, -156, 246, -110, 16, 76, -288, -33, 272, -297, 166, 95, -303, 189, -87, -255, 151, -295, 33, 169, -277, 54, 131, -216, 162, 124, -337, 278, -83, -139, 277, -98, -65, 67, -271, 182, 97, -216, 164, -82, -305, 294, -177, -64, 318, -93, -10, 295, -154, 224, 99, -152, 116, -106, -92, 335, -161, -239, 242]
1703B42l59P2J26m16M92l4m09L18j16J4L08l62J50L97o75L19P3l74M02r9k72L43
1725A40k21JL13m79K92K78n18K91K3l23L33k21j98N25j85o5J74m25L61J64l66
1746a06J61o7l30N61l22q6M10l54J14K00m62L59J17m63L51p2j55K78j96j70N18
1767B86l14j48K27j14J68J6l68L73J0k72L50k61kK83l27N4J38l03K39Jk64K95
1789F7n5j48J80p5k7L57m40J01K70k48l2J97l40M84l26j71L23k29K3K46l64Q3
1811a24J87l00L58n8k24L64j32l07M60k63L8L09l86J21J63m31K20m7j71M09l33
1832a47o0M26l60J04L25m28K85R0m12L02m7k65K37m5p5L21l43O6J35l70M16j1
1854A44m33L94j0j65K57j42j93M12m03K01O6k95K14O5l44K98j8k62M06k30%J57
$$ y = [242, -117, -45, 81, -335, 157, 123, -286, 32, -84, -70, 238, -124, 26, 423, -252, 67, 140, -234, 168, 69, -203, 140, -81, -80, 233, -246, 46, 324, -194, 97, 120, -203, 130, -91, -289, 236, 51, -14, 160, -265, 96, 260, -106, 55, -12, -342, 219, -103, -189, 221, -133, -19, 181, -281, 78, 195, -268, 83, 11, -144, 134, -62, -232, 286, -28, -176, 51, -63, 105, 121, -247, 126, 136, -136, 214, -47, -49, 234, -93, -39, 99, -204, 35, 36, -228, 67, 12, -136, 44, -31, -58, 299, -141, -40, 230, -18, -50, 147, -193, 291, -35, -206, 117, -112, -89, 157, -207, -124, 63, -237, 121, 63, -161, 203, 71, -236, 224, -39, -1, 308, -78, 43, 206, -225, -5, -52, -223, 186, -147, -207, 219, -141, -37, 288, -140, 145, 235, -177, 125, 78, -187, 50, 5, -70, 251, -92, -26, 109, -261, 155, 144, -289, 105, 95, -70, 187, 45, -148, 264, -139, 62, 128, -167, 47, 112, -232, 66, 48, -214, 192, -38, -38, 119]
1876A19j75J03N2k33K29l3k29L46j34o8J90k43k9L33l12o0J91r5K09j38j17K69
1898A75k07j23M48m08K14K53m99K22j3k52J92Q2l40L69q7j60K05k82K65J77m32
1919b01K14J25k79L22k67k2K85j79r8K83j65L7J44l69J48J84k70K20r4k63M74
1940B29l26p6L15k71J21J94l19K25K6k53K64j88q4L04j61q5J32j33J61K8l07K34
1962C0M1k55K62j62K5J78q5j17J88j73J51J00l58J77J27j72J92n9j72K47l19O9
1984h5K85k46R0J9k14M64k54k17L34k14L4K68m64J17J71j92J13J25k62L33k08
2005cj72J80n3J3N3j02P2J34k54J00m1K3L12k56j48K89j50n2J70k15J64J04k05
2028c7O0J57j54J34k12o1K98j47l4L6j21P5J89m29K36l1m1J93k10K6K13k10J7
$$ y = [119, -56, 47, 99, -134, 95, 62, -167, 179, 45, -23, 167, -76, -105, 228, -84, -144, 47, -48, 161, 23, -94, 175, -32, -155, 293, -115, 99, 352, -147, 75, 62, -190, 2, 84, -256, 113, 26, -134, 71, -211, 54, 231, -201, 13, 138, -141, 181, -86, -108, 177, -2, -100, 183, 18, 55, 199, -170, -22, 162, -108, 112, 18, -245, 229, -97, -173, 142, -129, -8, 186, -133, 92, 118, -135, 129, -59, -143, 161, 0, -85, 47, -86, 75, 103, -204, 30, 71, -184, 78, -84, -59, 119, 34, -83, 105, -68, 83, 183, -175, 2, 129, -43, 149, 90, -82, 165, -154, -85, 200, -46, 44, 63, -151, 313, 59, -158, 176, -38, -4, 264, -200, -83, 88, -104, 9, 134, -128, 205, -3, -175, 5, -48, -35, 18, -84, -12, 122, -132, -32, -73, -50, 262, 6, -142, 147, -3, -55, 115, -100, 64, 168, -37, 23, 180, 26, 160, -52, -113, 185, 38, 4, 40, -81, -6, 183, -246, -10, -41, -82, 111, -99, -73, 140, -70, -53]
2051e3O4j25J52J12l64K21P5j99K28k15K0J93j85J6J01r2J05o2j10J77Oj75J48
2074C8o7NJ52k20p3J40j09K38m8j58K82k19K0L2j74R2J04j33NJ92j13J16j96p0
2098a64L20j24j20J54j22J08K8j78J48O1k30N0J23j99J87j49K0R9m2P3P5k16J01
2121Cnl2Q1O1j47J61k28n7K33j65L4J00r7J57qk12J37Q6j55K07k15n0K39k87K56
2146I7J15l38J67K8j38J13k18J03K27j26j72J56K8q1J3j43K06q6L0R2M5j51L6
2169CJ02j44J22q1O1j1j14J57p0j72K25j03K1J37k69P1K62k77J10J06j50R7q3
2192@n1J33l8M4k3j29M9J06j39L8oj18J83L6j60J52j11O0J4j10N6J14j96J95j20
2217b1j09K53j38N4N9j57k7J64j49%J42k07J84l6r1Q8L3j15K70k96N5J10j26J40
$$ y = [-53, 11, -114, 38, 150, -214, 7, 82, -117, 111, -104, -84, 109, -76, -60, 41, -51, 54, -8, -118, 59, 65, -110, 38, -29, -24, 128, -92, -165, -25, -134, 104, 56, -102, 180, -39, -19, 13, -161, -69, 35, -98, -93, 99, -14, 102, -94, -164, 156, 32, -88, 66, -56, 52, 80, -98, 50, 111, -119, -69, 54, -145, 42, -107, -87, 12, -30, 43, 118, -98, 3, -2, -34, 47, 108, -39, 122, -106, -163, 70, -95, -61, 39, -58, 99, 91, -121, 16, 102, -53, 154, -61, -111, 128, -159, 97, 212, -126, 41, 69, -69, 44, -174, -71, 156, 30, -142, 14, 42, -39, -26, -169, 37, -49, -19, 73, 118, -33, 3, 105, -39, 83, 2, 63, 52, -62, 95, 25, -147, 78, -25, -4, 133, -136, -65, 197, -80, 30, 136, -14, 83, 0, -51, 82, 44, 88, 65, -64, -15, 91, -48, -10, -16, -134, 49, 85, -75, 77, -34, 26, 40, -70, -14, 100, -96, 99, -21, -130, 123, -15, 39, 98, -59, -86, 78, -71, -71, 71, -136, 48, 12, -79, 9, 42, -73, 197, -99, -44, 66, -60, 80]
2241H0m1j97K66N6l16J95k9o8J65j45ON5M2j36J52k43K00K2q0K15k68J5J74j63
2265d3J3J75j42K2R2j99K44j26k08K70j24LJ46j26j04J47p5J01R0k07Q8j4j3L5
2289D5q4K5J24n7p2O3n7P2p6j93K76l9j0K4m5L6Pj74J17R7j06J85n6j76P0l5k4
2316f3L9j37J82P3j50m7K58j93P5J6k28K84j11j37K27K0r1J43j98N9p3R7lNn7
2341a0M7n6k7R6k01J60L2j02n1J81r2J5k9q0J44j6j36K05l4K8oj86O3R4k00J95
2367C4k3q2J30j84K5K49k14J98r9j68K37j59p0J78o7k1Q1j55J13J02j47N8J00
2390A16j61J88j55l4P8j0j00k6M7M4N4j28R1J19j74L9n9o4R6N2j16L05k35o8K41
2415A40k57J20J12r9N7j38jJ49r4o4J00j4L5k8p6J07Mp%r0Q9O5j46NJ74j43pJ72
$$ y = [80, 39, -158, 108, 164, -152, 43, 14, -54, 111, -34, -28, 27, 69, -67, 85, -158, 42, 64, -16, 199, -69, -54, 120, -43, -30, 145, 3, 25, 117, -82, 162, 36, -172, 98, -26, -23, 123, -3, -107, 40, -35, 66, 156, -51, 37, 23, 10, 45, -39, -14, 110, 53, -19, 44, -13, 59, -17, -210, 66, 27, 17, 41, -4, 32, 39, -135, -18, 79, -27, 158, 102, -74, -4, -39, -63, -24, -161, 21, 94, -56, -103, 155, -38, 37, 53, -175, 109, -2, -139, 88, 108, 17, 160, -38, 21, -52, 45, 42, 47, -10, 37, -19, -46, 50, -151, 9, 41, -61, -112, 69, -23, -8, -37, -117, 27, 11, -125, 80, 46, 74, 68, -118, -55, 39, -161, 34, 11, -71, 59, -125, -100, 149, -65, 133, 34, -134, 103, -56, -126, 52, -15, -36, 45, -110, 3, 105, -42, 16, 116, -45, 143, -12, -46, 32, 22, -78, -104, -57, -13, 41, -87, 4, 123, -51, -12, -71, -135, -39, 13, -103, 202, -33, -101, 140, -117, 3, 115, 16, 73, -65, -66, 83, -11, -75, 25, 11, 46, 18, -58, 49, 53, 46, 46, -44, 45, 110, -36, -31, 143, 0, -7, 165]
2443A65k96Q1J61Kj31k1j4O3n1N9L8j89K47j14L0m0q2J7n6J79l0P2q9K0J7o3o0
2470h5J49j27M3M6q3M9Mq1J67j72L9J67j29J62p5r5M8lr0J32K3k48J04L8k6Q8
2496D5j27J58l2o0l9K8j23J79m8J2L4l1L2J3j29J80k2j27J22l0o8L3J15k41K8
2521i8k9R3m0Q6ok1k1lO4j73P7Q2J7N5k46J57M2l4J9J3j00K8J20j65J55r7j9J25
2549H1k3n3l8J71j13j5p6R5N1j78J28r6Q9l0l6K1N4l9P6j51J3J84j74J38k5p3
2575a9K5R9j29qlK8o6J05j40Q1M1q2J83j90J34l7p1n1J04K8k0O3j78J08l8l2J04
2602C9o9P0N9j60P4P0k35J21l1q7K02p6ON4l3q7J81j9j17Q7j82J64N9q6L4p4J32
2629I6K2j26J3O7j78J06qj3Lj1J8k6L5n3J21j68J58n2q5P9R4j55j3LJ11%m2m2
$$ y = [165, -131, -50, 111, 113, -18, -39, -53, 10, -41, 18, 56, -133, 114, 0, 30, -10, -92, -75, -131, 48, 18, 90, 1, 21, 38, -25, -85, 64, -63, -20, 26, -57, -8, -4, -85, 82, -90, -51, 116, -13, 149, 74, -21, 27, 24, -66, 66, 89, -159, -55, -17, -43, 45, -82, 76, 44, -16, -55, -27, -150, 29, -19, -7, 27, -4, 28, 41, -88, 92, 70, -57, 65, 35, -33, 0, 115, -126, -98, -127, -34, -74, 12, 6, -15, -36, -39, 25, -148, -71, 11, 28, 83, -163, -6, 36, 2, 21, 34, -66, -38, 82, -83, 72, -25, -44, 81, 58, 5, -33, 138, 25, 10, -66, 29, 80, -98, 30, -66, 23, -7, -43, -22, 32, -7, 69, -82, -69, 115, -59, 79, 54, -19, 6, 105, -24, -32, -35, -7, -73, 32, -108, -27, 14, -68, 115, -75, 59, 22, -49, -100, 4, 32, 12, 75, -103, 5, -33, -65, 39, -30, 40, 99, -61, 13, 83, -152, -31, -62, -149, 53, -23, -17, 37, 4, -83, 98, 79, -38, 49, -133, 31, 90, 4, 38, -36, 96, 118, -8, 5, 72, -106, 0, -8, -21, -18, -29, -11, -37, -2, -55, 66, -102, 56, 4, -81, -2, 92, -63, -76, -73, 38, 38, -4, -46]
2657d6J35j21L9qr8J41pj07P6N6q4O1o8M8O2j36k3J30j51J17r4j2L4L5r0J88l8
2684C9j96J35J0L2m4n4J58K6o0J4r8K2m8R6R8j12j10P3m2L1J82j58K9n5j03LK10
2711G8j14M4lN2q6K4o8R4P3o9L1J09j12j10o4J01J00o9j43J36j13J83K0k10K34
2736A18j98P4J1p9J19q1P5MK2j35J51j66o0K04r1j32R0Q5M7N1k72R0l2O3L6J20
2762A14l8q3O3L6q5n8N0O5j7P6j90RP6j1p9J49j76P1Q0j25q5J02j9M3J14r7K3
2789Hk3Q1m4k6k7J07r8P6J4j05P6nj11L9N2ok6O2Ok3q1M7K4%K6q7Q4l1k3l9J4
2820c9L3K6K3j51P0P6j00K5O9o4P0j26J0K03j76N0L8r1Nl3R2P9j26J08L8j27M7
2847B9j0j29J42L2o3j0N3j11J05j2o7M5Nj31J60k1j8K2j24K4P7p9J08K9r5J26
$$ y = [-46, 89, -32, 7, -1, -99, 42, 35, -72, 4, 60, -24, 37, -31, 17, 79, -57, -80, 50, -101, 16, -78, -90, -56, -21, -111, 77, 39, -157, -22, -12, 20, -24, -78, 80, 106, 46, 60, -38, -16, -64, 32, 130, 18, -92, -19, -61, -30, 152, -6, 23, -32, -135, -132, 78, -36, 8, 5, 57, -29, -5, -73, 21, 94, 25, 56, 165, 53, -57, -121, -20, 80, 11, -132, 4, -109, 74, 94, -116, 118, -80, -6, 5, -74, 45, -36, 39, 43, 65, -70, 81, -85, -145, 59, -32, -164, -74, 11, 58, 109, -163, -73, -105, -42, -6, 114, 76, -7, 56, 92, 7, -51, -1, 64, 47, 123, -67, -58, 18, 7, -72, 77, -99, -28, 52, -73, -158, -56, -75, -32, 82, -15, 8, -15, 66, 22, -4, -31, 76, -22, 54, 68, -37, 39, 34, -77, -38, 14, 8, -18, 44, 50, 27, -54, -7, 17, 17, 43, -44, 40, 9, -14, -53, -39, -6, 20, 43, -108, -38, 38, -62, -37, 32, -32, 38, -88, -78, 125, -51, -1, 37, -54, -49, -82, 10, 89, -37, 71, 109, -18, 29, 19, -110, 32, 64, 1, -9, 44, -67, 38, 26, -41, 4, 9, -122, 38, 17, -1, 21, -103, -79, -2, -81, 27, 56, -39, 87]
2873H7j61J54q2J5n3L7r8P1k8L5M0o4K8O7m5J03n8j44J53k8j9P4n2n1R9j34J7
2900c7J11o0j28J19j80J47L1m2K6q2N9J37j36J9Q3j21O6o6J21j0j12J3K18j95
2924a9PJ4r0J19l9jK8K2j33J19j1n4L0J4J5j14P6o4OQ5J7k8o1R4j13J30o1NQ2
2953G5k9r9J00n3J0k0K7n0N6R3j41M4r9M9J66j00J2N4r7P7j09p8Q0J65o0q2o3
2980g2J94j02Kj5r5K4O8K7j20J5mR3l5J05m6p8o2Q5N5o3J35r9K3oKl6K01j69j9
3009HO3j29R3n9Q1j84K28j81O5M8l7J3q3J04j22L0j5R5m3J05J0j34k2J7MK4r0
3036a11O3R9k1K0n5l0R9j19O2K3N8j8K2o9k2nJ1k3K5m5O4j3n6PL8n7P2N1j08P6
3066C8KN6j00p1O2j3l3J69q0J27j53j18J49o3J8l6P9K9L0p3l4Q9o9O5o8p6Q8N
$$ y = [87, -74, 80, -2, 13, -40, -3, -101, -30, -58, -23, 17, -47, -19, 48, 3, 106, 48, -96, 57, 29, 10, 84, 32, -19, 80, -54, -37, 74, 14, -114, 5, -175, -28, 3, -39, -13, -95, -36, 101, -35, -16, 67, -54, 12, -54, 67, 57, -55, -42, 176, -19, -12, 2, -88, 31, -8, -9, 19, 41, -92, 27, 16, -38, -8, 6, 21, -93, -17, -81, -75, 10, 27, -1, -62, 32, -81, 49, -12, -7, 75, 46, -53, 47, -6, 4, -16, 11, -39, 17, 110, -31, 13, -86, -37, 129, 29, 41, 95, -2, 75, -34, -112, -32, 133, 73, -9, -72, 122, 20, 22, 7, -88, -64, 4, 31, -89, -74, -78, 15, -20, 85, 39, -39, -101, -16, 39, -24, 111, 12, 35, 29, 31, -5, 196, 27, 8, 71, -58, 35, -24, 57, -127, 101, -80, -15, 33, -4, 9, -74, 30, -92, -62, -77, 18, -25, 80, 90, -44, -66, -49, -45, -21, -111, -48, 51, 30, 50, -5, -35, 64, -55, 7, 30, 88, 70, 92, 23, 1, -4, 7, -16, 9, -36, 28, 15, -41, -34, 4, -53, 19, 70, -38, 38, 40, 96, -4, -75, -13, -26, -59, 110, 30, 157, 4, -114, 35, -28, -10, -46, 33, 62, 92, 19, -15, 74, 5, 70, 2, -74, 14, 19]
3094A9j8m0J43j45J51r2l6%o1P2j0%O2p5K3Q5j20N5J69r7j70J37r3Q0j06N7J03
3121I3J4j02l5N8j08K39j81j38J65j06J6J65j82Q6l0R3n6n7l1N9k1mK09j16q2
3146e2J48j35OJ9n0O3o8KQ4p5j7Q5j43J58Q7k02J06r7r1K37j20j9Q9j86K13j1
3172C1j16R2r3Q3R2j35J9J39j06K6Or8M6P9j98K8N0L8O9o1m5K13l58J79J82k54
3198i2K0R2n5P5J0m3N6p7o2R1r4rO9j27J01J4N6j01K9KJ00m4m8r1P4O8M2m8Nm2
3228b9K0l0M8l7K6q6L9J27l7p4P9j20J60j20mK5J02k07N6Oj1J23j99J77j7nPo2
3256d3N0k4m2M3L0m9K3M5K7k7q2K2J24r2rJ7j3K2K1m8rJ21j57j5J03r1P2j64P8
3285f7N0k0L8Qj05J37p7M6o3P5l0K3J28k14R9r4PM0oo0J18o0K9K3l9n6L8j7J01
$$ y = [19, 1, -39, 104, -41, 110, 18, -18, -18, -79, -7, -17, -17, 45, -30, -7, 78, -42, 13, 182, 85, -85, 52, -41, 39, -67, -10, 93, 107, 5, -30, 28, -80, 159, -22, -160, 5, -101, -85, 80, -102, -16, -46, 47, -9, -66, -97, -38, -59, -63, 146, 30, -52, 96, -39, -33, -14, -64, -1, -69, -67, 17, -58, -75, 10, -133, 25, 112, -90, 16, -81, -172, 65, -55, -74, 15, -171, 42, 31, -85, 7, -86, -3, 89, -46, -27, 112, 6, 32, 38, -60, -14, 65, -133, -105, -55, -17, 52, -9, -54, 159, -199, -20, 162, -92, -72, 20, -35, 40, 50, 7, 63, -14, -76, 15, -79, -88, -19, -146, -45, -31, 25, -76, -47, -45, 55, 11, -37, -128, -54, 14, 56, 8, 13, -29, -9, -39, 9, -28, -2, -88, -49, 78, 41, -33, 46, -74, 86, -34, -38, -13, 89, -118, -62, -56, -67, 56, -143, 34, 17, 12, 19, -43, 7, -17, -59, -16, 14, -35, -12, 33, 60, 33, -49, -27, 97, 5, -4, 13, 0, 22, 43, -5, -14, 107, -50, -65, 38, -53, 19, -145, -67, -17, -37, 1, 9, -96, 41, -36, 10, -53, 22, -8, 15, 143, -71, 28, -66, -59, -19, -25, -85, 33, -27, 2, 25, -14, -70, -32, -49, 52]
3314E2j6j25J8l0J89j47P0J07m5j44P8l0p0Q2jj6J09q4q2J30n8L2q1l8J35K7j46
3341h4J55j70Q6K4j4N3O9j78P6l2j23J16O3m9lM2m6j8o2O1J40r0%k3o5J60j82
3368i4J8J90j49l8J57j79J0j8K22m8n3p9J27o1j75J95n9k3J77j93J14M3n6%p8
3393e0N8L6O6j56J38j34O8J04j75R5j06R8p4N4j07L9n2J50m8o7J52j08m3J14q0
3418b8Lj11J03J10L8J1j46k1pJ6j2l3J41p8n6Q2k1J20L4k40J00k7j8Q1j16K2Q7
3445C4Q5k30J81j28O2j2l5J63j98N1r2J39j9p6J62j25J66k79J92l9L5l0j01Q3
3469a1O5o7l9M5J8OQ0q1o8M8m1%N9j7L4k8j50L04j47o1K8J0R1n4lj7R8k42K55
3498A15m5j33Q1P9q1m8m6K4Q1p8P5k6j24J13N6o7J91j39j11k2P3M2P0j77K01j25
$$ y = [52, 36, -89, -71, -101, 88, -59, 11, 118, 73, -71, 7, -23, -93, -11, -12, -28, 81, -3, -85, 45, -13, 19, -62, -100, 35, 62, -84, 71, -99, -13, 11, -3, 50, 119, -59, 17, -15, -138, -22, 41, -8, -11, 31, -15, -33, -95, -34, 106, 16, 16, -7, -72, 88, -94, -76, 114, -35, -73, 84, -95, -85, -103, 119, 71, 18, -61, 66, 5, -170, 25, -34, -57, 120, -73, 41, 84, 28, 28, -50, 8, 44, 110, -46, 92, -42, 26, 130, -45, 50, -56, 42, -32, 22, -85, -46, -98, 52, 4, -63, 89, -19, -62, 52, -28, -25, -136, -33, 77, 115, 126, -20, -41, -48, -32, -44, -77, 64, -14, -70, 12, -9, 111, 145, -95, 5, -22, -40, 41, -75, -53, 34, 119, -111, 70, -58, 4, -8, -43, 120, -78, -27, -119, 20, 1, -75, 87, -38, 128, -151, 41, 2, 37, 7, -94, -11, 54, -13, -52, -7, 11, 17, 97, 16, -52, -4, -45, -45, 14, -3, 31, 3, -147, 157, 10, -51, -23, -13, 78, 24, 21, 4, 102, -140, 115, 70, -63, 18, 97, 16, -32, -78, -54, 27, -51, 24, -2, -126, -13, 43, -24, 167, 28, -83, -105, -32, 10, 80, -97, 104, -21]
3524b1M1m9O6j72L27j77l3Q3j45P8m3q4K38j00j1J3N5o4Ll7J4J14j85J10M0o9
3550hMlj16J09K7q5J07m0M3n3p9L7N2n5K4L2n7K6j2N6Lr7N3JL5J2n6Oj3nJ09N5
3582A12k02q8K30L2j21L1j28O8P1j1p9N1r8J84j3r1J49j00L0J2l6R2j10P7o1o2
3608f1r3K38j58R0J16p7q3J79k53L1J25m1%n6N4J6k2r2J05j03J75j11PJ0L4O2
3634I2M6j90N3r6O5J7Q0p0QL7J4n1P8j25J30r4p2M7jqJ85k37j5K08j7k9l5l3J03
3663I0qj24P0J5j72J95j31P7J03j11Km3K0M3m5l0J81j14L3qp3M5J12j57JQ0qj7
3691B6rl1P3k4k3K2Np0J19j39Q9p8PJ0M2k5o3M3Ln7L8kR8j35R4N6j54N2Mk9J12
3722E4r5Q3q9RN8M6j46R2n4q0K46k63J26M9j04L5N4p9J32pq2J17j46N7m7n4N6
$$ y = [-21, 20, -29, 37, -135, 192, 15, -18, 65, -80, -2, -45, -129, 109, 9, -2, 11, 66, 2, 5, -32, -18, 96, -89, 21, 61, -8, -4, -7, -123, -14, 13, -72, 35, -5, 38, -15, -94, -57, -5, -60, -36, -4, -61, -35, -47, 9, 12, -85, -32, -31, 4, 16, -40, -34, -47, -52, 57, 112, -90, -178, 52, 84, -37, -6, -134, -66, 5, -6, -85, -34, -132, 52, 39, -52, 97, -3, 27, 39, 3, 95, -15, 62, 1, -61, -154, 84, -74, 16, 132, 55, -28, 151, -102, -71, 54, 13, 13, -43, 11, 27, 5, -87, 18, -85, 90, -21, -14, -4, 30, 92, 138, -52, 1, -95, -30, -13, 67, -3, 5, 42, 56, 5, 83, -42, 88, -6, -78, -31, -32, -40, 145, -92, -107, 101, 84, 55, 20, -13, 90, 82, -42, 28, 43, -129, 66, -65, 12, 115, 4, 6, -37, -17, 26, -19, -49, 132, 18, 51, 43, -30, 15, 127, -30, -29, 51, 43, 26, 17, -14, 59, 35, 12, 34, 39, -31, 88, -51, 38, -40, -33, -23, 19, -6, -69, -26, -23, -80, -42, -44, 54, -81, 13, 69, -85, -33, -29, -58, 54, -41, 42, -47, -38, 20, 66, -80, 12, -42, -122, 124, -139, -13, 36, -68, -33, 21, -58, 74, 67, -15, 102, -44, 13, -34, -88, -32]
3749c2N7n0N2K8j32J21m4q6J57p0JM3n7n3N5m8O3L1k8n5P8l7m1l0L7P6PK6k02
3778a33L5K16o9m7o0R3m9J11k3o4R8k53K92j11n8K0mj1J18o1k9R2p3N8r7k2R2
3805F1k0r5P7oj30J03O0l0N3mk3q4rr8R8l2O1k8o6J14Q7n9qj3J4J05j10P1p1L
3835B1R4j56r1K07l5r7K4M3O5j56M6J16n9j3m0L2%J10o2j51O7L1J6M6j30J30j03
3862d5L7K1K7j62J84j38M8J62j18Q8j51J02j12J17j14R0l9O6j30MM5L8K7l7M2
3887E2k4n2J3o3O8M6q7O7J2L5k8j02N9Rn9J32m6K2j84J02q4J65n8J30lk19J19
3914B2Oql4nN9j5p5m8J16j7R1o7j09R5q9O7L1J0j14O8j24M0J21k0L1n6O2L3q2
3943a1p9J18r4R2k7K1j6O2j2l4p5k4J49r3J06K5n6p2R6q0P2q0j5J24r9j34J60
$$ y = [-32, 25, -25, 27, 55, -77, 44, 0, -86, 71, 1, 2, 45, -12, -65, -10, -58, 5, 36, 8, -47, 31, -6, -47, -77, -40, 36, 43, 69, -133, -98, 118, 49, 2, -58, 35, -14, 97, 74, 10, 108, -145, 147, 36, -22, -2, -6, -17, 101, 40, 11, 103, 30, 88, -9, -31, 61, 41, -54, 23, 17, -113, -10, 50, 20, 73, 69, 46, -38, -47, -145, -47, -79, -18, -46, -112, 2, 89, 30, 22, 9, 23, 128, 18, 89, 18, 21, 115, -41, -132, 75, 40, -57, -33, 10, 75, -81, -35, 81, 22, 9, -31, 1, 1, 111, 49, -102, -35, -4, 12, 58, -72, 58, -45, -8, 13, 40, -122, 62, -76, -28, 134, 16, 104, -47, 55, -57, 60, -54, 36, -3, 63, -67, -63, -18, 20, 47, 10, 52, 28, -24, -11, -74, -6, 40, -47, 20, 32, 67, 39, -63, -4, 5, -54, 78, 32, 54, -130, -28, -112, 53, -5, 125, 122, -97, 22, 28, 20, -14, -19, 40, 25, -50, -98, 18, 1, 92, 25, -84, 11, -78, -11, 20, 30, -84, -16, -140, -100, 21, 1, 32, -24, 38, 71, -11, -90, 28, -66, 26, -1, 20, 4, 66, 54, 20, -55, -79, 70, -23, 83, 108, 52, -20, 76, -4, 68, -12, -27, 97, -2, -136, 24]
3970B4N1j04J49j55J7O0j67Q3J07j18J56o1l8K8k7m7J06o5K8m4m3J42J5m4j55
3995a02O6L2n6ML9J58j39N2p9m5Q6J35j53J22k49J55P5j10rR6j66K1N2j02R6j3
4021c4o7O9L6mK8K9j59L7K4L8M7m5J96j87k9M8R3L5j06j8%r9O1k5j90J75J00o3
4049a0M9J1j20L4m1J12OL7j42k0N9j20J85L0m8r3J30l2P0j4k9j8J1r5R5r4L1Q1
4077F5q9N2j23J72R1k22l6J50j22L1P4q8m1R6L5K3o1j19J87O5q6K0j69K26j46
4102a5j0k9R9n2K1k7J2m8RM3K9q0l2m2R0N4j19P6M9Qj34J29n4K4j34J18J0N2l5
4131A2R5k09P3R6k0l9M5J5j17J22k5jO6q8J6Mq0L1m0l5P2rPJ38j87J32j30n8M4
4160g0O1O2O0q1m0j0JR6r0L0J09j11jo7L6N0O0p0JP2k11K75l04J79j51M5P2j7
$$ y = [24, 75, -29, 120, -35, -18, 42, -125, -42, 65, -53, 103, 42, 4, 32, 5, -42, 64, -1, 27, -17, -60, 82, 97, 53, -102, -36, -4, -60, -56, -17, 141, 2, 54, -25, -70, 16, 151, -2, 120, -129, 26, 101, -9, -18, 78, -88, -67, -15, -117, -21, -34, -101, -32, 4, 0, 28, 57, -102, -65, -41, -3, 44, -1, 195, 8, -21, 27, 120, 155, 49, 31, 31, -68, -7, -32, -222, -47, 53, -10, 39, 50, -70, -36, -77, 35, 41, 78, -64, -84, -25, -145, 40, 70, 22, -71, 59, 27, 97, 83, 54, 36, 47, -48, 47, -47, -16, 65, -24, 28, -95, 77, 168, -54, -90, 60, -62, -31, 43, -45, -86, 10, 45, 68, 7, -112, 75, 140, 54, 74, -95, 131, -15, -25, -54, 45, -7, 14, -13, -1, -49, -40, 3, 32, -48, -80, -122, -32, 22, -97, -21, 28, 36, -98, 31, -23, 1, -133, -15, -5, 47, 12, 107, -102, -29, 67, 47, 8, 53, 68, -49, 73, 48, 47, 113, 25, 41, 45, -35, -4, -44, -79, -7, -16, -9, 129, -58, 74, -56, -114, -70, -9, 53, 113, 32, -8, -18, -17, 79, -11, 19, 128, 17, 16, -51, -15, 35, 95, 25, 26, 98, -113, 162, -142, 37, -114, -69, 3, -14]
4188a4k9m6P1P4N5n9m3j3pn7Q0k0p0R0M2O0r1P6j27P4j61R4J15o6j0j26J15K1
4216B8j19M4K2L7J02j85O5N8k7m3J7n0K3O0M6j33O1n0L0l3j0J35Rk02J33qPK62
4244B79l62J6Q0q7N7j2J5jM0O2l3j49R2J21o6n4J5m4R4n1l8l2N4j0L7R3j91R2
4272A7j24J11J70k22J01n4j52K31j21J26k8m6M7N3j15J1j1M1roo0l3K4LQ8k3J0
4299B9l2j32K03l8j26K07p3n6k6P0q1K21j66KL9kj61J99q1L9Mr9J09n2Q3j76M6
4326e0R0j17P2L4q8J6pm2pR1K9M0l8o1RJ50j63Q6p7k8N0j7O8k0ml7M2Mp8Ol4J07
4358B6Rj02N2k5L9M2l2m4J0PRO2n5N4mj47J52o1L5L1j15J5J38j47M7j6k4M6J5
4387A7o4%m2J46k7n6m2J06k5j7Q8j66K24j88K8L7l9L3n4oR5l6m2Q5k3j10J35q3
$$ y = [-14, -43, -89, -18, 56, 111, 52, 9, -4, -11, -68, 12, -8, -78, 12, 54, 114, 23, 99, -28, 46, -115, -21, 94, 28, 18, -108, 7, 28, -91, -47, -25, 12, 114, -71, -6, 52, 25, -18, -1, -51, -28, 32, 78, -55, 6, -44, -14, -47, -57, 78, 87, -115, 18, 10, 17, 279, -83, -67, 13, -74, -17, -29, -14, -15, 25, 87, 54, -95, -3, 118, 52, -2, 13, -31, 63, 12, -26, -58, -4, -14, 23, 116, -75, 17, -107, 4, 174, -48, 53, -1, -153, 78, -43, 83, 55, 9, 56, 109, -6, 5, -6, 35, 26, 20, -40, -73, -49, -46, 42, 19, 29, -3, -135, 68, 30, -96, 111, 38, -18, -44, 26, -55, 166, 0, 2, 41, 39, -122, 77, -4, 35, 39, -60, 49, -3, 80, -96, -50, 40, -77, -5, 29, -59, -43, -50, -92, -99, -8, 21, 61, 23, -38, -29, 121, -42, 44, -33, -61, -11, -28, 40, 20, 16, -21, 21, 25, -53, -47, -81, 26, 35, -67, -15, -40, -1, 41, 9, -35, -25, -18, -9, 53, -2, 52, 48, -99, 53, -8, 27, 58, -57, -42, 96, -51, -4, -20, -44, 2, 17, -47, -47, -89, 57, 30, -26, -68, 38, 13, -4, 84, -82, 142, -46, -18, 19, -20, 13, -41, -47, 48, 12, -30, 55, 32, -78, 57, -26]
4415b6J61q0m1J3P2k50J89n6j20J56j49Q5L9j45J43J01k03J44J0j10N2rn2R5j
4440A8j32J11nn3J63nq6J3j03J23k0q4Q9k2j15J29J4j78J84o4J12r3M5n6MK5O2
4467G6n9j1k1J34r7l7l8R9o2M1j9Q7r1J6k1o3N3K3k2L9p6O5n9j8K37r9k3j21P
4496f0N5L2o9O2qRm7L8N9p8J7j19J78l2o7J18M6k62J11l0r2K28j73Q8o7p3J70
4523C4n4J7ok7K2P1k31K57j1j50N0%J41j55m3NJ52pp6J4l7J28Jj73K31j91L4k4
4551b8j45K28R1k62K28j59Q9Ro0nQ4p7k1J69j31N7M8j02J04j17K8p0l5J58o0k8
4577gQJ27k44J20N0j44J24np1q2J68m8Rl4R5j01l2M1P0p3N9r1K7J3l7P3l3L3k7
4606a2O2j11Q9r6m7J40k1N2k8n5l3J81j47m6J56j71K08j17j12J51j11K4%K2J44
$$ y = [-26, 135, 55, 14, 27, 99, -151, 38, -18, -138, 18, -131, -46, -7, -152, -9, 92, -111, 33, 43, -67, -15, -24, -76, 19, 18, -114, -3, -8, -61, 102, 97, 11, 24, -79, 44, 24, -60, 29, 7, -108, 21, 35, -143, 41, -23, 89, -4, 41, -15, -11, 14, 76, 17, 6, -15, 119, 22, -15, -53, 46, -16, 25, 6, 93, 2, 18, -3, -66, -13, 10, -12, 27, -49, 16, -43, -61, 176, 77, 54, -67, -60, -5, 27, -42, 20, 12, 21, -26, 12, 71, -7, 10, -109, 69, 37, -30, 88, 134, -128, -17, -47, -139, 89, -84, 4, -63, -136, 34, -20, -3, -9, -36, -14, 57, -174, 83, 72, -78, -28, -28, 113, -42, -85, -80, 72, 65, -11, 3, -34, 94, 95, -78, 153, -38, -4, -28, -173, 55, 146, -116, 112, -47, 42, 51, -9, -14, 70, -7, -28, 141, 10, 67, 115, 13, 117, 0, 28, -42, -77, 81, 21, -7, 1, 128, -116, 4, 54, -90, 34, 29, -42, -124, 44, -4, 5, -29, 66, -35, -67, -26, 44, -29, 30, -61, -34, -21, -58, 15, -18, 15, -12, 50, -61, 28, -68, -115, 25, 4, 56, 28, -27, -60, 121, -26, -72, 84, -87, 121, 4, -108, 43, -68, -44, -44, -22, 122]
4631A22n2l8j5R6j03PP7k17O7L2q1R9n9J61j01o5O0Jqk9K1L2J61j65L2j7P5r8
4659eR8j09O2r4M5k9R1j05K9N9j7R7k74P5O6L4o3K2M9l5k3M2o1J14j80J35o5P1
4687B9l8j1l5q8J5J79n5J3P7o8J7m4m8k4K54k39Q1j1m5J2l7J06j4p3K5L2j8j3
4715b1o4J30L4p8Q3j7J6j17M7pJ2l0J6k0J01o6Pnm5R7j16J03o5M1m8O2o1l6M0
4744gq3O5P7j44J17J6p5p5J68J8j28M6lP0j49Q0rO7k4J6n5Lm2k8J24J6pk7m3O3
4774D7K7m3J2j7Jp7o8J29k0o8J01q2k8J45M8J0j12l5JO4j50M4J28j05j9M5N8j7
4802A9M6Qp2n8J05r3j6Q5j01R7m9Q5j38N2M0P4r4O2j55J5Q8M7K4k1j17RL0j2L1
4831ijK3L9j67J15Lr7R8l8Q9J6J1K1q2l3M3jP3J2j60J68j31p4K08j76M2R6o9q
$$ y = [122, 70, 32, 17, 113, 10, 17, 94, -123, -56, -24, -105, -6, -65, 96, -5, -70, -10, -9, -17, -46, -25, 7, 168, 3, 35, 18, 93, -5, 93, -16, 46, -48, -3, -32, 59, -46, -17, 42, 25, 122, -152, -77, -11, 23, -40, -18, 31, -4, -27, 15, -46, 68, -112, 23, -42, 29, -9, -20, -55, -143, -128, 51, -4, 9, 86, 18, 35, -9, -57, -81, 173, -66, 15, 4, -41, -29, -66, 40, 26, -47, -22, 10, -8, -21, -85, 45, 79, 1, 84, 67, 83, -34, 13, 6, 18, -12, 4, -16, 85, 19, 26, 21, -24, 73, -43, 60, -5, 36, -12, 50, -11, -47, -7, -90, -25, 52, -92, 25, 41, -34, -109, 59, 77, -51, -5, -8, 62, -87, -7, -16, 51, 27, 43, -12, -9, -51, -79, 45, 61, 54, 27, -16, 47, 74, 31, 43, 26, 27, -50, -118, 11, -9, -77, 24, -58, -86, 59, 107, 117, 5, -30, -29, 35, -115, -71, 57, -48, -67, -22, 36, 19, 65, 73, 1, -57, 48, -45, -61, 24, -77, 20, -29, 56, -82, -30, 10, 84, -10, 52, -103, -88, 0, 47, 71, 50, -67, -58, -28, -40, -9, -10, 13, 52, -115, 0, 3, -94, 4, -34, 55, 71, 82, 103, 21, -12, 31, 30, 103, 115, -45, 123, -8, -82, 126, -50, -8, 88, 19, 11]
4860A1j9J7K8j23R6J0n7j8R7Q6j82O4O1j46L4m1k1M8KQKj2J18q2KQL2j9M7r4J49
4891A06N7j47Q1j85R8K7P0j13n0J05p3J17r9m7R5M7j0l7n8rR0j17P2l5Q5j35J09
4918D4O2p8k1M3j35j5J61l1l9j02J83O0j82QK4L6q6J01r0l7R3m9K4J42j47P4M7
4945I0J2O0k02k4N0P9r8J5o7O2N5K3k2j07m2J30m7oK2l6K4N2q1O4M2m3k6kr7J39
4975A9J3j02K9Oj7O2n0O3q3j1J12Kq6L1K6R2j82O7q7J07l0O7q2K9R8n3J01j59
5003a8J4M7O7j19NL0l1M2Rq1L5p8K4J28qp6O1K4j62M0J51j03J05j86P3o1l8J67
5031F1j31k3PJ01j0J3j22J25J03p3o8R9j98J83j05j06K37j66J10k1o3N3L4j0O7
5056I7j23L6ML9j14O1k4N5p2L6Q6j94J17j03O7P2j29l3Q6K1ok8J36j61O9R3q7
$$ y = [11, -8, 9, 37, -86, 10, 20, -37, -55, 42, 128, -54, 10, 71, -75, -41, -82, -103, -55, -53, -45, -43, -55, 63, -19, -17, -9, 23, 4, 51, -43, 106, 163, 16, 97, -88, 10, 37, 107, -6, -56, 49, -24, 93, -6, -53, 42, 89, 79, 42, -16, -25, 65, -52, 20, -15, 70, -65, 44, 106, 28, 7, 50, -85, -100, 61, 30, -9, -111, 72, 132, -50, -42, -18, 18, -68, 33, -57, -94, -1, -50, -26, 116, -31, 43, 90, 102, 162, -40, -64, -14, 65, -33, -18, -85, -23, 32, 55, 33, -74, -116, 14, -33, -39, -17, -53, -29, 23, -58, 6, 48, 5, -21, -23, -120, 19, 32, -70, -41, -35, -52, 10, -40, 23, -60, -71, 41, 43, -43, -12, 14, 106, -76, -9, -96, 11, -19, 48, -34, -5, 93, 40, 141, -18, -4, 43, 110, -9, -4, 26, -5, 37, 46, -35, 0, -78, -54, 74, 66, -10, 51, 75, -87, -47, 104, 1, 106, -80, -7, -68, -106, 61, -70, -93, -86, 15, 5, 18, -104, 21, 124, 51, -17, 82, -116, 67, -38, -144, 93, -73, 37, 16, -47, 6, 40, 30, 97, -26, 10, 14, 53, -61, 0, -24, 31, -41, -5, 81, -113, 4, -99, -32, 40, -89, -122, -36, -15, -21, -49, 87, -74, -5, 88, 1]
5083AK6J11j21r5M4R9j39J7P4q0Q5j04K8j02J83J9k7j5J8Nr3J06O8j29m3J68j25
$$ y = [1, 27, 138, 17, -78, -34, 65, -74, -57, 17, -63, 22, -82, -54, -156, 27, 46, 19, 4, 22, 27, -66, 40, 108, -21, -64, 104, -21]
$$ [...]
8191A33
##END NTUPLES=NMR FID
##END=
