##TITLE=1H_DE-80H_X3
 200.13MHz, d2o
 8 sc
 
 19ns.26.2.2025
##JCAMPDX= 6.0         $$ Bruker NMR JCAMP-DX V2.0
##DATA TYPE= NMR FID
##DATA CLASS= NTUPLES
##ORIGIN= UXNMR, Bruker Analytische Messtechnik GmbH
##OWNER= pz
$$ XWIN-NMR		Version 3.5
$$ Wed Dec 17 10:58:49 2025 Russian Standard Time (UT+4h)  Yarkov@DPX200
##.OBSERVE FREQUENCY= 200.1313
##.OBSERVE NUCLEUS= ^1H
##.DELAY= (6, 6)
##.ACQUISITION MODE= SIMULTANEOUS
##.ACQUISITION SCHEME= undefined
##.AVERAGES= 8
##.DIGITISER RES= 18
##SPECTROMETER/DATA SYSTEM= spect
##.PULSE SEQUENCE= zg30
##.SOLVENT NAME= DMSO
##.SHIFT REFERENCE= (INTERNAL, DMSO, 0, 14.3821)
##AUDIT TRAIL= $$ (NUMBER, WHEN, WHO, WHERE, WHAT)
$$ ##TITLE= Audit trail, XWIN-NMR		Version 3.5
$$ ##JCAMPDX= 5.01
$$ ##ORIGIN= Bruker BioSpin GmbH
$$ ##OWNER= Yarkov
$$ C:/Bruker/XWIN-NMR/data/yarkov2/nmr/H-C/1/audita.txt
$$ ##AUDIT TRAIL=  $$ (NUMBER, WHEN, WHO, WHERE, WHAT)
(   1,<2025-12-17 10:57:44.39 +0400>,<Yarkov>,<DPX200>,
      <created by zg, POWCHK disabled, PULCHK disabled
       configuration hash MD5:
       00 E9 B6 7A A2 85 ED C7 34 08 36 98 17 FE 4E 26
       data hash MD5: 16K
       C4 4C 55 4B AE 14 95 77 E1 47 21 BD F5 34 DB 52>)
$$ ##END=
$$ 
$$ hash MD5
$$ 62 DF E3 FE 00 87 AF F8 89 E4 DC BD 66 FD B2 7A
##$RELAX= 
##$RELAX= 
##$RELAX= 
##$RELAX= 
##$RELAX= 
##$RELAX= 
$$ Bruker specific parameters
$$ --------------------------
##$DU= <C:/Bruker/XWIN-NMR>
##$EXPNO= 1
##$NAME= <H-C>
##$PROCNO= 1
##$TYPE= <nmr>
##$USER= <yarkov2>
##$AMP= (0..31)
100 100 100 100 100 100 100 100 100 100 100 100 100 100 100 100 100 100 
100 100 100 100 100 100 100 100 100 100 100 100 100 100 
##$AQSEQ= 0
##$AQ_mod= 1
##$AUNM= <au_zg>
##$AUTOPOS= <>
##$BF1= 200.13
##$BF2= 200.13
##$BF3= 200.13
##$BF4= 200.13
##$BF5= 200.13
##$BF6= 200.13
##$BF7= 200.13
##$BF8= 200.13
##$BYTORDA= 1
##$CFDGTYP= 0
##$CFRGTYP= 5
##$CHEMSTR= <none>
##$CNST= (0..31)
1 1 145 1 1 1 1 1 1 1 1 1 1 1 1 1 1 1 1 1 1 1 1 1 1 1 1 1 1 1 1 1 
##$CPDPRG= <>
##$CPDPRG1= <>
##$CPDPRG2= <>
##$CPDPRG3= <>
##$CPDPRG4= <mlev>
##$CPDPRG5= <mlev>
##$CPDPRG6= <mlev>
##$CPDPRG7= <mlev>
##$CPDPRG8= <mlev>
##$CPDPRGB= <>
##$CPDPRGT= <>
##$D= (0..31)
0 0.7 0 0 0 0 0 0 0 0 0 0.03 0 0 0 0 0 0 0 0 0 0 0 0 0 0 0 0 0 0 0 0 
##$DATE= 1765954663
##$DBL= (0..7)
120 120 120 120 120 120 120 120 
##$DBP= (0..7)
150 150 150 150 150 150 150 150 
##$DBP07= 0
##$DBPNAM0= <>
##$DBPNAM1= <>
##$DBPNAM2= <>
##$DBPNAM3= <>
##$DBPNAM4= <>
##$DBPNAM5= <>
##$DBPNAM6= <>
##$DBPNAM7= <>
##$DBPOAL= (0..7)
0.5 0.5 0.5 0.5 0.5 0.5 0.5 0.5 
##$DBPOFFS= (0..7)
0 0 0 0 0 0 0 0 
##$DE= 6
##$DECBNUC= <off>
##$DECIM= 32
##$DECNUC= <off>
##$DECSTAT= 4
##$DIGMOD= 1
##$DIGTYP= 9
##$DL= (0..7)
0 120 120 120 120 120 120 120 
##$DP= (0..7)
150 150 150 150 150 150 150 150 
##$DP07= 0
##$DPNAME0= <>
##$DPNAME1= <>
##$DPNAME2= <>
##$DPNAME3= <>
##$DPNAME4= <>
##$DPNAME5= <>
##$DPNAME6= <>
##$DPNAME7= <>
##$DPOAL= (0..7)
0.5 0.5 0.5 0.5 0.5 0.5 0.5 0.5 
##$DPOFFS= (0..7)
0 0 0 0 0 0 0 0 
##$DQDMODE= 0
##$DR= 18
##$DS= 0
$$ [...]
##$SUBNAM2= <"">
##$SUBNAM3= <"">
##$SUBNAM4= <"">
##$SUBNAM5= <"">
##$SUBNAM6= <"">
##$SUBNAM7= <"">
##$SUBNAM8= <"">
##$SUBNAM9= <"">
##$SW= 18.0517328524113
##$SWIBOX= (0..15)
0 0 2 0 0 0 0 0 0 0 0 0 0 0 0 0 
##$SW_h= 3612.71676300578
##$TD= 16384
##$TD0= 1
##$TE= 0
##$TE2= 300
##$TE3= 300
##$TEG= 300
##$TL= (0..7)
0 120 120 120 120 120 120 120 
##$TP= (0..7)
150 150 150 150 150 150 150 150 
##$TP07= 0
##$TPNAME0= <>
##$TPNAME1= <>
##$TPNAME2= <>
##$TPNAME3= <>
##$TPNAME4= <>
##$TPNAME5= <>
##$TPNAME6= <>
##$TPNAME7= <>
##$TPOAL= (0..7)
0.5 0.5 0.5 0.5 0.5 0.5 0.5 0.5 
##$TPOFFS= (0..7)
0 0 0 0 0 0 0 0 
##$TUNHIN= 0
##$TUNHOUT= 0
##$TUNXOUT= 0
##$USERA1= <user>
##$USERA2= <user>
##$USERA3= <user>
##$USERA4= <user>
##$USERA5= <user>
##$V9= 5
##$VALIST= <valist>
##$VCLIST= <CCCCCCCCCCCCCCC>
##$VD= 0
##$VDLIST= <DDDDDDDDDDDDDDD>
##$VPLIST= <PPPPPPPPPPPPPPP>
##$VTLIST= <TTTTTTTTTTTTTTT>
##$WBST= 1024
##$WBSW= 4
##$XGAIN= (0..3)
0 0 0 0 
##$XL= 0
##$YL= 0
##$YMAX_a= 611274
##$YMIN_a= -481509
##$ZGOPTNS= <>
##$ZL1= 120
##$ZL2= 120
##$ZL3= 120
##$ZL4= 120
##$ABSF1= 10
##$ABSF2= 0
##$ABSG= 5
##$ABSL= 3
##$ALPHA= 0
##$AQORDER= 0
##$ASSFAC= 0
##$ASSFACI= 0
##$ASSFACX= 0
##$ASSWID= 0
##$AUNMP= <proc_1d>
##$AZFE= 0.1
##$AZFW= 0.1
##$BCFW= 1
##$BC_mod= 2
##$BYTORDP= 1
##$COROFFS= 0
##$CY= 83.5205535888672
##$DATMOD= 1
##$DC= 2
##$DFILT= <>
##$DTYPP= 0
##$F1P= 10.8118882576601
##$F2P= -7.23987719738617
##$FCOR= 0.5
##$FTSIZE= 0
##$FT_mod= 4
##$GAMMA= 1
##$GB= 0.15
##$INTBC= 1
##$INTSCL= 1
##$ISEN= 128
##$LB= 0.25
##$LEV0= 0
##$LPBIN= 0
##$MAXI= 10000
##$MC2= 0
##$MEAN= 0
##$ME_mod= 0
##$MI= 1.114404
##$NCOEF= 0
##$NC_proc= 0
##$NLEV= 6
##$NOISF1= 3.799351
##$NOISF2= 2.8
##$NSP= 1
##$NTH_PI= 0
##$NZP= 0
##$OFFSET= 14.38212
##$PC= 1
##$PHC0= -5305.955
##$PHC1= 10.82193
##$PH_mod= 1
##$PKNL= yes
##$PPARMOD= 0
##$PSCAL= 0
##$PSIGN= 0
##$REVERSE= no
##$SF= 200.129724274929
##$SI= 16384
##$SIGF1= 3
##$SIGF2= 2
##$SINO= 400
##$SIOLD= 16384
##$SREGLST= <1H.CDCl3>
##$SSB= 0
##$STSI= 0
##$STSR= 0
##$SW_p= 3205.1282051282
##$SYMM= 0
##$S_DEV= 0
##$TDeff= 0
##$TDoff= 0
##$TI= <>
##$TILT= no
##$TM1= 0
##$TM2= 0
##$TOPLEV= 0
##$USERP1= <user>
##$USERP2= <user>
##$USERP3= <user>
##$USERP4= <user>
##$USERP5= <user>
##$WDW= 1
##$XDIM= 8192
##$YMAX_p= 0
##$YMIN_p= 0
$$ End of Bruker specific parameters
$$ ---------------------------------
##NTUPLES= NMR FID
##VAR_NAME=  TIME,          FID/REAL,        FID/IMAG
##SYMBOL=    X,             R,               I
##VAR_TYPE=  INDEPENDENT,   DEPENDENT,       DEPENDENT
##VAR_FORM=  AFFN,          ASDF,            ASDF
##VAR_DIM=   8192,          8192,            8192
##UNITS=     SECONDS,       ARBITRARY UNITS, ARBITRARY UNITS
##FACTOR=    0.0002768,     1,               1
##FIRST=     0,             0,               0
##LAST=      2.2672688,     0,               0
##MIN=       0,             -481509,         0
##MAX=       2.2672688,     611274,          0
$$ Real data points
##PAGE= N=1
##DATA TABLE= (X++(R..R)), XYDATA
0@%%%%%%%%%%%%%%%qJ6j6J6j6K1k5K8l2M0m8N4o6P6q8J00j12J28j44J62j86K11
37A11k35K64k93L27l65M05m49M97n51O08o72P41q17Q98r88J091j204J328j466
56g70J625j804K012k254K538k880L302l839M544n520O966r371J4283m1913J21834
71H8753J44645L1198J12581J04744K0956p3727j15614j37279j24952j37556j45927
82b32178j43133q0599n552L7832O5527R6994J26071J66843J50542J07843Q8760
93C78950N6751l646n0529p5671j00405j51452j53312j07163r9017q7837k9794
104d23125J6788N0863R1726J32359J36618J11193J19624J19515N3448n477l1658
115C71874n9136r5701j34712j38963j15468j02469q1607l9656J3350N0923O3605
$$ plain form
0 0 0 0 0 0 0 0 0 0 0 0 0 0 0 0 0 -8 8 -8 8 -8 13 -12 16 -16 24 -24 30 -36 40 -48 52 -60 68 -76 86 -100 111
37 111 -124 140 -153 174 -191 214 -235 262 -289 319 -353 388 -429 469 -519 572 -632 696 -770
56 -770 855 -949 1063 -1191 1347 -1533 1769 -2070 2474 -3046 3920 -5451 8832 -33081 88753
71 88753 233398 264596 377177 481921 502877 429150 313536 176257 51305 -86251 -232178
82 -232178 -375311 -455910 -461462 -423630 -358103 -261109 -135038 31805 182347 290190 378950
93 378950 435701 432055 381526 305855 205450 53998 -99314 -206477 -305494 -393331 -423125
104 -423125 -406337 -355474 -263748 -131389 5229 116422 236046 355561 409009 403532 371874
115 371874 312738 217037 82325 -56638 -172106 -274575 -356182 -395838 -382488 -331565 -267960
126b67960J02261J42888J22826R2983R1444P3642K0074k8643m8319p8969j18392
137A03835j15329j03270j08863q8728l9513M064K7038N2859R2172J14895J17636
148E6796J06736P9487N9495L8715l234m7959q2009r5200r2847r9337j05857r0144
160b75358l9055J2862J4139K0852Q1260J21475J04458P6052P4567P7795M2859
171C11906m823l8355o8198p5739p8741j01551j05682p6828l5421o873J346K9331
183b49628P4914R6798R3457P8911P6261P5452L6476q372k5661m2922o9497r2069
195D4120r4082p9442o7864m8410k2283J13L5892O8653P5108P5459Q4153Q7351
207A58768O4059K6440N890j0363l9930o9455q4166q1214p4177p0252n4294k4254
$$ plain form
126 -267960 -165699 -22811 100015 192998 284442 358084 378158 349515 301196 222227 103835
137 103835 -11494 -114764 -223627 -312355 -351868 -347804 -320766 -267907 -175735 -60840 56796
148 56796 163532 243019 302514 341229 337995 290036 208027 112827 19980 -79357 -185214 -275358
160 -275358 -314413 -301551 -287412 -266560 -185300 -63825 40633 116685 191252 269047 311906
171 311906 307083 268728 200530 124791 46050 -55501 -161183 -238011 -273432 -280305 -278959 -249628
183 -249628 -174714 -77916 15541 94452 170713 246165 282641 274269 248608 205686 136189 44120
195 44120 -49962 -129404 -197268 -245678 -267961 -267848 -231956 -163303 -88195 -12736 71417 158768
207 158768 222827 249267 255157 244794 204864 135409 51243 -29971 -104148 -174400 -228694 -252948
219b52948O129K9227M7715O8328P9662Q0405P6569N7945L2714J5599n300l6251
231A99794o4975p2793o7488p4585p5249n1489k3126K59J8379L7838O2916P5705
243c4814P6055O9215N3783M0930K4021n542l3106n3354o1295o2428p3920p3476
255a33931m9379k3100m624P051K9450O0199P0556O5955O2115N5331M6064K6002
267B11689m127k7253m2007n0188o0853p3886o6621m3458k6422j5094J707K9977
279a66536N4507N8615N7284O0788N9303M4825K0521p31j5497l1811m9000o1822
291C0446o4673n5894m3738l3549k0570L425L0356M3278M6397N4250O3132N9089
303A11949L7801J8183Q461o781k9854m8507n6682n4229n1778m8848l5940j8302
$$ plain form
219 -252948 -246819 -217592 -169877 -101549 -21887 58518 135087 193032 225746 241345 236045 199794
231 199794 134819 62026 -5462 -80047 -155296 -206785 -229911 -229652 -211273 -173435 -110519 -34814
243 -34814 41241 110456 164239 205169 229190 223648 190542 137188 75893 13465 -60455 -133931
255 -133931 -183310 -206410 -211034 -203983 -174533 -114334 -43778 22177 84292 139623 185687 211689
267 211689 207562 180309 138302 88114 27261 -46625 -113246 -156704 -183126 -198220 -196513 -166536
279 -166536 -112029 -53414 3870 64658 123961 168786 189307 188576 173079 141268 92268 30446
291 30446 -34227 -90121 -133859 -167408 -187978 -184553 -154197 -110919 -64522 -10272 52860 111949
303 111949 149750 167933 176394 169613 139759 91252 34570 -19659 -71437 -120285 -156225 -174527
315a74527L662K3097L2603M3646N5956N8992N1958L5988K3751J4895o709k9442
327A33870m2321m7511m9216n4038n0959l2626j5439j732J3297K8004M4326N3612
339b0733N1646M6526L8196K9632J6269p238k5550l4077m0639m8199n3966m8173
351i6306l0556j7205p229P389K5662M1625M7326M5933M4432M1004L1229J5083
363A48387m565j8070k6951l7750m7994m9788m1932l1395k2121j0782N561K4013
375a13387L5330L9492M2629M4858M1606K9334J3271P78j1005k3610l5577m5061
387A8658m4804l7485l2414k5502j2309N646K0941K7343L4360M3342M2983L7280
399G8039K7545J5277N513p522k3115l3545l8713l8755l7531l5257k3565r923K224
$$ plain form
315 -174527 -170865 -147768 -115165 -71519 -15563 43429 95387 131375 155126 170021 163312 133870
327 133870 91549 44038 -5178 -59216 -110175 -142801 -158240 -159972 -146675 -118671 -74345 -20733
339 -20733 30913 77439 115635 145267 161536 154298 128748 94671 54032 5833 -48133 -96306
351 -96306 -126862 -144067 -151296 -143907 -118245 -76620 -29294 16639 61071 102075 133304 148387
363 148387 143822 125752 98801 61051 13057 -36731 -78663 -110058 -132179 -142961 -137400 -113387
375 -113387 -78057 -38565 4064 48922 90528 119862 133133 133911 122906 99296 63719 18658
387 18658 -26146 -63631 -96045 -121547 -133856 -128210 -107269 -79926 -45566 -2224 40759 78039
399 78039 105584 120861 126374 118852 95737 62192 23479 -15276 -52807 -88064 -111629 -121552 -119328
412a19328J5211K4028L2065M1148M0881L2989K5779J9297R107q873k2225k6594
424F3485l3135l8438l7919l3008k2510r886m75Q578K2184L3916L6843L3660L2871
437E6166K9583J9251P274n623j7731k4380k9032l6765l8760k9982j9857j3752
449a03608n352Q688K1384K8953L3018L2899L0621L0104K2687N443o009j0271j9427
462F9130l0956l5338l3362k8836k2814j4269n653M623J9139K6896K7445L2253
474H258L3233K6288J8865J0838J93j1539j9226k4901l2098l2616k5795k3810j8750
487i1060m673O231J2848K0871K7331L0243K9986K7530J9243Q305L407m341j9242
500F6679k6084k5139k7854k9080k3262j5698p485K476J2419J7392K3425K9801
$$ plain form
412 -119328 -104117 -80089 -48024 -6876 34005 66994 92773 112070 121177 112304 90079 63485
424 63485 30350 -8088 -46007 -79015 -101525 -111411 -111886 -103308 -81124 -47208 -10365 23295 56166
437 56166 85749 105000 112274 106651 88920 64540 35508 -1257 -40017 -69999 -89856 -103608
449 -103608 -108960 -100272 -78888 -49935 -16917 15982 46603 76707 99394 104837 98828 88557 69130
462 69130 38174 2836 -30526 -59362 -82176 -96445 -102098 -97475 -78336 -51440 -23995 8258
474 8258 41491 67779 86644 97482 97675 86136 66910 42009 9911 -22705 -48500 -72310 -91060
487 -91060 -95733 -89502 -76654 -55783 -28452 1791 31777 59307 78550 86855 90262 85921 66679
500 66679 40595 15456 -12398 -41478 -64740 -80438 -87923 -85447 -73028 -55636 -32211 -2410
512b410K8527K2422K0549J3002L89n718j0830k0465k8527k7185k3726k2326j6006
525g2304o966j577Q683J9308K4385K1186K5466K5214K0008J2760L952p023j2620
538F0472j5017k1601k9777k7079j7500j4046j1495j118P412J5045K2676K3594
550h434K1435K3393K2335J2935K044k487p568j8250k2340k1930k4881k2567j4172
563f0487r032l567M542J3718J8197K2114K4359K1195J7497J5895P498l692p716
576F0521j2135k0885k3201k0714k0163j8560j0506r31K996Q273J6686K0277K1495
589C153K2630J7606J1008Q664L261p245j4182j6433j9399k1385j8501j4954j2941
602e8718n453M978R251J2619J8100J9355J9003J9054J4209N511Q9l180r648j7294
$$ plain form
512 -2410 26117 48539 69088 82090 82479 76761 65931 45466 16939 -10246 -33972 -56298 -72304
525 -72304 -79270 -80847 -72164 -52856 -28471 -7285 18181 43395 63403 76163 80115 73092 60472
538 60472 45455 23854 -5923 -33002 -50502 -64548 -76043 -77161 -69749 -54704 -32028 -8434
550 -8434 13001 36394 58729 71664 73708 71221 63653 45403 23063 1133 -23748 -46315 -60487
563 -60487 -69519 -73086 -68544 -54826 -36629 -14515 9844 31039 48536 64431 71929 68237 60521
576 60521 48386 27501 4300 -16414 -36577 -55137 -65643 -66574 -63578 -55305 -38619 -18342 3153
589 3153 25783 43389 54397 63061 66322 59077 44895 28462 9063 -12322 -30823 -45777 -58718
602 -58718 -64171 -59193 -49942 -37323 -19223 132 19135 38189 52398 57909 57998 54818 45170 27876
616B7876j8505j8379j9522j4803q119o066j79Q729J4810J4243J8907J7610J7016
629C3618J4450Q086Q53o048p306j2498j9255j9885j6658j5333j0241n177o5N342
643e0117J2264J7395J6495J5855J8769J3584O051N172k439r748j2327j5365j7156
656a567j8243j5048j1391p401m30N979Q880J3073J7521J7003J5906J4649R119
669D8050K870n43n087j1538j5941j5633j5575j5675j1311o237l675K785R641J2017
683b5852J3522J5847J5625J3249R389M961n59n199p967j2657j6246j4429j2873
696b3189j1735p393k409J674O511J0950J3367J3584J3687J3574Q691M300J119
709D2731l977q660j0763j3194j4526j2738r928p037l778J406O696R239J1703J3963
$$ plain form
616 27876 9371 -9008 -28530 -43333 -51452 -57518 -57697 -48968 -34158 -19915 -1008 16602 33618
629 33618 48068 56154 57007 50959 43653 31155 11900 -7985 -24643 -39976 -50217 -55394 -55459 -50117
643 -50117 -37853 -20458 -3963 11892 30661 44245 50296 55468 53029 43281 30954 15589 -1567
656 -1567 -19810 -34858 -46249 -53650 -54080 -48101 -39221 -26148 -8627 8376 24282 38931 48050
669 48050 50920 50377 45290 33752 17811 2178 -13397 -29072 -40383 -46620 -50295 -47510 -37869 -25852
683 -25852 -12330 3517 19142 32391 41780 46741 46182 40983 33016 20359 4113 -10316 -23189
696 -23189 -34924 -42317 -44726 -43052 -36541 -25591 -12224 1360 15047 28621 37312 41612 42731
709 42731 38754 30094 19331 6137 -8389 -21127 -31055 -38092 -41870 -40464 -33768 -24529 -12826 1137
723A137J2428J1580R708M739N29l409p293j0251j2511j3191j2596j0655o349l025
737c9159j32N531R558J0779J2240J3146J1554Q709N300J727k655p125r341j1524
751H608j3139j1987j0360p799l106L01L472P910J0694J2188J2265J1173R369N874
765C5463K106j059o046r132j0515j1773j2070j0293q138m524n09L125O825Q844
779a7696J1064J2408J0900Q946O518K887m53m032p827r910j1159j0937r546q503
793b7340n323j452K231N996P960R015J0927J0916R082O335L068J11k863o346q420
808A3897j0108j0786q679p280n492k114J009M744P531Q616R195R326Q605O788
822B5252L389j17k556n188p549q644r779q911o707m837j975N84L502O887Q234
$$ plain form
723 1137 13565 25145 34853 39592 40121 36712 29419 19168 6657 -6534 -19130 -29785 -36134 -39159
737 -39159 -39291 -33760 -24202 -13423 -1183 11963 23517 32226 37526 39253 36598 29473 20132 8608
751 8608 -4531 -16518 -26878 -34677 -37783 -37482 -34010 -26100 -15406 -3218 9047 20220 29589 35463
765 35463 37569 36510 30464 21332 10817 -956 -13026 -23319 -31457 -35981 -36490 -33365 -26540 -17696
779 -17696 -6632 5776 16676 25622 32140 35027 34574 30542 22715 12805 1646 -9291 -18837 -27340
793 -27340 -32663 -34115 -31884 -25888 -17928 -8913 2014 12930 22012 28347 31415 31526 28663 22317 13897
808 13897 3789 -6997 -15676 -22956 -28448 -30562 -29553 -24809 -17278 -8662 533 9859 18464 25252
822 25252 28641 28524 25968 20780 13231 4587 -5192 -14103 -20810 -25647 -27622 -27038 -23536 -16649 -8415
837h415Q727Q785P483O143M106K71k389m771p121q153q783q535o948n047k011
852b6658J035K981N827P791Q343Q946P647N642L860J189k021m524o892p729q301
867b864q585o619n225k913O51K989M654P323Q413Q332P689O146M147J549j269
882B4418l248o196p931p507q038p336n153l468n48K423M355O060P269Q296P806
897A1202N754M546K427r92k462m233p144p920p027o483n490m055j054J558L490
912a7883N573O556O513P594O259L974K440K67k375l966n471o762p120o288m347
927a5036l691k201J449L204M010O388O570N961N745M252K364J42j640l426n764
942H327n681n403o676n115k582j453K31K980M404N025N982O387N375L410K537
$$ plain form
837 -8415 312 9097 16580 22723 26829 27100 24711 19940 12819 4666 -4117 -12652 -19600 -24647 -26658
852 -26658 -25623 -22642 -16815 -9024 -681 8265 15912 21554 25414 26603 24582 20058 13166 5437 -2864
867 -2864 -11449 -18068 -23293 -26206 -25555 -22566 -17912 -10589 -2176 6156 13845 19991 24138 25687 24418
882 24418 21170 14974 7043 -464 -8502 -15838 -20991 -24459 -25007 -22584 -18229 -12169 -4900 3396 11202
897 11202 16956 21502 23929 22937 20475 16242 9098 1178 -5849 -12332 -17822 -21877 -22931 -21373 -17883
912 -17883 -12310 -5754 759 8353 14612 18586 21026 21293 18918 14952 9481 2719 -4401 -10689 -15036
927 -15036 -18727 -20928 -19479 -16275 -12265 -5877 693 6654 12399 16651 19015 19157 17517 14091 8327
942 8327 2646 -2757 -9433 -14548 -17130 -18583 -18352 -15372 -10968 -5943 39 6426 11801 15211 17748
957A7748Q06k050l035m386o430n841m872n064l813j057N18J877L748O077N557
972b17M866N740M620K080R59j144l525m147m896n917n997m626l196k282J97K576
988a4909K764M113O447N757M620M466K857Q25n12j884m152n847m837m530n459
1003a0281m018j659q52J478L796L511M133N719N758L992K410J657k44k002k587
1018A0811m298o109m420l607m382k660j7O46J761L798M981M400M194M527K808
1033A2433J078J086j564l639l268l851n003m406l069k415j332R85K477K138L803
1048d547N305L859L140L629J575k76p79k348l762m040l691l954m132j754k38n71
1064a2584J772L732L031L508M659L751K398J634P80j342k561k634l678m702l244
$$ plain form
957 17748 18554 16504 13469 9083 2653 -3188 -8060 -13124 -16937 -17994 -17476 -15599 -11851 -5774 -217
972 -217 4649 10389 15009 17089 18048 16904 13379 9232 4336 -1581 -7578 -12204 -15400 -17682 -17485 -14909
988 -14909 -12145 -8032 -1585 4172 8792 13258 16115 16940 16428 14544 10392 4545 -292 -4822 -10281
1003 -10281 -14299 -15958 -16810 -15332 -11536 -8025 -3892 1827 7585 11577 13987 15644 15400 13398 10811
1018 10811 6513 404 -4016 -7623 -12005 -14665 -14682 -14036 -12275 -8477 -3496 904 5098 9625 12433
1033 12433 13511 14597 13033 9394 6126 2275 -2728 -7134 -10203 -12618 -13950 -12965 -10488 -8350 -4547
1048 -4547 758 4617 7757 11386 12961 12685 11906 9558 5796 1756 -1935 -5889 -10021 -11775 -12013 -12584
1064 -12584 -10812 -7080 -4049 -541 4118 7869 10267 11901 12681 11339 8778 6144 2466 -2236 -5480
1079e480k812l129o96Q67P15K227M093M046L431L372L248J391K72K80k149l941
1095E735k993l327m065l264k340j553r0J969K358J959L576M821L170K412K447
1110A0815N10o79j005k469l790l522k991l355k990r96j22P5K285L489K220L311
1126G86M049K640J426J493J28j811k160k163l343l988k678j989j862m00O30J088
1142h154K417L583K912K608K754K448O39o1k57k357k928k224k947l607j954j091
1158h219r09J31J578K373K227K902L407J949J864J733o1j284j127k462k874k807
1174a579k481k356j850l13M71M92K121K855K266K931K887J390J102N78m82j615
1190F417k310k108k829k925j764j778j292O44J038J248K176K840K560K447J851
$$ plain form
1079 -5480 -8292 -11421 -12117 -11250 -10535 -8308 -4215 -169 3262 6634 9882 11273 11545 11825 9676 5735
1095 5735 2742 -585 -4650 -7914 -10254 -11807 -11897 -9928 -7570 -5611 -2035 2786 5956 8368 10815
1110 10815 11325 10646 9641 7172 3382 -140 -3131 -6486 -9476 -10472 -10594 -10519 -8234 -4745 -2525 786
1126 786 4835 7475 8901 10394 10522 8711 6551 4388 1045 -2943 -5621 -7610 -9472 -9872 -9242 -8154
1142 -8154 -5737 -2154 758 3366 6120 8568 9207 9146 8889 6532 3604 1380 -1567 -5174 -7128 -8219
1158 -8219 -9128 -8997 -7419 -5046 -2819 83 3490 5439 7303 9036 8975 7691 6564 4102 1228 -1579
1174 -1579 -4060 -6416 -8266 -8579 -8108 -7616 -5495 -2640 -374 2557 5444 6834 7936 8514 8032 6417
1190 6417 4107 1999 -830 -3755 -5519 -7297 -8589 -7945 -6907 -5659 -3483 -643 1917 4364 6215
1205F215J329L69n04q76j967k528k202k594k348j263j037k70Q81J467J903K005
1221a420K735K508J479J312J092n14j411j120k032k433k406k126j385j240k38
1236g199P40J081J701K162K188K413J902R44R00J73j071j427j783k138k347k244
1252d005j300r24o49M74J220J408J902K268K154J902J338O29J88q63j158j649
1268B935k159j870k273j523q33o54J51J004J432J761K038J925J907J349P66K99
1284F255o85r72j396k055j914j799j837r31n43L9O91J117J618K117J774J600J567
1301D646P50N47m53j008j142j764j786j780j745j023n03j75Q61N23J575K026J504
1318A053J383J185J556L01J40j165r69p84k045k136j390j206p71k05L30R29J187
$$ plain form
1205 6215 7544 7913 7409 6533 4566 2038 -164 -2758 -5106 -6369 -7406 -7676 -6795 -5328 -3425 -1420
1221 -1420 1315 3823 5302 6614 7706 7192 5781 4661 2629 196 -2210 -4336 -5721 -6961 -7199
1236 -7199 -6459 -5378 -3677 -1515 673 3086 4988 5932 6832 7005 5934 4507 2724 586 -1761 -4005
1252 -4005 -5305 -6229 -6878 -6404 -5184 -3776 -1874 394 2548 4450 5788 6417 6605 5742 4584 2935
1268 2935 776 -1094 -3367 -4890 -5723 -6377 -6226 -5222 -3790 -2029 9 1934 3841 5190 5956 6255
1284 6255 5570 4598 3202 1147 -767 -2566 -4403 -5334 -5877 -5838 -5147 -4030 -2412 -295 1479 3079 4646
1301 4646 5396 5943 5490 4482 3340 1576 -210 -1990 -3735 -4758 -5261 -5436 -4575 -4052 -2477 -451 1053
1318 1053 2436 3621 5177 5478 5618 4453 3484 2700 655 -1481 -2871 -4077 -4848 -5053 -4723 -3794 -2607
1335b607J561J669J289J414Q85O58j90r36o75j430j147j989j339j348l90K67J93
1352d115N47P22J689K034J200J327J069j56M23m74j116j574j129j731j024j064
1368c372j223J10L16R15P04J259K009J036J081Q86P23r6l14r57j172j506j239
1385h40j169j374j004K39J95L0J302J392J311J216J527N90O70L40m45n62j317
1402B101j062j614j133j072j193j42N7K40Q87J162J403J096J324J126P82j94M72
1419D240n53j754m34j164j043k000r89J45k28n4J530M17J575R22M17J494P87J74
1437C482j20k37l76q99j375j428p53j190k84j89j06O84J353N00R03J150J251P
1455B373R72o8j076l57l41p45j240j293k58p32m51K28K99P20J283R50Q22R42P73
$$ plain form
1335 -2607 -1046 623 1912 3326 4211 4869 4679 3743 3068 1638 491 -1498 -2837 -4185 -4575 -4308 -4115
1352 -4115 -3568 -2846 -1157 877 2077 3404 4473 4317 4740 4266 3150 1576 447 -1284 -2308 -3372
1368 -3372 -4595 -4485 -4169 -3254 -2550 -1291 718 1754 2835 3721 4444 4348 4034 3077 1905 399 -840
1385 -840 -2009 -3383 -4387 -4148 -3953 -3923 -2621 -1229 82 1298 2825 3415 4085 4425 3980 3418 2101
1402 2101 1039 -575 -1708 -2780 -3973 -4115 -4058 -3818 -2931 -1769 -366 730 2054 3180 3962 3768 4240
1419 4240 3687 1933 1499 335 -708 -2708 -3697 -3552 -3780 -3834 -2304 -1887 -312 610 1027 2521 3308 3482
1437 3482 3362 3125 2749 1850 475 -953 -1706 -2896 -3180 -3369 -3475 -2791 -1438 -938 -35 1115 2366 2373
1455 2373 3345 3277 2201 1844 1503 758 -482 -1775 -2033 -2765 -3216 -2988 -2689 -1969 -686 264 1086 2028 2801
1474B801P3j81K03o32j401m26q93j298m38m36m76P4O30Q92N31J121J058N30P15
1493B447R00m61o11P2p78j247r36q23q86m93J23j11k72R72J352O26Q16J322L22
1512B334L85N00l59p76n24n45j252j195k90o41r34M33O40L2O70J304P11O79R74
1531B146N82k29J1J82r74j094n94o26j182j80m52n79M87P46M31M77J168Q52K84
1550A456O05P72n53n40J60o84j069o39o53q31l77M25j64p6Q04R33M04P17R57r2
1570A555M67M92m92r84j74l75r47p03l83k86m86O55J90J0R60Q95K26O16P46o4
1590A918j85P3n2j097o51l63p45o02Q8j98m18N22R41K34N24P42N53M36L43J37
1610B200n82l84m3q13j021j62n75n35j22K97O0L22O65O87M23R00N05j73K85K21
$$ plain form
1474 2801 2874 2693 2896 2264 863 437 -456 -1754 -2192 -2628 -3104 -3030 -2400 -1508 -977 144 1202 1732 2447
1493 2447 3347 2886 2275 2347 1569 322 -614 -1437 -2323 -2816 -2693 -2804 -3076 -2104 -752 -126 690 2012 2334
1512 2334 2719 3219 2860 2084 1560 1015 -237 -1432 -1722 -2363 -3297 -2864 -2224 -2192 -1522 -218 493 1172 2146
1531 2146 2728 2499 2510 2692 1718 624 30 -596 -1778 -1958 -2410 -2989 -2502 -1756 -1325 -848 320 1172 1456
1550 1456 2061 2833 2280 1740 1900 1216 147 -492 -1145 -1976 -2353 -1928 -2092 -2168 -1364 -431 -27 690 1647 1555
1570 1555 2022 2514 2022 1038 864 489 -458 -1161 -1544 -1830 -2316 -1661 -1471 -1461 -501 394 620 1236 1982 1918
1590 1918 1733 1806 1754 657 6 -357 -1102 -1704 -1616 -1814 -2232 -1710 -769 -535 -11 731 1284 1720 2063 2200
1610 2200 1618 1234 1191 378 -643 -805 -1380 -1915 -2037 -1740 -1680 -1358 -693 -6 417 1317 1822 1649 1934 2155
1630B155m76o99m79n59p50m26m05m73q7P13J63R4R75O49M15N09L48K07r4n1m17
1651A312o76m00m18r18n27K51m05q9M29N16N27N78L73M14K84N71J4n44m36N3m95
1672D14p91n37k84k22Nm6J54M97N55K47L11O77M79q5l0j28j15l95m51o84k51k40
1694i20k97l03k5N83L03Q8M63P08K31N58j8l38K68j56o09n09m00j13m13m37l9
1715a375O2J82L61K67L53P42K22J98K02Q4J18m88m07l95l13l61l63n07M5L47M0
1736i86rL46O77M68K10J16L08J71M8l02n01n4m70n45l31j57q5l9MO4N49L62M95
1759C39M1L98M09qp0j35j78j90m32n95k62k62j8k09q9K75N54K38jN74N12K11L4
1782A136k75J10N3m96m51l48k08j72k87kn2J42L78J67O0N91L06N9N2J0J20o7m54
$$ plain form
1630 2155 1679 980 501 -58 -808 -1234 -1639 -2112 -2199 -1486 -1323 -1229 -254 395 810 1319 1667 1874 1780 1729 1312
1651 1312 636 236 -182 -1100 -1627 -1376 -1781 -1870 -1441 -925 -398 180 553 967 1251 1822 1836 1292 856 909 414
1672 414 -377 -914 -1198 -1420 -1415 -1461 -1307 -810 -255 -8 303 980 1459 1374 1344 1216 1101 706 255 -429 -680 -920
1694 -920 -1217 -1520 -1545 -962 -659 -571 -108 600 831 1389 1371 1033 1301 1145 536 27 -373 -486 -899 -1336 -1375
1715 -1375 -1313 -1131 -770 -503 -150 592 814 1012 1214 1298 1416 928 521 126 -187 -548 -911 -1418 -1373 -1026 -986
1736 -986 -995 -649 28 496 706 822 1130 1301 1349 1047 546 492 22 -523 -854 -1011 -1096 -1135 -1131 -1067 -518 -156 339
1759 339 380 778 1187 1179 1109 974 796 606 174 -421 -683 -945 -963 -1172 -1261 -986 -432 -194 -195 379 891 1102 1136
1782 1136 861 971 1024 528 77 -271 -479 -651 -938 -940 -992 -850 -472 -305 -245 346 652 711 763 773 893 826 372
1805C72m49qk14k75m87J32M44j94P7L40K64M08K19n9J00J58O4j47n21K5l25l09
1827c85k81j92QK92j31j34N18M15K44O0J18K79K97l50k36j83j19j36p12p6J0j61
1849h55n1P3Q7N14L46N9K19L67K63r7l50j8J10l01m12m41q2K1k44k44K32L63J41
1872c00J7K15M86J79Q7J36k21M9K0l52n04o5M1l10l49m9K56K80j04K07J93M65
1894C77K76j80M5L58L3k95n53J9rk76l82l5j06L13j6j29J09N39J58J1K05K71p6
1917F57k9k95j16k30j2k95l55J88%j18o4K89K38K06J32J13k3L32K52n25j30J48
1939C63q6l59k53q2%j46o0J3K51L60N2j34L81L33N3o3j27j23Q8k21l85j86p3J78
1963b26l61p8K07L83l83K85L17K10Q7jj52N7L43k99l92j36K04l24l20R2J5j3J56
$$ plain form
1805 372 -77 -85 -299 -574 -1061 -929 -485 -679 -602 -262 2 410 629 570 670 828 892 745 224 249 -76 -385
1827 -385 -666 -858 -850 -558 -689 -823 -305 110 354 414 532 811 1108 758 522 339 220 84 -628 -704 -694 -855
1849 -855 -906 -833 -746 -232 114 173 392 759 1022 925 575 557 667 366 -46 -487 -569 -548 -792 -1036 -804 -441 -300
1872 -300 -283 -68 418 597 684 820 599 648 668 316 -188 -253 -212 -522 -871 -920 -664 -384 -488 -281 -88 377
1894 377 653 473 518 876 909 614 61 80 71 -205 -587 -622 -728 -415 -431 -560 -451 88 246 257 462 733 657
1917 657 628 333 217 -13 -25 -320 -675 -487 -487 -605 -669 -380 -142 64 196 309 286 618 870 345 215 363
1939 363 277 -82 -335 -417 -417 -563 -623 -610 -359 1 53 -81 300 633 686 623 496 373 461 240 -145 -331 -404 -226
1963 -226 -587 -665 -458 -75 -458 -173 144 354 441 440 288 345 688 389 -3 -139 65 -259 -579 -487 -472 -485 -329
1986c29R3m9L33L65j46j7K54J64j63k59n6l24N7q4k99j85K58J18j70k1M19L10
2008B69j84J14J53J15J00j00k21o8J10m83l15J61R9r2k00J45K20J6K36J14j52
2029C7K96L94l80j37K00l1k42k42q1j45k9n1j11l3L49M9J8J64L08J5l4J23j30
2052C07Qm3m0m11KJ03k66k62K98J47p6k8J80J66Q6K34j00j66K30P3k91j60N6j02
2076e5j33j19m9q4J31L9j23J76L37J46l18K86J90k03N7q5k48R0k3j77l64K80K9
2099b20p4j57L08K01o6J28M5J22J04j01j34K8m2qk64%M0j41q6O0J9M4L66k54O4
2124a8K50K75r4l17J67n1j8k16j56j40J15M8k59M4J5L18n1L3J36J64O3O1j63j04
2148A02K50j54k30j74K67k89j51p6J88O3Q1m9L9J65J88l2k2J29J51j81j13k17
$$ plain form
1986 -329 -236 -285 48 413 267 250 504 668 505 246 190 -134 -77 -161 -460 -645 -387 -269 -439 -460 -41 269
2008 269 85 199 352 467 567 467 246 178 288 -195 -510 -349 -250 -342 -542 -397 -177 -161 75 189 37
2029 37 333 727 347 210 410 379 137 -105 -186 -331 -360 -411 -522 -555 -206 -157 -139 25 333 348 314 437 307
2052 307 315 272 232 -179 -177 -74 -340 -602 -304 -157 -233 -261 -81 85 171 405 305 139 369 442 151 -9 47 -55
2076 -55 -188 -307 -356 -440 -309 -270 -393 -217 120 266 -52 234 424 221 278 193 -55 35 12 -165 -529 -249 -220
2099 -220 -294 -451 -143 58 -8 120 165 287 391 290 156 184 142 134 -130 -130 -90 -231 -317 -257 -238 -194 172 -82 -18
2124 -18 232 507 413 96 263 212 194 -22 -178 -318 -203 -155 -414 -370 -355 -37 -88 -55 81 245 308 369 206 102
2148 102 352 198 -32 -206 61 -228 -379 -455 -267 -204 -123 -172 -133 32 220 188 166 295 446 265 152 -65
2170f5P45l49n70m61l23N47K27j13N89R8l08p88Q58J93J84K79m08j69k27L18l44
2191h7n0j2l1n4J4Q0Q9O9k0M7J15n8L34k79N6p2j3q7k28O6m7nl1K4LQ9J17j07
2219g8P5K74N0j88L4o5J45jl41J7%k4K5j62K0P2J09N4j19R0J59K0p6J58j38k1
2245H9j71M4n1J10k10j5lK8P8M1j22K15J38m5Lp4K55Mj48J97k87j14k3j30J6K7
2271a48Q0j26J53k9P6R1J1l2J44N4l2k53J62l9n8j46j15n1J16p5OJ08n4L10j25
2296B8Q6P8L1j02P2n3k7o4o4p9P5n7j35q8J29J5J08k1K8J27M1J28j08K8l3R0j22
2323A11j27r0JM1p9r7O3P0koJ82j1L1Q7r2J3R7j6k38M5j7N9j83N8M1pj32P9j23
2352b42M64j54o6j56M40L11o93L15k52K29k47M6j59N4K2o7o6O7J73P7j06J28j3
$$ plain form
2170 -65 680 331 -239 -700 -1023 -476 -249 -362 227 325 17 -771 87 280 464 743 335 166 -61 257 -87
2191 -87 -137 -149 -180 -234 -220 -140 -51 18 -2 45 160 102 436 157 213 141 128 41 -187 -121 -168 -173 -204 -180 -177 -88 29 -78
2219 -78 -3 271 321 133 167 102 247 246 -95 -78 -78 -102 -77 -239 -219 -147 -38 16 -103 -13 146 166 90 248 110 89
2245 89 -82 -38 -89 21 -189 -204 -207 -179 -101 -60 -182 33 171 126 129 55 310 314 166 363 76 -38 -61 -191 -175 -148
2271 -148 -68 -194 -41 -70 6 97 108 76 220 274 242 -11 151 112 54 -92 -207 -258 -142 -217 -211 -103 -157 153 28
2296 28 114 192 223 121 193 140 113 49 -15 -94 -19 -76 -211 -299 -170 -155 -47 -68 -40 87 128 256 148 176 143 233 111
2323 111 -16 -106 -105 -64 -143 -240 -177 -107 -109 -115 67 56 87 174 82 95 192 176 -62 -17 -34 25 -158 -100 -59 -66 -198 -119 -242
2352 -242 222 68 2 -154 286 597 -96 219 -33 196 -51 -5 -164 -110 -88 -155 -221 -154 19 96 -10 118 105
2375A05J80j96M8k14R8J27r2j02RJ6j00oR%J34K9Rj3Q8j00J50l3J4m1q4k4q2m4
2403a15o0L8K5q3K01j7j84J81J93j29J50q7j16R7n5NO1j53P8j13n5pJ47q8%J39
2429E3q2K2L9Q6n2R5p9Lo1k5O3j11k7r5N2J01j56P5J39k7O8p9rJ57J5r4K9j67
2457f7J16j03L0j10N0j34J71l5J2Q8J56j64J20j19J31J44k46j1R3Rj57l3J7R9
2481E7j27K1p7jO7K5m2J28O4l4J03j33L0j58Q9L6p5o7K3n4K3J9Q7KKpQ2p7O2n5
2511A3O6R6q9r6L8M2j40m1n5K06k40J90J8NrL1M5m0l8P8m9L5L9n5n5M4j32j12
2539b05K10j1k4N2J3r5J59k6p0J32l4K3o9n4O3n3l0l1j2m6L4K0J04j16J28j9O1
2566A04K9m6J00j56P6L1n4q5l9p9J16j07L7qj0O3J8K6K0K2j7P4k6j35J70o0j97
$$ plain form
2375 105 285 89 137 -77 21 148 56 -46 -37 -21 -121 -127 -118 -118 16 45 54 41 129 29 179 146 160 119 35 11 -71 -115
2403 -115 -175 -137 -112 -195 6 -11 -195 -14 179 50 200 113 -3 94 39 44 105 -48 30 -83 -138 -145 2 -86 -86 53
2429 53 -29 -7 32 118 66 161 82 85 24 -1 62 -49 -76 -171 -119 -18 -174 -99 40 13 81 2 -7 150 165 71 100 -67
2457 -67 49 -54 -24 -134 -84 -218 -47 -82 -70 18 174 10 130 11 142 286 40 29 122 131 -26 -59 -42 57
2481 57 -70 -49 -126 -127 -60 -35 -77 51 115 81 184 51 81 -77 12 48 -27 -94 -71 -125 -102 -83 4 6 8 1 83 6 68 13
2511 13 79 175 86 -10 28 70 -70 -111 -166 40 -200 -10 8 13 4 35 80 40 2 80 31 66 105 50 -5 39 -93 -205
2539 -205 5 -6 -30 22 35 -60 99 73 3 135 101 124 55 1 64 11 -19 -50 -62 -108 -74 -54 50 -66 62 43 104
2566 104 133 87 187 31 107 138 84 -1 -40 -119 -3 -110 -73 -81 -91 -28 -10 16 36 58 41 115 89 -46 124 64 -133
2593a33N1O2o2q0M4P1K3K2k4N0n9J11L4j37J54r1r7N8J52j58l7o4M5k0j3P4O7
2620D3J9J2K4K1r4RN6j45J48j35N9J17j70l1qJ41j17J0m8N7k4J47o3m7J50m3r3
2647eJ3J07q3j6q5K2j03J06j35K18j93J13J29r6J2P9j62J43n5p9OJ14L6j72m3
2672a29Q0m4j0J23r9P0J2N6j06P7P4j1l0Q9j12M8k6M0j88J9N7K5o3kK6J3K10j18
2700H1o4jp4P5M0L8m9r9k0N3m7N2o4j6j1J6rK13j37R3j5m7k6K36j99q2k8L4L9
2729a8M9K4j30N7j8Q7o3O6k7J1l1N3pq3N5q1J51p8K1o6j0P9Jj52R2J01m5M9k3
2758F4j5j30J62q9J9l4j11K72j50j3j03J36m0%J0J6Q1K3K1n6Q6n4n3p6J32j36
2784c8J21k07K8J52j15R0j89J71k2K5q1O3KJ20k7M4j84J31o5L7j95N0N8o8R6K2
$$ plain form
2593 -133 -82 -20 -82 -162 -118 -47 -24 -2 -26 24 -35 76 110 -27 127 36 -61 -3 149 -9 -46 -110 -65 -85 -98 -24 43
2620 43 62 74 98 119 25 34 90 -55 93 -42 17 134 -36 -67 -75 66 -51 -41 -89 -32 -56 91 28 -19 131 88 -5
2647 -5 8 115 32 16 -69 -47 -150 -44 -179 39 -154 -41 88 -8 4 83 -79 64 9 -70 -64 50 86 -86 -129
2672 -129 -49 -93 -103 20 -79 -9 3 59 -47 30 104 93 63 152 40 88 62 102 -86 -67 -10 15 -48 -50 -24 -11 199 81
2700 81 17 16 -58 17 57 95 46 -53 -73 -20 -67 -15 -79 -95 -106 -90 -99 114 -23 70 55 8 -18 218 19 -63 -91 -57 -18
2729 -18 31 55 -75 -18 -36 51 -12 54 27 38 7 60 53 -30 25 -56 95 17 38 -28 -38 41 42 -110 -18 83 38 87 64
2758 64 49 -81 81 -8 11 -23 -134 138 -12 -25 -128 8 -32 -32 -22 -6 75 98 119 63 149 95 42 -34 98 -38
2784 -38 83 -124 -96 56 -59 31 -158 13 -9 16 -65 -2 0 120 93 137 -47 84 19 56 -139 -89 -31 -99 -3 19
2810A9j39J13K5j29K48j3p7j3j1k1K2L8j02M7j7R5j56J27r7l3L4J5pNJ42pj64
2837e6J69j7m7l2J0l1N9n4j09J16p2l3J2O0N2p0LJ25J4M8j19K6K0j54J32o7r6
2864a11j9J09m8rN0O4k5J0Q0j05J3M2n4M3r2JJ01j0m0M8J00j99J1Pj6nL8o1J12
2893C5p3N0o7l0M0P0L0k3p1j4k8J0O3j4L7J3k6J33o9K3J1K0j17l1O9q8P3P1j77
2922h0k0J35Qn5Pj19J16J31m5P8k19J84j09l5P0j79J02J19j74K36j50j22J16N5
2946E0r4R4r3Q4M6o0O3r2M8kj45J52P3j78J1M9K0K5o6q7J75p1L6K6n5O4m8o0J5
2975b0QJ41j55J25j52R4o9Q2j51L1J15p6J16K6j6j48L9OK%L1j1l7j37J48m5J63
3002A10j49QP9m7Q6Ml9J8j21N9rK1M4j32N6K7On0r1J37j23J32K8j36J29Q8j1j49
$$ plain form
2810 19 -120 -7 18 -111 137 124 47 34 23 2 24 62 -40 7 -10 85 -71 56 -41 -74 -40 -25 -32 -27 115 108 -56
2837 -56 113 96 49 17 27 -4 55 1 -108 8 -64 -97 -85 -25 27 -43 -40 85 99 147 28 54 74 -80 52 -15 -111
2864 -111 -130 -21 -69 -78 -28 36 11 21 101 -4 9 51 -3 40 -52 -51 50 40 0 48 148 -51 -40 -33 -49 -54 -16 -77 35
2893 35 -38 12 -55 -85 -45 25 55 32 -39 -53 -81 -71 -8 -22 15 28 2 135 66 89 100 120 3 -28 41 -47 26 97 -80
2922 -80 -100 35 43 -12 -5 -124 -8 123 78 156 -63 121 12 -23 47 -132 -30 89 -85 151 1 -121 -5 50
2946 50 -44 50 -43 41 87 27 90 -2 46 44 -101 51 124 -54 -43 6 26 51 -15 -102 73 2 38 64 9 73 25 -35 -20
2975 -20 -12 129 -26 99 -53 41 -28 54 -97 -66 49 -27 89 115 99 -49 -10 -4 -2 -2 29 18 -19 -156 -8 -53 110
3002 110 -39 -31 48 1 87 91 52 70 -51 8 -1 20 64 -68 -12 15 21 -29 -120 17 -106 26 54 -82 47 135 124 -25
3030b5oQJ1L7PN5q2Q1j9j21k9J20mJ2l9r2J40m0J53j25j82J56qj11R5Rlo8K9j1
3060e2P4JL7j28J01k6n0M2J08k11O6J10j23K2L2k7N6o9J5R1j3j1R8o9K2l7J9p2
3088FM8j00P0j02l7J37n9M9m5o2q0J48p7J59q3M3R6j09P7q3m2PJ05j6q3nJ9o1
3116h0M4m0N5M0l4p3Q5m8K7J8k7J23j19J04k5o9N9l8k0kJ5M0O0j68J56l4k46K41
3144D4K8m9P4j97J37j01K4o8N9J05m8k3k6P5j9j5lj8J61j9l7m4l8o0M4j3m7J22
3172D8l3k8p4M3N8r9J46m7K8O9p7q9J12pK1p9P8j15po5Q3P1N7q9nN9qP9j37M9
3202D2l9o2P6m3q9J17j2M6j50j7R4J11j19K6k2M2R2j77J40k2j31J84o5n2J2L8
3228B0O0K4k29J46q3l3Q2l2L6K9j1n9L5m9J45pp0m6L5P0o0Kk9q0J09J0K1k4j01
$$ plain form
3030 -25 -31 -23 -12 25 32 87 5 86 67 -54 -83 37 33 45 6 -86 54 14 167 42 -140 16 8 -103 -8 1 -2 -70 -41 -52
3060 -52 22 23 60 -68 33 7 -43 -1 107 -104 -38 72 -51 -29 3 -24 32 -37 -22 69 56 45 143 74 96 59 78 6
3088 6 54 -46 24 -78 -115 22 -37 12 -33 -95 -175 -27 -104 55 -28 15 111 2 79 -4 -46 -39 66 50 -33 -38 -19 -80
3116 -80 -36 -76 -21 19 -15 -88 -3 -51 -24 -6 -33 90 -29 75 50 -19 40 2 -18 -20 -5 35 95 -73 83 49 -197 44
3144 44 72 23 97 -100 37 -64 -40 -108 -49 56 8 -15 -41 34 15 0 -3 -21 140 121 84 40 2 -58 -14 -27 -74 48
3172 48 15 -13 -87 -44 14 -85 61 14 42 111 34 -55 57 50 71 -8 70 -45 -52 -117 -34 37 94 5 0 59 51 130 -7 42
3202 42 3 -59 17 -26 -115 2 -10 36 -114 -131 -37 74 -45 -19 -41 1 93 -84 56 34 -97 87 22 -30 -18 20
3228 20 80 104 -125 21 -62 -95 -13 -45 -9 20 9 -50 -15 -64 81 74 4 -42 -7 63 3 5 -24 -104 5 15 36 12 -89
3257h9P3J15o9k04R6N1K7N0n5j17J46m0Rk6O3J7J3p2N3K8q5RJ14j11k8M3m5nK
3286c7M4J3n3lkO8J1l9r0J60j3j18J87j20L3l5r2J47o4k4%oJ02q8RJ0j7MN2p1
3316c2m1j6J30j8k1L6n3J1j5J0o9K08j43R8j50J01M6j82J49r6R7r5J6n1J75j33
3342c8J60q4j27M0J34m6j30L8p7P7R2L8m8j6m7R1JJ04k36m6J65o9O5k8k2K0k2
3369a1nN2n3Q9q3J47k21J91j18j01K07k16J12P3j00J18r1Njj0nK5l0m6qJ02P2
3396I4j47J01K3n0p3N5O7p7j57K62l9p5L3J7m5l5R1q6J47j07l5O8j57J66j26J30
3422D5l1j6qp6O7r3j0J18M4j4m2L3p5J03k9j23K5L0J17r0QL8q4K4M5N15m39j53
3450g1P9JOj0J60j20l8k6J2j08J40j40O5j4J54j31O2n0P2j05L7P0m9J12j85N5
$$ plain form
3257 -89 -16 99 30 -174 -78 -27 0 50 -5 -122 24 -16 -7 -33 30 47 60 -12 41 69 -16 -7 107 -4 -32 11 -34 -39 -37
3286 -37 7 20 -33 -36 -38 30 41 2 -88 72 59 -59 128 8 41 6 -86 61 -3 -27 -27 -33 69 -19 -10 0 -17 -13 39 -32
3316 -32 -73 -89 41 23 2 38 -15 -4 -19 -9 -78 130 -13 85 -65 36 82 -100 49 -47 50 -45 -29 -80 95 -38
3342 -38 122 38 -89 -49 85 39 -91 -53 -130 -53 39 77 29 13 -34 57 58 162 -74 -120 45 -24 41 13 -9 11 -11
3369 -11 -16 36 -17 72 -11 136 -85 106 -12 -113 94 -122 -10 63 -37 81 -10 -5 -6 -16 -21 4 -26 -72 -80 22 94
3396 94 -53 48 71 21 -52 3 70 -7 -164 98 59 -16 17 34 -11 -46 45 -41 106 -1 -36 32 -125 41 -85 45
3422 45 14 -2 -10 -86 -19 -112 -122 -4 40 26 -16 17 -58 45 16 -107 -82 -52 65 -25 -17 21 -63 -39 6 521 82 -71
3450 -71 8 9 15 5 165 45 7 -19 -7 -115 25 -115 -50 -64 90 -41 21 -29 43 -62 -25 45 -4 108 -77 -22
3476b2jJ5m2O6k4l4M7O1p0n0m3J47q9r2J12j8J04l5J4q6L5r2J79j00K72ol62n4
3504a68O36r03K31N56l25r5L2Q5k05J75p4Q6o2o1k0K15o4q2M4j10J41L6l7M2q5
3529a2L0M6J0q6L4p4N9p1M8m2LOK4O8j6r2JJ72m3j01J26j46J1Q2j80K46k06J77
3557G4p6R0j45L8M5o6J7j23J82l3m0J7L3m9n6Q2m2M7l0j28J97Or6J73l00J57q9
3584a15LK27j72P7mo6O0L3j02J0j12J75l0Q0j09J30l04K64m2k3l5L2j4OR5q9J14
3611H9k0o2M8j61J87m7j1m1P1p1m2J3jM9j7J43j01j61J73r2KO7o8p9J47k4O5n4
3639BJ0Oj2o2L8P6j03p9J96r3K0n1R4%o9R0j64R4J8l8M6p5R2o2k3R8q2Q2j30M5
3669c6j31P7J16k6Mp8O0k4P4J2N5k7o5K6j07P5Kk7Q4m1J5qrj2j24J49j2P4j27
$$ plain form
3476 -22 -23 -8 -50 16 -8 -42 5 66 -4 -54 -97 50 -39 -131 -19 -37 67 32 46 -40 -5 -97 82 -18 254 248 -114 -168
3504 -168 468 -435 -204 352 27 -68 -36 49 -156 19 -55 31 -31 -92 -112 103 39 -43 1 -109 32 68 31 73 -12
3529 -12 18 64 74 -12 22 -52 7 -64 -16 -58 -55 -49 -25 43 27 -65 -64 108 65 -36 90 -56 -45 37 -143 103 -103 74
3557 74 -2 88 -57 -19 26 -40 -23 -146 36 3 -37 -20 13 -36 -92 -10 -52 -5 -35 -163 34 40 -56 117 -183 -26 -115
3584 -115 -112 115 -57 20 16 -50 10 43 -59 -49 -161 14 -16 64 -45 85 -219 45 3 -20 -55 -23 -37 -31 64 -25 89
3611 89 69 7 55 -106 81 34 23 -18 53 -18 -60 -47 -48 1 -16 127 26 -135 38 -54 -52 15 -53 -132 15 -9 56 2
3639 2 12 18 6 -56 -18 58 -45 -124 72 -21 -1 -52 42 42 -27 63 -101 -7 11 -27 19 -56 36 -26 -49 49 -33 49 -81 -36
3669 -36 -167 -90 26 0 4 -74 -14 -38 36 48 103 76 11 37 -70 5 7 -20 64 23 38 30 21 9 -115 34 22 96 -31
3698c1J7R6q6mN4m6l4M0Q5o5k9m9Q4j67J24mR6p7J3k5M6p6l5J31o1M1K0j12N0
3727dL2L4q2O5r1l1J48j6O9j09j00J9O8O1r7P3l4mQPK4j75Q4JK9o0P3Q7j08R1
3757F2o6N2j27R7mj7J6J4K3n5J61l02R4R2j1m8P0lk4Nm2q5R0P8j22J7Q7j3p8Q6
3787D7mm2k7R0o4p2L0P2l8J30j23L0m0K4j30J95j82N9LN2n7J40k13J74oJ5j36
3814g3J09O2p8m5Ol2oM7Q3j25kQ5J5j27P2r0j8N5J05M8k7q2P7j05L2K0j00L2k9
3843i1J33j23J89j01j36K35n2j38J36j7j05P5K4r7Q6O5j24Qk7J72l9o0m3o3J07
3868A4o9M2J9L9j21M3o4J18o2j8L6o9J38p1J31j17m1oJ97j41P9k0Jo3o7J03O5
3895I6p4j7L6R9j56o3J11N2q0J12m8p5K9J31j28j17R8L1j02O2mk3NRj1L7o7j2
$$ plain form
3698 -31 -14 82 -4 -8 46 0 -34 6 91 26 -3 -52 32 -135 -11 -15 81 4 17 -8 38 -38 -73 58 -3 38 58 -54 -4
3727 -4 28 62 -20 45 -46 -77 71 55 124 15 -85 -66 2 63 -34 39 5 1 9 16 40 -135 -51 -50 -21 -81 -8 79 -29 62
3757 62 -4 48 -79 18 14 -3 13 27 50 -5 156 -146 -52 40 29 -19 51 48 24 29 -13 -98 -8 70 -52 -35 52 39 -39 47
3787 47 43 1 -26 64 0 -72 -42 30 -8 122 -1 29 -11 13 -117 78 -104 -45 -42 10 -47 93 -120 54 48 63 -73
3814 -73 36 98 20 -25 -19 -51 -57 -10 73 -52 -54 31 46 -81 -9 -99 -117 -62 43 91 64 -18 59 -46 -14 6 -94 -62 -91
3843 -91 42 -81 108 7 -129 106 54 -84 52 35 -70 5 29 -68 18 83 -41 -33 -60 112 73 13 -30 -93 14
3868 14 -55 -13 6 45 -76 -33 -97 21 -41 -59 -23 -92 46 -25 106 -11 -52 -58 139 -2 77 57 58 -5 -72 31 96
3895 96 22 5 41 140 -16 -79 32 84 4 116 68 -7 22 153 25 -92 6 37 -65 -3 -7 -30 -25 -16 -27 10 -57 -69
3923f9J43q7N3l0M4o9O4p6l6L4M7O4j21O1m7J02o6P7Kj26k7nP0K9mm9LL9o5K4
3953b1P2j48K2K3N6p1K01q4j16N3m5J35j68Q0K6p6P6K5J5q7m4Q6o2Q1J38j22M
3980D9o9k7m9J44o5J7Rq5Q2RJ2LN8j00M9q1kk7NJ65Nj05r7J24P4l2r9oj0rM3P6
4012F1q1MQ6j93J47j03J12O3r8MO9j04j2J27o3p8R6k3N5m4n4K9j7KJ8O6J2l5o0
4041a4J04j23j3L9o3Q3k9k8J55q4l8l3J13p4nj1N7O2j29J05k41K77j42k0l9L9
4067e2J59j99N4Rj07J51K3J6k3m9n2R8K9q5lQ0J6J9J2j64J52n7k14J05O6Om1q5
4095a36J35O7p4r7N0J57k21J05k4O5m5k7R8j45O2n3M8J0J3J2j1O4j15l5J48j1
4121D0K8n6r0P6L5M7Rr6PQ8j51Mj8R9p8Q6j96J99r0P7k5O5j29L6P2qj55L4R4j30
$$ plain form
3923 -69 74 -13 40 10 54 -15 49 -27 -63 -29 18 82 -39 22 -25 77 11 88 90 -36 -63 -68 2 31 27 -22 -19 20 -45 -21
3953 -21 51 -97 -75 -52 4 -67 134 50 -66 -13 -58 77 -91 -11 15 -61 15 40 55 -32 -76 10 -52 29 167 45 49
3980 49 -20 -47 -96 48 -17 0 9 -76 6 15 27 30 88 -12 37 -44 -46 -73 -68 97 102 -3 -100 24 98 66 -33 -39 -49 -58 -15 61
4012 61 -20 -16 70 -123 24 -79 33 96 -2 2 71 -33 -45 82 19 -59 37 14 69 25 -29 0 -17 -15 3 69 81 46 -14
4041 -14 90 -33 -46 -7 -70 13 -16 -44 111 27 -11 -44 69 -5 -10 -21 36 98 -31 74 -167 110 -32 -52 -91 -52
4067 -52 107 -92 -38 -29 -136 15 38 54 31 -18 -70 28 57 -28 -31 49 65 84 96 -68 84 27 -187 -82 -16 -10 -51 -136
4095 -136 -1 66 -8 -105 -55 102 -119 -14 -38 27 -18 -45 53 -92 -30 -83 -35 -25 -12 0 -11 53 -62 -97 51 40
4121 40 68 12 -78 -2 33 80 89 -7 0 88 -63 -59 -77 22 -56 30 -166 33 -57 20 -5 60 -69 -33 39 31 -124 -90 4 -126
4151a26J42J8Rrn5j5R1j30M0o8R6N9j1On6K6k9n7P4j27K17k11J83l8J5n4oo9J48
4180F3p4k3R2K4qm9m2k4L6K5J3J4Jj24N6J7qM4n5J10n8Rk6m3R9m0p4J5M1m5P3
4211C9l7n6J06p3K9l7j1J5qJ0m3K00j30r9N7J10m1o5J24j48J02Jp5P2p7k0J10
4238E5j17pR2m1Q5j06MP3l8O7j01R6%j33J13j1p5J6N2m0P9q6J2n3J12L8r6l1N7
4267A6j29J98p3o8L0J9k5l4J3N6L5nnp7N2j3L4j80M3J86l8o8O8m6p2r4K38o3J5
4296A3K9J7q1o6K6Q8r0k6J09m8J6k0R3l2m0kOp1N8%Q5n7j6Q6m9ooq5L1j6L6K8
4328A0l1R9r6N2j3k0j68J80M1o8M8J5j74N2P3m3L4q0J73j63nrO5P6n0p1J36L2
4356I5j42L3n9R0K2j1M2j06O2p8l59M60k80L70l67K23j13P5N3o0O6Q5j74K7O1
$$ plain form
4151 -126 16 34 43 34 -21 -36 55 -75 -35 -103 -7 52 41 47 -9 17 -12 -69 5 -122 95 -116 67 29 44 -10 -16 -85 63
4180 63 -11 -34 58 82 74 25 -17 -41 -5 20 33 47 48 -76 -20 -3 -11 33 -22 88 30 39 13 -30 69 29 -45 -30 11 -34 39
4211 39 2 -54 52 -21 8 -29 -40 -25 -33 -23 -66 134 4 -95 -38 72 31 -34 90 -58 44 45 -30 42 -35 -55 55
4238 55 -62 -69 23 -18 67 -39 -35 38 0 67 -34 62 62 -71 42 31 -44 -28 24 -16 63 -23 -11 -64 48 86 -10 -41 16
4267 16 -113 85 12 -56 -26 -7 -32 -66 -53 3 38 33 28 -49 3 -10 24 -156 -113 73 35 -33 35 -11 -83 -177 61 -2 13
4296 13 42 59 -22 -88 -62 26 -64 -90 19 -29 -13 -33 60 28 -12 -14 -8 -79 -21 -21 64 7 -9 77 28 22 16 -69 -38 -54 -18 10
4328 10 -21 78 -18 34 21 1 -167 13 54 -14 34 49 -125 -73 0 -43 -9 -89 84 -79 -84 -93 -28 48 -2 -73 63 95
4356 95 -47 -14 -73 17 39 28 70 -36 26 -52 -411 49 -231 139 -228 -5 -118 -43 10 -50 16 101 -73 -46 15
4381A5P4k6j45Q6j9J09q6o2j6K02k8K4j8P1m7l8l88j54J04NM57j03J84n23J77
4406a45K43l39K90k06M32m81O5O9R1Nl4Kl8L1R6j80Q7rJ4J7M1j08J1J6M3om5N7
4434A9p1PP1m4N3n0o4RR8j21O5R3j21JL4M9j19k2J62Nl6o6L7Q5j28L2L4p6O5P
4464HO8q3J27p9N4n0k3n1P5j13M6L2j06J5M7R2Lp1k2q7J56p1Rm4J29j24lp8O6
4493g8J23pn1J40k65J91j65O4L5q2k0k40J24R7O69q88J5O57l16j73J79R8n45M94
4517E6m23J69n4K55K57l76Q4J26L8j51o7p0J79j05J85R1j04l42J31L3k16M89J60
4540C45m14K13m86O1j24j12j79O83k88N92k18m6j33J40l1N2m8L7j7o1R3o1l7m5
4564h4R5J04o7j19M9k3J2O6l6M7lK9k6j61R6l9j32J16P5J52rj11j38J13J1l3k9
$$ plain form
4381 15 89 63 -82 4 -15 94 8 -54 -70 132 104 128 110 181 134 96 -292 -446 -342 -337 120 17 201 -322 -145
4406 -145 98 -241 49 -157 275 -206 -141 -72 19 24 -10 -8 -46 -15 81 -99 -12 -21 -7 10 51 -57 -46 -30 13 7 -38 19
4434 19 -52 -45 26 -18 35 -15 -79 -70 28 -93 -28 65 -56 -55 -21 28 -91 -113 49 54 18 -48 -11 74 -54 -22 12 -64 1 8
4464 8 76 -7 120 41 95 45 22 -29 46 -67 -21 11 -95 -80 -33 59 62 -9 -31 -118 38 -33 -24 -68 61 -63 -66 -144 -78
4493 -78 45 38 -13 127 -138 53 -112 -48 -13 -95 -115 -355 -231 -134 535 -353 -338 319 3 -170 9 107 -438 56
4517 56 -367 -198 -252 3 260 -116 -32 94 132 -19 -86 -156 23 -82 103 194 90 -252 -121 -88 -304 185 345
4540 345 -69 144 -342 -281 -405 -517 -696 -13 -301 291 73 27 -106 34 3 55 7 44 27 -34 59 -2 -39 -84
4564 -84 11 115 48 -71 -22 -45 -33 33 -3 44 41 70 44 -117 -21 -60 -192 -76 -1 151 142 31 -107 6 17 -16 -45
4591d5Q5p8R6m6L9r4P8Q7r6l8n5R0k1J10k35O6oK8J8o1J55k0k8m9m5pP3NL3k9
4621A0k1j3O2r0K4j31K69j54K2K6J0k0j6J20j5l0q2J61k22J62n9j04J52j26N8
4646go5O7J4Q5q3j4o8O7KK6j3J6j14J43lp6J74r5j19LN6P9lj20J5n7J50P7j40
4675cNj2L3N6j6j13J56n3N3j94J3J48l8p0m0J37K7r6R5m4m4K9j7N3r9R2j3j7l1
4704cK1N4l1n3j1j6m0J00nMq9L1jN3j02K22j60L5p1J40j95K7L2P9J7r5L4o5J00
4733A2j02N2r0J06K4j6j9J5j7J02k1j47j8J81ol0N5j19N6m4N9l0N5k1m3P4o1O
4761A3J3O1j2k8l9r1J18m1L5j4k2j2Q1j17N4j49J58Opj05N8J19m6m8jMJ9O4q1
4790a0P3j5j01K14j16k5n3k6J40r3N6r9J81j27QKn2Q6j01R5l2j10J06j25J54p6
$$ plain form
4591 -45 40 -38 58 12 51 -43 35 122 26 -12 -67 23 2 112 -123 -57 -63 -35 -17 -78 77 57 29 -20 -65 -72 1 6 39 10
4621 10 -11 -24 38 -52 -28 -159 110 -44 -22 4 14 -6 -22 98 83 53 -29 132 -90 72 13 -91 61 -65 -7
4646 -7 -72 -5 9 94 11 -3 -71 -4 -2 24 11 27 -87 56 53 -23 151 56 -63 -60 -4 75 72 -48 -33 -90 60 137 -3
4675 -3 2 -10 23 79 63 -50 106 53 106 -88 -75 73 35 -35 -75 62 89 -7 88 44 0 29 12 65 -34 58 45 28 -3
4704 -3 18 72 41 -12 -23 -39 -79 21 16 20 -69 -38 -39 14 -88 134 -26 9 -62 78 -117 -90 -58 21 38 -57 -23 -88 12
4733 12 -90 -38 -128 -22 2 -14 -33 -18 -35 67 46 -101 -119 62 56 26 81 -38 18 -26 33 3 58 37 -6 68 7 13
4761 13 26 87 75 47 8 -83 35 -6 29 15 -7 -19 62 -55 -1 -150 8 14 7 -98 -40 79 33 -15 -16 -12 7 71 -10
4790 -10 63 48 -53 161 45 20 -33 -59 81 -12 44 -55 126 -1 7 9 -43 43 -58 37 5 -105 1 -124 30 -46
4816d6J5O8O6j01p5J66p7k3n6Q5J9Q5n2o6lj7JO3J1rl6r6Q2M7M9p6l3j1K3O4N9
4847A26oj59Q7j04o4nJ43k1M8n9q3R0J7j18N2N6j7l6N8k5Po8m3J14L5J8l3k9Q9
4876G0j57N2Q9p7Q0p5Q2j08n7P4n7M8J61k11J04JK1j39O2M5k%%R7j16K0K1J6j20
4905g6J71r0P8o3ML7j2l8L5J2K6n8K3j30R1q4J37j04oOJ34jj10M9j67Q6K0N5k7
4934bl7J14l3k1KJ5j05J50n9K7RMj59J23o5L8j26J95k9j20l7MP9M5P1n2j15R5
4962A1J00p5N0Rr2O3j26J27Oj33N5M0Jr0R9J2m9m2J7l8J76j41J36m4n4k4j6N1
4990B9okj5J31l59m93P11o7k77M79K27m30J78j67J59R1p4j21O5p3Q7k5L5o3o8
5015d8M0q2l4J83j6lj19J13J0J5j0Qm0k9MJ7J7j77K24q4k3M3p7O3O5n1j9O9K6
$$ plain form
4816 -46 -31 37 103 2 -73 93 16 -7 -63 22 41 126 74 8 5 -12 -11 52 63 54 18 -78 4 51 100 24 -9 -20 3 67 126
4847 126 120 -39 48 -56 -120 -125 18 -3 45 -14 -97 -7 10 -108 -56 0 -17 -53 5 -20 -13 -81 -124 -10 25 43 10 -19 70
4876 70 -87 -35 54 -23 57 -18 64 -44 -101 -27 -84 -36 125 -86 18 19 40 -99 -37 8 6 6 6 103 -13 7 28 44 -76
4905 -76 95 5 83 20 24 61 49 11 46 58 84 26 49 -81 10 -74 63 -41 -47 -41 93 92 -18 31 -136 -50 -30 25 -2
4934 -2 -39 75 42 21 23 38 -67 83 24 51 60 64 -95 28 -37 1 -125 70 41 -79 -116 -112 -33 12 83 31 -84 11
4962 11 111 36 86 95 3 66 -60 67 73 -60 -5 35 36 -54 45 57 8 -34 -17 -55 121 -20 116 72 18 -6 -22 29
4990 29 23 21 6 137 -222 -715 -4 -71 -348 131 358 -72 106 -61 98 189 115 -6 59 -14 73 48 83 20 -48
5015 -48 -8 -90 -124 59 43 40 -79 34 44 59 49 57 17 -12 -8 9 26 -151 73 -11 -34 9 -68 -5 60 9 -10 59 85
5044H5m7N3n2j4pO6n2p9J36j35K2J15j49rJ22K6j11K4Ol0N5j13J24r7Q1qN6nk8
5073C5N8k1j10k5N0L6q3K0O0jn2O8n3k2O2q9NR2J3q6R6K0j36O5k3p1J95j57j0
5102f4K7J12r5K6j5JP9l41M30M63j153K52K65Ok3J7Jo5K2L2J31j65J09k89J73
5127f4N4J02J6j49j3R9N9q0J01k8j46P8p8j8R6J3r3J79j97L56q69L61q2M84J0
5152A91n42L48o7J65n2k11J36j52k2K73j32l3J51o7R2q0m1N6K4j35P7L5JllR9
5178A08k13J33J14p5j4n5j3L13r16M97L03k87J18rj4J38j3j38j6M7j23N61n74
5201a28KM82r46L50j65K93j06L92K8j37K40l76k56L89L68n91k0l4J56K28L7o72
5223d66L36L17j00o72M59L13l72J62j70J35J19m85M50M85n54l81R1J53N5M42l78
$$ plain form
5044 85 38 91 39 25 18 84 32 -47 89 -46 -24 91 -58 -67 55 81 -30 -6 0 -30 25 -88 36 -61 20 12 68 63 35
5073 35 93 72 -38 -63 -13 23 -60 -40 20 19 -33 35 -18 -40 22 -67 -62 30 43 -43 53 73 -63 2 -21 -92 103 -54 -64
5102 -64 -37 75 -20 6 -9 -8 71 -270 160 623 -530 -278 -13 -7 -30 -13 -12 -77 -55 -23 108 -57 52 -237 -64
5127 -64 -10 92 108 -41 -54 45 104 24 125 97 -49 29 -49 -67 29 42 -51 128 -69 287 -582 -221 -303 181 191
5152 191 -351 -3 -70 95 43 -168 -32 -184 -206 67 -65 -98 53 -14 78 -2 -43 13 37 -98 -21 14 15 12 9 108
5178 108 -105 28 142 67 53 -2 -15 298 -618 -121 182 -105 13 4 -10 128 115 -23 -39 8 -115 446 -128
5201 -128 -126 356 -590 -240 -405 -112 -218 174 202 65 305 -71 -327 62 430 -161 -181 -215 -59 169 206 -466
5223 -466 -130 187 87 -585 -126 187 -185 -23 -193 -58 61 -424 26 511 -43 -424 -333 -180 -125 317 -61
5244f1O4O5m00P69n44J02M7k26k28N16m34L99j87L84l83k7n35L86l65L52p5N09
5266A28l10j63L58l84M36m25L60k60j95Q51o69PL93K56p26N78k33j88L69j54j66
5287a37l34M27p5n9L59q5j17m59L93M61p54J49k0N69n52N34j22J07m88J7R9J09
5309B2K34O3l76l85P73m71J65J79m52N93j86o15Q08n19K08n32J43L02m6J08m9
5330c3m43Q00l66Q7j55L03j76k03K91j59j8M7J38n3j01J01Rq8O3n2j9J0ON7k2
5355B4j8l6N2K1p4J77k73M1J88J28j22l05L75J6j69q26R09k36o97J293m20o56
5377f08K65m1R0M1lN71o85P14k96j88J24k60J50K2m70O77m45L11O18l19n42K32
5399d2m13L61k06L63J55l9j45j57M28k3m7p67N90q5l92O69k38k60L72M63j00p7
$$ plain form
5244 -61 3 68 -332 437 -107 -5 42 -184 -412 104 -330 69 -118 266 -117 -144 -679 -293 -658 -306 -381 128
5266 128 -182 -345 13 -371 65 -360 0 -260 -455 396 -273 -266 127 383 -343 235 2 -186 183 29 -137
5287 -137 -471 -44 -119 -178 181 96 -21 -480 -87 374 -380 -231 -251 318 -234 300 178 285 -203 -186 -87 22
5309 22 256 319 -57 -442 331 -140 25 204 -248 345 159 -456 352 -167 41 -491 -348 -46 -92 16 -33
5330 -33 -476 324 -42 45 -110 193 17 -186 105 -54 -72 -25 113 60 -41 60 69 -19 44 -8 -27 -17 -11 46 24
5355 24 6 -30 22 43 -31 146 -127 -86 102 230 108 -197 178 194 25 -801 108 -128 -825 468 48 -608
5377 -608 -343 -384 -294 -253 -256 315 -370 344 48 -140 -16 -276 -126 -104 -574 103 -342 -31 587 268 -274 -42
5399 -42 -455 -94 -300 63 218 179 34 -123 305 282 235 -532 58 -27 -419 250 12 -248 124 587 487 410
5421D10n22m3k03K61k76L32J70M7p0J69m85L48l07L22j42n1O1l3n2l74K66J30
5443d2l12K68K31o37Q61p23L69K43m88O04j03m07L66M8pn59J14PR6j09J28K66
5465B14j10j26lj71K6K89j28R7n43M39p1N13n27M41K96j188O01j43L04n92L78
5486dL86l91jj26k11P04o90k07K91l37O50l37M6k22O33l33J98k08M37l98J47M74
5508E01n37L4J8%Lr5P9j22R8j3n2L1L6P0L32J4q8k90J6j29q4K68k6j57j27J00
5534a20N85n89J1J41j04K13k54K29R2l38l61J076m18m1K6P9j22L43k75l14m42
5555e83L83K17Q6M23p77j78R12o37L35j87r0k63n98O31m1R23r30J14O84n74R0
5576f0K87m07M13k84P21o84P19o4n25k58M94l7q8l31j14J51K06j35p06M98L59
$$ plain form
5421 410 -112 -155 -358 -97 -373 -41 129 176 106 275 -210 138 -169 153 11 -40 21 -12 -64 -438 -172 -42
5443 -42 -354 -86 145 -492 369 -354 15 258 -230 374 271 -136 230 278 271 -288 -174 -167 -71 -180 -52 214
5465 214 104 -22 -25 -196 -170 119 -9 88 -455 -16 -87 426 -101 340 636 -552 49 -94 210 -382 -4
5486 -4 382 -9 -10 -136 -347 357 -333 -540 -249 -586 64 -273 -227 -449 184 -149 49 -159 278 -120 27 501
5508 501 -36 -2 16 16 19 -76 3 -119 -21 -34 -86 -55 -19 51 383 397 309 19 35 -94 -178 90 64 -93 -220 -120
5534 -120 465 -124 -113 28 -76 137 -117 112 204 -134 -495 581 163 122 148 227 105 448 173 -141 -583
5555 -583 -200 17 103 526 -251 -429 483 -154 181 -6 -96 -359 -957 -326 -367 556 -374 -260 424 -150 -60
5576 -60 227 -180 233 -51 670 -14 705 641 116 -142 352 315 227 -104 -218 -67 139 4 -702 -204 155
5597A55j93L22l10J17K70k89l19J80q7K84Oj17J71j60j9L9j51J35p4K18k18J70
5619A30K3k82L50l01J69j37L3M3j9K25k31k24J93j86K56J90k22J56r2o9M7n1Q
5642Ik8N1J50m26K58j55J02Q4n4J03m4l7J45j77j34J60r1J54j58K4J56j72J9J47
5666H6l8j55J18MM0p8r8J28Kn8p9J50q3J2Q1o1J3Q3n8p3J03k0mlj26N8j31J74
5694a3QM3L5j01L7N0j45N0O6r8J8m5K67j38L5r8L8r4J64J3r2J1kq5P3K6Qm6J46
5723A31n2j01O8o4l7J4J24j86Q5J02j27J5K9k1o8J07M6K3J6j11K0l4j5j1J8l7
5749f6J35j7o5P1l6p6P3oQ0j22O0p8P5j6N5l5L4l7j33J86q2n7P4J8J8m8j9J17
5777A03j23Q9k4%j03R4m4mL0Qn4J01r9kJ3m8L9k8J32k0N6r6o5J1N5K6o6K6j2R
$$ plain form
5597 155 -38 284 -26 91 361 72 -247 -67 -154 130 136 19 190 30 11 50 -101 34 -40 178 -40 130
5619 130 153 -129 221 -80 89 -48 -15 28 9 234 3 -221 -28 -214 42 232 10 166 74 5 52 1 9
5642 9 -19 32 182 -244 14 -141 -39 45 -9 94 50 13 158 -19 -153 7 -84 70 -88 -64 92 -80 -61 86
5666 86 48 -107 11 15 55 -23 -121 7 9 -49 -128 22 -61 -49 32 -29 -16 67 9 -64 39 19 15 12 -114 -56 -187 -13
5694 -13 -5 38 73 -28 9 59 -86 -36 30 -68 -50 -95 172 34 69 -29 9 -85 79 92 0 11 9 -76 -3 23 31 -15 131
5723 131 79 -22 46 -18 -55 -41 83 -103 -18 84 -43 -28 1 -20 -88 19 65 88 104 -7 13 -21 -36 -47 -29 -66
5749 -66 69 52 -13 58 22 -54 19 13 93 -29 31 -47 28 12 67 32 66 29 -104 82 0 -57 17 35 53 5 -14 103
5777 103 -20 69 45 45 -58 36 -8 -12 18 26 -28 73 -26 -28 -15 -63 -24 -52 80 60 116 20 -45 -34 21 47 -19 7 -5 4
5807Dn7O4k8l3N5L9n3Q0q7J34j70k5J50j45R6K5O9j67P6J07r5r0J49j83R5q6P5
5834ak1LJ17j18P3m2p2J12Mj17k5M8m1N3oP4O0j56J12N2m9q2N6p2K6K9P6q7J06
5863A12j73J90j05M3k9j06J88j84J40r1P2o7j72K07q8N5O8j03J5L3J09j66N5m1
5887c8J04p4J3rj0q9J28N8j00O1l5K1o6L6qk8J4n1N2r3R9k2l1J29j15O2kJ37k30
5916h7M9P4q0R2r8O4M9n1J28p3p2k5K9K7M2l8q3R0%j56J15P4l9N0j31J04r8o4
5944a08Q1K9L7j11J75j42k0J24j15N0o4M8M7R2k27R7o5O7K6l7P1n5J71k17K4k4
5970d6N5J35j87J00p8N9j05J49oj34l2P5L9j36J68j00J31j44L6M5jnj7m1R8lO5
5997A20j53R3q9O4Ll9L9j34K41j25M0q6o3pQ6QK8M1q7K5N1K5p3j4P2k7L2j51J23
$$ plain form
5807 4 -53 11 -17 -50 5 44 -9 71 -16 118 -52 -77 73 -72 24 49 118 -49 27 134 39 -51 98 -85 10 -76 -1
5834 -1 -22 -19 98 -20 53 11 -61 51 55 -62 -87 -39 -80 -27 -33 41 101 -55 57 109 60 -22 34 -38 -12 17 93 6 112
5863 112 -61 129 24 67 38 -68 120 -64 76 -15 57 -10 -182 25 -63 -8 60 -43 -28 5 114 -52 3 -38
5887 -38 66 -8 5 -4 -14 -103 25 83 -17 44 9 30 -36 0 -8 -36 -22 -73 -21 -114 -15 -37 -68 61 -54 8 6 143 -87
5916 -87 -38 36 -44 48 -50 14 63 12 140 67 -5 -30 -1 26 68 30 -53 37 37 -119 -4 70 31 81 -50 54 -44 -108
5944 -108 -27 2 39 -72 103 -39 -59 65 -50 0 -64 -16 31 123 -104 -7 -72 -5 21 -16 55 0 171 -46 -22 -46
5970 -46 9 144 -43 57 -21 38 -67 82 76 -58 -90 -15 24 -112 56 -44 87 -57 -21 24 23 18 1 -40 58 55 120
5997 120 -33 60 -29 35 38 -1 38 -96 145 20 60 -26 -89 -96 -10 -2 26 67 -20 5 56 81 8 -6 66 39 71 -80 43
6026D3j2o5J16j62k5J82l9Q5j44nP7j37oR3M6j82P1J1J14k5O5j11N0m5K1R2r7
6053A1K6o1J4J11l5rj5o4R1k5n3j07J38J48r3j25Q1m9k1J7j9M3l8R4j53O0J17
6080H4o7j2o0J8M1PJ52j91%k5R0J1o2n2K8o2qK04j60L3L2l6j7P8J7j18J5mP0l4
6110b8J47j55Q1o5k2J47k6m6n8k7L2J17p0r5RQ9J1O7j7j17n4k8J52j49O5P8nl9
6138fj14J28j2j7k0m7L0L5JJ16K3k8j61K9Ml6J97j06r8R9m2q0K19l5p9N3k5o2
6166c4R8j9m8P8j61J53j7o6K00k52M4l8J3J51q6l1o0P8k4JR0o9j9L1K0n3m0K9
6194c1q8J60l4j21M2J55n4k2j4k3k1J01j08J2N0j02J10r3RN9OoM6l6Ol4P3r3Q4
6223C3j52J48P2j00q9QONJ06K1p4k2j9O2N3J2Ro4q8M9J70j0r6j0k2N5j2k3j09
$$ plain form
6026 43 31 -34 82 -80 -105 77 38 123 -21 -26 51 -86 -92 1 47 -135 -64 -53 61 36 101 -10 40 -5 16 108 11
6053 11 37 -24 -10 101 66 57 42 -22 69 44 -9 -116 22 170 77 -48 33 -16 -37 -20 -39 4 -34 60 -93 -33 84
6080 84 17 5 -55 -37 4 11 163 -28 -28 -53 37 48 -14 -66 -38 -100 -108 96 -64 -31 1 -35 -52 26 43 -75 -60 -64 6 -28
6110 -28 119 -36 45 -20 -42 105 79 33 -25 -52 -20 97 27 -68 -59 30 41 108 91 -26 -80 -108 44 -105 -40 38 33 -6
6138 -6 -120 8 -4 -21 -41 -88 -58 -23 -22 94 117 89 -72 -43 -39 -75 122 16 -82 17 -25 -105 114 79 0 53 28 -34
6166 -34 64 45 -3 75 -86 67 50 -16 184 -68 -24 -62 -49 102 16 -15 -75 3 -21 -20 70 1 -18 13 33 -20 -60 -31
6194 -31 -119 41 7 -114 -72 83 29 7 -7 -30 -51 50 -58 -46 4 -98 12 -81 -72 -13 -7 -13 33 -3 3 -31 42 -51 33
6223 33 -119 29 101 1 -88 -80 -74 -69 37 58 -16 -38 -57 5 58 70 79 15 -73 -24 146 136 40 30 8 63 51 28 -81
6252h1K6M6p2M3q0L2J53m2P5j18qJ59q5k9l3lL5J6J5M5j74R0j75J82j6p6J68q0
6280A3j31M7L2J08j9n1L5K7Jl6j82J90r9J1m0J65j16J6N5j06N5nR6j39Q4q4O5
6307hK4N1n9j71J31N4mj00J27L3q0K11j77m2O8n0n9M1p0J10j15L2J19k02J71j58
6333a23J66q0J3j1L7J3l1k4N3r6O1O2r1O7k5p9M2R8j13P1O1Mo8N7j2Oj65Q7J20
6362A00p6l1j6M2o4R9K6m3k6Ml1M3j5oJ18j53k1m8kJ74m0n5m6M9Q7p4o8K3N2P8
6392H0q5j5R7j22M9J8j33J41p6L1J3m6O0q0J89o4L2j30J07r7k5Q7r6J71j24o8
6418h6Q8p3J3J62j48Q4l5N9r2K7N9k5j4QKOKp2NP0Kk2l0N7j88J29n1P8n2Q1j34
6449i0J90j44O5n2J6J7j4k0J03j69J53q6J8J14j66Q5j35J68r1Qj5k4M7j9K00j18
$$ plain form
6252 -81 -55 -9 -81 -38 -118 -86 67 25 100 -18 -26 133 48 19 -14 -17 18 34 49 94 -80 10 -165 17 1 -75 93 13
6280 13 -118 -71 -39 69 50 -1 34 61 62 26 -156 34 -65 -54 -94 71 -45 -29 26 -80 -25 -30 66 -73 11 -73 -8
6307 -8 16 67 8 -163 -32 22 18 -82 45 78 -2 209 32 -10 58 8 -51 -10 -80 30 -85 -53 66 -136 35 -123
6333 -123 43 -37 -24 -35 2 15 -16 -40 13 -83 -22 40 -51 16 -9 -88 -46 52 -61 10 71 75 7 64 52 58 -107 -20 100
6362 100 24 -7 -23 19 -45 54 80 37 11 15 -16 27 12 6 124 -29 -50 -98 -100 74 34 -21 -67 -18 69 -5 -73 -50 2 80
6392 80 -5 -20 77 -45 4 22 -111 30 -46 -15 -2 -48 12 -68 121 57 89 -41 66 -31 -56 31 -65 106 -18 -86
6418 -86 2 -71 -58 104 -44 40 5 64 -28 -1 58 33 19 27 29 35 37 -35 -30 40 42 20 -10 47 -141 -12 -63 15 -37 44 -90
6449 -90 100 -44 21 -31 -15 2 -12 -32 71 -98 55 -31 -13 101 -65 20 -115 53 -38 -30 -45 -69 -22 -41 159 41
6475D1Q5j35nm2P0k6p0NJ45l8jm2L8J2j69M4L0j1K5J06n2q1M4P6ppn3L4J8j6p
6506A1R4o9p9J9J46j25M5r8k4J20q3O3m2J65j23N5m1j09P2J39%j37m0O3J53j55
6532B0L7q6LM6q3J42j6r1P4j9L7j54N2P5r4J21j13N2L4lm5o4J16o1M6p9o2J80
6560F5l6M7k9j47J4m3R5J1J26j09R4p0m0K2J8K3n8o9J06N5%j68J81p2k8Q0j08
6587d0kk0R4j03J27Jo0k4n5J02r5R7P8N4j08r1J59r5K2L7o1k8k5Q5J13j59o9P4
6615HK8J57k65QN9N0M8j43P8k8j04M8j9J58q8J26n8l0p0o4Q4j13J32j8k9O1k5
6642irk8n5J62n9l0Q7m5q2P7r6J54o5m9O5r7O1M8l8L6n8M8n9N3k7OrN4jn9p1O1
6674c4RM2l9j3l4J7J22rj06R3j3O1j40M1KJj08J75r3O1M7q8l5J37K1r9o6m7K9
$$ plain form
6475 41 126 -9 -14 -56 14 -12 -82 -77 68 30 29 -13 25 37 -132 -88 -58 -69 -44 62 10 -71 -27 49 42 35 -18 16 34 18 11
6506 11 105 36 -43 -24 122 -3 42 -56 -80 40 -43 20 -22 143 20 75 34 -75 -3 136 136 -1 -41 22 175 20
6532 20 57 -29 -26 20 -63 79 63 -28 46 27 64 -90 -38 37 -57 64 -49 3 37 34 -11 -75 41 -20 26 -53 -115 65
6560 65 29 76 47 -100 -86 -129 -34 -23 103 -6 88 18 -22 0 18 41 -17 -86 20 75 75 -93 88 16 -12 68 -40
6587 -40 -42 -62 32 -71 56 57 -3 -27 -82 20 -75 22 100 154 46 -45 114 19 41 78 17 -11 -36 49 162 3 -66 8
6615 8 36 193 -72 -64 -5 45 93 -50 28 0 -104 -56 -75 83 -5 121 63 33 -37 -101 -17 -130 2 -16 -45 16 -9
6642 -9 -18 -46 -101 61 2 -28 59 14 -68 9 -87 67 2 -47 18 -79 -18 30 -8 28 -30 18 -41 12 -15 -9 -18 36 35 -24 -95 -34
6674 -34 -25 17 -22 -35 -69 -52 70 61 -45 48 35 96 -44 -3 -1 0 -108 67 -26 35 82 -6 -41 96 117 18 -48 -95 -66
6703f6K5QK7Q3j05m2J15p0l3M1l2J9N7pQ3j76J15M4j14J1J9o3QJk3P2q2J14Qq9
6733e2Q2J8j2k3O1j77J25k4J20o2J3j4M1j39L0O1K0K9j26M9L8p6N7K3n3K5k9q8
6761h3J84o7j62K23kJ4l6j99J15J15q0j33N6J17j49J17j3M1om6j11J9M1L1j02
6786a16J50k3L8p7L5j0o7R3k1J00o5M4j34M0l0rK2N9k1j45J59n2J06p1k4R3j05
6813c1J7K4L4m9m3K5j8N1j3K2k1N2N6j36KR0j58J45j05J22q9k8L4N0j52J66j02
6840e5OJ13o3K2L5p4J3j00N2J7Q0o7R1Q1j94J26q6pp9J12r0N8m1J43j32l5R5J3
6868C4K6q8M9K4J3l4%O8j76J11M7Qn1k5j46%K12p4Jr4kK1j7J61j0ML4o9L0j81
6898a24J26Pr4N3L7kj6m7Q1l7O9N7j12rK5M9l0O2r5OR2o8J77k28R4l9j53K04j06
$$ plain form
6703 -66 -41 -33 -6 77 -28 -70 45 -25 -58 -17 -49 -30 27 20 103 -73 42 86 -28 -17 2 -61 -53 -52 -75 -3 -85 29 37 -52
6733 -52 30 48 36 13 74 -103 22 -2 118 56 69 55 96 -43 -13 48 68 97 -29 20 58 -18 39 62 9 34 5 -83
6761 -83 101 34 -128 95 93 107 71 -128 -13 102 22 -111 -55 62 -87 30 17 58 52 6 -105 -86 -45 -14 -116
6786 -116 34 11 49 -28 7 -3 -70 23 2 102 37 81 -53 -13 -43 -52 -30 29 8 -137 22 -30 76 5 -19 74 -31
6813 -31 -14 10 44 -5 -48 -23 -41 10 -3 19 -2 50 106 -30 -28 62 -96 49 -56 66 -23 -51 -17 33 -119 47 -55
6840 -55 -49 64 1 23 58 -16 -3 -103 -51 -34 46 -21 70 151 -43 83 -3 -10 -89 23 -67 -9 -50 93 -39 -74 21 34
6868 34 60 -28 21 45 58 24 24 92 -84 27 74 82 31 6 -140 -140 72 -2 -1 -95 -97 -76 -93 68 58 62 96 27 57 -124
6898 -124 2 9 -85 -32 5 3 -13 -60 21 -16 53 110 -2 -11 14 63 33 95 0 6 98 30 207 -21 73 34 -119 85 -21
6927b1K3n1P2q0OJ4l4L1K2p6R1L4j54J17J0l3J17j60J28j36J77j71J46j56J37
6952E3P7j08Qn1l8J09j07Q6J9n5J06m2m6j54O1J3R3p1J3O4n0Q4r0R7j08J06rj09
6980d9R3j11j0J19n0k1j2L6p1P6J15n0k4j51R1Q1k33J07J09L8p6q3J54k0Pj18
7006e3P9P2m4j5j2r3J9o3R2N4p8L5QJ3J6j31J87j32M7K1m3l6J7J5jJ5J60k18O0
7035iJ8M5p5P1j95J78n8P1j4q6R2n5MJ0j4J4p1P6mR9n8j97J48L6%p8K2RJ57j01
7065C5j19J95j20J8N0q5n2L3M2o8O0j6N3n3J31k18J16q2J14jml7P4K5k4j30J46
7092H3r0n2R2r2mR9Poj9k1RR4o3Rnr6N9n1m2J43J5j72Q8P6r1m0J58j19J05j23
7122d9lM7n8J2N7N2r1R3n1O4j45L6j21J11RJ00p5l0n3J20m1K2LO2J7r3R2j24l5
$$ plain form
6927 -21 2 -49 23 -57 -51 -37 -71 -40 -18 -94 -3 31 -123 -6 4 -29 88 -72 56 -80 97 -74 72 -84 53
6952 53 130 22 30 -21 -59 50 -57 29 48 -7 99 57 11 -143 -82 -69 24 -47 -34 30 -20 64 -26 71 -37 69 60 -49
6980 -49 44 -67 -77 42 -8 -29 -41 -5 -76 0 115 65 41 -110 -19 62 -171 -64 45 83 7 -76 78 58 65 -53
7006 -53 26 98 54 39 27 -66 -47 -110 -18 36 -42 -7 1 14 30 -101 86 -46 1 22 -21 -57 -40 -25 -26 -11 149 -69 -9
7035 -9 9 54 -21 50 -145 33 -25 46 32 -54 38 -17 -13 -3 -17 -3 -74 2 -2 97 39 -158 -10 26 26 -52 -30 -21 136 35
7065 35 -84 111 -9 9 59 -26 -78 -45 -3 -71 -11 -27 26 -27 104 -114 2 -80 34 33 29 -8 66 91 67 -63 83
7092 83 -7 -59 33 -59 -63 36 43 37 18 -3 6 100 37 46 41 -55 4 -47 -89 54 69 -103 -15 61 -30 -70 88 -31 74 -49
7122 -49 -52 -5 -63 -51 6 58 -33 60 9 73 -72 -36 -157 -46 -37 63 -12 -42 -95 25 -16 6 9 71 88 -5 87 -37 -72
7151g2N9L0J8L7j43M8J09j33P2n1N0on0qJ30p7O6j61J51m8k1l2M6Q2n0p1pMn7
7180h5P5j2k7R8M1p4K5j11J46p8Nk0L5o8L5K2m6N7M9n1J7L5j7N5q3j0Lj24P4J42
7210A08m4M0o9J0q6N6m8PQ6o6%j38L1M9K7J2L5K7L1j4j8j16P5M1j20M6mJ06J8
7239H2k06J40m8J5jk4J31j26J08p6K3K4J7r8K6J5J13oj78J55k30J49rj1j02J73
7265E6j57O5L7n9J54o8o2O1m5j35J57M2n5o0J6qJ7rK2j7J02o8L0j21L8j8Q1N8
7293E4n6J60k35j0O1j5O4n7J6Q3ROj34K3M1j4L9o9J06j5m1J2K3k8M8j14J7K7R
7322A0n6P4n0P0m8J5P2k8j05N3K4k4m4okN5m0N6K7L1n4l1pJ01j92J9j8J2k9J56
7352D1o0N0J8K4j71L2j03J84k0m6Q2Rr9JN2J0O0j07L3J1J9j73J70j44Q1R5M1o5
$$ plain form
7151 -72 -13 17 35 72 -71 -23 86 -47 25 -26 24 18 -32 -40 90 13 79 -82 69 21 0 -32 14 96 46 -25 -32 -28 -85
7180 -85 -10 -22 -49 49 90 16 41 -70 76 -2 3 -17 18 -50 -15 7 -39 18 67 16 33 68 51 106 23 13 16 -108 -34 108
7210 108 64 104 35 45 -41 15 -33 -26 60 -6 -6 -144 -113 -64 -37 -25 10 37 68 54 36 -80 -5 36 -84 -38 -42 64 82
7239 82 -124 16 -32 -17 -18 -42 89 -37 71 -5 18 42 59 -39 -13 2 115 109 -69 86 -144 5 -4 -15 -117 56
7265 56 -101 -36 1 -58 96 28 -34 27 -18 -153 4 46 -9 -69 -53 -61 -44 -53 -31 -48 54 -14 16 -105 -67 -85 -4 54
7293 54 -2 158 -77 -87 -26 -41 23 -34 -18 65 74 80 -54 -31 10 -4 35 -34 72 57 16 28 51 23 71 -43 -26 1 10
7322 10 -46 28 -22 48 0 15 87 59 -46 7 31 7 -37 -43 -45 10 -30 26 53 84 30 -1 -8 93 -99 -80 -98 -86 -115 41
7352 41 -19 31 49 73 -98 -66 -169 15 -5 -51 31 40 -59 -58 -6 4 64 -43 -10 1 20 -153 17 -127 -46 49 90 25
7380B5q6L7P0j35J72n7p0NP8j17m1J84q7Q8n0l2k2m7J02o8M3j03R4M0k0K7l9O2
7408E3kn0k6O1k0j8p2L1J51j03Q1j47J3J9j2J5OlJ0J03p2N3o8O0j44J35o7J2n
7437fm1R2Nj46J13%J0K5j7j5j38M0M1O3O2n1j1k7M7j26L5P1o5pn8K88q7j17J2
7466hp7J05MKj07J31j18Q6%O5j01j9J11n1kL1n7n6J65p1r0N6J2l2R7n8j14J05
7494IJ1J26j10L2k5j21O0M0J4r8R5r2P0q5J06p0R5j14j15J23J57p1j6L4J3r7n5
7521h4J31k4j3l0P5Pr0O6O0Nq3j39J08j11J13l6J22qq5p2O0J16j88O6Q1Rm4N6
7549F8o2R6m4r0n2J88k44J10K0j2J32r4N5M3j62l2O2o3N4o1J00l4N6K9j29J27
7575F1j18N2L5n4L4q6k6P3J65j09l7O3m1N1j37O7r5O9J7O8j75P1m2N0l5R1o3J86
$$ plain form
7380 25 -61 -24 46 -89 83 26 -44 -39 39 -78 -119 65 -22 66 16 -16 -38 -85 17 -51 -8 -111 -17 23 3 30 -9 53
7408 53 51 1 -25 36 16 -2 -74 -43 108 5 86 -61 -48 -29 -41 -26 -20 -23 -13 90 18 71 3 63 -81 54 -13 -1 -6
7437 -6 -47 45 50 -96 17 17 27 52 35 20 -118 -78 -37 26 88 37 26 -1 46 -80 -45 26 -39 -46 -104 184 97 -20 -8
7466 -8 -85 20 24 26 -81 50 -68 18 18 83 -18 -37 74 23 21 52 -5 -61 104 33 -57 -1 11 -21 76 18 -96 9
7494 9 20 146 36 68 43 -78 -18 22 36 -62 33 -59 11 -74 32 -38 57 -57 -172 -49 108 37 21 55 68 -29 -84
7521 -84 47 23 10 -20 55 62 -28 38 98 103 20 -119 -11 -122 -9 -45 77 69 -16 -88 -28 88 -100 -34 47 56 12 68
7549 68 6 102 58 -32 -84 104 -140 -30 -10 -22 110 16 71 114 -48 -80 -18 -81 -27 -88 12 -22 34 63 -66 61
7575 61 -57 -5 30 -24 10 -76 -102 -29 136 27 -10 53 12 63 -74 -7 -102 -33 -16 52 -123 -52 -94 -44 -79 12 -51 135
7603A35n5j03N0j14M8L1J58k31J37k4o2J07j87J01n6J18j14J96j28P5jj46J39
7626G4r0O2p5L6N1m7M9r9l8J00p2L5N4j48O4k8L2M7J6M0j28J39m0r9j8j5J52j06
7654e2N6p0P0Pm3O0pl6O7k9%j1qj01R7pmN5K9k8J06j06P9k50J37p6J12p7J61j49
7684a8M1q7qP3R5k1j22L9q0J66j73m4J07Jj1J8k9K1LJ23j43P7rp2RL8j4N9N4r9
7714fN5j42J75Pj58J20r8P3n4l3P5N2j81J75l0N1k25K38j47K8n2O5Q4r5J8K4k7
7741hk3P6p0M7l5q9J40nlO3j32oJ6L8L9k4k8q2O3mJ02j60J43m9Q6q3m5L6N0r0
7771c7J04j02J06o2N8K5j19O8j0J6j11Q5J1n6l2j0J74q5l6J6L9Q2j82J26l9rM3
7798F3k6N5q6m0P3N9k7O7k8q6JL9k11R1L5J72j71r4J35rL4j20L9m7o3J61k2j4
$$ plain form
7603 135 80 -23 27 -87 -39 -8 150 -81 56 32 -30 77 -110 -9 -65 53 -61 135 7 82 81 -65 74
7626 74 -16 46 -29 7 58 11 60 -39 -77 23 -49 -14 40 -108 -44 -72 -40 7 23 63 -65 74 34 -65 -83 -98 54 -52
7654 -52 4 -66 4 11 -32 28 21 -15 52 23 23 12 4 -97 0 -7 -11 44 73 45 151 45 124 -126 11 -65 47 -30 131 -18
7684 -18 23 -64 -72 1 96 75 -47 -8 -88 78 -95 -139 -32 -31 -42 -24 -53 -32 -29 94 -49 28 19 -53 -44 -6 -20 39 93 -6
7714 -6 49 -93 82 89 -69 51 -47 26 -28 -61 14 66 -115 60 30 81 -144 94 -53 -25 -77 -12 72 -23 -5 19 -8
7741 -8 -31 45 -25 22 -13 -102 38 33 30 93 -39 -45 -29 9 48 24 -4 -86 -23 -27 75 -85 58 9 95 12 -33 3 53 -37
7771 -37 67 -35 71 9 67 92 -27 41 31 47 -64 21 32 -24 -56 -66 108 23 -13 3 42 124 -58 68 29 20 63
7798 63 37 92 6 -34 39 98 71 138 110 24 25 64 -147 -56 -21 151 -20 -114 21 12 46 -74 -35 -82 -145 16 -6 -20
7826b0Q2lk6j38J84j1j38J00j3J0l5L3L8j3o9Jl9L7j7JJ58r1Q1j11o9J18j3r6
7854e9Q0O8N5k29R1kk8J52m6r0pL3J6k4o9P8Nj95J38N7j4MKr8P6M9m9q8J03N5
7884F4j44o5O0M5J24j3k3j40P5m1J54m4k5q6J12j34j9J73j39M%O8M9P0j03j7p5
7911g0M2m6Q4N5j70Q5m2Q3k4j56J82k2p2J83j47j1l1P8J4j35K69o6l1l4l0P7j37
7938g2M7k0qq8J0J21LnK5J6O9j29M6J6R0k25P5P3lr8J5%O1p2J41p6O1l8j06Q6
7968A5P8j8j22R3j5l6j6O3j19J14o3Q1M5j80M0%J02j42J14P1j25J20pr2P8n8N6
7995G7j46L7pJ26m9j01R0J4K2j30J62j27OQ0p7J0o9Q0R8q0l2J58j88m3L4ON5J38
8023A44j51N6j48R4q8j4N5P1l5OM8m4P2l7Jrl2JJ9om0K3m3L5P5j0R0n2p8j8P3
$$ plain form
7826 -20 62 59 33 -105 79 68 -70 30 17 27 -8 25 63 50 -19 -18 -57 -20 -37 -36 122 31 112 1 -68 50 37 -59
7854 -59 21 89 144 -85 6 4 -24 128 82 -8 -15 18 34 10 -59 19 24 -171 -33 24 10 14 16 -82 -6 43 -6 -94 9 64
7884 64 -80 -145 -85 -40 84 71 48 -92 -17 -58 96 52 27 -59 53 -81 -100 73 -66 -62 -62 6 55 125 22 5 -70
7911 -70 -28 -74 10 65 -105 -20 -62 21 -3 -159 23 1 -71 112 -35 -46 -77 1 15 -120 149 83 52 18 -12 65 -72
7938 -72 -25 -45 -53 -141 -131 -10 -7 -12 13 29 98 -31 15 31 121 -104 -29 44 41 -57 -42 -42 19 -53 88 12 73 35 -71 15
7968 15 93 75 -47 46 31 -5 -21 42 -77 37 -26 55 100 -80 -40 -40 62 -80 34 105 -20 100 93 1 79 21 77
7995 77 -69 -32 -39 87 38 -63 27 41 63 -67 95 -32 -26 54 -23 -13 -82 -2 96 16 -16 142 -46 -89 -55 -49 6 144
8023 144 -7 49 -99 -5 -93 -107 -52 19 -16 -10 38 -6 66 29 30 21 -11 -10 9 3 -37 -14 -57 -22 53 43 133 81 3 -15 58
8054E8j20K7R0j11L5M7m6L5K0L4n0p3J13r4L8nl0J48j22o8J10n4j11J24K8K8n1
8081@M8j53J51r1L6j4J9N1J1m9o0M8J09r9n9K6M0r5JO3l8k0J38j89J01L9j15O0
8109d1R2j01M5K6l7o1R4j21P4O1q0M2L6K9j60J05m7K2m2M3l9J24m2m8J13p8L7
8136D6j17J48j43qJ01n5N5q9J80j98J52q8j4L3P7kq1n8J4J01P6k02M5RO0O1r5
8163HL4m8oJ1n7pJ00J22j50o2RoO5m8M5J22j98P7o2L6N3j4m6M9O5p9J2r
$$ plain form
8054 58 -62 -35 55 -56 -21 26 -20 15 35 69 19 -54 59 -35 3 -2 -32 116 -6 -74 36 -18 -129 -5 23 51 0
8081 0 48 -105 46 -45 -9 -23 -4 47 58 9 -51 -3 106 7 -52 -26 14 -81 -80 -17 -55 -75 63 -126 -25 14 -101 -41
8109 -41 51 -50 -5 21 -16 -77 17 -104 -30 31 -49 -7 29 58 -102 3 -44 -22 -64 -21 -60 64 22 -26 87 9 46
8136 46 -71 77 -66 -74 27 -28 27 -62 118 -80 72 -16 -30 3 80 78 -3 -61 -47 54 130 -72 -27 -18 42 103 8
8163 8 42 -6 -12 -1 -58 -65 35 157 7 -55 -46 -52 13 -35 10 132 -66 11 -51 -15 38 24 -22 27 92 13 25 16
8191A6
$$ Imaginary data points
##PAGE= N=2
##DATA TABLE= (X++(I..I)), XYDATA
0@%%%%%%%%lLqJ6j6K4l2M0m8N6p2Q8j04J20j44J68j92K24k64L12l60M10m68N38
32B88o11O91p83Q83r91J113j248J391j550J723j912K118k344K592k861L154l477
49a824L834m221M648n123N652o243O908p662Q525r523J0692j2089J3790j5918
63h554J8664k2364K7657l5914N0733q5724L28856L37920k23894l2497j05440j22471
75A26972k33123j60556j29772n3254l1776J2577K3896J19181J51266J69045J40500
86A34956J26074J05564R2566K2202l4442q3808r8424j39259j61689j38654j10580
97b85494j11746n7283J4450N7095P2148J12122J48398J40017J21166J17270O5197
108C93340O513j5003l7915r2903j39582j32401j05199j08196r6113n3191m097
$$ plain form
0 0 0 0 0 0 0 0 0 0 -3 0 -8 8 -8 16 -16 24 -24 32 -40 48 -56 64 -80 88 -104 120 -144 168 -192 218 -250 288
32 288 -323 368 -415 468 -523 590 -658 733 -817 906 -1006 1112 -1232 1360 -1501 1653 -1824
49 -1824 2010 -2211 2437 -2686 2966 -3277 3631 -4031 4494 -5029 5663 -6426 7364 -8554
63 -8554 10110 -12254 15403 -20511 30222 -55502 273354 611274 387380 354883 249443 126972
75 126972 -106151 -266707 -396479 -449733 -481509 -468932 -445036 -325855 -174589 -5544 134956
86 134956 261030 366594 459160 481362 446920 363112 264688 125429 -36260 -174914 -285494
97 -285494 -397240 -454523 -440073 -382978 -310830 -198708 -50310 89707 210873 328143 393340
108 393340 399853 384850 346935 254032 114450 -17951 -123150 -231346 -327459 -380650 -384747
119c84747L8928O1941R0711J28454J25188J02922R6023Q3058L6283k7454m9851
130C01456n8777j08443j31253j09135r9827q7917m9806l424K5385M5971R2958
141a82812J21029J04092R7364R3450P0127L7805q084m5837o6350q4653r9766j14544
153g8179j09474p3849m1686j5855P107L4103Q6861J18632R5546P6862R3195R5166
165B88429M0063k3909l4362l9120p4967j04806j11538r7622o8728m3394k7034
176b96988p425L6654Q2944R2098Q2648Q5197R2511Q1576L9236k830j9125l5195
188B31301o8563r9004r8064p7964p4665o5784l0362M540L2475N6212P2151Q5157
200c2570R0909Q8929O8143L2201J5393K77l8581p0977q1028p8335p7623q0769
$$ plain form
119 -384747 -345819 -283878 -193167 -64713 60475 163397 259420 342478 378761 351307 301456
130 301456 242679 134236 2983 -106152 -205979 -293896 -343702 -347126 -321741 -275770 -182812
141 -182812 -61783 42309 139673 233123 303250 341055 332971 287134 220784 136131 36365 -78179
153 -78179 -187653 -261502 -303188 -319043 -311936 -277833 -190972 -72340 23206 100068 193263 288429
165 288429 328492 304583 270221 231101 156134 51328 -60210 -157832 -226560 -269954 -296988
176 -296988 -304413 -267759 -184815 -92717 -10069 75128 167639 249215 288451 285621 266496 231301
188 231301 162738 63734 -34330 -112294 -186959 -252743 -283105 -278565 -246090 -189878 -117727 -32570
200 -32570 58339 147268 215411 247612 263005 263282 224701 153724 72696 -5639 -83262 -164031
212a64031o0986k6347j521K0773M1783O5061Q5112Q1333P2855O5897M5042K1630
224B46601m087l3551n5415o8866p2466p6620p9540n4617k3622r599Q402L7185
236a86195O4459P4777O9843O8468O4894M7569K3599m434k8057m3153n7851p0130
248B3789p6681p0190m8634k9147j5577K976L2663O0269O5938O0920O4854O6335
260A37515N0661K1073l500j7731l4293n3296o7847p3376o2294m5899l5135k1736
272b05858J257L2494N2022N2443N7920O7884O4221M5584K0682M624o914l1651
284A54708n2910o1968o2586n6463n1889m1781j9563L093K4329L8389M5798O0087
296b0756O7581N7043L9991K5268J5722k258l2575m8835n0681n3691n7553n6119
$$ plain form
212 -164031 -225017 -251364 -252885 -232112 -190329 -125268 -40156 41177 114032 179929 224971 246601
224 246601 242514 208963 153548 84682 12216 -64404 -143944 -198561 -222183 -231782 -223380 -186195
236 -186195 -121736 -46959 22884 91352 156246 203815 227414 222980 194923 151770 93919 23789
248 23789 -52892 -123082 -171716 -200863 -216440 -213464 -180801 -120532 -54594 6326 71180 137515
260 137515 188176 209249 205749 188018 153725 100429 32582 -40794 -103088 -148987 -184122 -205858
272 -205858 -204601 -172107 -120085 -67642 -9722 58162 122383 167967 188649 193273 186359 154708
284 154708 101798 39830 -22756 -79219 -131108 -172889 -192452 -189359 -165030 -126641 -80843 -20756
296 -20756 46825 103868 143859 169127 184849 182591 150016 101181 50500 -3191 -60744 -116863
308a16863l9965j6669r55J3447L0340M5553N8077N8804N0659M1764L1910J7820
320A73922m422k7273l7901m3577n2237n8383n2005l4376j9099q751P047K9033
332a28022M5008M9583M9177M9570M5315L3376J5250m635j8462k8963m1038n1482
344A4677n5195m5326l1925k4165j3001N877K6451M0220M1960M4344M9579M5086
356I8582L1805J4492r92j1253k5039l9821m8048m8981m1430l3704k8211j2981
368a45581O412K1519L2215L7463M4251M9031M1596K8891J6561M878o712k4343
380A06181l8353m2165m2777m0865l6530k8644j2698M779J6732K5632L4615M4593
392i500M6322L6937K8449K1183Q744p222k2083l2162l7316m0168m1439l7458k5909
$$ plain form
308 -116863 -156828 -173497 -174452 -161005 -130665 -85112 -27035 31769 82428 124192 156102 173922
320 173922 169500 142227 104326 60749 8512 -49871 -101876 -136252 -155351 -164102 -157055 -128022
332 -128022 -83014 -33431 15746 65316 110631 144007 159257 154622 136160 107197 66159 14677
344 14677 -40518 -85844 -117769 -141934 -154935 -149058 -122607 -82387 -40427 3917 53496 98582
356 98582 130387 144879 143887 132634 107595 67774 19726 -29255 -70685 -104389 -132600 -145581
368 -145581 -139169 -117650 -85435 -47972 -3721 45310 86906 115797 132358 137236 130524 106181
380 106181 67828 25663 -17114 -57979 -94509 -123153 -135851 -131072 -114340 -88708 -54093 -9500
392 -9500 36822 73759 102208 123391 132135 124913 102830 70668 33352 -6816 -48255 -85713 -111622
405a11622j1830m48J0102K3566L4990M0111L9927L6594K9850K2474J0908o720
417A17902j9260k4975l2213m0692m1516l2842k3187j6670n349R131K1127L1791
429e6753L5564L4293L6133L3393K1837P747k993j1274k2040l2937l6263l6839
441c0132l2324k2790j7778r372Q009K0711K5849K8958L4439L6870K9825K0402
453I2667J0516j047q352j7243l1574l6132l0667k8050k7036j9882o087O341J4580
466h1966K3193K8318L0635L4292K9902J8417J1243M060q380j9228k4519k9447
478A6520l2826k9408k3023j8250q886M744J2558J7781K7261L2833K9244K5307
490E3855K1492J3205L542n573j6253k4854k6818k6444l0128k7431j4676o673j667
$$ plain form
405 -111622 -123452 -123900 -113798 -90232 -55242 -15131 24796 61390 91240 113714 124622 117902
417 117902 98642 73667 41454 762 -40754 -73596 -96783 -113453 -118802 -109671 -88544 -56753
429 -56753 -21189 13104 49237 82630 104467 112214 109221 97947 75907 42970 6707 -30132
441 -30132 -62456 -85246 -103024 -112396 -104387 -83676 -57827 -28869 5570 42440 72265 92667
453 92667 103183 102136 93784 76541 44967 8835 -21832 -49882 -76918 -96800 -102887 -96546 -81966
466 -81966 -58773 -30455 180 34472 64374 82791 94034 98094 89714 70486 45967 16520
478 16520 -16306 -45714 -68737 -86987 -95873 -91129 -78571 -60790 -33529 -696 28548 53855
490 53855 75347 88552 92094 86521 70268 45414 18596 -7848 -37976 -65407 -80083 -86756 -88423
503h8423R645J9150K4292K8319K9452K5355J9732J5379O020o767j3326j8347k7961
516B2520k8557k3465k4923k0294r781J325Q016J4640K1738K5396K6422K8227K2432
529F3696J0184O024K91j0292j8293k3861k7612k5791k0042j6571j5180n070J0092
542g2425J5202J6279K2605K6190K4901K1455J4404M762n30n057j5362k4309k3450
555D665k1043k3054j9239r542m059K031J2616J8708J9273K2832K3750J9725J4392
568F1055Q296K06q148j1978j7143k4397k3222j8164j7986j3542k859L321P449
581e7112J5658K2333K1382J9202J9605J6263P920K133n606j4456j6106j7671k2967
594i422k2652j6260j0741o188J441Q768J2460J7234K3449K1504J6581J5017R825
$$ plain form
503 -88423 -78778 -59628 -35336 -7017 22435 47790 67522 82901 88921 82154 68828 50481 22520
516 22520 -6037 -29502 -54425 -74719 -84500 -83175 -75159 -60519 -38781 -13385 13037 41264 63696
529 63696 73880 79904 80195 69903 51610 27749 137 -25654 -45696 -62267 -77447 -82517 -72425
542 -72425 -57223 -40944 -18339 7851 32752 54207 68611 73373 72843 67786 52424 28115 4665
555 4665 -16378 -39432 -58671 -68213 -72272 -70241 -57625 -38917 -19644 3188 26938 46663 61055
568 61055 69351 69557 61409 49431 32288 7891 -15331 -33495 -51481 -65023 -67882 -64561 -57112
581 -57112 -41454 -19121 2261 21463 41068 57331 65251 67384 61778 47322 31216 13545 -9422
594 -9422 -32074 -48334 -59075 -65263 -63822 -55054 -42594 -25360 -1911 19593 36174 51191 61016
607F1016K434k626r448j7309k0235j8153j8439j9206j3276n279j094O443J3617
620d1555J5216J6709K1231J9738J4061R151L281j115o397j3403j7676k0850j6904
633a8513j3714j4703r216k16N168R350J4440J6951J6122J8272J5423R583K167
646E1114Q15m974j3258j4124j6033j7883j6649j0101p708k847L402Q799J2262
659b7185J5549J7799J5109J2377J0900M986r94m947j0291j5183j4998j4481j5395
672b6754j3067o910j035J804P494J2734J3479J5212J6852J3263Q494N238Q49m747
686D2906r917j2931j5324j5563j3309j1411r466k793L190O083J0354J4055J5002
699H76J4776J3629J0283N302Q50k746q177j2880j3436j4631j4746j1487q259m757
$$ plain form
607 61016 63450 60824 51376 34067 13832 -4321 -22760 -41966 -55242 -60521 -61615 -55172 -41555
620 -41555 -26339 -9630 11601 31339 45400 54551 57832 56717 50320 36917 19241 -1609 -18513
633 -18513 -32227 -46930 -56146 -56362 -51194 -41844 -27404 -10453 5669 23941 39364 48947 51114
646 51114 51929 46955 33697 19573 3540 -14343 -30992 -41093 -48801 -51648 -48246 -39447 -27185
659 -27185 -11636 6163 21272 33649 44549 49535 48541 43594 33303 18120 3122 -11359 -26754
672 -26754 -39821 -46731 -47766 -45962 -38468 -25734 -12255 2957 19809 33072 41566 46804 47653 42906
686 42906 32989 20058 4734 -10829 -24138 -35549 -45015 -47808 -44618 -38535 -28181 -14126 876
699 876 15652 29281 39564 44866 45716 42970 34793 21913 8477 -6154 -20900 -32387 -40646 -45403
713d5403P94N954R479J1617J3966J5259J3063R784P069K130k627n916j0286j3470
727A1413j3773j3170j1729q756n230n41L847Q052J1421J1710J3325J3534R781
740B9884O308L759r61n666q703j1135j2448j2907j1025q190n789j207L075O205
754b8800R774J1594J1500J1606J0170O776L315q28m072p407j0113j1108j1697
767i290j0943p580m924k002K253N478Q571J0660J1133J0657R026O424M073j88
781C3348m353o613r268j0460j0570j0312q168n004j505K336M706P366J0226J0922
795B651J0532Q867N811L634J055l446o874q985j0051r825r741q123n452k397J659
810c0685N168O860Q800J0409J0239R445O539L465R20k176n441p987j0270r939
$$ plain form
713 -45403 -44609 -38655 -29176 -17559 -3593 11666 24729 34513 41582 43712 41085 35169 24883 11413
727 11413 -2360 -15530 -27259 -36015 -41245 -41786 -37939 -29887 -18466 -6756 6569 20103 29884
740 29884 36192 39951 38990 33324 24621 13486 1038 -11869 -22894 -31084 -36873 -38080 -35005 -28800
754 -28800 -19026 -7432 4068 15674 25844 32620 35935 35107 31035 23628 13515 2407 -9290
767 -9290 -20233 -27813 -32737 -34739 -32486 -27008 -18437 -7777 3356 14013 23039 29463 33536 33348
781 33348 28995 22382 13114 2654 -7916 -18228 -26396 -31400 -32905 -30569 -25863 -18497 -8271 2651
795 2651 13183 22050 27861 31495 32550 29104 22230 13245 3194 -6631 -16372 -24495 -29947 -32344 -30685
810 -30685 -25517 -18657 -9857 552 10791 20236 26775 30240 31160 28984 23543 15556 5286 -4653
824d653r132q137n653l064J77M074O640P994R427R654R238P404M278J497j633
839B8111m403o430q993r693r002q065n980l296p89K591N119P413R121Q571Q421
854A2696P346M761K337p24l801n655p274q666q552p834n698l295j358J714M534
869a9469O061Q005Q309P157O840M983K174k69k834m983o689p815p354p099o027
884a9010k977r03J052L891N590O827P850P106N923M422K563J70k946m855n619
899I084p481p286o058n739m100n31J636L089M920O524P764O913O011M316K110
914B1172O02j725m978n873o494p369o617n155l707j861Q15L682M818N463P425
929A98P325N528M832L078K49j642l451n475o462o761o322n940m045j168k81J580
$$ plain form
824 -4653 -13785 -21922 -27575 -30639 -30462 -26388 -19748 -11754 -2327 7327 16565 23969 28247 29744 28111
839 28111 23708 17278 8285 -1408 -10410 -18475 -24455 -27751 -28540 -25949 -20830 -13417 -4296 4275 12696
854 12696 20042 24803 27140 26416 22615 16960 9686 1020 -7532 -15366 -21064 -24359 -25717 -24003 -19469
869 -19469 -13408 -5403 2906 10063 16903 21886 24060 23791 20957 15974 9285 1470 -5884 -12983 -19010
884 -19010 -21987 -22890 -21838 -17947 -12357 -5530 2320 9426 15349 19771 22334 22504 19558 14703 9084
899 9084 1603 -5683 -11741 -17480 -21580 -22111 -20475 -17386 -12466 -5942 1822 8735 14746 19062 21172
914 21172 21774 20049 15071 9198 2704 -4665 -11282 -16437 -20144 -22005 -21190 -17508 -12690 -7227 198
929 198 7523 13051 17883 20961 21210 19568 16117 10642 4180 -2581 -8903 -14843 -18888 -20056 -20337 -18757
945a8757N214N719N865O681O204M497L168J488q55l590m443n090o692o160m929
960a1680m692k556N88J284K800N354N811N577N627N393L300M04n1j536m180n215
976F228n343o119m875l496k649r88J237L305L910N091N966M765L673M031K116
991A6852j234j778l064m793m961m872m961m528j702K66K72J770M516M797M826
1006A406N403L742K160K299M43j973l762l912m430n151m187l584l312l94J875
1021a3377J537K944N267M746M071M457L499J429m90q00k631m671l864m531n338
1036g752l351j895j446J33K246L334L889M648N120L454K725L005L83j864j748
1051A0881l357m817m270m102l975k918q19J57P32K929M524L544M042M936L055
$$ plain form
945 -18757 -13543 -7824 -1959 4722 10926 15423 18591 20079 19224 15634 11191 6101 -591 -6751 -11680
960 -11680 -16372 -18928 -18340 -17056 -14256 -8902 -3091 2486 8113 13506 16806 17210 17159 15623 11443 6228
976 6228 885 -5234 -10109 -13605 -16254 -17242 -16005 -12700 -8790 -3699 2267 7032 10705 14736 16852
991 16852 15618 13840 10776 5983 1022 -3850 -8811 -13339 -15041 -14775 -14503 -12733 -8217 -3420 1406
1006 1406 6809 10551 12711 15010 15453 13480 9718 5806 1376 -3775 -7962 -11546 -14858 -15252 -13377
1021 -13377 -11840 -8896 -3629 1117 5188 9645 13144 14573 14083 13283 10652 5981 2117 -2414 -7752
1036 -7752 -11103 -12998 -14444 -14311 -12065 -8731 -4842 -194 4926 8380 11105 14110 14493 12629 10881
1051 10881 7524 2707 -1563 -5665 -9640 -12558 -13377 -13220 -12488 -9559 -5035 -1491 2551 7487 10542
1066A0542J375J367k98k452l161l267m288m440l140k578k322O5J697J483L162
1081f255M496L447L221L891K680K75n45r45k693l756k858l801m473k164p25j060
1097a1265M13K308K680L263M245L461J855K143K289k36k203j858k831l866k943
1112b545l047l282j363J1M41J184K900L335K999L375L505J477O92Q48j217k616
1128F697k477k885l801l163k010j478j438O50J988K018K835L609K700K775K822
1143H842R89k59o87j483k658l499k661k991l164j071n79n01J269K630K481K714
1159f28L170K937K017J187Q66q99j725j606k939l602k398k183k276o58L6O71J706
1176f324K692K825K350K642K672J124M75O3j785k147j986k545l080k457j570q93
$$ plain form
1066 10542 11917 13284 12986 10534 7373 4106 -182 -4622 -7762 -10340 -12662 -12597 -10900 -9417 -6255
1081 -6255 -1759 1688 4909 8800 11480 11755 11210 10265 7572 3816 958 -2843 -7316 -9480 -10205 -11265
1097 -11265 -10852 -8544 -5864 -2601 1644 5105 6960 9103 11392 11156 8953 7095 4264 398 -2545
1112 -2545 -5592 -8874 -10237 -10226 -9785 -8601 -5701 -2366 633 4008 7513 8990 9682 10530 9313 6697
1128 6697 4220 1335 -2466 -5629 -7639 -9117 -10555 -9905 -7917 -5899 -3064 545 3245 6020 8842
1143 8842 9831 9572 8885 7402 4744 1245 -1416 -4407 -7571 -8642 -9221 -9722 -8453 -5823 -3342 -628
1159 -628 2542 5479 7496 8683 9549 8650 6925 5319 2380 -1222 -3620 -5803 -8079 -8737 -8701 -8030 -6324
1176 -6324 -3632 -807 1543 4185 6857 7981 8456 8519 6734 4587 2601 56 -3024 -5481 -7051 -7944
1192g944n50J189J511J804K722L077J898K043J850L51k37j030j623k388k633k334
1208b294k284k107o27k77K16J537K027K008K783K338J894J379R46J41j222j593
1224D865j757k458k700j904j638j447l33M11J288J456J978K681K096K057J521
1239F116P83R7m62j545j801j829k594k167j705j072o64m7J250J557J519K328K478
1256B242J736J404R87J40l39j134j767j737k390j925j649j320m47r4O93J444J798
1273b358J768K171J920J321J010J96k73q39j529j689k088j983j469j292p12oN44
1290e308J217J603J674J991J719J403J169K21k55p73j227j636j772k127j329j186
1306d616q14j11N91P76J709J165K556J057J721J586pn87m62p64j584j845k504
$$ plain form
1192 -7944 -8494 -7305 -5794 -3990 -1268 1809 3707 5750 7600 7951 7714 6684 5061 2673 40 -2294
1208 -2294 -4578 -6685 -7312 -7589 -7373 -5836 -3809 -1801 982 3320 5214 6593 7539 7680 6458 4865
1224 4865 3108 650 -2050 -3954 -5592 -7039 -7372 -6961 -5673 -4217 -2239 442 2538 4595 6116
1239 6116 6899 6996 6534 4989 3188 1359 -1235 -3402 -5107 -6179 -6843 -6890 -5640 -4083 -2564 -236 2242
1256 2242 3978 5382 6369 6509 6170 5036 3269 1532 -858 -2783 -4432 -5752 -6199 -6293 -5600 -4156 -2358
1273 -2358 -590 1581 3501 4822 5832 6028 5755 4916 3387 1698 -390 -2373 -3842 -5134 -5846 -5852 -5308
1290 -5308 -4091 -2488 -814 1177 2896 4299 5468 5689 5434 4661 3434 1798 26 -2101 -3430 -4616
1306 -4616 -5430 -5541 -4950 -4174 -2465 -1300 1256 2313 4034 5620 5613 5026 4564 3800 2216 371 -2133
1323b133m65j524j725J042K04N75J067J807J549J762J454R69O76l04k35j148j021
1340B550k497j192j352j230j134m37M17P81J219R06J941J575J460O71J123n98
1356D203M14m80j800j315j617j460j293j150k23J72K00J050J500J009J712J290
1372B212J543O46n2l13m38q56j480j275j457j322r76n92J54M12P02J214J590J066
1390G78J398P21N13Q29o12n38p96r43j039j595j394k3q61l80K23Q62J138J395
1408c24J015J141J087P03M7k31k44q06j240j157r28j466m20l40j7M9Q25N23P05
1427a078J874R44N90J379J00P94j671l81j602q47j390l36j364l55j47k74R71Q22
1445a971J339Q28J079J426N06L41j23n1j082p47j227j002j522o19n19m47j10Q61
$$ plain form
1323 -2133 -2598 -4122 -5847 -4805 -4601 -4026 -2959 -1152 397 2159 3613 4582 5258 4954 4719 3571 2550
1340 2550 53 -1139 -2491 -3721 -4855 -5292 -4875 -4094 -2875 -1969 -28 1547 3007 3678 4801 4203
1356 4203 4617 4137 2337 1022 -595 -2055 -3348 -4498 -4721 -4549 -4349 -3299 -1799 -790 922 2212
1372 2212 3755 4401 4349 4036 3598 2742 1262 -13 -1470 -2792 -3768 -4360 -4206 -3794 -3092 -1878 -288 778
1390 778 2176 2897 3410 4239 3627 3089 2293 1350 311 -1284 -2678 -2701 -3562 -3942 -3719 -2857 -1719 -324
1408 -324 691 1832 2919 3622 3669 3438 3194 2388 1148 -9 -937 -2403 -2823 -3163 -3180 -3131 -2306 -1783 -1078
1427 -1078 796 1740 2330 3709 3809 4603 2932 2551 949 102 -1288 -1624 -2988 -3343 -3490 -3764 -2793 -1971
1445 -1971 -632 196 1275 2701 3207 3548 3425 3374 2292 1545 318 -684 -2206 -2825 -3344 -3791 -3901 -3040
1463c040O35R64K178J80J399O22N99k28j50l39j110j202n22j143j575j88k1m22
1481c363N02P87M80R84J344R67N02M42N45k28n50j43j160j481m57n69j167m22
1499b987K90j2M38J066P97N06Q98J410k8Q4L59m29p90n30p64j355o19l37m74l37
1519b814N40N16J38J145J252J92O37P60K11k60o6n13j073p00l08r82j145J08R4
1538b268n8N30Q24K15R64J102M34K11M11K51o97m58j33j195j193k31l99q49L0
1557b509K62J73O34J105O51K66R23Q87K9j7oq29o08j93j111j315k71m3l84j41
1577b497N01N04N12R17Q47L07Q10P53l52l32j5o32r51n21l80q65q51J44o8j8Q26
1598a361N13Q6J037R82K93J23K91J22m28l82m92q31n70j42p93n83K71L14%N26
$$ plain form
1463 -3040 -2405 -1441 737 917 2316 2938 3537 3309 3159 2820 1710 508 -14 -1157 -2732 -2920 -2941 -3363
1481 -3363 -2861 -2074 -1594 -610 734 1701 2203 2645 3190 2962 2412 2269 1109 -372 -829 -1398 -2565 -2987
1499 -2987 -2697 -2709 -2271 -1205 -408 98 996 2406 2378 2462 2821 2392 1602 1072 308 -1047 -1666 -2003 -2477 -2814
1519 -2814 -2274 -1758 -1620 -475 777 969 1606 2366 2577 2317 2251 1738 665 -35 -343 -1325 -2470 -2362 -2268
1538 -2268 -2326 -1796 -972 -757 207 1309 1743 1954 2365 2616 1919 1461 1328 133 -1060 -1291 -1690 -2539 -2509
1557 -2509 -2247 -2074 -1440 -335 316 582 1505 2392 2421 2404 2398 1569 961 768 -343 -1658 -1929 -1972 -2356 -2497
1577 -2497 -1996 -1492 -980 -63 784 1091 1901 2654 2302 1970 1955 1323 372 -149 -529 -1394 -2245 -2101 -2169 -2187 -1361
1598 -1361 -848 -762 275 1257 1550 1673 1964 2086 1658 1276 784 -47 -617 -759 -1552 -2135 -1864 -1550 -1550 -1024
1618a024P37M59L33O48N40j07J81N4p69n87rp57q49k84k48J0J09K92L20K97R89
1639C35N47J21M37M35m09j47j81n55n68n13m54m00j67L0l8J24Q32M13J05O35P46
1660A328L18N1k98k00l3m01n89q95k87q2m19k92K28K20M39M74M71N41N81M39K2
1681A616j75j5q6n89n63l60n43m02k60l93R0N17J99L22L24Q14N61p1L87K92j71
1702A494k10m80o00j54m62m31n92p6K18Q1qO40M48M19M26K31J88L36Mm90k61k42
1724D79l11n49m79k58k69J31J97r2M46N07N25O6L86L39K35k07l98J51l22l65m67
1745b55n42j64J06k71KK58L47L68J56M08M02K23K1m7j21j10l41m44m25j44j02
1766f75l43k15J65K93L05O9L16M20O04M5j64K17rk72k44p07j36K8n96k63j1J46
$$ plain form
1618 -1024 -287 172 505 1153 1693 1586 1767 1821 1052 465 456 -301 -1150 -1434 -1682 -1672 -1563 -1271 -951 -654 335
1639 335 882 1003 1440 1875 1466 1319 1138 583 15 -498 -952 -1352 -1519 -1489 -1527 -1403 -571 -158 -53 582 1328
1660 1328 1646 1697 1399 1199 1166 765 176 -719 -1006 -1088 -1507 -1799 -1571 -1351 -912 -438 33 574 1155 1594 1616
1681 1616 1441 1426 1340 751 188 -172 -715 -1117 -1377 -1770 -1680 -1163 -964 -642 -318 496 1057 986 1373 1665 1494
1702 1494 1284 804 204 50 -412 -843 -1435 -1511 -1293 -1212 -1220 -580 -132 287 713 944 1132 1468 1472 982 721 479
1724 479 168 -381 -860 -1118 -1387 -1256 -1059 -1151 -705 -198 327 393 779 1118 1353 1146 748 899 577 212 -255
1745 -255 -797 -961 -855 -1126 -1124 -866 -519 -151 5 413 815 1038 1059 1012 891 781 440 -4 -429 -573 -675
1766 -675 -1018 -1233 -1068 -775 -470 -401 -85 335 939 984 820 1037 1028 756 512 -195 -331 -303 -899 -1162 -1173 -1027
1788a027K14J82J88M45L59M01K38j04K31km09l85k11j60k87n30l18J89R6K1p8
1809i47L99O95K10R7L41J70J65j75l29j35k4m11m89k32k19J9j78mK20M38M30J44
1831A85j02N98K68p8q2j20m0k5m87m17k26j7j01k09l1L37J41O9L25K20K42M25
1853H75l39Q4J02j0m25l66k9j10k28k04j67J20L04O5q3K92O28O5nk8K03o2j93
1876D89k65j96k00L9m26k60N0L08L1n4K55K65L83N4K4R3P9J38m85k25J50k25m19
1899c97k24jL0K5j60J99K43M00J60p9K16M71j90k58o1j9j06l23l12k32J39j3j16
1922f08k57M49M67j57J03K54K87K39k11j02R2K9j47n08k97J73r1m63J92P7K68
1943b11J8K4J62K71J99J55k30J8K64k15n25jJj77j75j50oQJ72J01j3L48O05l07
$$ plain form
1788 -1027 -813 -631 -443 2 361 762 1000 896 1127 1125 716 331 120 -40 -327 -857 -1175 -986 -890 -869 -947
1809 -947 -548 147 357 454 795 965 1130 955 626 491 467 56 -433 -665 -884 -865 -1043 -1047 -827 -389 41 185
1831 185 83 681 949 871 789 669 629 604 117 -300 -526 -543 -644 -853 -884 -547 -406 -337 -12 208 450 875
1853 875 536 620 722 712 287 -79 -108 -218 -446 -650 -817 -697 -393 -328 -411 -119 509 574 569 541 744 682 489
1876 489 224 28 -172 -133 -559 -819 -769 -461 -430 -484 -229 36 419 473 497 590 669 807 322 97 247 22 -397
1899 -397 -621 -622 -592 -567 -727 -528 -285 115 275 196 412 883 693 435 374 355 249 -74 -386 -618 -479 -492 -608
1922 -608 -865 -416 51 -106 -3 251 538 777 566 464 556 585 438 -70 -367 -194 -285 -748 -556 -479 -211
1943 -211 -193 -169 -7 264 463 618 388 406 670 455 -70 -71 -70 -247 -422 -572 -578 -570 -398 -297 -310 38 643 336
1967C36o3K75R4j11j59k93j12Nj65m76O8J36P9q0N4L54K23O8J51j28K72J81k61
1990D48k81M1Q9l62l26n7L0o5J52k62J31M33K19k00J47L04K42k64j28mk4j50l2
2013H1l51p7N9j77j22O4L06J20l0K03K07P8J51l8j53O0Q0m00l23R3K0j63j56R
2037d59R8M7K23o9P0L97J55l45J05K06j29j35j13l4j24j04q2k17P1L47j54k17
2059d63M06K91J2M1j8l0K42j64q3l06Q1J50m17k88K46J46k44p7L35O8J18N6J01
2082B03M1J54R6l33M1j0j9k60j86n8J54k0j65j67M41J78j54j6L46J29j4j25Q0
2105C36j04k8m5k26k17J85j04k30r0K89jP8J70j08J86L00ll13K96pj18l47oK26
2129A19l67L3q8qJ00O3j14P3K43M6N2K3J12m2L9j68J6j61M9q7k33J5K13j80j7
$$ plain form
1967 336 273 548 642 531 372 79 -33 -28 -193 -669 -601 -465 -386 -466 -412 -58 165 233 384 256 528 709 448
1990 448 167 208 297 -65 -391 -448 -418 -483 -331 -593 -462 -29 190 -10 137 441 683 419 291 287 263 113 81
2013 81 -270 -347 -288 -465 -587 -523 -217 -97 -127 76 283 361 512 474 321 381 461 61 -262 -169 -149 -312 -468 -459
2037 -459 -361 -314 -91 -160 -90 307 462 117 222 428 299 164 51 17 -107 -211 -293 -510 -439 -92 -246 -463
2059 -463 -57 234 246 287 269 239 481 317 234 -72 9 159 -258 -546 -300 -154 -398 -475 -140 -72 46 102 203
2082 203 244 398 494 161 202 192 173 -87 -273 -331 -177 -197 -362 -529 -88 90 -64 -80 266 395 381 256 336
2105 336 232 204 159 -67 -284 -99 -203 -433 -523 -234 -235 -157 13 -95 91 391 388 75 371 364 246 -101 -107 119
2129 119 -248 -215 -303 -311 -211 -148 -262 -189 54 100 152 175 287 245 284 116 132 -29 20 -67 -300 -285 -72 -252 -269
2154b69kK38J26r4Q2O8L4J86j66j60O8Q2k42k77j8QM44n49N30o77j30J354j502
2177h66O44Q29R4j080L27K87p63L56l17J22P24l39L0l30J24J01J52k66K42r5O3
2198C9L08j73J03q9M3k67j55L4J49k90j8P9O5o3J26m7J11K87jm6m3K74k28j41
2222E7j13KK0n9j65r5J20N5n5O3Q3L02j12M0M3r2K16n0j67j5Jj37j10p2M7M4n6
2249b05q8K05K40l4n5O4K3N8m5m1l7J49j64l25O7j2K28j60l6O5Q2K2J5L6Q0j1
2275A21M9j58J18O4Kj12q8o9P0j01j20J20n5K46j60j01K65N8JKj67J73J40j64
2299A34j46J4p8o4J63j77O2N4r5J25m3R8J24q6p7J72n7Q0j38j07M1j32ml9k7J87
2325a6j90N9K4J30J50j40M6P9P9k32M1pj5k8p5o0N1O2p7K9P6KQ5oR0q6M2P8N8
$$ plain form
2154 -269 -271 -33 93 -1 81 149 183 369 203 43 111 193 -49 -326 -344 -336 108 -441 89 -588 -718 636 -866
2177 -866 -222 607 701 -379 -52 235 -528 -172 -489 -367 357 18 48 -282 -158 -57 95 -171 71 -24 39
2198 39 347 174 277 188 231 -36 -191 -157 -8 -298 -316 -237 -172 -235 -109 -156 -45 242 241 195 152 426 198 57
2222 57 -56 -54 -34 -93 -258 -353 -233 -178 -233 -170 -87 215 103 143 186 94 310 260 93 78 79 -58 -168 -240 -193 -149 -205
2249 -205 -293 -88 152 118 63 127 150 208 163 122 85 234 70 -255 -188 -200 28 -132 -168 -103 -21 1 16 52 132 121
2275 121 170 12 130 194 196 84 -4 -73 -3 -104 -224 -104 -159 87 -73 -174 91 149 150 152 -15 158 298 134
2299 134 -12 2 -76 -140 23 -154 -92 -38 -133 -8 -51 47 171 85 8 180 123 203 65 -42 -1 -133 -137 -176 -203 -16
2325 -16 -206 -147 -123 7 157 17 63 142 221 -11 30 23 8 -20 -95 -155 -104 -42 -119 -90 -14 -12 73 67 157 71 113 191 249
2354B49k35N24m07J21j48k29J63j60K3j24P1J69o0k8L6Q7J41Kp4l1J0M3k13Q2
2378A2p2m3o6J0O1P7O2M5j07K3J61p2P4N1k17N7l9l7k0pj11O7q2Q2J14j23j0J81
2406G1j2Pm8P7l7l8P7r3n5Q6o0j20R9j00O3L1%l9J00p4N1J99j64Q2J8l7m4K5o3
2435Bo5j31N8J24k19J66J2%J19l0o0K21k18J61o0M5q4j21Q4Q7k17J00m3l8qQ5
2461c0o8M4J02j3kO6j5O2n2J6O3j93l3J30j49l9j5J13j13J13M5j4oJ46Mj32m8
2488a8J29j19O5q7m7k6k8K6Mj7ok2Q2J60o2L7J10j1k1q9j30J04m2j3N1l5j98J31
2516g2q2l8K36q6O4J12j92J92n9k4LK5l3qj20r4J36r6j1P8q8M8%M8J66j31J35
2543A09R3k33P8M1j39L4M2j06j00J80k02J04M1O6j74J57M0P5L0Qp1n1L9J1n3p3
$$ plain form
2354 249 14 538 131 252 104 -125 38 -122 -99 -223 -152 17 -43 -71 -35 52 193 195 121 90 100 143 -70 12
2378 12 -60 -103 -169 -159 -98 -21 41 86 -21 2 163 91 165 216 -1 56 17 -20 -40 -47 -158 -91 -173 -91 23 -100 -110 71
2406 71 59 66 18 95 58 20 97 4 -51 35 -25 -145 -46 -146 -83 -52 -52 -91 9 -65 -14 185 21 103 121 84 40 65 2
2435 2 -63 -194 -136 -12 -231 -65 -53 -53 66 36 -24 197 -21 140 80 125 41 -80 4 91 -126 -26 -69 -107 -115 -30
2461 -30 -98 -54 48 35 33 99 84 146 94 110 173 -20 -53 77 -72 -111 -126 -13 -126 -13 32 18 12 158 162 30 -18
2488 -18 111 -8 57 -30 -77 -103 -131 -105 -101 -118 -124 -146 -64 96 34 71 181 170 149 60 -70 34 -8 -21 30 -5 -203 -72
2516 -72 -154 -192 44 -42 22 134 -58 134 75 51 54 79 46 38 -82 -176 -40 -136 -147 -69 -157 -109 -109 -61 105 -26 109
2543 109 202 -31 47 88 -51 -17 25 -81 -181 -1 -203 -99 -58 8 -166 -9 31 106 136 144 73 22 61 72 19 -54
2569e4J56k11J52o9Rq6J10Nq7J45k5K7L9Ok1Oo2l1M0j19qJ9Ol5qk2j9K45n3p3
2599a8o5K29q3j5P2m2pj1j39O7q4L0r7J14r8J20J0M9N3j44J58j40M7J8L8n3L3
2626D2j05O5k8n0J4j1P0J3p4J03R8j65J58j6q6r4Q6J67j34%q2K2l4m1oo3R5j09
2654a65K05M8j29R0Kk5Qk2J13q5j16P6m4Q5j11K6m1N2j8J13j02J0jl7K67j25j71
2681i7P5P5q2k6q3R8ol2L8K8m6k7J29j87J93n5J03m5q0OM4kk8Mp2l8pm5J34k3
2711e4L9N4r8J80j32Q1j26oO3R7j93M6m7P2J6l1p7M1M7K3J6M9P7j31o2J98Rj13
2739C8P0k09N9O5J8n6o4J4J1K0M9p7K5J51L2l0O5j62j01J24n8M6J9j40J06K3n8
2766b0R1q9P0n0J2rN2pPQ4j69J67j26n1n4R9j38J82q1j3P9m1mm7J24K0j14q4J37
$$ plain form
2569 -54 102 -109 43 -26 -17 -103 7 12 -75 70 45 72 111 117 96 102 40 9 49 -70 -78 -59 -53 -88 -96 -118 -137 108 55 -18
2599 -18 -83 146 63 48 120 78 71 60 -79 -12 -96 -66 -163 -49 -147 -27 -17 32 85 -59 99 -41 6 24 62 9 42
2626 42 -63 2 -26 -76 -62 -73 -3 10 -64 39 137 -28 130 114 28 -66 20 187 53 53 -29 -7 -41 -82 -88 -151 -56 -165
2654 -165 40 88 -41 49 51 26 34 12 125 40 -76 0 -44 41 -70 -44 -85 -33 -51 62 -40 -30 -31 -68 199 74 -97
2681 -97 -22 53 -29 -55 -138 -40 -46 -78 -40 -12 -58 -85 44 -143 50 -5 98 53 -27 -21 23 21 -7 -3 -75 -113 -120 -165 -31 -54
2711 -54 -15 39 -59 121 -11 70 -56 -62 1 98 -95 -49 -96 -24 -8 -39 -116 -75 -28 -5 11 60 137 6 -56 142 151 38
2739 38 108 -101 -42 23 41 -15 -79 -65 -54 -34 15 -62 -37 114 146 116 181 19 -82 42 -16 30 49 -91 15 38 -20
2766 -20 71 -18 52 2 14 5 57 50 57 141 -28 139 13 -38 -92 7 -131 51 -30 -43 36 -5 -9 -56 68 88 -26 -110 27
2795B7J4o7O0j1l4p2pN0n3Q1n8m3J44J0k3N8J9j33mR8jq1K2nn4m5P0%Qm7J12j78
2827a43K33j37J04O2No0o1P4j52p5J62L7j01N7j74Q4J5R2M2j25J07m0O3r6jK35
2853B07k08Q7j27P2J09p4q6j00K03j27qn1J27K1nJ6Q6o7n9n1O3%M1o6l1L3m1N
2881c1j03P0R0r4k9K4R1K2n5J07o9J8j14J2j5j6M5K3km8N7l3O3p4J49o5n4L8O6
2910G3N1j6r8j1o2J5k9P6L7q0j8J9R1j3r7R3j9M2j45J09n8PJ70j40l8K5l7L0m3
2939f6J4QQ5q4j8M8m0J22j1L3m7n9K5J4o5qJ01j37QM3n9K24j74r6J78k1K9M7o5
2968B9J4jo7Q9j16J8j2o2J12j17K2pJ53j16J04Kj10M6M2Ln9M1j6n5O9L1n5L1M6
2997E9j0r2P9n6L3J3oKl7l6m8M8L1p3J35j9rj0m4j8mP2k4N0O3o6m0J36n3p2M5
$$ plain form
2795 27 41 -26 34 23 -11 -83 -90 -40 -93 -12 -70 -113 31 41 18 76 95 -38 -42 56 55 -26 -4 -9 -63 -108 -38 -38 -30 -77 35 -143
2827 -143 90 -47 57 119 124 64 3 77 -75 -150 12 49 -52 5 -169 -85 -70 22 64 -61 46 6 69 -27 -28 207
2853 207 -1 86 -41 31 140 66 -20 -120 83 -44 -52 -103 24 45 40 56 142 75 16 -35 28 28 69 3 -28 5 -36 -31
2881 -31 -134 -64 26 -68 -97 -73 18 40 -15 92 23 41 -73 -61 -76 -92 -47 -24 -26 -74 -17 -50 13 -61 88 23 -31 7 73
2910 73 124 108 10 -1 -63 -48 -77 -1 36 -44 -62 -43 48 35 -62 31 12 54 -91 18 -40 -33 137 -3 -41 -16 -53 -23 -66
2939 -66 -52 -44 41 -43 -61 -13 -53 69 58 91 44 -15 10 24 -41 -49 52 -85 -77 -34 -93 131 -43 -139 39 18 47 94 29
2968 29 43 42 -25 64 -52 -34 -46 -108 4 -113 -91 -98 55 -61 43 45 -65 -19 23 26 -33 8 -8 -63 6 37 -18 13 59
2997 59 49 -43 36 -20 13 26 20 22 -15 -51 -99 -51 -20 -93 42 23 14 4 -40 -58 -62 10 -14 36 99 33 -7 129 76 4 49
3028D9N0j35jk6J7N1O4j04j24J26m0J42o0j1k8K8j8r1J55n9N2q1n4R9no9R6J08
3056A31j20p5N5Q7k24K06P2j57j9J29j28P8jj07L9O7j09R0J9k9J98k79j5K22m8
3081H2j07L8j3Q1q6J6q1N2L9j57J11N6K6p5J38j47j0P7P6o2qRl8K1J5l3m7K5o
3110hn9K7J3l6P8M3j56N3J39j71O7qo2l7K13qj11K1J9o5q4K74j15pRJ15j55K9
3138A8M8j96J22K3j7j7M1k9R2o3j11L4K4P7n3M8n6O1Pj2o2J09j45P3m4j6L9J9
3166A4j92K07P6r2kj21qJ68p6OR2j04N3p9J15n2KPOJ5q6L2N5k2m6P8l8O2j54o5
3196a49J15R5l8J4kj11J08r3J24j15m1p1K18p4o6M6l0J46J8r8l0K0J4L2p4K9q5
3223i8P3n3O2N4j15k9J09K7l9Q2O4j65M7mR9j73L5o1J5J2N6J25o7j12j18L6J30
$$ plain form
3028 49 99 -36 -37 -63 -46 5 69 -35 -159 -33 -73 69 9 -2 -30 -2 -20 -111 44 -15 37 -44 -98 1 -4 -73 23 131
3056 131 11 -64 -9 78 -146 60 132 -25 -44 85 -43 35 34 -73 -34 33 -76 14 33 4 202 -77 -92 130 82
3081 82 -25 13 0 81 -5 11 -70 -18 21 -136 -25 31 57 -18 120 -27 -37 40 116 54 46 55 17 38 53 20 -27 -2 -8
3110 -8 -67 -40 -27 -63 15 58 -98 -45 94 -77 -10 -18 -80 -117 96 88 -23 -2 17 -48 -132 142 27 20 29 144 -11 18
3138 18 66 -130 -8 15 -2 -19 22 -7 85 22 -89 -55 -31 46 -7 41 -15 46 53 41 -21 88 -57 16 -28 -44 -5 14
3166 14 -178 29 105 13 11 -110 -118 50 -26 -20 72 -32 21 -58 57 5 7 14 20 35 -51 -19 36 14 -32 46 8 70 -84 -149
3196 -149 -34 61 23 37 35 -76 32 -61 63 -52 -93 -164 54 -20 -86 -40 -70 76 94 -4 -34 -14 0 32 -42 -13 -98
3223 -98 -25 -78 -16 38 -77 -106 3 30 -9 73 137 -28 19 15 114 -59 -24 -85 -70 -58 -2 123 56 -56 -174 -138 -8
3250hQ4J1r9l9l9K23k23R8N3r6J70j54n1J08j31R5L1O8j75m3R7J6O0Rl0j00M1
3277b4j3P3n7J2p8P2J07j73Q9O3r5O8p7o6J43q6K7l2Q3m1k8L5k3k4O3j30O9j9
3305f2QJ75j27N7j5L8N8j12n7L9KO1j1l5j3Lo3M5J1n8q2J60J54k11L0O8j29K9
3333c7R7J2j07K7pJ9j6l5J47q1J0m8kK6J70j62q1P4P0r3J3J27j23L4O9J2k11K7
3361f9J43r0P2q4M4nJ13j61l6J20j68J28l4J38j60K9Nk2o6qQ5J20j28N1N8p8J02
3388I9n7j24M9J41j11M0L6q6N0l2p0K3J5J11p2J6O1n3k9N9m4o6J05r5q5J85j64
3415i8R0qk5k9K6O8j8L5j43J47m9L8N5j91M2M5J4p6N2P5M9o3N0p9pJ1L1m3p5N5
3445b1k06L60j97k1J30n1J3p3j5M4p4J49mj36P8m3L3o2J81j27J13o0p5O2Lp4j1
$$ plain form
3250 -8 76 87 -12 -51 -90 133 -90 8 61 -35 135 -19 -70 38 -93 2 33 101 -74 -117 -20 -4 56 65 35 -65 -24
3277 -24 -37 36 -21 -9 -87 -15 92 -81 8 71 -24 44 -33 -99 44 -42 -15 -47 36 -5 -33 2 -21 -45 18 -112 -43 -62
3305 -62 -54 121 -6 51 36 74 132 20 -37 2 4 65 54 19 6 9 -54 -9 2 -56 -138 22 176 -35 -5 63 -66 -37
3333 -37 60 72 -35 -8 -15 4 -12 -47 100 19 29 -19 -21 5 175 13 -68 6 76 -17 -4 123 0 34 103 115 -96 -69
3361 -69 74 -16 56 -28 16 11 124 -37 -73 47 -121 7 -27 111 -49 -20 -15 -37 -103 -111 -26 94 -34 17 75 -3 99
3388 99 42 -82 -33 108 -3 37 73 -13 37 5 -65 -42 -27 84 12 28 89 36 7 66 22 -44 61 -34 -119 66 -98
3415 -98 -8 -16 -41 -70 -44 24 6 41 -102 45 -4 34 89 -102 -60 -15 -1 -77 -25 50 99 36 86 7 0 11 42 -1 -76 -21
3445 -21 -227 133 -64 -85 45 -6 7 -66 -81 -37 -111 38 34 -102 -24 -67 -34 -96 85 -42 71 11 -64 -2 1 -73 -84
3472h4K4n9J23LJ01j31o3JJ38nk4j8n2LJ21K2j04l2q7P6r1K55k01J11j07O4m8
3499f4J33n3J40Ll26kO5L72m51k04K31K17K0r1j4J00k12R8o2O3O2n4L3n9O5R2
3525A02j45J79p0m6N5pj4mj21k3k0O6J09l2j14P3Qq1O5l5KR2op1J45q2kn6J0N0
3555B7m8J7P0rj4r1J14p4JJ50j13L2j02J21K3K9j07j22J31k6p1Q2O9L4j29p6J34
3582E2j04J20o9k0K0%J90k03Q4l9j15M5J0J13n0j9K2k7R8j09j3R1j08M6o7J10
3608E8j9j40J00r8N5j18J69Q2o4N7j58J33N4pj76J2N3M0m6l4P1j3m9m3qPJ38j12
3636e6J35j00N2m8kk1M6k5R3k4l7N7j25m3J33Q2j10l1n1J42O9p7j27R3n0L5QK9
$$ plain form
3472 -84 -60 -119 4 7 108 -23 -86 -85 53 48 24 6 -46 -43 78 100 -4 -36 -123 -47 -138 117 -84 27 -80 -16 -64
3499 -64 69 16 156 159 -167 -169 -104 268 -183 -387 -156 61 81 -10 -24 76 -136 -38 -100 -37 25 -29 4 -55 10 102
3525 102 -43 136 66 20 75 68 54 50 -71 -94 -114 -48 61 29 -85 -12 -4 -85 -20 -55 -53 39 33 -38 107 25 23 -33 -23 27
3555 27 -21 -4 66 57 43 -48 66 -8 -7 143 30 62 -40 81 104 133 26 -96 35 9 -62 20 89 123 -6 -82 52
3582 52 -52 68 -1 -21 -1 -1 189 -14 70 31 -84 -39 -29 84 34 15 37 10 108 -1 -14 77 -31 15 -52 58
3608 58 39 -101 -1 -99 -44 -162 7 89 25 82 -76 57 111 104 -72 -60 -7 33 -13 -47 24 11 -38 -81 -89 -82 56 -56
3636 -56 79 -21 31 -17 -19 -40 6 -19 74 50 13 70 -55 -98 35 117 7 -24 -75 67 136 59 -68 25 -25 10 18 47
$$ [...]
8191D3
##END NTUPLES=NMR FID
##END=
