##TITLE=1H_DE-80H_X3
 200.13MHz, d2o
 8 sc
 
 19ns.26.2.2025
##JCAMPDX= 6.0         $$ Bruker NMR JCAMP-DX V2.0
##DATA TYPE= NMR FID
##DATA CLASS= NTUPLES
##ORIGIN= UXNMR, Bruker Analytische Messtechnik GmbH
##OWNER= pz
$$ XWIN-NMR		Version 3.5
$$ Thu Dec 18 10:21:55 2025 Russian Standard Time (UT+4h)  Yarkov@DPX200
##.OBSERVE FREQUENCY= 200.1313
##.OBSERVE NUCLEUS= ^1H
##.DELAY= (6, 6)
##.ACQUISITION MODE= SIMULTANEOUS
##.ACQUISITION SCHEME= undefined
##.AVERAGES= 8
##.DIGITISER RES= 18
##SPECTROMETER/DATA SYSTEM= spect
##.PULSE SEQUENCE= zg30
##.SOLVENT NAME= CDCl3
##.SHIFT REFERENCE= (INTERNAL, CDCl3, 0, 14.3821)
##AUDIT TRAIL= $$ (NUMBER, WHEN, WHO, WHERE, WHAT)
$$ ##TITLE= Audit trail, XWIN-NMR		Version 3.5
$$ ##JCAMPDX= 5.01
$$ ##ORIGIN= Bruker BioSpin GmbH
$$ ##OWNER= Yarkov
$$ C:/Bruker/XWIN-NMR/data/yarkov2/nmr/H-C/1/audita.txt
$$ ##AUDIT TRAIL=  $$ (NUMBER, WHEN, WHO, WHERE, WHAT)
(   1,<2025-12-18 10:21:30.40 +0400>,<Yarkov>,<DPX200>,
      <created by zg, POWCHK disabled, PULCHK disabled
       configuration hash MD5:
       00 E9 B6 7A A2 85 ED C7 34 08 36 98 17 FE 4E 26
       data hash MD5: 16K
       30 30 5D C6 27 C6 44 DF A2 A8 9D D7 75 5B 43 25>)
$$ ##END=
$$ 
$$ hash MD5
$$ 25 97 05 B4 CC D1 6D C8 F6 A7 EC 7E 22 2E 8C 9B
##$RELAX= 
##$RELAX= 
##$RELAX= 
##$RELAX= 
##$RELAX= 
##$RELAX= 
$$ Bruker specific parameters
$$ --------------------------
##$DU= <C:/Bruker/XWIN-NMR>
##$EXPNO= 1
##$NAME= <H-C>
##$PROCNO= 1
##$TYPE= <nmr>
##$USER= <yarkov2>
##$AMP= (0..31)
100 100 100 100 100 100 100 100 100 100 100 100 100 100 100 100 100 100 
100 100 100 100 100 100 100 100 100 100 100 100 100 100 
##$AQSEQ= 0
##$AQ_mod= 1
##$AUNM= <au_zg>
##$AUTOPOS= <>
##$BF1= 200.13
##$BF2= 200.13
##$BF3= 200.13
##$BF4= 200.13
##$BF5= 200.13
##$BF6= 200.13
##$BF7= 200.13
##$BF8= 200.13
##$BYTORDA= 1
##$CFDGTYP= 0
##$CFRGTYP= 5
##$CHEMSTR= <none>
##$CNST= (0..31)
1 1 145 1 1 1 1 1 1 1 1 1 1 1 1 1 1 1 1 1 1 1 1 1 1 1 1 1 1 1 1 1 
##$CPDPRG= <>
##$CPDPRG1= <>
##$CPDPRG2= <>
##$CPDPRG3= <>
##$CPDPRG4= <mlev>
##$CPDPRG5= <mlev>
##$CPDPRG6= <mlev>
##$CPDPRG7= <mlev>
##$CPDPRG8= <mlev>
##$CPDPRGB= <>
##$CPDPRGT= <>
##$D= (0..31)
0 0.7 0 0 0 0 0 0 0 0 0 0.03 0 0 0 0 0 0 0 0 0 0 0 0 0 0 0 0 0 0 0 0 
##$DATE= 1766038889
##$DBL= (0..7)
120 120 120 120 120 120 120 120 
##$DBP= (0..7)
150 150 150 150 150 150 150 150 
##$DBP07= 0
##$DBPNAM0= <>
##$DBPNAM1= <>
##$DBPNAM2= <>
##$DBPNAM3= <>
##$DBPNAM4= <>
##$DBPNAM5= <>
##$DBPNAM6= <>
##$DBPNAM7= <>
##$DBPOAL= (0..7)
0.5 0.5 0.5 0.5 0.5 0.5 0.5 0.5 
##$DBPOFFS= (0..7)
0 0 0 0 0 0 0 0 
##$DE= 6
##$DECBNUC= <off>
##$DECIM= 32
##$DECNUC= <off>
##$DECSTAT= 4
##$DIGMOD= 1
##$DIGTYP= 9
##$DL= (0..7)
0 120 120 120 120 120 120 120 
##$DP= (0..7)
150 150 150 150 150 150 150 150 
##$DP07= 0
##$DPNAME0= <>
##$DPNAME1= <>
##$DPNAME2= <>
##$DPNAME3= <>
##$DPNAME4= <>
##$DPNAME5= <>
##$DPNAME6= <>
##$DPNAME7= <>
##$DPOAL= (0..7)
0.5 0.5 0.5 0.5 0.5 0.5 0.5 0.5 
##$DPOFFS= (0..7)
0 0 0 0 0 0 0 0 
##$DQDMODE= 0
##$DR= 18
##$DS= 0
$$ [...]
##$SUBNAM2= <"">
##$SUBNAM3= <"">
##$SUBNAM4= <"">
##$SUBNAM5= <"">
##$SUBNAM6= <"">
##$SUBNAM7= <"">
##$SUBNAM8= <"">
##$SUBNAM9= <"">
##$SW= 18.0517328524113
##$SWIBOX= (0..15)
0 0 2 0 0 0 0 0 0 0 0 0 0 0 0 0 
##$SW_h= 3612.71676300578
##$TD= 16384
##$TD0= 1
##$TE= 0
##$TE2= 300
##$TE3= 300
##$TEG= 300
##$TL= (0..7)
0 120 120 120 120 120 120 120 
##$TP= (0..7)
150 150 150 150 150 150 150 150 
##$TP07= 0
##$TPNAME0= <>
##$TPNAME1= <>
##$TPNAME2= <>
##$TPNAME3= <>
##$TPNAME4= <>
##$TPNAME5= <>
##$TPNAME6= <>
##$TPNAME7= <>
##$TPOAL= (0..7)
0.5 0.5 0.5 0.5 0.5 0.5 0.5 0.5 
##$TPOFFS= (0..7)
0 0 0 0 0 0 0 0 
##$TUNHIN= 0
##$TUNHOUT= 0
##$TUNXOUT= 0
##$USERA1= <user>
##$USERA2= <user>
##$USERA3= <user>
##$USERA4= <user>
##$USERA5= <user>
##$V9= 5
##$VALIST= <valist>
##$VCLIST= <CCCCCCCCCCCCCCC>
##$VD= 0
##$VDLIST= <DDDDDDDDDDDDDDD>
##$VPLIST= <PPPPPPPPPPPPPPP>
##$VTLIST= <TTTTTTTTTTTTTTT>
##$WBST= 1024
##$WBSW= 4
##$XGAIN= (0..3)
0 0 0 0 
##$XL= 0
##$YL= 0
##$YMAX_a= 121722
##$YMIN_a= -109411
##$ZGOPTNS= <>
##$ZL1= 120
##$ZL2= 120
##$ZL3= 120
##$ZL4= 120
##$ABSF1= 10
##$ABSF2= 0
##$ABSG= 5
##$ABSL= 3
##$ALPHA= 0
##$AQORDER= 0
##$ASSFAC= 0
##$ASSFACI= 0
##$ASSFACX= 0
##$ASSWID= 0
##$AUNMP= <proc_1d>
##$AZFE= 0.1
##$AZFW= 0.1
##$BCFW= 1
##$BC_mod= 2
##$BYTORDP= 1
##$COROFFS= 0
##$CY= 83.5205535888672
##$DATMOD= 1
##$DC= 2
##$DFILT= <>
##$DTYPP= 0
##$F1P= 10.8118882576601
##$F2P= -7.23987719738617
##$FCOR= 0.5
##$FTSIZE= 0
##$FT_mod= 4
##$GAMMA= 1
##$GB= 0.15
##$INTBC= 1
##$INTSCL= 1
##$ISEN= 128
##$LB= 0.25
##$LEV0= 0
##$LPBIN= 0
##$MAXI= 10000
##$MC2= 0
##$MEAN= 0
##$ME_mod= 0
##$MI= 1.114404
##$NCOEF= 0
##$NC_proc= 0
##$NLEV= 6
##$NOISF1= 3.799351
##$NOISF2= 2.8
##$NSP= 1
##$NTH_PI= 0
##$NZP= 0
##$OFFSET= 14.38212
##$PC= 1
##$PHC0= -5305.955
##$PHC1= 10.82193
##$PH_mod= 1
##$PKNL= yes
##$PPARMOD= 0
##$PSCAL= 0
##$PSIGN= 0
##$REVERSE= no
##$SF= 200.129724274929
##$SI= 16384
##$SIGF1= 3
##$SIGF2= 2
##$SINO= 400
##$SIOLD= 16384
##$SREGLST= <1H.CDCl3>
##$SSB= 0
##$STSI= 0
##$STSR= 0
##$SW_p= 3205.1282051282
##$SYMM= 0
##$S_DEV= 0
##$TDeff= 0
##$TDoff= 0
##$TI= <>
##$TILT= no
##$TM1= 0
##$TM2= 0
##$TOPLEV= 0
##$USERP1= <user>
##$USERP2= <user>
##$USERP3= <user>
##$USERP4= <user>
##$USERP5= <user>
##$WDW= 1
##$XDIM= 8192
##$YMAX_p= 0
##$YMIN_p= 0
$$ End of Bruker specific parameters
$$ ---------------------------------
##NTUPLES= NMR FID
##VAR_NAME=  TIME,          FID/REAL,        FID/IMAG
##SYMBOL=    X,             R,               I
##VAR_TYPE=  INDEPENDENT,   DEPENDENT,       DEPENDENT
##VAR_FORM=  AFFN,          ASDF,            ASDF
##VAR_DIM=   8192,          8192,            8192
##UNITS=     SECONDS,       ARBITRARY UNITS, ARBITRARY UNITS
##FACTOR=    0.0002768,     1,               1
##FIRST=     0,             0,               0
##LAST=      2.2672688,     0,               0
##MIN=       0,             -109411,         0
##MAX=       2.2672688,     121722,          0
$$ Real data points
##PAGE= N=1
##DATA TABLE= (X++(R..R)), XYDATA
$$ [...]
1729b376K309P29j13J895p85j458l3j861k58J327o2J650J712k70l76k105j695
$$ -2376 -67 662 549 2444 1659 201 168 -1693 -1951 -624 -686 964 2676 2406 2030 -75 -1770
1746a770J69j147M10L429M58o4J65j773p32m63r37J558P19O64J377q21Q2M33k545
$$ -1770 -1601 -2748 -2338 1091 1549 1485 1650 -123 -855 -1318 -2255 -697 22 686 2063 1242 1324 1757 -788
1765g88q71Q02o65P80J197P10J009j462j509J07j761K65J887K41J449J076j578
$$ -788 -1659 -857 -1522 -742 455 1165 2174 712 -797 -690 -2451 -2186 -299 -58 1391 2467 889
1782H89k20k94j326K12j86P71J401r30N43R17k059n99J9j058P65R36J54J561k45
$$ 889 669 375 -951 -739 -925 -154 1247 317 860 1777 -282 -881 -862 -1920 -1155 -219 -65 1496 1251
1801A251o73j32j712M16Q93r20J661J004j249K70k32j054P4r05L22R77p01R00
$$ 1251 578 446 -1266 -850 43 -877 784 1788 539 809 577 -477 -403 -1308 -986 -9 -710 190
1819A90Q39j036N41l93j590J016K69q7J031J37K06P8j643M54J20j466J213N62
$$ 190 1029 -7 534 141 -1449 -433 -164 -251 780 917 1123 1201 -442 12 132 -1334 -121 441
1837D41r38Q42k77m95N10o47n5N41n88R79J99q29J520j88j563J014j32o90O55
$$ 441 -497 345 68 -427 83 -564 -619 -78 -666 313 512 -317 1203 1015 -548 466 334 -356 299
1856B99n35L81K16r90O66R7j117R95l38p63J295k13k82J144n16J20j9o38Q91m72
$$ 299 -236 145 361 -629 37 134 -983 12 -326 -1089 206 -7 -289 855 339 459 440 -198 693 221
1876B21j128J496k05r77J087m45m08N49j016J34L39n18J006k5r1J337j137r19
$$ 221 -907 589 384 -593 494 49 -359 190 -826 -692 -353 -871 135 110 19 1356 219 -700
1894g00J368p58l05P20j30M93j4p46O94o99j090P38o00J31J427n82J93J138j250
$$ -700 668 -90 -395 325 195 688 674 -72 622 -77 -1167 -429 -1029 -898 529 -53 140 1278 28
1913B8m92j92j87J228l55J79J793j013r36N93j323j37M48q59R44Q61m13N29o00
$$ 28 -464 -656 -843 385 30 209 2002 989 53 646 -677 -814 -366 -1225 -281 580 167 696 96
1932I6n32M48j704J99K040m86O78J151q48l35j150q90R28k74K47J494n44J76K67
$$ 96 -436 12 -1692 -1493 547 61 739 1890 1042 707 -443 -1333 -405 -679 -432 1062 518 694 961
1951I61k082J29N64j108M51R82O40J063p21k62M32j988n09J027l57J435R50o78
$$ 961 -1121 -992 -428 -1536 -1085 -103 537 1600 879 617 1049 -939 -1448 -421 -778 657 1607 929
1969I29K92q13j600k52k64O30J259n03J336Q42j724r1j10j023L16R6N38J685q4
$$ 929 1221 408 -1192 -1444 -1708 -1078 181 -322 1014 1856 132 41 -69 -1092 -776 -680 -142 1543 1459
1988A459j11p1j826l84m18j171K008J476n04R01l58j121m48j216N03J186m22J410
$$ 1459 1348 1277 -549 -933 -1351 -2522 -514 962 458 1359 1001 -120 -568 -1784 -1281 -95 -517 893
2006H93J160j047N25q15j758L50m58k56J358P89P90Pj649n0q63j841J545J197
$$ 893 2053 1006 1531 716 -1042 -692 -1150 -1406 -48 741 1531 1538 -111 -161 -1024 -2865 -1320 -123
2024a23L01J664k36o13j89j556m20L72k45J477N33m37J377j010j594P8q78n26
$$ -123 178 1842 1606 993 804 -752 -1172 -800 -1045 432 965 528 1905 895 -699 -621 -1499 -2025
2042b025J022L18J802Q22j038K25j214j605O64J0M69K163j51k15L03j515p09o32
$$ -2025 -1003 -685 1117 1939 901 1126 -88 -1693 -1029 -1019 -550 1613 1462 1247 1550 35 -674 -1306
2060a306o08J321K45L2J942l53j027K28j477o24N60k6J625J102j53M38j295j353
$$ -1306 -1914 -593 -348 -316 1626 1273 246 474 -1003 -1627 -1067 -1093 532 1634 1481 1919 624 -729
2078g29L05j241Q5J948J39J85N46q91k71r19r23J010j66L42J925k30P4M21j750
$$ -729 -424 -1665 -1580 368 507 692 1238 347 76 -843 -1766 -756 -922 -580 1345 1115 1189 1610 -140
2097a40o62J41o37Q05Q78M62J138j264r83K90j794k19J472o2Q66Q90n45L20p20
$$ -140 -802 -661 -1298 -493 385 847 1985 721 -262 28 -1766 -1985 -513 -575 291 1181 636 956 236
2116B36r50K69m68L64J299m57P54Q78j766n27k58j001N43L34N71J509o44m69K28
$$ 236 -714 -445 -913 -549 750 293 1047 1925 159 -368 -626 -1627 -1084 -750 -179 1330 686 217 445
2135D45j382r0O31n25J395Q05p51N16j95q01k43r75L99Q00p27R04J105j117m9
$$ 445 -937 -1027 -396 -921 474 1279 528 1044 849 48 -195 -1170 -771 29 -698 206 1311 194 145
2154A45m83r82O67n4Q1J479k02M12o9j344M24Oj206R63P58m26L77m09k1l7j136
$$ 145 -338 -1320 -653 -707 -626 853 651 1063 994 -350 74 80 -1126 -163 595 169 546 137 116 79 -1057
2175a057J18O31m48Q60N11o12R48l79j239N77r3M8O08k89P68O5j547N07rj017
$$ -1057 -939 -308 -756 104 615 3 951 572 -667 -90 -183 -135 473 184 952 1017 -530 -23 -32 -1049
2195a049P33L2o4R79o23l54O39o90J98R5m13J321j05q94J036k21r64M26m63L14
$$ -1049 -316 -284 -348 631 8 -346 293 -397 -199 -104 -517 804 699 -195 841 620 -344 82 -381 -67
2215f7M10q08N34K62q38M75l58n16J263l83l70J169l66k70M4n39P21k52n10J282
$$ -67 343 -465 69 331 -507 -32 -390 -906 357 -26 -396 773 407 137 181 -358 363 111 -399 883
2235H83l96o52N89p42l58N87o93K85O57k23M03j65m99O73p64m35J527l73j07R33
$$ 883 487 -165 424 -318 -676 -89 -782 -497 160 -63 340 175 -324 349 -415 -850 677 304 197 1130
2255A130o49k46j88j018N15L24l00R51m05j40O76j318k34R93p55L55O86N5N33
$$ 1130 481 235 47 -971 -456 -132 -432 519 114 -26 650 -668 -902 91 -664 -309 377 432 965
2274I65l74n19M92r54m15Q97m78O53R19r49r2lj391K76m9L33J309l58L86P63j455
$$ 965 591 72 564 -390 -805 92 -386 267 1186 237 145 142 -1249 -973 -1022 -689 620 262 648 1411 -44
2295d4m19L70q83P19O99k06R98k77p42K47j272k78N34p78J158J208p90M70l3j112
$$ -44 -463 -93 -976 -257 442 236 1234 957 215 462 -810 -1088 -554 -1332 -174 1034 244 714 681 -431
2315d31k66m32K74J262l4O24P58j352j71k70j281O75P1k5J209J11p5P3j352j63
$$ -431 -697 -1129 -855 407 373 997 1755 403 232 -38 -1319 -644 -573 -598 611 722 647 720 -632 -795
2335g95K4j106J290J276o5J043k79r12k88j336k39R43J48J043P07q59K08p44j693
$$ -795 -771 -1877 -587 689 624 1667 1388 476 188 -1148 -1387 -444 -296 747 1454 595 803 59 -1634
2354a634N02J40j98J348L40O78L30j259q3l87j337O58N59L47J591J28j010j21
$$ -1634 -1132 -992 -1190 158 498 1176 1506 247 164 -223 -1560 -902 -343 4 1595 1723 713 592
2372E92j336q39J41n8J451P33j95J050n61j520k9n42k21J101J96J004J013p07
$$ 592 -744 -1583 -1442 -1500 -49 684 489 1539 978 -542 -571 -1113 -1334 -233 -37 967 1980 1273
2390A273k26r88j503K03j49O5K239N28l99J50j297q01n05n73J314R28K40J338
$$ 1273 1047 59 -1444 -1241 -1390 -1325 914 1442 1043 1193 -104 -905 -1410 -1983 -669 259 499 1837
2408A837k66r41m8j491o04R56k36P15J120J61M56j211j493J92r11k55J699Q96
$$ 1837 1571 630 582 -909 -1513 -557 -793 -78 1042 1203 1659 448 -1045 -853 -1764 -2019 -320 576
2426E76Q09O11j156o00o51j199M86M52P11J521m57j51M70j696j140K27m52Q76
$$ 576 1385 1996 840 240 -411 -1610 -1124 -672 39 1560 1103 952 1422 -274 -1414 -1187 -1639 -763
2444g63Q70M91J230m74j230k06j340l05J045J15J364J472q13l86p54j320j41n35
$$ -763 107 598 1828 1354 124 -82 -1422 -1727 -682 -567 797 2269 1456 1070 316 -1004 -1145 -1680
2462a680N38J543M8M17O84j183o42m81j214P07Q41L80J606J55p8n85j825o21M44
$$ -1680 -1142 401 449 866 1550 367 -275 -756 -1970 -1263 -422 -42 1564 1719 1641 1056 -769 -1390 -946
2481i46n60J226J537j37L54p70j290k14p69j43J165M03R98R45r48J74o01j564
$$ -946 -1506 -280 1257 1120 1474 704 -586 -800 -1569 -1712 -547 -144 854 1799 851 1025 424 -1140
2499a140n3K96J62J341N66L81J8j638q63j94q85Q43J046K51J353j44q93j61j119
$$ -1140 -1193 -897 -735 606 1172 1553 1571 -67 -930 -1124 -2009 -1166 -120 131 1484 1340 447 286 -833
2518h33m63N49j15J368R44n12N76m05j614m21m86k08J265M66P50P03r59m27r62
$$ -833 -1296 -747 -862 506 1450 938 1514 1109 -505 -926 -1412 -1620 -355 111 861 1564 605 178 -784
2537g84q39O90L63K77J433L68n29p0r26m85j96o25Q98P44M6Q98j99r31l37r21
$$ -784 -1623 -933 -570 -293 1140 1508 979 909 -17 -502 -698 -1323 -425 319 365 1263 1064 133 -204 -1125
2557a125n29P80L94Q57P63n8K31r68j349M51l04J4J191L91K37J93r39m52l75q52
$$ -1125 -1654 -874 -480 377 1140 1082 1313 345 -1004 -553 -857 -843 348 739 976 1169 230 -222 -597 -1449
2577a449M95L59L45J351l35l18M61j244o65K28j13R20O75N1P26o84j075l5p05
$$ -1449 -954 -595 -250 1101 766 448 909 -335 -1000 -772 -885 35 710 761 1487 803 -272 -307 -1012
2596a012j60R88j80O64P15n36j89m46o20J85j61J34J362n3N3O24r35o49k77n21
$$ -1012 -1172 -184 -364 300 1015 479 290 -156 -776 -591 -752 -618 744 691 744 1368 433 -216 -493 -1014
2616a014M96M32J95O88j76n27J0j035j8O70n17O25R97r0M9l93n59K81q03J2R46
$$ -1014 -518 -86 109 797 621 94 104 -931 -949 -279 -796 -171 826 736 785 392 -167 114 -689 -677 269
2637B69r2L35M20p00l9l28r91L35L60J54O45r9J86L87j201j06M25o15M88N64j76
$$ 269 177 512 932 232 193 -135 -1126 -791 -431 -277 368 269 455 842 -359 -465 -40 -655 -167 397 221
2658B21N46j65o43J56n17l48M93l83P97N80p99K45J35q23N6l4J53P11j24J47N10
$$ 221 767 602 -41 115 -402 -750 -257 -640 157 737 -62 183 318 -505 -449 -483 -330 381 257 404 914
2679I14p70j25P7p21N99L3m04P84P0o46K16m39j1K19o21O96O83m72M37p4n42L37
$$ 914 144 19 96 -625 -26 7 -397 387 457 -189 27 -412 -423 -204 -825 -129 554 82 519 445 -97 240
2701B40m68k26O48k55L76J79n98K80j27q17O83j05k87O37O2q3L36o67J99K04n72
$$ 240 -228 -454 194 -61 315 494 -104 176 49 -768 -85 -190 -477 160 222 139 475 -192 7 211 -361
2722c61N60J02l38P31l77n35N37m17k92K16r3K98P5m45O53j08o68M89j26j66P29
$$ -361 199 301 -37 694 317 -218 319 -98 -390 -174 -267 31 106 -339 314 206 -462 27 -99 -265 464
2743D64l39N1M98n66k0Kn33O97k36l89P76k99n66M52k17N4K06k94L40J09k68M28
$$ 464 125 176 674 108 88 90 -443 254 18 -371 405 106 -460 -8 -225 -171 35 -259 81 190 -78 350
2765C50j78k31M47m18j69N40l43j07L19l87K39l02k12M37j50l09P35l93l2L70
$$ 350 172 -59 388 -30 -199 341 -2 -109 210 -177 62 -240 -452 -15 -165 -474 261 -132 -164 206
2785B06m82K43L06l27L18P3l05L15m48j06M63n92O2N27m69J29J24l84L95k95l8
$$ 206 -276 -33 273 -54 264 337 32 347 -101 -207 256 -336 -274 253 -216 -87 37 -347 48 -247 -285
2806b85N07k21P2K69l53J35L96p97L01K70l53J23n6j33M47o15q7M80n28K33K89
$$ -285 222 1 73 342 -11 124 520 -277 24 294 -59 64 8 -125 322 -293 -380 100 -428 -195 94
2827I4l21L70J22m62L64o7j72K83k91J49L39o39L59L13q36K65M9k24K91j00p2
$$ 94 -227 143 265 -197 167 100 -72 211 -80 69 408 -231 128 441 -395 -130 -81 -305 -14 -114 -186
2848a86M45k78p5J22l71M10K34m94O13R5o05L31l70J07J42n44L11L64n86K61J40
$$ -186 259 -19 -94 28 -343 67 301 -193 420 515 -90 241 -129 -22 120 -424 -113 251 -335 -74 66
2869F6m61M25q8l41N56q2n0L46l30K55M0o99N63L1n00M38o6o1J47l37k37M31l82
$$ 66 -395 30 -58 -399 157 75 25 371 41 296 336 -363 200 231 -269 169 103 42 189 -148 -385 46 -336
2892c36R6M04l52N24j62l88N36q4m20M12j36J22R8m76L57n8m34M15k7m79N00l49
$$ -336 -240 164 -188 336 174 -214 322 238 -182 230 94 216 314 -162 195 137 -297 118 91 -388 112 -237
2914b37NL66k05o2K04k29K59Nk94N77j80m10N69j85l31K87l57J40J26l81L71j34
$$ -237 -232 134 -71 -133 71 -158 101 106 -188 389 209 -201 368 183 -148 139 -218 -78 48 -333 38 -96
2936i6j60M00m58k1N78k40j71L94l09K34J48k38J28q5k47M00l00k33L45l82%N00
$$ -96 -256 144 -314 -335 243 3 -168 226 -83 151 299 61 189 104 -143 257 -43 -276 69 -313 -313 187
2958A87m82J86J92j73Q1j19NN88l77j19N36n46m4K88m30K71P0l42M50j12k16K65
$$ 187 -295 -109 83 -90 -9 -128 -123 465 88 -31 505 -41 -85 203 -227 44 114 -228 222 110 -106 159
2980A59l77pM58o32L20L71k95J87J7j68J38l01L8L69l67K57K76m90J14N1p30K76
$$ 159 -218 -225 233 -399 -79 292 -3 184 201 33 171 -130 -92 277 -90 167 443 -47 67 118 -612 -336
3002c36L63k97L36q8J34K25n94J62K64m66J92L56k04L07Ol98J62l61j06K57j90
$$ -336 27 -270 66 -22 112 337 -257 -95 169 -297 -105 251 47 354 360 -38 124 -237 -343 -86 -276
3023b76L33K11m60K77K10o33J16O6j80M80j66K60M21n39L6k9m52J55R1k37O12
$$ -276 57 268 -192 85 295 -338 -222 -156 -336 144 -22 238 659 120 156 127 -325 -170 -79 -316 296
3044B96Q8l26J69m30j91P6m43O83M95m46N07Q0n83J48k83k91O01j19RL99l39J55
$$ 296 384 58 227 -203 -394 -318 -761 -78 417 -29 478 558 -25 123 -160 -451 150 31 40 439 100 255
3066B55j06o53K76j69k90P77P2n1K86l31q6L3m39K40J96NO46j82m65M52n78n24
$$ 255 149 -504 -228 -397 -687 90 162 111 397 66 -20 13 -426 -186 10 15 661 479 14 466 -112 -636
3088f36L67j54K79K82j41O62m00n73L89l48l33O51M1K32L85l53j36l2n35K05k93
$$ -636 -269 -423 -144 138 -3 659 259 -314 75 -273 -606 45 86 318 703 350 214 182 -353 -148 -441
3109d41N3Q36l29l4M03n55j24j04l64K56L69o6P15p9l02M4o08j3J78k24L99N36
$$ -441 -388 448 119 85 488 -67 -191 -295 -659 -403 -34 -100 615 536 234 278 -330 -343 -165 -389 10 546
3131E46k41Q7l15m79J35l21r4P12j34M06K93m88N3j23o06K73L03k3M88l4q1L18
$$ 546 305 392 77 -402 -267 -588 -682 30 -104 302 595 107 160 37 -569 -296 7 -16 472 438 357 675
3153F75r34l16K81l62K85M80o4M40o9n65J61m33j95M76k1M65M06m43J65N9q10
$$ 675 -259 -575 -294 -656 -371 109 45 485 416 -149 12 -421 -616 -140 -161 304 710 267 432 491 -319
3174c19r2l6j4N86J1J72K44m06m13K6n22L77K48k0P59M0k88M5l56l36J87m61N28
$$ -319 -411 -447 -461 125 136 308 552 146 -267 -241 -763 -386 -138 -158 601 641 353 398 42 -294 -107 -568 -40
3197d0M92l20K96j02n16m2l94r3M76j5M83L62j94Rk50o53K86N4j09N13K71k08
$$ -40 452 132 428 326 -190 -232 -626 -719 -243 -258 225 587 393 402 152 -501 -215 -161 -270 243 514 306
3219C06K41o20m9j0n23K16L63k8N08N7l88K20m83k91J04J16M45L54k08K92j10
$$ 306 547 -73 -122 -132 -655 -439 -76 -104 404 461 73 293 -190 -481 -377 -261 184 538 330 622 512
3240E12o69r3j14j85M68O8J88M21m94p8p2m37N4K45j38P40L6q5K57n13m18O4k73
$$ 512 -157 -250 -364 -549 -81 -13 175 596 102 24 -48 -485 -431 -186 -324 416 452 367 624 111 -307 -243 -516
3263e16M08L73k05M77r4n41R5m85j26M53r2K59N37n5j11j23m77J88k96j28N42
$$ -516 -108 265 60 537 443 -98 -3 -488 -614 -161 -253 6 543 488 377 254 -223 -35 -331 -459 83
3284H3J81J07J57l74j76n9m91J89k10n13J598k36k2J43n27k17L31k57J78M14M5
$$ 83 264 371 528 154 -22 -81 -572 -383 -593 -1106 492 256 234 377 -150 -367 -36 -293 -115 299 344
3305C44J72Pm95R1m53n1J41k4N99J82l40j39J35n65P4J29j56N75J4R3L47n47k54
$$ 344 516 523 28 119 -334 -385 -244 -268 331 513 173 34 169 -396 -322 -193 -349 226 240 333 680 133 -121
3328a21J13k34M9L21J38j38K18l06L8l74j47K87m34N43M89l99K57P4m09O4l00
$$ -121 -8 -242 -193 128 266 128 346 40 78 -296 -443 -156 -590 -47 442 43 300 374 -35 29 -271
3349b71l4M95k10J45K79l28Q0p5o16K46J35k20M42Q0O7Kk77n3J79l39J59L29k27
$$ -271 -305 190 -20 125 404 76 156 81 -535 -289 -154 -374 68 148 215 217 -60 -113 66 -273 -114 215 -12
3372a2L56Q3l72J56k25l34J96j10J69K45k25K84o6m61J75O8j52L88j05n3M89l03
$$ -12 344 427 55 211 -14 -348 -152 -262 -93 152 -73 211 145 -316 -141 -73 -225 163 58 5 494 191
3394A91j15L8k40%R2k47M56L7k96J37k49N1K4j51K36P9j81K81M8k24J56j93j00
$$ 191 76 114 -126 -126 -34 -281 175 212 -84 53 -196 -145 -121 -272 -36 43 -138 143 191 -33 123 -70 -170
3417a70M01l09K3L36l33K14j00k89K02j32k54L85N9j35K67j39j14J35k80K36L01
$$ -170 231 -78 -55 281 -52 162 62 -227 -25 -157 -411 -26 33 -102 165 26 -88 47 -233 3 304
3438C04l40K11q3m7J92k76j90K87l14J43Q2j21J90k1j45J56l6j65K28j4j69M04
$$ 304 -36 175 92 45 237 -39 -229 58 -256 -113 -31 -152 38 17 -128 28 -8 -173 55 41 -128 276
3460B76l67R6K66l69K6J73l11M05k81k18L16j12J9J75l10K72j4k22K19J45k38
$$ 276 -91 5 271 -98 -72 101 -210 195 -86 -304 12 -100 -81 94 -216 56 42 -180 39 184 -54
3481e4K19j97M0J59j77qJ59l39J28Kr0J24n2j77L23j83j47L06k10J44K31m04L50
$$ -54 165 -32 8 167 -10 -18 141 -198 -70 -68 -158 -34 -86 -263 60 -123 -270 36 -174 -30 201 -203 147
3504A47O0j97r1M1R3J0j38K5K41k94nJ05k11P8Q2k45M90p6j86J72l7qL8k59J14
$$ 147 207 10 -81 -40 53 63 -75 -50 191 -103 -108 -3 -214 -136 -54 -299 191 115 -71 101 64 56 94 -165 -51
3529e1L41l33R5J69m52K62J3k49K50l53R6L64j48M5j01j53K55q4j56L62q9L7K67
$$ -51 290 -43 52 221 -231 31 44 -205 45 -308 -212 152 4 49 -52 -205 50 -34 -190 172 83 120 387
3552C87m20J45O8m57J66P2j99L11pj87K29j85j20J93k01K48J08j22K09L4k46J24
$$ 387 -33 112 180 -277 -111 -39 -238 73 66 -121 108 -77 -197 -4 -205 43 151 29 238 272 26 150
3574A50j00j83O2o6J50J64l53K25O2m45K68r9q1L73j33p0K89j53L2o4j02N8J66
$$ 150 50 -133 -71 -137 13 177 -176 49 111 -334 -66 -165 -246 127 -6 -76 213 60 92 28 -74 -16 150
3597A50l02L53j4k28J15k03o9J14j50J30K84j65K9m9j02K44k00j65L83j87J53
$$ 150 -152 201 187 -41 74 -129 -198 -84 -234 -104 180 15 44 -5 -107 137 -63 -228 155 -32 121
3618A21K83k86L4j4m18K29J9k13K59k6q1K45l77LJ25lp5J48M3L62k02j10J07j88
$$ 121 404 118 152 138 -280 -51 -32 -245 14 -12 -93 152 -225 -222 -97 -100 -175 -27 16 378 176 66 173 -15
3642a5j28K21k80J63K91k52J54m9k49J02j03k10N13k66Q8L74l59l4R1k53K43j3
$$ -15 -143 78 -202 -39 252 0 154 105 -144 -42 -145 -355 158 -108 -20 354 -5 -39 52 -201 42 29
3664B9j18L22r1j95J56k27M0L4l04K60J4N1J85j08o5P3j45j2K03j35K1L06k82
$$ 29 -89 233 142 -53 103 -124 -84 -50 -354 -94 -80 -29 156 48 -17 56 -89 -101 102 -33 -12 294 12
3687A2J51j40M31j91k16j84M03j69r1J43l07M1K36l90K06K18k31L27q7j7Q1k63
$$ 12 163 23 454 263 47 -137 266 97 6 149 -158 -117 119 -271 -65 153 -78 249 162 145 226 -37
3709c7J11L3j86J35Q2l12K81k5k52P1n0m7K16n2R1J60l03J70On1j57J58k39L99
$$ -37 74 107 -79 56 138 -174 107 82 -170 -99 -149 -196 20 -32 59 219 -84 86 92 41 -116 42 -197 202
3733B02j23j26J73j45Rj30k26M26j78q5L83j51k19K11p4M8J02j88J53J57k50P7
$$ 202 79 -47 126 -19 -10 -140 -366 60 -118 -203 180 29 -190 21 -53 -5 97 -91 62 219 -31 46
3755D6o5j56J06K1j78L17j20m4J23k09K60rl52L59j85P7J80Q9j09J00l88K23j46
$$ 46 -19 -175 -69 -48 -226 91 -29 -73 50 -159 101 92 -260 99 -86 -9 171 260 151 251 -137 86 -60
3778f0l69M63P5k20K05j67j80L25k20N4J15n2rK26k45J36n2K1J15j7k97K40j31
$$ -60 -429 34 109 -111 94 -73 -253 72 -148 -94 21 -31 -40 186 -59 77 25 46 161 144 -153 87 -44
3801d4J56k9j71j65JM79j35j88P5P9k6m1Q2k00qL07q0j16L00o2l76K03l2j0k78
$$ -44 112 83 -88 -253 -252 227 92 -96 -21 58 32 -9 73 -127 -135 172 92 -24 276 214 -162 41 9 -1 -279
3826b79n7N56k85K4J13L8l36J94K82n7j84J47k66k61O08J42m44n9K41k43K01n6
$$ -279 -336 220 -65 -41 72 110 -226 -32 250 193 9 156 -110 -371 237 379 -65 -124 117 -126 75 19
3848A9j20k0P4j43K16j32J39jj02J15J6j98K34j61JJ94Jj25J75k11%J02k33J63
$$ 19 -101 -121 -47 -190 26 -106 33 32 -70 45 61 -137 97 -64 -63 131 132 7 182 -29 -29 73 -160 3
3872CK9j19J74m8j29K24j58j23K04j30J31J73k28J95o6k40J59O2j83J64j32LK15
$$ 3 32 -87 87 39 -90 134 -24 -147 57 -73 58 231 3 198 132 -108 51 113 -70 94 -38 -35 180
3895A80j91M8l0j18n6J35q7K55j29J51l9n0JMj77J40J09n6N7j41j25P2q9l5J88
$$ 180 -11 37 7 -111 -167 -32 -119 136 7 158 119 69 70 74 -103 37 146 90 147 6 -119 -47 -136 -171 17
3920A7j72J77O0j32J3O2j50J05j38J9J93R1r0J71j45Pj7k86R7J2M9K07j99j6J69
$$ 17 -155 22 82 -50 -37 25 -125 -20 -158 -139 54 145 55 226 81 88 71 -215 -118 -106 -57 150 -49 -65 104
3945A04j92p2J83j40j6M00j32J15n7l34J92r9j07J59O6j3L1j16nL4j60P8qm8K49
$$ 104 -88 -160 23 -117 -133 267 135 250 193 -141 51 -48 -155 4 70 57 88 -28 -33 1 -159 -81 -89 -137 112
3970A12j6M7Q3j31k00J49j14J6K19j59M9Pj15J96k32q6Q8j8n6L67k17Q2Q9k79
$$ 112 96 143 226 95 -105 44 -70 -54 165 6 55 62 -53 143 -89 -175 -87 -105 -161 206 -11 71 160 -119
3994a19J86m9j98L62j70P5K56k22L5j46k08J28N6j80L65j23k0R7k94J29Q9j99
$$ -119 67 18 -180 182 12 87 343 121 156 10 -198 -70 -14 -194 171 48 28 125 -169 -40 49 -150
4016a50J79K08k31P9R5k07J07k5k68K44p3J11M0j59J56j34k19J72l9o8K10L3j2
$$ -150 29 237 6 85 180 -27 80 55 -213 31 -42 69 109 -50 106 -28 -247 -75 -114 -182 28 61 49
4039D9O0n9l9N8l57K85J1l7K19m3j64J00j75n1K6o9J47J73k51L55j18p4p0L8j25
$$ 49 109 50 11 69 -288 -3 8 -29 190 147 -17 83 -92 -143 -117 -186 -39 134 -117 238 120 46 -24 14 -111
4064a11K00j27J28M6q7P0k02l3K8l2r5M26j33q3K8n2k8l6j23K64J25k20J74l4
$$ -111 89 -38 90 136 49 119 -83 -116 -88 -120 -215 211 78 -5 23 -29 -57 -93 -216 48 173 -47 127 93
4088I3p4J42l11J3J27j51K37k0r0K06j71j88N8M4o2J19q0J64J50j12j17l8m7J61
$$ 93 19 161 -150 -137 -10 -161 76 56 -34 172 1 -187 -129 -85 -147 -28 -108 56 206 94 -23 -61 -108 53
4112E3j71J35J61j03j01J19k3k31J73j25K06o3q5J43j19Q1K5q0r9M4M7l5K36j59
$$ 53 -118 17 178 75 -26 93 70 -161 12 -113 93 30 -55 88 -31 50 75 -5 -104 -60 -13 -48 188 29
4136B9QR8j83o9Q1j1R4k7n3R8j96J03j7j00LJ24j32K42j5r0J51j79l4J46k33J18
$$ 29 37 135 -48 -117 -36 -47 47 20 -33 65 -131 -28 -45 -145 -142 -18 -150 92 77 -13 138 -41 -75 71 -162 -44
4162d4J92j36N6o1j19J66j55j30J92QJ3k0L3J6n8o7J20rmL9p2O8P1k36P4J15j54
$$ -44 148 12 68 7 -112 54 -101 -231 -39 -31 -18 -38 -5 11 -47 -114 6 -3 -7 32 -40 28 99 -137 -63 52 -102
4189a02J09Q7j97J47r7O9j0j5j89M91%l30J80k44J94O9qq3p5L14j63k67O4m16
$$ -102 7 94 -103 44 -53 16 6 -9 -198 293 293 -37 143 -101 93 162 154 71 -4 310 147 -120 -56 -472
4213d72M30l33K35P8Rj044O54O82o98O44j64n35L46j9j32L96N1k59J09j06k2J01
$$ -472 -42 -375 -140 -62 -53 -1097 -443 239 -459 185 21 -514 -168 -187 -319 77 128 -131 -22 -128 -150 -49
4235d9k21m28K45R1L1J37M8j36J33L68k60J8N1O7%m9j14N81l21K01l76k82J67
$$ -49 -270 -698 -453 -362 -331 -194 -146 -282 -149 219 -41 -23 28 95 95 46 -68 513 192 393 17 -265 -98
4258i8o09J74K81K64n5L25J38l49n4j67j75J10P32J49j025M95l17R5O63o90k10
$$ -98 -707 -533 -252 12 -43 282 420 71 17 -150 -325 -215 517 666 -359 136 -181 -86 577 -113 -323
4279c23L51j42J50M46o15oJ09o5N1J26l17K31m46M33p4J24J68K13o34j17mL83
$$ -323 28 -114 36 482 -133 -139 -30 -95 -44 82 -235 -4 -450 -17 -91 33 201 414 -220 -337 -341 42
4301D2r8P2Rr1J12j51J53k05K79j25j7J30p0n1J68k15J5jq3J86Oj09Q7j8q9K6
$$ 42 -56 16 25 -66 46 -105 48 -157 122 -3 -20 110 40 -11 157 -58 -43 -44 -127 59 65 -44 43 25 -64 -38
4327c8o1J91rqK3J3o7j5k4j35J42L4k02J95o0j28K23k40J16j7j44K81p5m0K12
$$ -38 -99 92 83 75 98 111 44 29 5 -130 12 46 -156 39 -21 -149 74 -166 -50 -67 -211 70 -5 -45 167
4352A67j28p9J37p6j20J46j61K11n9l3J90j90k05J43K5n6L9M5O4J16k71R0L5j20
$$ 167 39 -40 97 21 -99 47 -114 97 38 5 195 5 -200 -57 -32 -88 -49 -4 60 176 -95 -5 30 -90
4376i0R2k7j03L08j10r2O9j26k1R9k14K31R3k18J84lj79J50j93Q7P8J32K2j54
$$ -90 2 -25 -128 180 70 -22 47 -79 -100 -1 -215 16 109 -109 75 72 -107 43 -150 -63 15 147 169 15
4400A5lN7l9j32R3NJ95j08q7O8j9q4K4o9j79R7K08m8J83j17j76K04j92KQ1n1J63
$$ 15 12 69 30 -102 -9 -4 191 83 -4 64 45 -39 -15 -84 -263 -166 42 -6 177 60 -116 88 -104 -102 -21 -72 91
4427I1l7n6J33k08m0J61n5n7P5M2q1K38k35K8j12J30q5K9N7K23k07J1J8q4mo7
$$ 91 54 -2 131 -77 -117 44 -11 -68 7 49 -32 206 -29 -1 -113 17 -68 -39 18 241 34 45 63 -21 -25 -92
4453i2k8J26P7q4J38k46R4lj31P5l9M5K46j06kr4O7k00J29L1p1J86j76J33k9j12
$$ -92 -120 6 83 -1 137 -109 -15 -18 -149 -74 -113 -68 178 72 70 -24 43 -157 -28 3 -68 118 -58 75 46 -66
4479f6Q4j27N3j6N8o6J29m2L4k3R7q1q1L0O8J01p9Oo9j25J70j37j31K67jP0K8
$$ -66 18 -109 -56 -72 -14 -80 49 7 41 18 115 34 -47 -17 51 152 73 79 10 -115 55 -82 -213 54 53 123 151
4506A51k92J51Lo1M4j34J36j22K02P2m9k20J27j7k00K52q0k0J35j7r9l9J10j52
$$ 151 -141 10 13 -48 -4 -138 -2 -124 78 150 101 -119 8 -9 -209 43 -37 -57 78 61 -38 -77 33 -119
4530a19J38j29K78Nj81O5p8p2J2m9J02J86k53K18j7j01J1j46N4J51j27Q5P1k5
$$ -119 19 -110 168 173 -8 57 -21 -93 -81 -130 -28 158 -95 123 106 5 16 -130 -76 75 -52 33 104 79
4554G9m9J8j08J47L4j78J82j15j14J76n7P9j25m4k5j34R8J58p8m4J92r4q1J24
$$ 79 30 48 -60 87 121 -57 125 10 -104 72 15 94 -31 -75 -100 -234 -136 22 -56 -100 92 -2 -83 41
4578D1m0r4K03L2j1nj34J05k0j98K01j90P6N6j2j1P8j98L8J06K5lL4j21Q6p7K3
$$ 41 1 -93 110 142 131 126 -8 97 77 -121 80 -110 -34 22 10 -1 77 -121 -83 23 48 45 79 -42 44 -33 -10
4605a0J44j15J4l8R3j00p2N2O4p4j4J49r1o5J78r3J3j27OJ12l5n5J94l9p7M3q6
$$ -10 134 19 33 -5 88 -12 -84 -32 32 -42 -56 93 2 -63 115 22 35 -92 -86 26 -9 -64 130 91 14 57 -29
4632b9j3O1k12K07L4p2M3mM7k2j06P0J23j53l1J21k15J92O8k06J79o7p4J19rm0
$$ -29 -42 19 -193 14 48 -24 19 15 62 40 -66 4 127 -26 -57 64 -151 41 109 -97 82 15 -59 60 51 11
4658A1L1j92N7j8l2J50p%pl4K0J13k66J07K28j45n81R21k44k16J60l40K79k3r5
$$ 11 42 -150 -93 -111 -143 7 0 0 -7 -41 -21 92 -174 -67 161 16 -565 356 112 -104 56 -284 -5 -28 -123
4683a23J24p7O5Q5j57J62l2k1r8J52n3N6p1P3k0p7o1k8J23j6j5n6L9J61l1k9k06
$$ -123 1 -76 -11 74 -83 79 47 26 -72 80 27 83 12 85 65 -12 -73 -101 22 6 -9 -65 -26 135 104 75 -131
4710a31J92l3J57qL5j68J87p76N07k02K8L65q8j28R0M6j05k0M0q7Q8J5p7K01q1
$$ -131 61 28 185 177 212 44 231 -545 -38 -240 -212 153 65 -63 27 73 -32 -52 -12 -99 -11 4 -73 128 47
4735D7OJ01k65J65m1K7j4N6j38J12M3j68o1R3o4L7P2Q8j06JM4Mr4J23q2O5P5n
$$ 47 53 154 -111 54 13 40 26 82 -56 56 99 -69 -130 -37 -101 -64 8 96 -10 -9 35 39 -55 68 -14 51 126 121
4763A21m92j25n8O76p5n88N00K1q7M5P5j35J80p5k4P1lN9K9k8p2L3j99J85m9J3
$$ 121 -371 -496 -554 122 47 -541 -41 -20 -107 -62 13 -122 58 -17 -41 30 27 86 115 87 15 48 -151 34 -15 -2
4789bJ10j55L1N8M0j85j47J53J62j70Q2Q5j2p6O2J6j21J08o9N4J25n4o3l7L0j55
$$ -2 108 -47 -16 42 82 -103 -250 -97 65 -105 -23 62 50 -26 36 52 -69 39 -30 24 149 95 32 -5 25 -130
4815a30O2L1p7O4L4L1j08N3O3m4O6O0Mj77J28q6N3J7n6K3p6J21o7o2P5m3n1J52
$$ -130 -68 -37 -114 -50 -16 15 -93 -40 23 -21 45 105 109 -68 60 -26 27 44 -12 11 -65 56 -11 -73 2 -41 -92 60
4843F0j13k4J18j01J46R5k13L8mm5l2L1Q9j17K6mQ6j17k6rJ7J88j25j3J32M5j33
$$ 60 -53 -77 41 -60 86 181 -32 6 2 -43 -75 -44 45 -72 -46 -50 36 -81 -107 -116 -99 89 -36 -49 83 128 -5
4870eJ31j02m3m0Q4N6P8k52J33j20l4J89j41l2J8N7RK1n9j7N9n2P0M7j26J47p5
$$ -5 126 24 -19 -59 25 81 159 -93 40 -80 -114 75 -66 -98 -80 -23 -14 7 -52 -69 -10 -62 8 55 -71 76 1
4897AN0L5k42N7J31q7j5K02j56R6j88J56l5l9K7PJ67q3o6o5O8j39R3PoN1j4p5
$$ 1 51 86 -156 -99 32 -55 -70 132 -24 72 -116 40 5 -34 -7 0 167 84 18 -47 21 -118 -25 -18 -24 27 13 -62
4925f2J48n2m7q1J23j49Q5K4O8J1l7J60j06J6np2j03J99o5k57L33m1m8Jm4n8Q9
$$ -62 86 34 -13 -94 29 -120 -35 -11 57 68 31 191 85 101 96 24 -79 120 55 -202 131 90 42 43 -1 -59 30
4952C0p1J07p6j1K9Pn0Q0p3MJ53o1k2K4j77R6J9n1Q3p2j5PJ2o4P9j6J31j57nN5
$$ 30 -41 66 -10 -21 8 15 -35 45 -28 -24 129 68 46 70 -107 -11 8 -43 40 -32 -47 -40 -28 -92 -13 -29 102 -55 -60 -5
4982eJ07q0jJ9k8P6p7p8O5j50J92J7j39J07o9mL6n0K3M7o2M8l5onJ35j12J44j12
$$ -5 102 22 21 40 12 88 11 -67 -2 -152 40 57 -82 25 -44 -48 -12 -62 -39 8 -54 -6 -41 -47 -52 83 -29 115 3
5011Cl8J7mk7j7j35J71Kp6J66J4j83N4n4J09J17k16K36pj76J45j07N6L9p7p6N2
$$ 3 -35 -18 -22 -49 -66 -201 -30 -28 -104 62 76 -107 -53 -107 2 119 -97 139 132 -44 101 -6 50 89 12 -64 -12
5038a2j4j05Q2J19j29J4q1R7K19k08K8Rk9J31j41J02N6j09J0L9j41m2R9j12J33
$$ -12 -26 -131 -49 70 -59 -45 -126 -29 190 -18 10 19 -10 121 -20 82 138 29 39 78 -63 -105 -6 -118 15
5063A5k9%J46k44O7J02m7nM7k2N4j33R8O5j51L8M2j03lJ82j11J3M1j00K5pl4J61
$$ 15 -14 -14 132 -112 -45 57 10 5 52 30 84 -49 49 114 -37 1 43 -60 -63 119 8 21 62 -38 -13 -20 -54 107
5091A07q8m2P8j31O7J27j54L3J12j35O5j05LR4j35N4O3j3O2j0m0N2p1j07R4Lo1
$$ 107 19 -23 55 -76 -9 118 -36 -3 109 -26 39 -66 -63 31 -104 -50 13 0 62 52 12 64 -7 -114 -20 -17 -78
5118g8J52r7M5Q4l3j42J68j50qmJ5M8n3j5k8R0k9N6r4J15ll8J50j84QrP2J1j23
$$ -78 74 -23 22 106 73 -69 99 -51 -59 -63 -48 0 -53 -68 -96 -6 -35 21 -73 42 39 1 151 -33 -25 -34 38 49 -74
5147g4K4M4M2l6J2l2n0P1K5r1J49j15M8J23j02k4J9o1J01m1j5Kk1j7%jo1J59j52
$$ -74 -50 -6 36 0 12 -20 -70 1 26 -65 84 -31 17 140 38 14 33 -28 73 32 17 19 -2 -19 -19 -20 -81 78 -74
5176g4O4O6r0Q5j05N9J32j45K1O6j93R3P1l8J6n5K3Jj4j68K14j14M3R4o3j34J79
$$ -74 -10 56 -34 51 -54 5 137 -8 13 79 -114 -21 50 12 28 -27 -4 -3 -17 -185 29 -85 -42 52 -11 -145 34
5203C4j47J31m2jJ38j13K1J9j24J76m5o8m1M4o5J48p8o5N4j21P8M1J3j42J62K4
$$ 34 -113 18 -24 -25 113 0 21 40 -84 92 47 -21 -62 -18 -83 65 -13 -78 -24 -145 -67 -26 -13 -155 7 31
5229C1P8n1rQ0j06m7J14k17M8J19p5O2j0j48P7n8J61q6ql8R5k3M3M9j20jR8k9
$$ 31 109 58 49 129 23 -24 90 -127 -79 40 -35 27 17 -131 -54 -112 49 -37 -45 -83 12 -11 32 81 -39 -40 58 29
5257B9N5q8q2N0J6j07j4K1N0N8p6J41k1p1K8J2J5J16j37kJ27n0j6L4j04L3L6j41
$$ 29 84 -4 -86 -36 -20 -127 -141 -120 -70 -12 -88 53 32 -39 -11 1 16 132 -5 -7 120 70 54 88 -16 17 53 -88
5285h8K43q1q4O3k9k1j9k7K1Q0q2RMl3K27q3mn7l5mN9j07P1o5j01L2J28m4p9J88
$$ -88 155 74 -10 53 24 3 -16 -43 -22 58 -24 -15 -11 -44 183 100 96 39 4 0 59 -48 23 -42 -143 -111 17 -27 -106 82
5315H2q1N7p7lO2j46J21O4k10J26JM1J5q5P2l1n9K0N7j29J82n9j53R9K9k5N6J5
$$ 82 1 58 -19 -22 40 -106 15 79 -131 -5 -4 37 52 -33 39 8 -51 -31 26 -103 79 20 -133 -34 -5 -30 26 41
5343D1j21K17m8m1R3j84J05mj32Q6k2l8R9j02K8O9o3K7J26j12R9j04n3K10k37
$$ 41 -80 137 89 48 141 -43 62 58 -74 12 -10 -48 51 -51 -23 46 -17 10 136 24 123 19 -34 176 -61
5368f1J27k6l0J8p3n6J23M0r9j5R3j24J08k4l8K46k62J07%j01o0J58nrq3q2J53
$$ -61 66 40 10 28 -45 -101 22 62 -37 -52 41 -83 25 1 -37 209 -53 54 54 -47 -107 51 46 37 -46 -128 25
5395B5k2j13K31j57p2M2j8L4L0q4J41J1p9R8m8M6k7j16P6Q3o1n1j3j34K04j18
$$ 25 3 -110 121 -36 -108 -66 -84 -50 -20 -104 37 48 -31 67 19 65 38 -78 -2 81 20 -31 -44 -178 26 -92
5421i2p8J19r6Q0P1k3K1l1l9J57q7p1Q0Nmk0O1K3j41O9k1O0j87J60n7j16K24j16
$$ -92 -170 -51 -147 -67 4 -19 2 -29 -68 89 2 -69 11 16 12 -8 53 76 -65 4 -17 43 -144 16 -41 -157 67 -49
5449d9o2R6Q3j26J20j05N7Np8K33k38Q4L5k1L5m2j33N6Ql6K08j71M6J19r7j3P6
$$ -49 -111 -15 68 -58 62 -43 14 19 -59 174 -64 20 55 34 69 27 -106 -50 -42 -78 130 -41 5 124 27 14 90
5476I0j18P9k1m1O6K0j14%K6oP7j51n7P6K1K0P1j59K24j32M0J64j93k8MK8n0K21
$$ 90 -28 51 30 -11 55 75 -39 -39 -13 -19 58 -93 -150 -74 -53 -33 38 -121 103 -29 11 175 -18 -46 -42 -14 -64 157
5504A57k92K69j16k06R4O7l9J38j48P2K0j2n7J37k51M7N5J6J08l20M19j90j81
$$ 157 -135 134 18 -188 -94 -27 -66 72 -76 -4 16 4 -53 84 -167 -120 -65 -49 59 -261 158 -32 -213
5527b13k5l9R27q36K95k07m03M97k31O16j64p02L89J25J18L69n65j67K19j3K8
$$ -213 -238 -277 650 -186 109 -98 -501 -4 -235 381 217 -485 -96 29 147 516 -49 -216 3 -10 18
5548A8L50j89pO6l47j11L06n6k0j75K9p0J36P1m4l2K49k66K40J34m74l29N81M4
$$ 18 368 179 172 238 -109 -220 86 30 10 -165 -136 -206 -70 1 -43 -75 174 -92 148 282 -192 -521 60 104
5572A04l5K3k34j38K21K27m6M39j18J68k12j132P48m43J07K86m84R89n47K68n83
$$ 104 69 92 -142 -280 -59 168 122 561 443 611 399 -733 15 -428 -321 -35 -519 470 -77 191 -392
5593c92M02q4N1r4J18O4j4p8N0k0q7m2R3O4jL0O6k41J64m2l8J09p1m5J78m2k4
$$ -392 10 -74 -23 -117 1 65 51 -27 23 3 -84 -126 -33 31 30 60 126 -115 49 7 -31 78 7 -38 140 98 74
5620G4l7l0j4l5q2K22n7P2r3l8M0P5o8r8M3k5J8Q0m7K6k2r5J41p6j13J67n9J8
$$ 74 37 7 -7 -42 -124 98 41 113 20 -18 22 97 29 -69 -26 -51 -33 47 0 26 4 -91 50 -26 -139 28 -31 -13
5648a3L7n5N5k0j16J76K1q0R0l7l8R3k23P8m5l2R4L6n8k5O8k36L09k03J22L5o5
$$ -13 24 -31 24 4 -112 64 85 5 95 58 20 113 -110 -32 -77 -109 -15 21 -37 -62 6 -230 79 -124 -2 33 -32
5675c2R0O7j66J56l2j12N4j8q0J74j20l1K64j78r4M6j28K06l4p2k9Q3Q2J29k04
$$ -32 58 125 -41 115 83 -29 25 7 -73 101 -19 -50 214 36 -58 -12 -140 66 32 -40 -69 14 96 225 21
5700B1j7k0pQ8Lr6P6n7j01P4K7n4J24q9k1J59k28J48M7j35K52q6j99J47n9N8p3
$$ 21 4 -16 -23 65 68 -28 48 -9 -110 -36 -9 -63 61 -28 -49 110 -118 30 77 -58 194 108 -91 56 -3 55 -18
5727a8m8m0J00j5j5M8JJ0l1m3J02n7K3K5m7P6J39l01J70on7L6r6PJ45k4j10N8
$$ -18 -66 -106 -6 -21 -36 12 13 23 -8 -51 51 -6 17 42 -5 71 210 -91 79 73 16 52 -44 -37 108 84 -26 32
5755C2j67j7L62Jm6j01l48J02L95j9l15J80k04K81o41J6L90K1L98n38P96n52k04
$$ 32 -135 -152 210 211 165 64 -284 -182 213 194 -121 59 -145 136 -505 -489 -99 -78 320 -218 578 26 -178
5778a78r5K81k32J62J17p5L7M8j76L17j31M82k81n94M15J4j26LJ27j65O8o9lr
$$ -178 -273 8 -224 -62 55 -20 17 65 -111 206 75 557 276 -318 97 111 -15 -12 115 -50 18 -51 -54 -63
5802f3J00j30J30l4M5m4N1om8j7%m0J06nl5pO0j43K00m8r3n3R2j26J68j25J44
$$ -63 37 -93 37 3 48 4 55 49 1 -16 -16 -56 50 45 10 3 63 -80 120 72 -21 -74 18 -108 60 -65 79
5829G9k14K30k03j80O4J43L11l09O43n82J65l34J05J71m5j38L6L8j6j9qPP4j7
$$ 79 -135 95 -108 -288 -224 -81 230 -79 564 -18 147 -187 -82 89 44 -94 -58 -20 -36 -55 -63 -56 18 1
5853Am5L9J13r4P5n5J03k34N4J3N1r4P8Q0j32O2j39J51j25lM4M1J11j14R1j33
$$ 1 -44 -5 108 14 89 34 137 -97 -43 -30 21 -73 5 85 -47 15 -124 27 -98 -101 -57 -16 95 -19 72 -61
5879f1J75m2r6R9n5J4n6n3J43p1j4m3L93n55K55l78N12O8j92M0j73K13l05k02
$$ -61 114 72 -24 75 20 34 -22 -75 68 -3 -17 -60 333 -222 33 -345 167 235 43 83 -90 123 -182 -384
5903c84r7N66l88K67K97p90L69J15n9Q6L0l9L3J4k00J57M9j42J36n4k9J11j10
$$ -384 -481 85 -303 -36 261 -529 -160 -45 -104 -18 12 -27 6 20 -180 -23 26 -116 20 -34 -63 48 -62
5926f2J08J9j32J31j13K4P5P0n0m5J8j49J85j77k3K17j52Q3L9q0P3r3M3M3p9k0
$$ -62 46 65 -67 64 -49 -25 50 120 70 25 43 -106 79 -98 -121 96 -56 27 66 -14 59 -34 9 52 -27 -47
5952d7M3J5j06J91j90Q8n8q4J83Ll1Q5j99K4K54k14P2Q8j77J11o7l1QK2j57J02
$$ -47 -4 11 -95 96 -94 -6 -64 -148 35 38 7 92 -107 -83 171 -43 29 117 -60 51 -16 -47 -39 -17 -174 -72
5978g2J97j45p7J4R3l8k7J41o7q0O0Oq0J32j15Q7O8m3n8n2k8N4M2l7j7K%P7q7
$$ -72 125 -20 -97 -83 10 -28 -55 86 19 -61 -1 5 -75 57 -58 29 97 54 -4 -56 -84 -30 12 -25 -42 -40 -40 37 -50
6007e0o9J68j06K4J16j80J25M7j70J34O5j48R2q4j1J1p8J10j5j89K46r6%Q3j09
$$ -50 -119 49 -57 -33 83 -97 28 75 -95 39 104 -44 48 -36 -47 -36 -114 -4 -19 -208 38 -58 -58 25 -84
6032h4K8Qj0J54l5l6J06n9j77J17n1O0L5m5n7J02q0Q6oQl3qq0J85o4l7K0p1p0
$$ -84 -56 -48 -58 96 61 25 131 72 -105 12 -39 21 56 11 -46 56 -24 62 56 64 31 23 -57 128 64 27 47 -24 -94
6061i4J67j9j21Q5k8L3m4j1m7k7Q4l4n8Q2J54j76J18P0j66J21j4m6O1j12k8P7
$$ -94 73 54 -67 18 -10 23 -21 -32 -79 -106 -22 -56 -114 -32 122 -54 64 134 -32 89 75 29 90 -22 -50 27
6087B7q7J59j38K6j6M3j13R1r3R9k3N6j3n7L9rMLJ5j9m8pl0L5J55k01J61K3q3
$$ 27 -60 99 -39 -13 -29 14 -99 -8 -101 -2 -25 31 18 -39 0 -9 -5 -2 13 -6 -54 -61 -91 -56 99 -102 59 82 -1
6116aj02J07k3q8j3J79Oj62K09O6k34J17lj14J20n7j02J37q8qK13l45M9O3J29
$$ -1 -103 4 -19 -107 -120 59 65 -97 112 178 -56 61 58 -56 64 7 -95 42 -46 -54 159 -186 -137 -74 55
6141E5L0j03QJ31q1r8N2R1l1n9l3O5M4j13L5K7r1J6J7j5N6n6K2J80j55N5j24R1
$$ 55 85 -18 -10 121 40 -58 -6 85 54 -5 -38 27 71 -42 -7 20 -71 -55 -38 -53 3 -53 -31 149 -6 49 -75 16
6169A6n5o2p7K35j2k00J46mOK9q8J52Rk19J68k0J0n0O4j38J29N7p8k7p4J60l5
$$ 16 -39 -101 -178 57 45 -155 -9 -13 -7 22 -66 86 95 -124 44 24 34 -16 48 -90 39 96 18 -9 -83 77 42
6196D2P0j71O9j39O5n6N3M1KJPQJM6rJ20p0r3J71k05Q7rm8m4J02j36L3J38j13
$$ 42 112 -59 10 -129 -64 -120 -67 -26 -24 -23 -16 -8 -7 39 30 150 80 -13 158 -47 40 31 -17 -61 41 -95 -62 76 -37
6225c7M9l5K5L9n3j5P1j33K09p8m4O5l0M6rj39J12M0j01L8R9Kj31N6k4N3j58%
$$ -37 12 -23 2 41 -12 -27 44 -89 120 42 -2 63 33 79 70 -69 43 83 -18 20 119 121 -10 46 22 75 -83 -83
6253h3J33l8j8J34j36n9R1j12K24m3r0J08m7p1J2j45R1R3k24J08Q1k6r6J75j76
$$ -83 50 12 -6 128 -8 -67 24 -88 136 93 3 111 64 -7 5 -140 -49 44 -180 -72 9 -17 -113 62 -114
6278a14K34r8r0J92j21K3Jp2JJ62k71K49m9j11k2L3K7R3l6k2N2K2j39j7j6M3Q5
$$ -114 120 22 -68 124 3 26 27 -45 -44 118 -153 96 47 -64 -86 -53 -26 67 31 9 61 83 -56 -73 -89 -46 39
6305C9k0J49k37J0J49j31j5J11p9K5oj62L20j51j43J35j52R1P0m2N3N0Pj8R1j54
$$ 39 19 168 -69 -59 90 -41 -56 55 -24 1 -5 -167 153 2 -141 -6 -158 -67 3 -39 14 64 71 53 144 -10
6331a0L4J3j7K1o4J47q7j9l2n5k8R9M7j14J06K1j64J33j7l7J4k2J72j44l5J07
$$ -10 24 37 20 41 -23 124 37 18 -14 -69 -97 2 49 -65 41 62 -102 31 14 -23 -9 -31 141 -3 -38 69
6357F9j57K6J17j31Q2p2RnO3n9J17j6K5K1j18L4J47j78J13J8j50l9J55j29J77
$$ 69 -88 -62 55 -76 6 -66 -57 -62 1 -58 59 43 68 89 -29 5 152 -26 87 105 -45 -84 71 -58 119
6382A19j70M7J19r1j02J08n6q6J73j56J31n2k6J57n4p7O8m0Q2l1q8L0po9J55l8
$$ 119 -51 -4 115 24 -78 30 -26 -112 61 -95 36 -16 -42 115 61 -16 52 12 94 63 -25 5 -2 -71 84 46
6408D6j57K51j77k1M9m8Q8O5j51J87M4k92L00j84o3R3r3N7M1J6j92J01J34k38
$$ 46 -111 140 -37 -58 -9 -57 31 96 -55 132 176 -116 184 0 -63 30 -63 -6 35 51 -141 -40 94 -144
6432a44K63r6j34J02k8L5n3O5K9j5K3q0j27J82J5j14Q5orJ52k30J72J43k04oR2
$$ -144 119 23 -111 -9 -37 -2 -55 10 39 24 47 -33 -160 22 37 -77 8 2 -7 145 -85 87 230 26 20 112
6458A12k69K14PRk2m8LJ15j26LR9q7p5J28j75J61p6n9J38Pk5m6R6j16l5l0J77
$$ 112 -157 57 64 73 51 3 6 121 -5 -2 97 10 -65 63 -112 49 -27 -86 52 59 34 -12 84 -32 -67 -97 80
6485H0L1q2L9kr9K0j56J48N9k3p0Kk0N0P0j42J48j8p1J02m6n5kP0o6M6j20J94
$$ 80 111 29 68 66 -33 -13 -169 -21 38 15 -55 -53 -73 -23 47 -95 53 35 -36 66 20 -35 -37 33 -33 13 -107 87
6513H7Kk23K62o9r6Q9n0k09J81jk0R2j31P4J59k31J41Kj16K18k70J37j73m0J6
$$ 87 89 -134 128 59 -37 52 2 -207 -26 -27 -47 45 -86 -12 147 -84 57 59 -57 161 -109 28 -145 -185 -169
6538a69l56j1N66k23J38P1o07N79k53R25o58m51O20m22Q93r42O60p6p90N14J82
$$ -169 -525 -536 30 -193 -55 16 -591 -12 -265 660 2 -449 171 -251 642 -300 360 284 -506 8 190
6559A90p87j14J179n25J44J74o41N53l49K23oJ08j09Lqn3j27L13k00L15k66k89
$$ 190 -597 -711 468 -57 87 261 -380 173 -176 47 41 149 40 43 35 -18 -145 168 -32 283 17 -272
6581b72K02k85K63J30K4k75L97j33j63K75j27Q2o70P50k40Q0m5J42p5n8K2J1k41
$$ -272 -70 -355 -92 38 62 -213 184 51 -112 163 36 118 -552 198 -42 38 -7 135 60 2 24 35 -206
6604b06K42j01M9q1J94k36K93j08m8J27j49j8K96K54j48l36q8J47k25N4K70m95
$$ -206 36 -65 -16 -97 97 -139 154 46 -2 125 -24 -42 254 508 360 24 -64 83 -142 -88 182 -313
6626c13M17M6l20R6K08k65J8J83j08P2j11J20m4M1J4k5L5n7J52k06J60P6L74l24
$$ -313 104 150 -170 -74 134 -131 -113 70 -38 34 -77 43 -1 40 54 29 64 7 159 -47 113 189 563 239
6650B39n04o9L44O5l29L46k14K19j16R5p6k57j40P98o34M76m32L37K80n52L57
$$ 239 -265 -334 10 75 -254 92 -122 97 -19 76 0 -257 -397 401 -233 243 -189 148 428 -124 233
6671B33K6J75p99O79l08K5M04k54l78M90o61L25M7O3j02J41j48L44L01j382Q94
$$ 233 259 434 -365 314 6 31 435 181 -197 293 -368 -43 4 67 -35 106 -42 302 603 -779 115
6692A15M94j963J630j595J179k36k6P12k77q5j36L19L42K92n16qj0r34J954j681
$$ 115 609 -1354 276 -1319 -140 -376 -402 310 33 -52 -188 131 473 765 249 241 231 -703 1251 -430
6712d30Q39o88n6M31o96J42K03N57o53L65K75m45K24o5r3J55r3K8J03j37J18o6
$$ -430 409 -279 -335 96 -600 -458 -255 302 -351 14 289 -156 68 3 -90 65 -28 0 103 -34 84 18
6734A8n7O7M5n12J25M97N9j18p6l64K74R9o91L88N41j041J044l91M3N30k68m04
$$ 18 -39 28 73 -439 -314 183 242 124 48 -316 -42 57 -634 -246 295 -746 298 -93 -50 480 212 -192
6756a92M74k18N21P4r49N26o48L97j95P3K12n23M44K05N86r21n02J131p13N12
$$ -192 282 64 585 659 -290 236 -412 -15 -210 -137 75 -448 -4 201 787 -134 -636 495 -218 294
6776B94l46L16o4k91K7J81p6j33k9J30m9J58j19K26j93J92K61j043Q15l73K36
$$ 294 -52 264 200 -91 -64 117 41 -92 -121 9 -40 118 -1 225 32 224 485 -558 257 -116 120
6797A20m8K3k5J7k53K85j36L0R8j23j68J70R0p8mQm0K2k4J20j4j58J66p7K7j5
$$ 120 72 95 70 87 -166 119 -17 13 111 -12 -180 -10 80 2 -2 6 -34 -12 -36 84 70 -88 78 1 28 13
6823A3p9N0n8l8R5J57j65J06n3K8j37K1n7J22j36P1J87o3L5o4j13J79k8r4j1J01
$$ 13 -66 -16 -74 -112 -17 140 -25 81 28 56 -81 -60 -117 5 -131 -60 127 64 99 35 -78 101 73 -21 -32 69
6849F9k4Q2k03J18o2o3O1n3OJ59o1p6J79j77O2O9j17J42R6l28J12J9r0K10k20
$$ 69 45 127 -76 42 -20 -83 -22 -75 -69 90 29 -47 132 -45 17 86 -31 111 207 -121 -9 10 -80 130 -90
6874i0J2J61o0q8N1k0M5j03j3K11j58L0R7k4mQL7L7n8j82J03L7j98J83Lj3rJn3
$$ -90 -78 83 23 -65 -14 -34 11 -92 -105 106 -52 -22 75 51 47 55 92 129 71 -111 -8 29 -169 14 17 4 -5 -4 -57
6903e7J06j30J18N3r7m9M6j20K13j18l0j4Q2mk3rn3M8M0J9O8j15Q6p1j40K54p0
$$ -57 49 -81 37 90 -7 -56 -10 -130 83 -35 -65 -79 3 -1 -24 -33 -86 -38 2 21 89 -26 60 -11 -151 103 33
6930C3j62K24j91O0J37j44N5P8j28n4qM0P8j67J55j12m9K28k9q4J10q1P6mr2P4
$$ 33 -129 95 -96 -36 101 -43 12 90 -38 -92 -100 -60 18 -149 6 -106 -155 73 44 -40 70 -11 65 61 -31 43
6956D3p6o3J04J2m4M4n7QJ8m6K1R2j30MJ81r1j03R1M6P3j9j16j8k1n6J75j26L8
$$ 43 -33 -96 8 20 -24 20 -37 -29 -11 -57 -36 56 -74 -70 111 20 -83 8 54 127 108 -8 -26 -47 -103 72 -54 -16
6984a6P3p9PJ13k66L53j43m01M71j16j56K85o5m5j6jPJ08j07J8k1o8J91j99k2
$$ -16 57 -22 -15 98 -168 185 42 -359 112 -4 -160 125 60 15 -1 -2 5 113 6 24 3 -65 126 -73 -95
7009i5J98q9q7K2L9J31o2j9K9l9mJ9R1j18k2j7k9K0n1K9J70k21J49kj62J07nN3
$$ -95 103 14 -73 -51 -12 119 57 38 67 28 24 43 134 16 -6 -23 -52 -32 -83 -54 116 -105 44 42 -120 -13 -18 35
7037C5J42j22LJ14j10K5p1n3R3n0pq7J7K2J75r2n8J35j58R3J19j88j7J00q3J50
$$ 35 177 55 58 172 62 87 16 -37 56 6 -1 -88 -71 -49 126 34 -24 111 -47 46 165 -23 -40 60 -23 127
7063A27j23J0M6r6M6l0n1KM9j01J04p0J04r3QJ9K8j30J99j28l1J52j6LM7n5l6
$$ 127 4 14 60 -36 10 -20 -71 -69 -20 -121 -17 -87 17 -76 -68 -49 -21 -151 48 -80 -111 41 25 28 75 20 -16
7090a6J11k12J50Mn2J00l2l6j15Q1j35K28k68J14Q2o8R0J57l08R20N5j049M23
$$ -16 95 -117 33 37 -15 85 53 17 -98 -17 -152 76 -192 -78 4 -64 26 183 -125 795 850 -199 224
7113B24l82K27j30pK5J68j92O3k2J2M7j09q9K99j40PN2j30R1o9P3o3J31r1J23
$$ 224 -158 69 -61 -68 -43 125 -67 -4 -26 -14 33 -76 -165 134 -6 1 53 -77 14 -55 18 -45 86 -5 118
7138A18k11o2J65n4Q6n4LP7j2j54J15r7M9J5N7o0lk8J48n2j04R0O1j20O3p0PR7
$$ 118 -93 -155 10 -44 42 -12 -9 68 56 -98 17 -80 -31 -16 41 -19 -22 -50 98 46 -58 32 93 -27 36 -34 -27 70
7166G0j01j14J24o6K23j52K3R6r5r6J54j5L5l91q49M57O71L0j07K27j33P9j34
$$ 70 -31 -145 -21 -87 136 -16 7 103 8 -88 66 51 86 -305 -1154 -697 -26 4 -103 124 -9 70 -64
7189f4p6J76j2n2L0J08k3j34L6L2L5j59J38oq8P0QJ1n8J4j23J80q8J5N5l2J13
$$ -64 -140 36 24 -28 2 110 87 -47 -11 21 56 -103 35 29 -59 11 19 30 -28 -14 -137 43 -45 -30 25 -7 106
7216A06j05n4N8k6m5J69j67K33r4j04J5o7K1oO9OJ6j90J40L4q4M6K5j63J28kL
$$ 106 1 -53 5 -21 -66 103 -64 169 75 -29 -14 -81 -60 -66 3 9 25 -165 -25 9 -75 -29 -4 -167 -39 -41 -38
7243c8J36m9j25J99k49J84j60J41n8J04j49m72L75N1K02p7p9Q5M9r6ko1K06j96
$$ -38 98 49 -76 123 -126 58 -102 39 -19 85 -64 -536 -161 -110 92 15 -64 21 70 -26 -28 -89 117 -79
7267g9J70j05J2l5Q0j56J57k3n5m9J93j72j6J1K9J21j94Q2j7kPJ59j08m4P1k5
$$ -79 91 -14 -2 -37 43 -113 44 21 -34 -83 110 -62 -78 -67 -38 83 -111 -29 -46 -48 -41 118 10 -34 37 12
7293A2l1L1o1j5j01J12Q3M5j01l5J48j13P6r0O8L1o0M6n4Q0K9l2p2J06Oj47J10
$$ 12 -19 12 -49 -64 -165 -53 30 75 -26 -61 87 -26 50 -40 28 59 -1 45 -9 71 100 68 -4 102 108 -39 71
7320G1j0p8j08MJ47K7j18l8J02J1J4r8L8J57j41l1P3j1OJ6j1m2q9L4K01q9j9J58
$$ 71 61 -17 -125 -121 26 53 -65 -103 -1 10 24 -74 -36 121 -20 -51 22 11 17 33 22 -20 -109 -75 126 37 18 176
7348A76j64l7P1j22P2k8O6l3J0j18J42j23J31Rj73J31j6p4J01j22J36kj24J78
$$ 176 12 -25 46 -76 -4 -32 34 1 11 -107 35 -88 43 52 -121 10 -6 -80 21 -101 35 33 -91 87
7372H7o9j31J75j4r6Q9n8k9PN6N8R1k30J25l6j38K40k67O5k5M9N3j0m5O6P6k48
$$ 87 18 -113 62 48 -48 41 -17 -46 -39 17 75 166 -64 61 25 -113 127 -140 -75 -100 -51 2 -8 -53 13 89 -159
7399a59J88q7L4M3n9L4J31j28o5J50j82J53m6j19J02R7j74M1J36k0M4j60N1R0
$$ -159 29 -58 -24 19 -40 -6 125 -3 -68 82 -100 53 7 -112 -10 87 -87 -46 90 70 114 -46 5 95
7423I5j36J8K9m8J18j63qJ29rN1q4n9Q7M9k59K05J81k98J31N1l3J25j57M9p0M
$$ 95 -41 -23 6 -42 76 -87 -95 34 25 76 -8 -67 20 69 -190 15 196 -102 29 80 47 172 15 64 -6 -2
7449bP5j17rP6nK4j18j15K22q40N34L35k65R7J55Q2j18J16j47k6J62j37L7j3n2
$$ -2 73 -44 -53 23 18 42 -76 -191 31 -809 -275 60 -205 -108 47 129 11 127 -20 -46 116 -21 16 3 -49
7474d9M4Qk6P5j48K6J24k5nLk3p6L0M4P9r5q3R7j6J01n6q3J03j15K7J1m0j02J45
$$ -49 -5 3 -23 52 -96 -70 54 29 24 27 4 -72 -42 2 81 -14 -97 0 -16 85 29 -54 49 -66 -39 -28 -68 -170 -25
7503b5J0J5K6m1PL3k8j05K10k5j39Q1K2n8R7j58J16k5p8J81j04l4Q7j97J22m2
$$ -25 -15 0 26 -15 -8 25 -3 -108 102 77 -62 19 41 -17 80 -78 38 13 -65 116 12 -22 65 -132 -10 -52
7529e2k4K77j61p6JJ42j39J12j63N4oL3QL4mM7j03q6K11r3j43J35p1J4K33k13
$$ -52 -76 201 40 -36 -35 107 -32 80 -83 -29 -35 -2 6 40 36 83 -20 -106 105 12 -131 4 -67 -53 180 -33
7555c3P1k9j8L6l6j07J37O6j43J84j54M2r2m9R6k7nJ38j42L7J11j18O6RKj18J75
$$ -33 38 9 -9 27 -9 -116 21 87 -56 128 -26 16 -76 -125 -29 -56 -61 77 -65 -28 83 -35 31 40 42 -76 99
7582I9j50rJ24j89J21J2k3J1l0K3KLNk0N1m7m0J22P4p3j4o7j4N7Oj42K3J21n4
$$ 99 -51 -60 64 -125 -4 8 -15 -4 -34 -11 -9 -6 -1 -21 30 -17 -57 65 139 66 52 -15 -29 28 34 -108 -85 36 -18
7611a8q3P7L5N6j55O9M1l1M9NpK8j6k6Ql6r4J9J31m6K3j44N1K2m4L5L0P2L6k4
$$ -18 -101 -24 11 67 -88 -19 22 -9 40 45 38 66 50 24 32 -4 -98 -79 52 6 29 -115 -64 -42 -86 -51 -21 51 87 63
7641F3j7p7K7J3P0p3Q1j51L06o12j23N86o9j12M5P0j60K05o6r0R4j6j31J09K4
$$ 63 46 -31 -4 9 79 6 87 -64 242 -370 -493 93 24 -88 -43 27 -133 72 6 -84 10 -6 -137 -28 -4
7666dr3J95j64n5N3K6Q7po9N0P9j08l6M1K0J4m7j15P9J8Qk03N79K69j189L89K76
$$ -4 -97 98 -66 -121 -68 -42 45 38 -31 19 98 -10 -46 -5 15 29 -18 -133 -54 -36 -28 -231 348 617 -572 -183 93
7693I3q6m56R49q41O49m41J46k80J88K6o9K17k22O9MOJ14k9p2O4m8L7J07j35Q
$$ 93 7 -449 500 -341 308 -133 13 -267 -79 -53 -122 95 -127 -58 -54 -48 66 37 -35 29 -19 18 125 -10 -2
7718bqj3P1p1j08K25K0p7j06K8J5N0k9J66j54J8M5j57J22pMlj0n4J05q7j92K05
$$ -2 -10 -23 48 -23 -131 94 114 37 -69 -41 -26 24 -5 161 7 25 70 -87 35 28 32 29 19 -35 70 -17 -209 -4
7746dk8JM7pr8J91j36J5P0j40K18o5j11J26o1n8M7j0j1J88k26J05j61J07O1M8
$$ -4 -32 -31 16 9 -89 102 -34 -19 51 -89 129 64 -47 79 18 -40 7 -3 -14 174 -52 53 -108 -1 60 108
7772A08N5j49L0n7L4j3M4l8q4J39lk11J46l4p7J47p7m9J89k26J08Q4n9R1j77K3
$$ 108 163 14 44 -13 21 8 52 14 -70 69 66 -145 1 -33 -110 37 -40 -89 100 -126 -18 66 7 98 -79 -56
7798e6K18k74N2J31j16J11j41J26N0n7n8J5n5L6mk8MQ7n7K8L2o6K9R4j74J46K4
$$ -56 162 -112 -60 71 -45 66 -75 51 101 44 -14 1 -54 -18 -22 -50 -46 41 -16 12 44 -22 7 101 -73 73 97
7825I7o4O9j79P4O5o6k9Q2j53J59j36R4k1m1N2J10q3j49J80L4j36J05l2k1K4o3
$$ 97 33 102 -77 -3 62 -4 -33 49 -104 55 -81 13 -8 -49 3 113 30 -119 61 95 -41 64 32 11 35 -28
7851b8J00j11j48K84j74L3J07m0r5J25j31K10o6p5J5k2L2j21R0P3k9o5jq3Q9Q1
$$ -28 72 -39 -187 97 -77 -44 63 23 -72 53 -78 132 66 -9 6 -16 16 -105 -15 58 29 -36 -37 -120 -31 50
7877E0p3j42K58k07J6J65r4j2R3j6j1J53k63J84p5P2j07l3oQ9K2n6k2j4M5j0n6
$$ 50 -23 -165 93 -114 -98 67 -27 -39 54 38 27 180 -83 101 26 98 -9 -42 -48 41 63 7 -15 -29 16 6 -50
7904e0O2k0j3J17r0k1M4q6M5Q4j27J51L8n1k7P2j18J22j69l5P2K6M2j04L9J3Q
$$ -50 12 -8 -21 96 6 -15 29 -57 -12 72 -55 96 134 83 56 128 10 132 -37 -72 0 26 68 -36 3 16 24
7931B4p0P7J7Rq4j8L6J7m8J31m6j01L9K5j9O3p7J28p3r3J4m5Q7L8l2j24K14j51
$$ 24 -46 31 48 57 -27 -45 -9 8 -40 91 45 -56 -17 8 -11 52 -25 103 30 -63 -49 -94 -7 31 -1 -125 89 -62
7959f2n5K36r9J8R2j88J05K0p7o2J0O0m1O3j02N7J2P9l1q1O6J18p8o4nn3K17j21
$$ -62 -117 119 20 38 130 -58 47 67 -10 -72 -62 -2 -43 20 -82 -25 -13 66 35 -46 20 138 60 -4 -9 -62 155 34
7987C4M8p6N8m6Q4j80J53j00PP9R8q4Qp1m4P1L3j20j73J12K21m0m1q8P0n8L35
$$ 34 82 6 64 18 102 -78 75 -25 -18 61 159 75 83 12 -32 39 72 -48 -221 -109 112 72 31 -57 13 -45 290
8014B90j1o7n0l83L20p2k8L2r3N8L4m5L1Q8o3K2rp4j07M24l2m57J91L22l86J27
$$ 290 279 212 162 -221 99 27 -1 31 -62 -4 30 -15 16 104 41 63 54 -20 -127 297 265 -192 -1 321 -65 62
8040F2q7j0Q3j48J36j3J78j40r6O7R3j62L0J0M1J04o4l8Nmo9n1j3R6Pm9J4k9j52
$$ 62 -25 -35 48 -100 36 23 201 61 -35 32 125 -37 -7 3 44 148 84 46 51 47 -22 -73 -86 10 17 -32 -18 -47 -199
8069a99J88O0LL1m9m2j3j36K96l40N18M6n02j78N75k08j01J23j25J76k18J00%
$$ -199 -11 49 52 83 34 -8 -21 -157 139 -201 317 363 -139 -317 258 50 -51 72 -53 123 -95 5 5
8092EJ62M54n26j41K3J00n5K07k37k5m1l6N9J11l7p2N0j7nj8O7kj03J0R7r1R3
$$ 5 167 621 95 -46 -23 77 22 229 -8 -33 -74 -110 -51 60 23 -49 1 -16 -21 -39 28 26 -77 -67 30 -61 32
8119C2n7mJ31q1qj25J50o1K1m3j42J56P6N9q1o2k4J24l0l1o7N9M9l8L1j19J6p8
$$ 32 -25 -29 102 21 13 -112 38 -23 -2 -45 -187 -31 45 104 23 -39 -63 61 31 0 -67 -8 41 3 34 -85 -69 -147
8147a47J59j46J24O8q1l1J07L8q1L0k8l5M8m8M4j16N3N2R2j89N5n4O2n7N9K0j47
$$ -147 12 -134 -10 58 -23 -54 53 91 10 40 12 -23 25 -23 21 -95 -42 10 102 -87 -32 -86 -24 -81 -22 -2 -149
8174a49J67j4q5K6n7J01J0n1K41j99m6N2M8m8N6l9O6
$$ -149 18 4 -81 -55 -112 -11 -1 -52 189 -10 -56 -4 44 -4 52 13 79
8191G9
$$ Imaginary data points
##PAGE= N=2
##DATA TABLE= (X++(I..I)), XYDATA
0@%%%%%%%%%%%%%%qJ6j6J6j6J6k4L2l2M0m8N6o5P3q8J04j18J34j52J69j91K15
$$ 0 0 0 0 0 0 0 0 0 0 0 0 0 0 0 -8 8 -8 8 -8 8 -16 16 -16 24 -24 32 -33 40 -48 56 -62 72 -80 89 -102 113
36A13k42K74l06L40l78M20m66N17n74O34o99P69q49R38j031J137j253J382j528
$$ 113 -129 145 -161 179 -199 221 -245 272 -302 332 -367 402 -447 491 -540 597 -656 726 -802
55h02J691j876K085k327K616k959L377l899M571n481O782q813J2447k0974P9738
$$ -802 889 -987 1098 -1229 1387 -1572 1805 -2094 2477 -3004 3778 -5035 7412 -13562 66176
70F6176N5546j18940n4629k0742K1476J1619L4680N2354K6461m5876n2983j5319
$$ 66176 121722 2782 -51847 -72589 -51113 -39494 -4814 47540 74001 28125 -24858 -40177
82d0177M1755K7903l3909m2385Q698K7395K9096J8977J5991O251m0002p8808m4437
$$ -40177 1578 29481 -4428 -46813 -38115 -10720 18376 37353 53344 59595 19593 -59215 -103652
95a03652K5548Q5841P1291q30l4036l1599m2577l4472k226M1297O1071J6294l4594
$$ -103652 -78104 7737 79028 78198 44162 12563 -30014 -64486 -66712 -25415 35656 51950 17356
108A7356k8267M407K7528M700l4727k0018M597m763L828L2996N1383K8053m3566
$$ 17356 -10911 -6504 21024 25724 -9003 -29021 -24424 -29187 -25359 7637 59020 87073 43507
121D3507q1713m6197Q904M7055M6283K6081K2583r103n9997n2712l285L6853L9261
$$ 43507 -38206 -84403 -75499 -28444 17839 43920 66503 57400 -2597 -55309 -58594 -21741 17520
134A7520J313j5618R10O812O023k880r485M47j6033l8086n876M1001N6030L1423
$$ 17520 18833 3215 4125 10937 16960 14080 4595 5042 -10991 -49077 -54953 -13952 42078 73501
148G3501k2598m7608l7098k4133J575K8268M4963M7509P07n0363l9544o415J2333
$$ 73501 50903 3295 -33803 -57936 -56361 -28093 16870 64379 65086 14723 -24821 -31236 -18903
161a8903J3104n25L444J0880j613k879N746J1584P406k9849m8449p522L1608M0450
$$ -18903 -5799 -6324 -2880 8000 6387 3508 9254 20838 28244 -1605 -50054 -57576 -25968 14482
175A4482L0629M968j1992k8546m5731k4705J5269M3016M4359L192k7320j4972
$$ 14482 45111 50079 38087 9541 -36190 -60895 -45626 -2610 41749 44941 17621 2649
187B649q948r510r43M105J1207M458j2205q93J7784K1710Q871k8055l8667j0096
$$ 2649 -6299 -15809 -16752 -12647 -1440 3018 -9187 -10080 7704 29414 38285 10230 -28437 -38533
201c8533N720J5383L0064K7989J2495k0469m7855l0536K179K4113K9884R439j161
$$ -38533 -32813 -17430 12634 40623 53118 32649 -15206 -45742 -43563 -19450 10434 19873 18712
214A8712J876j4689j9014n19Q798P784n515j4700L718J8063J7935J0295j2915
$$ 18712 20588 5899 -13115 -13634 -4836 2948 -2567 -17267 -13549 4514 22449 32744 19829
227A9829k1416j4493j8111k212K6728L1576J9518p813l0264k2319r381L581J5776
$$ 19829 -1587 -16080 -34191 -36403 -9675 21901 41419 33606 3342 -18977 -28358 -24777 -9001
240i001J1533J1249Q401j3916j4215M178O126J367j0158j3233L742J0510J0619
$$ -9001 2532 13781 22182 8266 -5949 -1771 4355 5722 -4436 -17669 -13927 -3417 7202
253G202J2578J637n369j5030k9706j0017K0811K3674J6628K480r395j0749j6903
$$ 7202 19780 21417 16048 1018 -28688 -38705 -17894 5780 22408 24888 15493 4744 -12159
266a2159j0584Q307J2356J2034L714j1771k723P209j039k511m333p504k176k102
$$ -12159 -22743 -14436 -2080 9954 13668 1897 -826 6383 5344 2833 -1500 -9004 -11180 -13282
280a3282N908J6023Q610K206r160k3451r972P513Q716J2781R389J236k877j4012
$$ -13282 -7374 8649 17259 19465 10305 -13146 -23118 -15605 -6889 5892 15281 16517 13640 -372
294c72j2316J463N563Q718J470r027L901Q259m352k668oj889l139r161J180J4910
$$ -372 -12688 -11225 -5662 3056 4526 -4501 -600 7659 3307 639 633 -1256 -4395 -13556 -12376 2534
310B534R824L797n313j3600k871j852n763Q577J2568M115k390r846m757J327k181
$$ 2534 12358 16155 10842 -2758 -5629 -7481 -13244 -4667 7901 12016 9626 -220 -4977 -3650 -5831
325e831K967K686l481M248K318l891M127K207l003k382o274r60O049L984N754
$$ -5831 -2864 -178 -3659 589 2907 -984 3143 5350 2347 -35 -6309 -7269 -1220 2764 8518
340H518m47p507O20l558q309M087P163L239R49m935j000K080l648N04J121k11
$$ 8518 8071 564 1184 -2374 -10683 -6596 567 3806 4755 -180 -1180 900 -2748 -2244 -1123 -1334
356a334N574k345n216O286K419m161j759k083J667Q61l413L807K289k616J537
$$ -1334 4240 1895 -3321 2965 5384 1223 -536 -2619 -952 -91 -3504 303 2592 -24 1513
371A513l466l593N736J05k086L364J78L99q45l394K838K46j815M523k202l431
$$ 1513 -1953 -5546 190 295 -1791 1573 1751 2150 1305 -2089 749 995 -820 3703 1501 -1930
387a930M127k580l582K017N53K602P09l477J764r06k127L178j969M60O739l014
$$ -1930 2197 -383 -3965 -1948 -1395 1207 1916 -1561 203 -703 -2830 348 -1621 -1161 5578 2564
403B564l982K737J57K71j888l117L225m28j626L976j058p9L057p006m106L949
$$ 2564 -1418 1319 1476 1747 -141 -3258 -33 -461 -2087 1889 831 752 3809 -3197 -7303 -3354
419c354J573L622K283o52J439m353m310K024j601K968O208m131k418K689j846
$$ -3354 -1781 1841 4124 3472 4911 558 -3752 -1728 -3329 -361 5847 1716 -702 1987 141
434A41k42j427j902K258k034o98M882O95L230K170q410l745J839j271L631M920
$$ 141 -101 -1528 -3430 -1172 -3206 -3904 978 1673 4903 7073 -1337 -5082 -3243 -4514 -883 4037
450D037K473J494o207n186J98k914K939N348k466J089J799l597J110O78j899K34
$$ 4037 6510 8004 1797 -3389 -3191 -6105 -3166 2182 -284 805 2604 -993 117 795 -1104 -870
466h70k766L03L679J95N712L638p591l914j786m064K704M596L855L873m141m526
$$ -870 -3636 -3333 346 541 6253 9891 2300 -1614 -3400 -7464 -4760 -164 3691 7564 3423 -1103
482a103j621l808K844L154j953M603K130m507J591K099j003j553m962M05K891
$$ -1103 -2724 -6532 -3688 -534 -2487 2116 4246 -261 1330 3429 2426 873 -4089 -3684 -793
497g93j277M900M375l140j456n668o674L701L880K031M388K64m32l402n806L099
$$ -793 -2070 2830 7205 4065 2609 -3059 -9733 -6032 -2152 -121 4267 4531 4099 697 -5109 -2010
513b010K472k653L464J372k634K570J2p87M14m483k126J19n43N255K878o84L230
$$ -2010 462 -2191 1273 2645 11 2581 2593 1806 2220 -2263 -4389 -4270 -4813 442 3320 2636 5866
530E866m561q145J737K408J820L307Q18K488j310o476L29P54r94L253k285j689
$$ 5866 1305 -6840 -5103 -2695 -875 2432 3250 5738 4428 -2048 -1719 -965 -1959 1294 -991 -2680
546b680N146p07k588J527j021p12k764k090O013K340p79L921k320m476L94k495
$$ -2680 2466 1759 -829 698 -323 -1035 -3799 -5889 124 2464 1685 5606 3286 -1190 -796 -3291
562c291P51M288l18J164k46k728K51k955o02N026k468k226M530k18p82Q87j172
$$ -3291 -2540 1748 1430 2594 2348 -380 -129 -3084 -3686 1340 -1128 -3354 1176 958 176 1063 -109
579a09J359q67k880K731M96M90L026l756j323K792m237j497L289L74R62p14j104
$$ -109 1250 383 -2497 234 730 1220 4246 490 -833 1959 -2278 -3775 -486 -112 850 136 -968
596i68K075l104j243M331j149N53K785l027L78J093l120O75J303K58J314k930
$$ -968 1107 -1997 -3240 1091 -58 495 3280 253 631 1724 -1396 -721 582 840 2154 -776
612g76q2K700m258l77L213k160O83J512j393K001L56j046J065k946m7K321j995
$$ -776 -858 1842 -2416 -2793 420 -1740 -1057 455 -938 1063 1419 373 1438 -1508 -1555 766 -1229
629a229L115L624m073p13o77m405K18J587K860L416k239o96M41m915N68K433j442
$$ -1229 1886 5510 1437 724 47 -4358 -4140 -2553 307 3723 1484 788 1229 -3686 -3118 -685 -2127
646b127L451J776k658J621L89m87k24l965n78Q36k209M615M351j827Q06k712o747
$$ -2127 1324 3100 442 2063 2452 1965 1741 -2224 -2802 -1966 -4175 440 4791 2964 3770 1058 -5689
663e689j143J133L757N867N93R13j151o066n26K44j734M662J487k577K023P72
$$ -5689 -6832 -5699 -1942 3925 4518 5431 4280 -1786 -2312 -2068 -3802 860 2347 -230 1793 2565
679B565k28j86m052j503j584l007N526N893J503L701l188p924l075k352K076P055
$$ 2565 2337 2151 -1901 -3404 -4988 -7995 -2469 3424 4927 8628 5440 -2484 -5559 -7911 -5835 1220
695A220L955L023j530n917j050l092l430M812J313j689K547J245K131J859l668
$$ 1220 5175 8198 6668 751 -299 -3391 -6821 -2009 -696 -2385 162 1407 3538 5397 1729
710A729k582l976m457L641M576N527Q304k113q062m868o249j724M935N834O902
$$ 1729 -853 -4829 -9286 -5645 -1069 4458 12762 10649 2587 -2281 -8530 -10254 -5319 515 7417
725G417J22m761p83m092l951K563k11J13L510j5L010N236n66l123p276o102J081
$$ 7417 7539 2778 1995 -2097 -6048 -3485 -3696 -3583 -73 -88 2922 8158 7592 4469 -2807 -8909 -7828
742g828N83N581J2170K351m655n955r454m311J909L380Q299M760n79l73n082k494
$$ -7828 -7245 -1664 10506 12857 8202 2247 -7207 -11518 -9609 -6229 2070 6830 6251 5878 796 -1698
758a698J625m082j298L263k99L010O126L152J22p660r515l262k269M534J1584
$$ -1698 -73 -4155 -5453 -2190 -2489 521 6647 9799 9921 2261 -7254 -10516 -12785 -8251 3333
773C333O316L180k781j2323p021m54J200N966N483L987K122n277k437J392m474
$$ 3333 9649 12829 10048 -2275 -9296 -9750 -8550 -2584 2899 6886 9008 3731 1294 2686 -1788
788a788k867o76k643M012O284M454M799k632q830q156p338K876R633O615Q735
$$ -1788 -4655 -5331 -7974 -3962 2322 6776 11575 8943 113 -8043 -15381 -12505 -2872 3743 12478
803A2478L317r107q675n361k239M014L394M037M450j481r09J52m012j150l422
$$ 12478 15795 6688 -1987 -7348 -9587 -5573 -2179 1858 6308 4827 3918 4070 58 -1092 -4514
818d514p020K295O508O096P736J577m049q524j2026k269N737O277J0612N873m148
$$ -4514 -11534 -9239 -2731 3365 11101 12678 8629 105 -11921 -14190 -8453 -2176 8436 14309 10161
833A0161n114p752o567J513K123K723L622O71L367J444l064O53l518q900k108
$$ 10161 5047 -2705 -9272 -7759 -5636 -2913 709 1380 4747 6191 3127 3780 262 -8638 -10746
848a0746K508N849J0498N134l3n560j2072p242j647L159J1576P289q7j5n815p565
$$ -10746 -8238 -2389 8109 13243 13210 7650 -4422 -11664 -13311 -10152 1424 8713 8626 8611 2796 -4769
864d769j288m13J623K554L98M673L100j30K750l435q732l983l598K076J0295P537
$$ -4769 -6057 -6470 -4847 -2293 -1895 2778 5878 5748 8498 5063 -3669 -7652 -11250 -9174 1121 8658
880H658L936j536q991p695o535j579Q836O966L462M147l190n231j534l201p12
$$ 8658 12594 11058 2067 -5628 -12163 -13742 -4906 2060 5522 9669 6479 1248 -286 -3487 -4199
895d199M36o45L611L091K349N157j988o524m705p950j929P438P265P242L172m260
$$ -4199 -3763 -4408 -797 2294 4643 9800 7812 1288 -3417 -11367 -13296 -5858 1407 8649 11821 7561
911G561n882q386m915M944L943M420O055j170k314o31m026j788j112k584J128
$$ 7561 1679 -6707 -11622 -6678 -2735 1685 7740 6570 4256 3625 -401 -2189 -3301 -5885 -4757
926d757J490L693O935J28k268k615r367n100L178M609P986N728p0j898p428o714
$$ -4757 -3267 426 7361 7489 5221 2606 -6761 -11861 -8683 -4074 3912 9640 9570 7672 244 -6470
942f470M4J34L981N697q81J036J691l635j813j487l032p50r63L087P540K092J125
$$ -6470 -6426 -6292 -2311 3386 2505 3541 5232 1597 -216 -1703 -4735 -5485 -6448 -3361 4179 6271 7396
959G396k11p665n512j462k72O686O476J609N11m033m738k759l453K683M895j371
$$ 7396 7185 -480 -5992 -7454 -7726 -1040 5436 7045 7556 3523 -1215 -3974 -7427 -4744 151 -1220
975a220J829L162j262M50j637l313n10k684K74M787L178M439R20o386l010l050
$$ -1220 609 3771 2509 2959 1322 -1991 -2501 -5185 -4911 -124 3054 7493 8413 2027 -983 -4033
991d033m385K955N396L115K374k214j827j431m466M44K599p71K766J464o92L319
$$ -4033 -8418 -5463 -67 3048 5422 3208 1381 -50 -4516 -4072 -1473 -2244 522 1986 1294 4613
1007D613k98l546j387k458q53J000P44N765K951m186j386k272m294J166J317K373
$$ 4613 4315 769 -618 -3076 -3929 -2929 -2185 3580 6531 2345 959 -1313 -5607 -4441 -3124 -751
1023g51M345l36j048l65k490M08o52k125L426N15j900L432R25j590j054l281n07
$$ -751 3594 3258 2210 1845 -645 -237 -889 -3014 412 927 -973 2459 3384 1794 740 -2541 -3048
1040c048K43j035L769K780o36J099k785l295K241q64n03L194R39N75r30k103J771
$$ -3048 -2805 -3840 -71 2709 2073 3172 387 -2908 -667 -1531 -2034 1160 2099 2674 1744 -359 1412
1057A412j037l037K142l92j154K780l44n9J431k420q78K21o21K171J98M0L263
$$ 1412 375 -2662 -520 -912 -2066 714 370 311 1742 -678 -1556 -1335 -1956 215 413 453 3716
1074C716k377k550K169r83j089J230n76J151p4j911J421m47j030J889j904l08
$$ 3716 1339 -1211 958 -25 -1114 116 -460 691 617 -1294 127 -320 -1350 539 -1365 -1673
1090a673L011j703k69K029j056M67p5p94J704j507j073K381k017p22K335j618
$$ -1673 1338 -365 -634 1395 339 806 731 -63 1641 134 -939 1442 -575 -1297 1038 -580
1106e80J97R66j855N01N64r17J109q78L80K555k041R5K660k462p93O29j605J324
$$ -580 -383 583 -1272 -771 -207 -1124 -15 -893 -513 2042 1 96 2756 294 -499 130 -1475 -151
1124a51O01k2J719j659j159O16k867M13K568j139J610J849k128M53j42r99M38
$$ -151 450 428 2147 488 -671 -55 -2922 -2509 59 -1080 530 2379 251 704 562 -437 1
1141Aj400O98K382j652J289J983k848n63q83k794J371J310P63K626m64m23o20
$$ 1 -1399 -701 1681 29 1318 3301 453 -110 -993 -3787 -2416 -1106 -343 2283 1819 1396 776
1158G76l528Q06J617j426K516K109j521N96n36j145M8k652j37J665r75K412K133
$$ 776 -2752 -1946 -329 -1755 761 2870 1349 1945 1409 264 312 -2340 -2477 -812 -1787 625 2758
1175B758j496R84j901m479O35J123J175L003R83J350q14m530k85K48j683K557
$$ 2758 1262 2246 345 -4134 -3499 -2376 -1201 1802 2785 4135 3321 -1209 -1494 -1246 -2929 -372
1191c72J352n30K019q65j500M87k138j077j62j180M266K183r28K469o06m408j585
$$ -372 980 450 2469 1604 104 591 -1547 -2624 -2786 -3966 300 2483 1555 4024 3418 -990 -2575
1208b575q97J017L283O18K175O19l334j141k039j911K876q7p71L618P43o70M12
$$ -2575 -3472 -2455 828 1446 3621 4240 906 -235 -2274 -4185 -1309 -1396 -2167 1451 2194 1524 1936
1225A936j596o27k014k393L375K397Q08L242r73k979j425l913p93L086J558K164
$$ 1936 340 -287 -2301 -4694 -1319 1078 1886 5128 4155 1176 -249 -4162 -4955 -1869 -311 1853
1241A853O56p58L13l245k638K690k93q79K636N68J626J355k056n65j707l035N94
$$ 1853 2509 1751 2064 -1181 -3819 -1129 -1422 -2301 335 903 2529 3884 1828 1263 -444 -3479 -2885
1258b885K09K328M679r23j598L2m089k665J080J230L365J307o5J624j985k426
$$ -2885 -2676 -348 4331 3408 1810 1842 -2247 -4912 -3832 -2602 763 2070 2005 3629 1644 -782
1274g82N83j944J21J944r81J936K957q20j124k176k257j69k019J555N276N50J37
$$ -782 -199 -2143 -2022 -78 -1059 877 3834 3014 1890 -286 -2543 -2712 -4731 -3176 2100 2650 2787
1291B787N14l592j558m19j142K718J965N96J403j620l78J87l596k11J440j966
$$ 2787 3301 -291 -1849 -2268 -3410 -692 1273 1869 3272 1652 1274 1461 -2135 -2346 -906 -2872
1307b872J439K685O25J060j600k254n72k404M23L395J027K695J141l676r01o91
$$ -2872 -1433 1252 1877 2937 1337 -917 -1489 -3893 -3470 -75 952 3647 4788 1112 211 -480
1323d80k497Q81J152J343J646j384M15N74l179p9L88j903J648J682L89K315k25
$$ -480 -2977 -2096 -944 399 2045 661 1076 1650 -1529 -1608 -1220 -3123 -1475 207 596 2911 2686
1340B686j424q69k529J40J004l20L147J695k439l9j028k356L25j34P32K164n93
$$ 2686 1262 393 -2136 -1996 -992 -1312 1835 3530 1091 1052 24 -2332 -2007 -2141 -1409 755 162
1357A62R92O46k077Q25n70k424J799O85k22K291K77o97m98k540k33Kj153K937
$$ 162 1154 1800 -277 548 -22 -2446 -647 38 -184 2107 2384 1687 1189 -1351 -1584 -1582 -2735 202
1375B02J418j467J141r52j719O93q06L82J623l17J194Jj228J565j183k103J592
$$ 202 1620 153 1294 342 -1377 -684 -1490 -1108 515 198 1392 1393 165 1730 547 -1556 36
1392C6k96j000J920P0J8J19j837J94k65j207K148O14l89K012j408j293J281j272
$$ 36 -260 -1260 660 730 748 867 -970 -776 -1041 -2248 -100 514 125 2137 729 -564 717 -555
1410e55j59J105L8J189r20j364J599j144j715J859n15l14J498j071M06Q45j393
$$ -555 -714 391 429 1618 698 -666 933 -211 -1926 -67 -582 -896 602 -469 -63 782 -611
1427f11N19p1l50J775j056j86K312j728j360J164j081j57N40k05J636m97j527
$$ -611 -92 -163 -513 1262 206 20 2332 604 -756 408 -673 -830 -290 -495 1141 644 -883
1444h83P66j168j67J543q94Q76K223j668o32N41o38L58r30O8K181j211m89J538
$$ -883 -117 -1285 -1452 91 -803 73 2296 628 -4 537 -101 257 -673 -605 1576 365 -124 1414
1462A414j486o50J44j796J141J137k52J474K26l71m73k350K91K221j409J117K346
$$ 1414 -72 -722 -578 -2374 -1233 -96 -348 1126 1352 981 508 -1842 -1551 670 -739 378 2724
1479B724j120n62r41j442Q18o96l12J443p5P26Q82k007P29K99k759K84J358O56
$$ 2724 1604 1042 101 -1341 -523 -1219 -1531 -88 -163 563 1445 -562 167 466 -2293 -2009 -651 5
1497EJ778K54L36N9l328j178Q54r83J921J850o22J178r48k659k07k82J90J023
$$ 5 1783 2037 2373 2432 -896 -2074 -1220 -2203 -282 1568 946 2124 1176 -1483 -1690 -1972 -1782 -759
1515g59k58K582J387k147N03J07k667k22l83L62K487R57L86J74k357j322j403
$$ -759 -1017 1565 2952 805 1308 1415 -1252 -1474 -1857 -1495 992 1949 2335 2509 152 -1170 -2573
1532b573j519K587J949p9K001L2j752p71j394j7O33o27J900J733l72J211j004
$$ -2573 -4092 -1505 444 365 2366 2398 646 -125 -1519 -1536 -903 -1530 370 2103 1731 2942 1938
1549A938k766j61j835j137K386K088J759R04j767n82k231k960J769J782R47K822
$$ 1938 -828 -989 -2824 -3961 -1575 513 2272 3176 1409 827 -1404 -4364 -2595 -813 134 2956
1565B956J91j088k64k219j068r7p43J440Q15M85K392n17k045m0k445k005J315
$$ 2956 3147 2059 1795 -424 -1492 -1589 -2332 -892 -77 408 2800 2283 238 198 -2247 -4252 -2937
1582b937J483K766K149l23k7k326l185J38m36R22L416L08Q1P30j847j719r10j485
$$ -2937 -1454 1312 3461 3138 3111 785 -2400 -2262 -2698 -1776 1640 1948 2029 2759 912 -807 -1717 -3202
1600c202R41K16J036L509L56o81L00k992k481R0q3K643K944P96N63j940k837q01
$$ -3202 -2261 -2045 -1009 2500 2856 2175 2475 -517 -2998 -2908 -2991 -348 2596 3392 3955 2015 -822 -1623
1618a623k114L33L082L42Q76J746j029p22r43j886J30p87M87L085J213J123R28
$$ -1623 -3737 -3404 -322 20 896 2642 1613 891 -52 -1938 -1808 -2595 -2108 977 2190 3313 4241
1635D241k756k376j286k253J384K739J938J765p88j436j199l173o15K162K35J669
$$ 4241 1485 -891 -2177 -4430 -3046 -307 1631 3396 2608 1172 -27 -3200 -3815 -1653 -1418 251
1651B51K227l92O98p94k266p84j404j66J675P58K627J952k428j440j385l054j03
$$ 251 2478 2086 2784 1990 -276 -1060 -2464 -2630 -955 -197 2430 4382 1954 514 -871 -3925 -4028
1668d028J656J960K854K36l74j39k853j062K45r58J990J539l28J841N34j636j451
$$ -4028 -2372 -412 2442 2678 2304 2165 -688 -1750 -1505 -2463 -473 1066 738 2579 3113 1477 26
1685B6k277p24M46k88K925L029n45oj733l210k41k70P31L176J400O34k98k140
$$ 26 -2251 -2975 -2529 -2817 108 3137 2592 2586 853 -2357 -2598 -2868 -2137 1039 2439 3073 2775 635
1703F35l51j263k207J463J380n06J909P76j27k43k446j181o6p90K005K016R07
$$ 635 284 -979 -3186 -1723 -343 -849 1060 1836 1709 1466 -980 -2161 -2227 -3017 -1012 1004 1911
1720A911J958j210l113j36j155q07J419J231J808M42j439J44r26k371L68j10k5
$$ 1911 3869 2659 -454 -590 -1745 -2552 -1133 98 1906 2348 909 1053 127 -2244 -1876 -1986 -2011
1737b011K480N58N06J357j524j632j211j108J539P22M37L056k02k357m46j701
$$ -2011 469 1027 1533 2890 1366 -266 -1477 -2585 -1046 -324 113 3169 2967 610 164 -1537
1753a537o89O39m6J480J471m63M79p71j104O22j505p20K179L74M37J438k45n47
$$ -1537 -2226 -1587 -1633 -153 1318 855 1334 563 -541 81 -1424 -2144 35 409 846 2284 2039 1492
1771A492j655j883O14n4P0K411K46k61L73k065r78P69n73N71J071N98J298r98
$$ 1492 -163 -2046 -1432 -1486 -1416 995 1241 980 1353 -712 -1690 -921 -1494 -923 148 746 2044 1046
1789A046o43Q75j729j229J236m93P57J415n61M24o04j533j13n86K90J834m48O78
$$ 1046 403 1278 -451 -1680 -444 -937 -180 1235 674 1098 494 -1039 -1152 -1738 -1448 386 -62 616
1807F16J508j792m87M54r76L00J65R8J276n78k31R06j587m88M01j440R25J276
$$ 616 2124 332 -155 299 -677 -377 -212 -114 1162 584 353 1259 -328 -816 -415 -1855 -930 346
1825C46n74Q65J82o47n3r55K46J205q87O22J213j414L64J16j107M83m43l75P82
$$ 346 -228 637 819 172 119 -836 -590 615 -272 350 1563 149 513 629 -478 5 -438 -813 -31
1844c1l98K35P19j076N24M26j519P52Q25p54O94J43j80O89j099K23M19j176M93
$$ -31 -429 -194 525 -551 -27 399 -1120 -368 457 -297 397 540 360 1049 -50 173 592 -584 -91
1863i1L56j216Q46L56r90R42k51o03N16m80N35N32j121J232M99j227Q84N3j025
$$ -91 265 -951 -105 251 -739 203 -48 -651 -135 -615 -80 452 -669 563 1062 -165 719 772 -253
1882b53L49m28k42R59o14L07K93r26P40m21j471J456M01r43J232K70j34K60r36
$$ -253 96 -332 -574 385 -229 78 371 -555 185 -236 -1707 -251 150 -793 439 709 575 835 -101
1901a01K38K50j251Q25J72l44J295m89r10P01j162r01P25J70J025L89m98J156
$$ -101 137 387 -864 -39 133 -211 1084 595 -315 386 -776 -1677 -952 -782 243 632 134 1290
1919A290n95j709R31l02k20J128k54L30Q69r84k09n78q16M81o73j16K473k61o61
$$ 1290 695 -1014 -83 -385 -605 523 269 599 1468 484 275 -303 -1119 -638 -1311 -1427 1046 785 124
1938A24R07j080q76j8m28J434Q10l42J258n55r99J61j590j74J295n29N9J341K8
$$ 124 1031 -49 -925 -943 -1371 63 873 531 1789 1234 235 396 -1194 -1368 -73 -602 -543 798 826
1957H26J25r99j001N21r60k84K022N12L66J025j399n97l07j514N16R25M40J253
$$ 826 951 -48 -1049 -528 -1488 -1772 250 762 1128 2153 754 157 -150 -1664 -1148 -223 217 1470
1975A470q29j57O36k144q25J051n47M10J192K96J176l81j041k33j144k83R24k80
$$ 1470 641 484 1120 -1024 -1849 -798 -1345 -935 257 553 1729 1348 307 74 -1070 -1353 -429 -709
1993g09J717J569j495m51m41j564k14j08O92J726l26K14Q94j463l13k13j269R89
$$ -709 1008 2577 1082 631 190 -1374 -1588 -1696 -1004 722 396 610 1504 41 -272 -485 -1754 -765
2011g65Q82j34J639M78p74l25k016m43N06j025J614J794l71J84o32j417j82o65
$$ -765 117 -17 1622 2100 1326 1001 -1015 -1458 -952 -1977 -363 1431 1060 1244 612 -805 -987 -1652
2029a652q9J593L69J023P28j271K23k30k141L91M30l17J443N88L41J2j792p53
$$ -1652 -1741 -148 221 1244 1972 701 924 694 -1447 -1056 -626 -943 500 1088 1429 1441 -351 -1104
2047a104k49j131J341J354L17J482k51j603J20j033m75O45J9J188Q08p41O75l66
$$ -1104 -1353 -2484 -1143 211 528 2010 1759 156 276 -757 -1232 -587 -568 620 1428 687 1362 996
2065I96j957k5n33l90J411N97Q15J015j184n97p44j226J043M32R9K096o1j007
$$ 996 -961 -986 -1519 -1909 -498 99 914 1929 745 148 -596 -1822 -779 -347 -248 1848 1787 780
2083G80J23j022q69j16m58J188O50k43J246l28j288K80j210o34J325J87Q80J301
$$ 780 903 -119 -988 -1104 -1562 -374 276 33 1279 951 -337 -57 -1267 -1901 -576 -389 491 1792
2101A792k61j23j073j425N48m80j86K000M9j36L50j257k70l28q90P32O45K23J357
$$ 1792 1531 1408 335 -1090 -542 -1022 -1208 792 841 705 1055 -202 -472 -800 -1690 -958 -313 -90 1267
2120A267m53j92O60j620r27Q65l14O87Q23K8O87r38j409L59r08j13J259K9M46
$$ 1267 814 622 1282 -338 -1265 -400 -714 -27 796 824 1511 573 -836 -477 -1385 -1498 -239 -210 236
2139B36J099j292j06K69r92K61j43M27J429n91j3R51j422p90J23o93O50P63l96
$$ 236 1335 43 -63 206 -786 -525 -668 -241 1188 597 584 1535 113 -677 -554 -1247 -597 166 -230
2158b30R43r6o55o1r71K49J018q03O54J412q01l8j95n47K39p39j31J234n32K99
$$ -230 713 617 -38 -99 -1070 -821 197 -606 48 1460 659 621 426 -121 118 -621 -752 482 -50 249
2178B49N51j150J76k1j339Q90O63k84P53l8J48J21j265J93R00j053O92N61o41
$$ 249 800 -350 -174 -195 -1534 -644 19 -265 488 450 598 719 -546 -353 547 -506 186 747 106
2197A06M61l80j019P33l59k38N32m25Q84L01j238P39L25j301Q32K73j19O03l87
$$ 106 567 187 -832 -99 -458 -696 -164 -589 295 596 -642 97 422 -879 -47 226 107 710 323
2216C23m9N28j100J8J85p78J043J33j092J089k89p82M54j89L78N00n82P46M14
$$ 323 274 802 -298 -280 -95 -873 170 303 -789 300 11 -771 -317 -506 -128 372 -210 536 950
2235I50j266O16p2p80R56l14l22J021n65l59n5o58O29l40m61J586L2q62P94m05
$$ 950 -316 300 228 -552 404 90 -232 789 224 -135 -190 -848 -219 -559 -1020 566 598 -264 530 125
2255A25m91K37l43N12Q40o03N89k60q28M10p69o26J243m2m31R25k82j5k06q51
$$ 125 -366 -129 -472 40 880 277 866 606 -222 188 -581 -1207 36 -6 -437 488 206 191 -15 -866
2275h66N58q3m14J480l4n6P31q79p91K17r16L03Q54M3Q41m25p47M10j052p83J232
$$ -866 -308 -391 -805 675 641 585 1316 437 -354 -137 -1053 -750 104 147 988 563 -184 226 -826 -1609 -377
2296c77n1L12R73k54K93k27j038K68m84k67J106j95M01J211j349n77J03j211J33
$$ -377 -428 -116 857 603 896 669 -369 -101 -585 -852 254 59 460 1671 322 -255 -152 -1363 -1230
2315a230M17L51J273K7l79M87j210o68N38n02O99J160n03P60r2r20m16r09k25
$$ -1230 -813 -462 811 838 459 946 -264 -932 -394 -896 -197 963 460 1220 1128 208 -208 -1117 -1342
2334a342Q33m14R23J491p65j97l09j442P1m4K65J469N83J62M60j412n51o8j336
$$ -1342 -509 -923 0 1491 726 529 220 -1222 -1151 -1195 -930 539 1122 1284 1744 332 -219 -287 -1623
2353a623P20J104l08Q53L81o07q4j310o35O97o75R56J501J5O41k41j643j65l94
$$ -1623 -903 201 -107 746 1127 520 436 -874 -1509 -812 -1487 -531 970 985 1626 1385 -258 -423 -817
2372h17o51J050O86R94N53j341j36m05j836L89N15J75J367L88R5L84j115r88j59
$$ -817 -1468 -418 268 1262 1815 474 338 -67 -1903 -1514 -999 -824 543 931 1026 1410 295 -693 -852
2391h52p30Q90J032J17J610M0j737l28j094q30N91K74J259J277p86J44l73j445
$$ -852 -1582 -692 340 457 2067 2107 370 42 -1052 -1882 -1291 -1017 242 1519 733 877 504 -941
2409i41M3k66k48J619N10K87Q00n41o30q48j614N20M34NK010N71o10k28j495j057
$$ -941 -898 -1164 -1412 207 717 1004 1804 1263 633 -215 -1829 -1309 -875 -870 1140 1711 1101 873 -622 -1679
2429a679K15k01R40J525K64Q46o43j235R1r93j038J193N52P67Q91k99P4r92j778
$$ -1679 -1464 -1665 -725 800 1064 1910 1267 32 123 -870 -1908 -715 -163 604 1495 1196 1270 278 -1500
2448a500j06k16K76J701O44M17P56j375j321m3o33M06P59O15J446l36q88J99j298
$$ -1500 -1606 -1822 -1546 155 799 1216 1972 597 -724 -767 -1400 -994 -235 380 1826 1490 602 801 -497
2467d97j073L95m10R36J473M5M86r2j443n05j054m7J555L87P58J362q02r66o61
$$ -497 -1570 -1175 -1585 -649 824 869 1355 1263 -180 -685 -1739 -1786 -231 156 914 2276 1474 508 -153
2486a53j220P4K45K11J560K47RK25j345o50j79q97M58J562L17J039K61p49m72
$$ -153 -1373 -1299 -1054 -843 717 964 973 1198 -147 -797 -976 -1873 -1415 147 464 1503 1764 1015 543
2505E43j462o53Q23q3R20J431m12N1n81j525l32j46m3J161O15O05Q49j091l85
$$ 543 -919 -1572 -749 -832 88 1519 1107 1158 577 -948 -1280 -1426 -1469 -308 307 912 1761 670 285
2524B85k2j721J63P34L87J261M27l10q2j450p53j59m33J009J236j71P14Q4j219
$$ 285 263 -1458 -1295 -561 -174 1087 1514 1204 1122 -328 -1081 -1240 -1673 -664 572 401 1115 1199 -20
2543b0l72n18j76M85K53Q82J133p22J92l99j472r5k38k60J367O53J77K68q48n58
$$ -20 -392 -910 -1086 -601 -348 534 1667 945 1137 738 -734 -829 -1067 -1327 40 693 870 1138 290 -268
2563b68m86j023Q59Q93N9J067L94p68j42r77n04L03k72P27Q33j90O06l97j252
$$ -268 -754 -1777 -918 -25 34 1101 1495 727 585 -392 -896 -593 -865 -138 695 505 1111 714 -538
2582e38K16p24o42R78O98N54O43m92M9o15j117K14L13O0J042J77r5L73r98p80
$$ -538 -322 -1046 -1688 -710 -12 542 1185 693 742 127 -990 -776 -463 -403 639 816 721 1094 96 -684
2602f84J11m59L39L94Q6J163j10p63K44o37q73N81L5P95Q03k45J37l32j010m7
$$ -684 -573 -1032 -693 -299 -213 950 840 77 321 -316 -1189 -608 -573 222 1025 780 917 585 -425 -472
2622d72m21p1J156j69N8Q31o75m59p8o14M50l2J63J018K32l27L63q43n03K57n77
$$ -472 -893 -964 192 23 81 912 237 -222 -300 -914 -464 -496 -333 685 917 590 953 110 -393 -136 -713
2643g13K58R92j89K91j47n80L0q29j89R15p7J41Q20l60J24j35p30Q9J51k77O79
$$ -713 -455 537 348 639 492 -88 -58 -887 -1076 -161 -238 -97 723 363 487 352 -378 -289 -138 -415 264
2664B64l7K60M74r55l25K71p25r6P26j25O70q3k70L49o55k37L79l37N67O26o13
$$ 264 227 487 961 6 -319 -48 -773 -869 -143 -268 402 319 49 398 -257 -494 -115 -452 115 741 128
2685A28L15J27n67j19l44p7N21l48L41O63o37n1P0o07K59J94k12P88Q5l10K72
$$ 128 443 570 3 -116 -460 -537 -16 -364 -23 640 3 -48 22 -585 -326 -132 -344 444 529 219 491
2706D91n04rK21q32N48N17o78L07K20m71J56l15k41O32m75L35N73n60M25J43q14
$$ 491 -13 -22 199 -633 -85 432 -246 61 281 -190 -34 -349 -590 42 -433 -98 475 -85 340 483 -331
2727c31N16M4n14N14k1l1J91m89L7J80p80M46K66l50K60J41k27M28l27j71L63
$$ -331 185 229 -285 229 208 177 368 -121 -84 96 -684 -238 28 -322 -62 79 -148 280 -47 -218 145
2748A45k98L39L63p38O25j51o09M01K1m74L76j81P7K13m76J57L21n03N25q3l76
$$ 145 -153 186 549 -189 436 285 -324 77 98 -376 0 -181 -104 109 -367 -210 111 -392 133 50 -326
2769c26P81j70n06N53k01l5J30m54N38j3n76M38j66l52K61k90n6N92l85J91K75
$$ -326 455 285 -221 332 131 96 226 -228 310 297 -279 159 -7 -359 -98 -388 -444 148 -237 -46 229
2790B29l55K52l5k89N82k27k57P90o01j88J68k94M7R8k82L70n7l14N34m01n0O09
$$ 229 -126 126 91 -198 384 157 -100 690 89 -99 69 -225 -178 -80 -362 8 -49 -363 171 -230 -280 329
2812C29m89L8N48m09Q0K38l43L36l86k20O13l27k69N42m94R0L01o48K67K08l30
$$ 329 -160 -122 426 17 97 335 -8 328 -58 -278 335 8 -261 281 -213 -123 178 -470 -203 5 -325
2833c25K88N7N3L94n64q6P24n48j50M52l79L95k07k80K13q9m02L44k55J17N00
$$ -325 -37 20 73 467 -97 -183 541 -7 -157 295 -84 311 104 -176 37 -52 -454 -110 -365 -248 252
2854B52m67K28K93n07J61Q6j45K95r6m2M30m10j84M19n39J66J03m35L21J62l64
$$ 252 -215 13 306 -201 -40 46 -99 196 100 58 488 78 -106 313 -226 -60 43 -392 -71 91 -273
2875b73K51j45R0O8m16L32M55l86J60L03m54K97k37l93O28k60j91L99l54L3J52
$$ -273 -22 -167 -77 -9 -425 -93 362 -24 136 439 -15 282 45 -348 280 20 -171 228 -126 -93 59
2896E9o05M04K58n80M68J89l06L96l01J25K07m51K64J44k74J82n6n46N44r8m16
$$ 59 -546 -142 116 -464 4 193 -113 283 -18 107 314 -137 127 271 -3 179 123 -423 121 23 -393
2917c93L31j22n3J34k51M91P1m83M67J01l52K54j58L4K94k81j01K85m03K40n5
$$ -393 -62 -184 -237 -103 -354 137 208 -275 192 293 -59 195 37 71 365 84 -17 268 -135 105 50
2938E0n16O87k93m70O44j41k18L71j85K57N2m96L91J78l67K26Nk88M78l78l65
$$ 50 -466 221 -72 -542 102 -39 -257 114 -71 186 238 -258 133 311 -56 170 175 -113 365 -13 -378
2959c78M73l27kR0l5L36j89k62M14j19l04N92k67l4L44k90J34J52m07K11k22k84
$$ -378 95 -232 -234 -144 -179 157 -32 -294 120 1 -303 289 22 -12 332 42 176 328 -79 132 -90 -374
2981c74M46j60k62P01l94q5J28l93J42K14j93L99Q0k61M74l85k63M45o00J01O55
$$ -374 72 -88 -350 351 -43 -128 0 -393 -251 -37 -230 169 249 -12 462 77 -186 259 -341 -240 415
3002D15l58n5J99k76J24l56j53M50j48j17O06l38K50L1n19K06L3k18M77j35J41
$$ 415 57 2 201 -75 49 -307 -460 -10 -158 -275 331 -7 243 274 -245 -39 -6 -224 253 118 259
3023B59K06m10j27L56o74q1M90l58M01Q9j61K42l90k70M89l68L16M29l86M47R3
$$ 259 465 55 -72 284 -390 -471 19 -339 62 151 -10 232 -158 -428 61 -307 9 438 52 499 592
3044E92o34M6j70j87R3q2M53M17n47m9K38o57J46L7j28N77J88j26K79l12j02o4
$$ 592 -42 4 -166 -353 -260 -342 111 528 -19 -68 170 -487 -341 -304 -432 145 333 207 486 174 72 8
3066Hm49J94M37m67O33J38n04Q4l74k13L02k99K56N84p4J51r9m27K43j47n45O45
$$ 8 -441 -247 190 -277 356 494 -10 74 -300 -513 -211 -510 -254 330 256 407 308 -119 124 -23 -568 77
3088G7J27J53J68k64j0j27q34K12K20k41Q21j8J3J75m16m15R2j07P2M77M6M67
$$ 77 204 357 525 261 251 124 -710 -498 -278 -519 302 284 297 472 56 -359 -267 -374 -302 175 221 688
3110F88p7o45L46m16n74L30m0K29N19l01J66jn38l4k48L6O15O5L3P03l78n03J46
$$ 688 611 -34 312 -104 -678 -348 -388 -159 360 59 225 224 -314 -348 -596 -560 55 120 153 856 478 -25 121
3133A21n67L7J63O3M93J80m35K79n30l58K80l70J76P52o2K77Km19J91n91l03N35
$$ 121 -446 -409 -246 -183 310 490 55 334 -196 -554 -274 -644 -468 284 222 499 501 82 273 -318 -621 -86
3155h6jN0O44j62j08k60o41J38n7r6O24L1J73M00n23k81J72n20j38N17J70N83
$$ -86 -87 -37 607 445 337 77 -564 -426 -483 -579 45 76 249 649 126 -155 17 -503 -641 -124 46 629
3177F29j61k00J48n68l13J7j07L45N67l54L85K0n93j23j02j63M81RK40O93n18
$$ 629 468 268 416 -152 -465 -448 -555 -210 357 3 388 408 -185 -308 -410 -573 -92 -83 157 850 332
3198C32o3J13q33Q3L8j21O65J71r1J63n13l09Nm97M71N00j67M28K81l77Rm17l40
$$ 332 269 382 -451 -368 -330 -451 214 385 294 457 -56 -365 -360 -857 -386 114 -53 375 656 279 288 -129 -469
3221d69K83k07K88N28q5P2l4o56j86M2l24M65L14J64L27k74j38p1n54K32K46j14
$$ -469 -186 -393 -105 423 338 410 376 -280 -466 -424 -748 -283 31 195 522 248 110 39 -515 -283 -37 -151
3243a51N73J8j37J59l67n18J03k80L09L86j93M74rn05J53k73m35N58q8M48L86
$$ -151 422 440 303 462 95 -423 -320 -600 -291 95 -98 376 367 -138 15 -258 -693 -135 -223 225 611
3264F11k31jN5p34l5R7k98O99l0n5L53k20m18n6k95K31J62m2N88J77l77K30l41
$$ 611 380 379 434 -300 -335 -238 -536 163 133 78 431 211 -207 -263 -558 -327 -165 -207 381 558 181 411 70
3287G0l51O0o3J12P34k98N83j07r72J62m67k17N83J09m3N68k75R3j58m21J58K9
$$ 70 -281 -221 -284 -172 562 264 847 740 -232 -70 -537 -754 -171 -62 -105 463 188 281 123 -298 -140 -111
3309a11j43M68J84p78Q14l80l36J84k94oL48J13K61q0k92J71l69k37L58p7K02
$$ -111 -254 214 398 -380 434 54 -282 -98 -392 -398 -50 63 324 244 -48 123 -246 -483 -125 -202 0
3330@M51l92N76o52k26K60k31j53M34j10J53M51m74j22L4l77J8J59k7M67J56j39
$$ 0 451 59 635 -17 -243 17 -214 -367 67 -43 110 561 87 -35 -1 -378 -360 -201 -228 239 395 256
3352B56K45m18j46Q7l86K28L02r0J13J0j97J6k45k00L59k61J75M75k17O6P8m91
$$ 256 501 83 -63 24 -362 -134 168 78 191 201 4 20 -225 -425 -66 -327 -152 323 106 172 250 -241
3374b41O9J42k68M32Q0o6K32l58q5J01l57J26J65j88K35J95l36K72l02rP5p0J02
$$ -241 -172 -30 -298 134 214 148 380 22 -63 38 -319 -193 -28 -216 19 214 -122 150 -152 -161 -86 -156 -54
3397e4K32l00M58Nm70J67L1l45K40j47J81L17m18N3K39m58M3K09k15L76%j31K29
$$ -54 178 -122 336 341 -129 38 69 -276 -36 -183 -2 315 -103 -50 189 -269 -226 -17 -232 144 144 13 242
3420B42j97r6L9l28M13L3k25J81L4j85J08j54j23K43k46%M74k84J65o8j35L35
$$ 242 45 -51 -12 -340 73 106 -119 62 96 -89 19 -135 -258 -15 -261 -261 213 -71 94 26 -109 226
3442B26j05l54K98N1j47K31k53J65Q0m52J55J96l75L23J0k72L22j38r8K95k25
$$ 226 121 -233 65 116 -31 200 -53 112 192 -260 -105 91 -284 39 49 -223 99 -39 -137 158 -67
3463f7o6K86r9J34l7k59K70l8l38L01j45j34K92k97mK19k39J71Kj74M00k70n3
$$ -67 -133 153 54 188 151 -108 162 124 -214 87 -58 -192 100 -197 -201 18 -221 -50 -48 -222 178 -92 -145
3486a45M01j91j13K13j48lL7p5J45j00j55K36k76J37J33k98J03K60k90J25J62
$$ -145 256 65 -48 165 17 14 51 -24 121 21 -134 102 -174 -37 96 -202 -99 161 -129 -4 158
3507A58j43J17J6j33L03k95j56L80m02N1R6j02R4J02k50J17n7j38K99k10K09L66
$$ 158 15 132 148 15 318 23 -133 247 -155 -104 -8 -110 -16 86 -164 -47 -104 -242 57 -153 56 422
3529D22l72M5P7k72J20P3k63L22o6k61M02l20J5N6l03J64J52j96L29J9k20J48
$$ 422 50 95 172 -100 20 93 -170 152 86 -175 227 -93 -78 -22 -325 -161 -9 -205 124 143 -77 71
3551G1r3r0J37k20J79K33k02J34k4k17R5j23k36K88llJ95k97K00P6l68J90J29
$$ 71 -22 -112 25 -195 -16 217 15 149 125 -92 3 -120 -356 -68 -71 -74 121 -176 24 100 -268 -78 51
3574E1j98K21J10l1K03l41OJ09k70Q8L7j17K11K4k26J70j39k21K02r4J49K34j65
$$ 51 -147 74 184 153 356 15 21 130 -140 -52 -15 -132 79 103 -123 47 -92 -313 -111 -205 -56 178 13
3597A3Q9J30k30l7J10k86K97q9M5L16l04j40m4Mnl7o0L21J35k09J09n8j02J25
$$ 13 102 232 2 -35 75 -211 86 -3 42 358 54 -86 -130 -126 -131 -168 -228 93 228 19 128 70 -32 93
3621I3k62J43J34r6K21J22l75J35j78k64L31l4j46K77k7p3J49m19J9J56%J71L8
$$ 93 -169 -26 108 12 233 355 -20 115 -63 -327 4 -30 -176 101 74 1 150 -269 -250 -94 -94 77 115
3644A15q8K73k10J6Kl18K4J98n2J83l6j63K13k10k42K24rK5K83j84K37j08j81
$$ 115 27 300 90 106 108 -210 -186 12 -40 143 107 -56 157 -53 -295 -71 -80 -55 228 44 281 173 -8
3667hJ12j61j16J47o0K0L55k92k7J46k80K4o5Q0J23j6mL31j95j46J01p2k68j03
$$ -8 104 -57 -173 -26 -86 -66 289 -3 -30 116 -164 -140 -205 -125 -2 -18 -22 309 114 -32 69 -3 -271 -374
3691c74K03J08K37j78K2j26Q1j5k59J20K73j33j4J97l87K25n3k69L21N0J28J83
$$ -374 -171 -63 174 -4 18 -108 -27 -42 -301 -181 92 -41 -55 142 -245 -20 -73 -342 -21 29 157 340
3713C40j74l2o9l21J18L00k28K02j24j19J79k37l4K22k40J39J78l96M39L5k06
$$ 340 166 134 65 -256 -138 162 -66 136 12 -107 72 -165 -199 23 -217 -78 100 -296 143 178 -28
3734b8Q5o6j61J87j07J07Q8j52o2J26p4L2K6j94L12j94N9K06k42J17N8k50J10
$$ -28 57 -9 -170 17 -90 17 105 -47 -109 17 -57 -25 1 -193 119 -75 -16 190 -52 65 123 -127 -17
3757a7N1k14L99n9j73J24o0k47R6m1p9K50q8J09O4j86mR9PK58m4j38K90l40Ln
$$ -17 34 -180 219 160 -13 111 51 -196 -100 -141 -220 30 -58 51 115 -71 -75 24 31 289 245 107 397 57 60 55
3783E5j66J03J23k09J28p2o1J11j21n3J98j42J51l1n8J30j94jJ10J90k47M30l58
$$ 55 -111 -8 115 -94 34 -38 -99 12 -109 -162 36 -106 45 14 -44 86 -108 -109 1 191 -56 374 16
3806A6N8Jm27M32j3k07O9j0K7Q8P1j83K47k56N06N47m02l24j1r46P15J64p80O51
$$ 16 74 75 -352 80 67 -140 -71 -81 -54 34 105 -78 169 -87 419 966 564 240 229 -717 -2 162 -618 33
3830C3l34L47j36P5J55k73l02N50j0j04L03m95J73K60j86N7Lj10k3O4l2O0k7r4
$$ 33 -301 46 -90 -15 140 -133 -435 115 105 1 304 -191 -18 242 56 113 116 6 -17 47 15 75 48 -46
3854d6J92j76j35K08k76J19J98k35J70J63o9K2j06l7J65k14P5J03j54J67N4l04
$$ -46 146 -30 -165 43 -233 -114 84 -151 19 182 113 135 29 -8 157 -57 18 121 -33 134 188 -116
3876a16O1n0j16J80q8m5K02N6j46J74k57Q4N9j9J36J33k03P2q5m7M5p3J0J01n8
$$ -116 -55 -105 -221 -41 -129 -174 28 84 -62 112 -145 -61 -2 -21 115 248 45 117 32 -15 30 -43 -33 68 10
3901A0P8l0k74J30L2j44K16J4j68L84k00J25Kk01n2J7n5J83m0l0J27j00j55J39
$$ 10 88 58 -216 -86 -54 -198 18 32 -136 248 48 173 175 -26 -78 -61 -116 67 27 -3 124 24 -131 8
3925Hk76J72J66m19N25l1j92J32j60O9J02k00J04J71j89J64Pk82J29j29j40M05
$$ 8 -268 -96 70 -349 176 145 -47 85 -75 -6 96 -104 0 171 -18 146 153 -129 0 -129 -269 136
3947A36j11j02J83j21Q0q8j50J20N5QJ53m0m0R3j49j32J06l02J23K83k09K79j00
$$ 136 25 -77 106 -15 65 -23 -173 -53 2 10 163 123 83 176 27 -105 1 -301 -178 105 -104 175 75
3970G5k60K60l09M3Q2N8qL03k23M9J46l01L4J05j70J19l7O1K03j80j64mJ3p0Q1
$$ 75 -185 75 -234 -191 -109 -51 -59 244 21 70 216 -85 -51 54 -116 3 -34 27 230 50 -114 -118 -105 -175 -94
3995i4J18J7Q4m9J00j57j16J31r9J03J66k41K01O8l71J26k06qJ93j33P1L07j52
$$ -94 24 41 125 76 176 19 -97 34 -65 38 204 -37 164 232 -139 -13 -219 -227 -34 -167 -96 211 59
4018E9P7r8k14J75k1j02K50NkJ94k80j08J27k27q7K43K1O7L1j24O2k39MK26j11
$$ 59 136 38 -176 -1 -22 -124 126 131 129 323 43 -65 62 -165 -252 -9 12 79 110 -14 48 -191 -187 39 -72
4043g2l0K61j17J63Lk08J9j7o6NJ64n9J77j58j01k1j75Q9O2q7K40m0J20n1Ok37
$$ -72 -102 159 42 205 208 0 19 2 -64 -59 105 46 223 65 -36 -57 -232 -143 -81 -168 72 32 152 101 107 -130
4069a30J04N7j08J19o3K43j02r5p3m3q8pN1K9J53j14R3J50l24K05m1j00J81K9
$$ -130 -26 31 -77 42 -21 222 120 25 -48 -91 -179 -186 -135 -106 47 -67 26 176 -148 57 16 -84 97 126
4093A26n4M8J07k17m1j35J65J27l05J45M6l4j0k9n5J39j31L5J12N2L8p1j6k6N6
$$ 126 72 120 227 10 -31 -166 -1 126 -179 -34 12 -22 -32 -61 -116 23 -108 -73 39 91 129 58 42 16 72
4118G2k80K89o0J8K7j34lO8j95j8O2J03O5J13k7J08j51j15M8R1j28J51j24K41
$$ 72 -208 81 21 39 66 -68 -71 -3 -198 -216 -154 -51 14 127 100 208 57 -58 -10 81 -47 104 -20 221
4142B21j71j52J68o6n5J29j70pJ41K4Pq1k3J3o7L7J96n4J7J50l15J13Mj90J05
$$ 221 50 -102 66 0 -55 74 -96 -103 38 62 69 -12 -35 -22 -89 -52 144 90 107 257 -58 55 59 -131 -26
4167b6no0J04K9j34J69j05n7R9j23Q7J23j62R5Ol5J15r4j31K32k28J56K4j78J64
$$ -26 -31 -91 13 42 -92 77 -28 -85 14 -109 -22 101 -61 34 40 5 120 26 -105 127 -101 55 79 -99 65
4192F5m1j29J4J15q9J40M43Ln61j39L07j37r1K55j04K77l42o1K5J46k7r7k22j58
$$ 65 24 -105 -91 24 -65 75 518 521 -40 -179 128 -9 -100 155 51 328 -14 -75 -50 96 69 -28 -250 -408
4216d08M64L49k75o12K56L37n33N80m94O7K22O1J58j6l39J71Jl4K38l35P9K71
$$ -408 56 405 130 -482 -226 111 -422 158 -336 -269 -47 14 172 156 -183 -12 -11 -45 193 -142 -63 208
4238B08m47L35q6N6k40M25j91Q0l07J42K58k83L14k08m05L17N9j19M1n42L72R73
$$ 208 -239 96 10 66 -174 251 60 140 -167 -25 233 -50 264 56 -349 -32 27 -92 -51 -593 -221 752
4260G52q90m0m80R59p8M8q31Q19l44K22m9J43n56O89q2L56n23n42K20N9K38q3
$$ 752 -138 -178 -658 301 223 271 -560 259 -85 137 88 231 -325 364 282 638 115 -427 -207 -148 90 7
4282GK94r48Q45q16N02k34r5L86l13N40R6l37L69j9l97J56n21N05J01J98j65k11
$$ 7 301 -647 198 -618 -116 -350 -445 -59 -372 168 264 -73 296 277 -120 36 -485 20 121 319 154 -57
4304e7L00p32M59L5o3Q8o9J25l1j95J76r1O2J28j49J3J17k11J88q3j96R2K3l6
$$ -57 243 -489 -30 5 -58 30 -39 86 55 -140 36 -55 7 135 -14 -1 116 -95 93 10 -186 -94 -71 -107
4328a07K03j88J2J83j61p7J33r1J19L0mO9ok49J88j25m8J91r4P3J8j35R3j48k2
$$ -107 96 -92 -80 103 -58 -135 -2 -93 26 56 52 121 115 -134 54 -71 -119 72 -22 51 69 -66 27 -121 -143
4353a43M0J0j36M14o7j22M3l7N0k9j40J43n8L8N8j44Q6N4j29q8J1J8N1%J47K3
$$ -143 -103 -93 -229 185 118 -4 39 2 52 23 -117 26 -32 6 64 -80 6 60 -69 -157 -146 -128 -77 -77 70 93
4379I3R6k76J32q1N4K3k8J08M5k79R2J04k70J69J1j54L17k55m3K20j26j25J53
$$ 93 189 -87 45 -36 18 41 13 121 166 -113 -21 83 -187 -18 -7 -161 156 -99 -142 78 -48 -173 -20
4402b0j49J37n2P3L12k09j43pm5Q7m5o1J57O4l7L6m7j54J08j07L4K6J56p1L1J13
$$ -20 -169 -32 -84 -11 301 92 -51 -58 -103 -16 -61 -122 35 99 62 98 51 -103 5 -102 -68 -42 114 43 74 187
4428A87j55K9j14L0P9j9J44q7J4r4J4r7n2j6K20l3q2J34j48l8J86j72KJ35j79
$$ 187 32 61 -53 -23 56 37 181 94 108 14 28 -69 -121 -137 83 50 -32 102 -46 -84 102 -70 -68 67 -112
4453a12R6J97j34J82k40j17J32n0J7O0o4OK37m22K21K5p7Q9qj58K57J0k06J65
$$ -112 -16 181 47 229 -11 -128 4 -46 -29 31 -33 -27 210 -212 9 34 -43 46 38 -120 137 147 -59 106
4477A06j29r6J71k05K75k5j78R2o5k6P2j95K38np5P8R6o1k8Rj23K27k32J26P2
$$ 106 -23 -119 52 -153 122 97 -81 11 -54 -80 -8 -203 35 30 -45 33 129 68 40 49 -74 153 -79 47 119
4502A19%j20J34k66j1R6j17K27No2L7n2M8J5p4j8n4M6Q7P5j34J79k66m0J71j56
$$ 119 119 -1 133 -133 -144 -48 -165 62 67 5 42 -10 38 53 -21 -39 -93 -47 40 115 -19 160 -106 -146 25 -131
4528a31M6J23p0PP0j84J94p6j76J07J35q6J49m4j04J46k48Q2Rl8Q7Q8r2Q3j45
$$ -131 -85 38 -32 -25 45 -139 55 -21 -197 -90 45 -41 108 64 -40 106 -142 -60 -51 -89 -2 86 -6 77 -68
4553f8k4O6o9l4K20j02P4p2m5R6K8j07J07j00j04J62L9J34k7j57p9M3n1N8j8j16
$$ -68 -92 -26 -95 -129 91 -11 63 -9 -54 42 70 -37 70 -30 -134 28 67 201 174 17 -62 -19 -70 -12 -30 -146
4579a46J81j8j29K41j10j7O4j45J55J43j61O2r2j23K32k87J33O2j16j1J07j01
$$ -146 35 17 -112 129 19 2 66 -79 76 219 58 120 28 -95 137 -150 -17 45 -71 -82 25 -76
4601g6J37j42J14m8O3j4J06j21RPk05J72k7J6k2N0l1J85k17j08J25n5Q1p6%K06
$$ -76 61 -81 33 -15 48 34 140 19 28 35 -170 2 -25 -9 -31 19 -12 173 -44 -152 -27 -82 -1 -77 -77 129
4627A29j2L0q9k2j86L08j98j11K81j13m8M2j5j5Rj33J54n6J64k7r6K9j42J21k0
$$ 129 117 147 58 36 -150 158 -40 -151 130 17 -31 11 -4 -19 -10 -143 11 -45 119 92 -4 25 -117 4 -16
4652a6J50j78J36m9n6%m6K4O5j59J37J3j9J6K56l25J71l87M49k63J27j72L00j39
$$ -16 134 -44 92 43 -13 -13 -59 -35 30 -129 8 21 2 18 274 -51 120 -267 182 -81 46 -126 174 35
4676C5K44m1k32j4J28j04n0N0q9J66j42pn3N2j9P3J0Po5P2l6J11n6M1o3J00r6
$$ 35 279 238 6 -8 120 16 -34 16 -73 93 -49 -56 -109 -57 -76 -3 7 14 -51 21 -15 96 40 81 18 118 22
4703B2m5K35k28n0L5R0n9Q8rp0J5j3j47J42n8m98P59k16K96K8n16M14j82r8K2
$$ 22 -23 212 -16 -66 -31 59 0 88 79 9 24 11 -136 6 -52 -550 209 -7 289 317 -199 215 33 -65 -43
4728d3M8j29J98j67R1Qj05R8LL1ql1k8P3p8P1j2L2j2K4q2P7n1j27K04n0j30M3
$$ -43 5 -124 74 -93 -2 6 -99 -1 2 33 25 -6 -34 39 -39 32 20 52 40 64 -18 59 8 -119 85 35 -95 -52
4756e2n7J4k5J10J78J9n83L05M94j205Q85JJ17k36MM8n4r7J30k0j29J29%o2J64
$$ -52 -109 -95 -120 -10 168 187 -396 -91 403 -802 83 84 201 -35 -31 17 -37 -134 -4 -24 -153 -24 -24 -86 78
4781G8j08M0J2mk7M4p8J51r2n2R4m1j5Q2k36K06j50o5K46j68nL7j6J3J20n3J2
$$ 78 -30 10 22 18 -9 35 -43 108 16 -36 58 17 2 84 -152 54 -96 -161 85 -83 -88 -51 -67 -54 66 13 25
4808B5kQ7m7n2k25K49J8p1J05n2n1M9k02J18P8j57K9L7o1J09r9M9p4J6P3J02r5
$$ 25 23 110 63 11 -214 35 53 -18 87 35 -16 33 -169 -51 27 -130 -101 -64 -125 -16 -115 -66 -140 -124 -51 51 -44
4835d4J13J00k69J86p6j00J85j30N4N3j66K3J45j92J16q7oJ54N6j31J39j10m8
$$ -44 69 169 -100 86 10 -90 95 -35 19 72 -94 -71 74 -118 -2 -89 -95 59 115 -16 123 13 -35
4858c5J04p7jM0j16J83r2j70J96l1n8N3k4n3J19j33K14q7kn5N9n7O6l6p7J13j49
$$ -35 69 -8 -9 31 -85 98 6 -164 32 1 -57 -4 -28 -81 38 -95 119 32 30 -25 34 -23 43 7 -70 43 -106
4885a06J45m5l1M1N3k28J82O4j67N5L2P8p1m2J3J33j53J20r9m6J33j14j7J09l2
$$ -106 39 -6 -37 4 57 -171 11 75 -92 -37 -5 73 2 -40 -27 106 -47 73 -26 -72 61 -53 -70 39 7
4910Gk5P0q4J8j29J29k4P1j63R6Q8m5N5K1K8n8m1m4QP9n6n3J8J27j23r0K08p7
$$ 7 -18 52 -32 -14 -143 -14 -38 33 -130 -34 54 9 64 85 113 55 14 -30 -22 57 1 -52 -34 93 -30 -120 88 11
4938A1m1p2J39J1l9n0O8l5M8L2n4j2kK0r0N4n2R6p1n0J23k6k5Q5m9k5L6K4q7k
$$ 11 -30 -102 37 48 9 -41 27 -8 40 72 18 6 4 24 -66 -12 -64 32 -39 -89 34 8 -17 68 19 -6 30 54 -33 -35
4968c5l8RJ55oj12L8j17O4l7j5%M8M8K1M7r3j07J8R5l4N4J25j29M9l8rMN7m6j03
$$ -35 -73 -64 91 85 -27 11 -106 -42 -79 -94 -94 -46 2 23 70 -23 -130 -112 -17 -51 3 128 -1 48 10 1 5 62 16 -87
4998h7J16n6Q4k4m0M0o8n7R4m0M6l0m7J74l0j79K41j93R6pqL2n7Q3J0q5p4or6
$$ -87 29 -27 57 33 -7 33 -35 -92 2 -38 8 -22 -69 105 75 -104 137 -56 40 33 25 57 0 83 93 8 -66 -72 -168
5027a68P4J25K8j56O1J0O2n9P3o1Jm5J64l1j09J0j79J31O7J2L1m9k7K7oM6m1l8
$$ -168 -94 31 59 -97 -36 -26 36 -23 50 -11 -10 -55 109 78 -31 -21 -200 -69 -2 10 41 -8 -35 -8 -14 32 -9 -47
5055d7L6R3q0mM0jQ1j61n9K3O3l1M6j05J08J9j7R1p8N8K1m9j01J46k6q8rJ32j14
$$ -47 -11 82 2 -2 38 37 118 -43 -102 -79 -16 -47 -1 -106 2 21 4 95 17 75 96 47 -54 92 66 -22 -31 101 -13
5084a3J6j11O4J13j53Q1rl7RN9m1N1r6L9k3L3N1R5k19Q5Lq6Q0p5k7P4qM2n7R1
$$ -13 3 -108 -44 69 -84 -3 -12 -49 -40 19 -22 29 -67 -28 -51 -18 33 128 -91 -6 -3 -89 -9 -84 -111 -37 -45 -3 -60 31
5114C1m6l2%O6K3k7j2P8j37J01l1N5qn5l0R0m8Q9j29o4J35j77NJ71q9n1K34j53
$$ 31 -15 -47 -47 19 42 15 3 81 -56 45 14 69 61 6 -24 66 18 107 -22 -86 49 -128 -123 48 -41 -92 142 -11
5142a1Q2r6MJ66j84MP0O9n9M3j23K4j07k3J24L1q4KP5p9J31r8K7M7q3%N3l2P4
$$ -11 71 -25 -21 145 -39 -35 35 104 45 88 -35 -11 -118 -141 -17 14 -70 -68 7 -72 59 -39 -12 35 -48 -48 5 -27 47
5171D7Np2J3l6L3R5j56N5P1q3J1j42pK08n4L7J08j66J5J02j48k8Q7J12n2k9o1
$$ 47 52 -20 -7 -43 -10 85 -71 -16 55 -28 -17 -159 -166 42 -12 25 133 -33 -18 84 -64 -92 -5 107 55 26 -35
5198c5R2q2j57J25l8J32j33j07L04q5m4J3m1K8m0J6O3R3p4J9k8j29R9k2r7J67
$$ -35 57 -25 -182 -57 -95 37 -96 -203 101 16 -28 -15 -56 -28 -68 -52 11 104 30 49 21 -108 -9 -31 -128 39
5224C9j05j9N1l0nJ5M5P0l8j9L5m6o9J07K6j19J24r5k6L1j1N5O8k17J6Q4qP4P
$$ 39 -66 -85 -34 -64 -69 -54 -9 61 23 4 39 -7 -76 31 57 -62 62 -33 -59 -28 -39 16 84 -133 -117 -33 -41 33 40
5253D0ql8N8M6Q2k01kM2qJ05j36J8J54j39r2J50j80M2j8KJ64j37K7J22j10j2K1
$$ 40 32 -6 52 98 180 -21 -23 19 11 116 -20 -2 152 13 -79 71 -109 -67 -85 -83 81 -56 -29 93 -17 -29 -8
5280hO0j01J53k36J48O5j20nQ3j08N1pL7L0l6QM2r3P9l1n4L3R1o2M7k6r6J62j90
$$ -8 52 -49 104 -132 16 81 -39 -44 39 -69 -18 -25 12 42 6 14 56 -37 42 11 -43 -10 81 19 66 40 -56 106 -84
5309h4J61pl5K1p2k2O6j20k2J38o0M0j6m4J11n0p4N7K0j8jl3q2K94j31ol4k9n9
$$ -84 77 70 35 56 -16 -38 28 -92 -114 24 -36 4 -12 -56 55 5 -69 -12 8 -10 -11 -44 -126 168 37 31 -3 -32 -91
5338i1K3M1J47p4oN6j36L1O9m8j03R9m6N3J55l22P6J61k62J79n5R0j32lQ2N6j9
$$ -91 -68 -27 120 46 40 96 -40 -9 60 12 -91 8 -38 15 170 -152 -76 85 -177 2 -53 37 -95 -98 -16 40 21
5365B1N9l1m1n3M2NP9k9lJ11k23K9op5J01J0j13J98j70K2O6k1oJ49k76K01m4J4
$$ 21 80 49 8 -45 -3 2 81 52 49 160 -63 -34 -40 -115 -14 -4 -117 81 -89 -67 -1 -22 -28 121 -155 46 2 16
5393A6J18o1k08J64P9k04J63j04RR8j62J47j39KK7M1j24K56q6j09J80p2o1O4m
$$ 16 134 73 -135 29 108 -96 67 -37 -28 70 -92 55 -84 -82 -55 -14 -138 118 32 -77 103 31 -30 34 30
5418C0PJ35k38J61Rl25K93r8N8M4j97J48k3n9Q9n8M2L3Q0q7m9l1J23r0L3mMj16
$$ 30 37 172 -66 95 104 -221 72 -26 32 76 -121 27 4 -55 34 -24 18 51 131 44 -5 -36 87 -3 30 26 30 -86
5446h6J9K5j7L6k5p3J81j58J12J22k99R2P3j01J82N0q5J32j95K6J16j03j01J13
$$ -86 -67 -42 -59 -23 -48 -121 60 -98 14 136 -163 -71 2 -99 83 133 48 180 -15 11 127 24 -77 36
5470C6r0R4L8j90J79k0q3J50k21J14J09j03q1P3L2j4q3Q1J24j29n0N1j09pJ77
$$ 36 -54 40 78 -112 67 47 -36 114 -107 7 116 13 -68 5 37 23 -60 21 145 16 -34 17 -92 -99 78
5495G8k45Q4R2n1K7k3Q5K9j16N9q5J46j58Q7qm7O6j57K01o3j50K33q7J09J1N6
$$ 78 -167 -83 9 -42 -15 -38 47 76 -40 19 -66 80 -78 9 1 -46 20 -137 64 1 -149 84 -3 106 117 173
5521A73m64l2R7O12l64o7K51M43n15M1k07Q3K14p7k0L05p34L97jk19lN66n69O1
$$ 173 -291 -323 -226 386 22 -45 206 649 134 175 -32 51 265 188 168 473 -261 136 135 -84 -87 479 -90 -29
5545b9j78L01k06J86j61N5n0K68o0m96N14k37K48Ql84K63M1j56J6J95o86P47l76
$$ -29 -207 94 -112 74 -87 -32 -82 186 126 -370 144 -93 155 163 -221 42 83 -73 -57 138 -548 199 -177
5568a77K05m8O6K77J7m22O6m38O73J02m23J03J85j23o0o13J686m7o77K63k34Q0
$$ -177 28 -20 46 323 340 -82 -16 -454 219 321 -102 1 186 63 3 -610 1076 1029 352 615 381 461
5590D61n94M29n22J13L90l10J28J15j78O4j09r4J9k4JK06j69J9N0j10O7K31k46
$$ 461 -133 296 -226 -113 277 -33 95 210 32 96 -13 -107 -88 -112 -111 95 -74 -55 -5 -115 -48 183 -63
5613f3J34P4r0J29j92o4J90r7j27P7Q5j81J87r4r7J70k00K30nj81K73r5j23J46
$$ -63 71 145 55 184 -8 -72 118 21 -106 -29 56 -125 62 -32 -129 41 -159 71 66 -115 158 63 -60 86
5637H6m3M7k7j05j7J30l0n0P0q8J07q4j05J00r6R8N8j19J68k2j02N0m0j05K42
$$ 86 43 90 63 -42 -59 71 41 -9 61 -27 80 -4 -109 -9 -105 -7 51 -68 100 78 -24 26 -14 -119 123
5662A23q5p7N6m0P1Q8k66J54p0p0Q2k4N2p7j5R5m7l6J11j1O6j10J15M1j25k7r9
$$ 123 38 -39 17 -23 48 136 -130 24 -46 -116 -34 -58 -6 -83 -98 -3 -50 -86 25 14 80 -30 85 126 1 -26 -125
5689a25J06l3l6L7J55q0L3j51R5j4L9j7p7K6R9K4j54N3o6K44k24j00P2J03J2M3
$$ -125 -19 -52 -88 -51 104 24 57 -94 1 -13 26 9 -68 -42 57 81 -73 -20 -86 158 -66 -166 -94 9 21 64
5715F4p3Kl3l4O0oJ3P4j3p2J28p7O6pj24K4J45j40Q8l0r4o8K5O5J30j27n2J60
$$ 64 -9 -7 -40 -74 -14 -20 -7 67 54 -18 110 33 99 92 -32 -8 137 -3 85 55 -39 -107 -82 -17 113 -14 -66 94
5743I4m0K5k08K24j86J27r1J82j38J11qjj21k33M15j97j50j00M94o29L30J74j29
$$ 94 54 79 -129 95 -91 36 -55 127 -11 100 92 91 -30 -263 152 -45 -195 -295 199 -430 -100 74 -55
5766e5N9j50l72O77k96L05m04l78Q69m67K13j65K65j33J05N7k36j4J56m7Q8J56
$$ -55 4 -146 -518 159 -137 168 -236 -614 255 -212 1 -164 101 -32 73 130 -106 -120 36 -11 77 233
$$ [...]
8191H2
##END NTUPLES=NMR FID
##END=
