##TITLE=1H_DE-80H_X3
 200.13MHz, d2o
 8 sc
 
 19ns.26.2.2025
##JCAMPDX= 6.0         $$ Bruker NMR JCAMP-DX V2.0
##DATA TYPE= NMR FID
##DATA CLASS= NTUPLES
##ORIGIN= UXNMR, Bruker Analytische Messtechnik GmbH
##OWNER= pz
$$ XWIN-NMR		Version 3.5
$$ Thu Dec 18 10:40:24 2025 Russian Standard Time (UT+4h)  Yarkov@DPX200
##.OBSERVE FREQUENCY= 200.1313
##.OBSERVE NUCLEUS= ^1H
##.DELAY= (6, 6)
##.ACQUISITION MODE= SIMULTANEOUS
##.ACQUISITION SCHEME= undefined
##.AVERAGES= 8
##.DIGITISER RES= 18
##SPECTROMETER/DATA SYSTEM= spect
##.PULSE SEQUENCE= zg30
##.SOLVENT NAME= CDCl3
##.SHIFT REFERENCE= (INTERNAL, CDCl3, 0, 14.3821)
##AUDIT TRAIL= $$ (NUMBER, WHEN, WHO, WHERE, WHAT)
$$ ##TITLE= Audit trail, XWIN-NMR		Version 3.5
$$ ##JCAMPDX= 5.01
$$ ##ORIGIN= Bruker BioSpin GmbH
$$ ##OWNER= Yarkov
$$ C:/Bruker/XWIN-NMR/data/yarkov2/nmr/H-C/1/audita.txt
$$ ##AUDIT TRAIL=  $$ (NUMBER, WHEN, WHO, WHERE, WHAT)
(   1,<2025-12-18 10:38:58.65 +0400>,<Yarkov>,<DPX200>,
      <created by zg, POWCHK disabled, PULCHK disabled
       configuration hash MD5:
       00 E9 B6 7A A2 85 ED C7 34 08 36 98 17 FE 4E 26
       data hash MD5: 16K
       41 84 2B B8 13 76 B1 C0 FC B4 E6 7F D9 6E CB A8>)
$$ ##END=
$$ 
$$ hash MD5
$$ F7 D3 29 20 3D 39 28 7C FE 62 AC BC 5B 72 D2 A0
##$RELAX= 
##$RELAX= 
##$RELAX= 
##$RELAX= 
##$RELAX= 
##$RELAX= 
$$ Bruker specific parameters
$$ --------------------------
##$DU= <C:/Bruker/XWIN-NMR>
##$EXPNO= 1
##$NAME= <H-C>
##$PROCNO= 1
##$TYPE= <nmr>
##$USER= <yarkov2>
##$AMP= (0..31)
100 100 100 100 100 100 100 100 100 100 100 100 100 100 100 100 100 100 
100 100 100 100 100 100 100 100 100 100 100 100 100 100 
##$AQSEQ= 0
##$AQ_mod= 1
##$AUNM= <au_zg>
##$AUTOPOS= <>
##$BF1= 200.13
##$BF2= 200.13
##$BF3= 200.13
##$BF4= 200.13
##$BF5= 200.13
##$BF6= 200.13
##$BF7= 200.13
##$BF8= 200.13
##$BYTORDA= 1
##$CFDGTYP= 0
##$CFRGTYP= 5
##$CHEMSTR= <none>
##$CNST= (0..31)
1 1 145 1 1 1 1 1 1 1 1 1 1 1 1 1 1 1 1 1 1 1 1 1 1 1 1 1 1 1 1 1 
##$CPDPRG= <>
##$CPDPRG1= <>
##$CPDPRG2= <>
##$CPDPRG3= <>
##$CPDPRG4= <mlev>
##$CPDPRG5= <mlev>
##$CPDPRG6= <mlev>
##$CPDPRG7= <mlev>
##$CPDPRG8= <mlev>
##$CPDPRGB= <>
##$CPDPRGT= <>
##$D= (0..31)
0 0.7 0 0 0 0 0 0 0 0 0 0.03 0 0 0 0 0 0 0 0 0 0 0 0 0 0 0 0 0 0 0 0 
##$DATE= 1766039938
##$DBL= (0..7)
120 120 120 120 120 120 120 120 
##$DBP= (0..7)
150 150 150 150 150 150 150 150 
##$DBP07= 0
##$DBPNAM0= <>
##$DBPNAM1= <>
##$DBPNAM2= <>
##$DBPNAM3= <>
##$DBPNAM4= <>
##$DBPNAM5= <>
##$DBPNAM6= <>
##$DBPNAM7= <>
##$DBPOAL= (0..7)
0.5 0.5 0.5 0.5 0.5 0.5 0.5 0.5 
##$DBPOFFS= (0..7)
0 0 0 0 0 0 0 0 
##$DE= 6
##$DECBNUC= <off>
##$DECIM= 32
##$DECNUC= <off>
##$DECSTAT= 4
##$DIGMOD= 1
##$DIGTYP= 9
##$DL= (0..7)
0 120 120 120 120 120 120 120 
##$DP= (0..7)
150 150 150 150 150 150 150 150 
##$DP07= 0
##$DPNAME0= <>
##$DPNAME1= <>
##$DPNAME2= <>
##$DPNAME3= <>
##$DPNAME4= <>
##$DPNAME5= <>
##$DPNAME6= <>
##$DPNAME7= <>
##$DPOAL= (0..7)
0.5 0.5 0.5 0.5 0.5 0.5 0.5 0.5 
##$DPOFFS= (0..7)
0 0 0 0 0 0 0 0 
##$DQDMODE= 0
##$DR= 18
##$DS= 0
$$ [...]
##$SUBNAM2= <"">
##$SUBNAM3= <"">
##$SUBNAM4= <"">
##$SUBNAM5= <"">
##$SUBNAM6= <"">
##$SUBNAM7= <"">
##$SUBNAM8= <"">
##$SUBNAM9= <"">
##$SW= 18.0517328524113
##$SWIBOX= (0..15)
0 0 2 0 0 0 0 0 0 0 0 0 0 0 0 0 
##$SW_h= 3612.71676300578
##$TD= 16384
##$TD0= 1
##$TE= 0
##$TE2= 300
##$TE3= 300
##$TEG= 300
##$TL= (0..7)
0 120 120 120 120 120 120 120 
##$TP= (0..7)
150 150 150 150 150 150 150 150 
##$TP07= 0
##$TPNAME0= <>
##$TPNAME1= <>
##$TPNAME2= <>
##$TPNAME3= <>
##$TPNAME4= <>
##$TPNAME5= <>
##$TPNAME6= <>
##$TPNAME7= <>
##$TPOAL= (0..7)
0.5 0.5 0.5 0.5 0.5 0.5 0.5 0.5 
##$TPOFFS= (0..7)
0 0 0 0 0 0 0 0 
##$TUNHIN= 0
##$TUNHOUT= 0
##$TUNXOUT= 0
##$USERA1= <user>
##$USERA2= <user>
##$USERA3= <user>
##$USERA4= <user>
##$USERA5= <user>
##$V9= 5
##$VALIST= <valist>
##$VCLIST= <CCCCCCCCCCCCCCC>
##$VD= 0
##$VDLIST= <DDDDDDDDDDDDDDD>
##$VPLIST= <PPPPPPPPPPPPPPP>
##$VTLIST= <TTTTTTTTTTTTTTT>
##$WBST= 1024
##$WBSW= 4
##$XGAIN= (0..3)
0 0 0 0 
##$XL= 0
##$YL= 0
##$YMAX_a= 72977
##$YMIN_a= -51346
##$ZGOPTNS= <>
##$ZL1= 120
##$ZL2= 120
##$ZL3= 120
##$ZL4= 120
##$ABSF1= 10
##$ABSF2= 0
##$ABSG= 5
##$ABSL= 3
##$ALPHA= 0
##$AQORDER= 0
##$ASSFAC= 0
##$ASSFACI= 0
##$ASSFACX= 0
##$ASSWID= 0
##$AUNMP= <proc_1d>
##$AZFE= 0.1
##$AZFW= 0.1
##$BCFW= 1
##$BC_mod= 2
##$BYTORDP= 1
##$COROFFS= 0
##$CY= 83.5205535888672
##$DATMOD= 1
##$DC= 2
##$DFILT= <>
##$DTYPP= 0
##$F1P= 10.8118882576601
##$F2P= -7.23987719738617
##$FCOR= 0.5
##$FTSIZE= 0
##$FT_mod= 4
##$GAMMA= 1
##$GB= 0.15
##$INTBC= 1
##$INTSCL= 1
##$ISEN= 128
##$LB= 0.25
##$LEV0= 0
##$LPBIN= 0
##$MAXI= 10000
##$MC2= 0
##$MEAN= 0
##$ME_mod= 0
##$MI= 1.114404
##$NCOEF= 0
##$NC_proc= 0
##$NLEV= 6
##$NOISF1= 3.799351
##$NOISF2= 2.8
##$NSP= 1
##$NTH_PI= 0
##$NZP= 0
##$OFFSET= 14.38212
##$PC= 1
##$PHC0= -5305.955
##$PHC1= 10.82193
##$PH_mod= 1
##$PKNL= yes
##$PPARMOD= 0
##$PSCAL= 0
##$PSIGN= 0
##$REVERSE= no
##$SF= 200.129724274929
##$SI= 16384
##$SIGF1= 3
##$SIGF2= 2
##$SINO= 400
##$SIOLD= 16384
##$SREGLST= <1H.CDCl3>
##$SSB= 0
##$STSI= 0
##$STSR= 0
##$SW_p= 3205.1282051282
##$SYMM= 0
##$S_DEV= 0
##$TDeff= 0
##$TDoff= 0
##$TI= <>
##$TILT= no
##$TM1= 0
##$TM2= 0
##$TOPLEV= 0
##$USERP1= <user>
##$USERP2= <user>
##$USERP3= <user>
##$USERP4= <user>
##$USERP5= <user>
##$WDW= 1
##$XDIM= 8192
##$YMAX_p= 0
##$YMIN_p= 0
$$ End of Bruker specific parameters
$$ ---------------------------------
##NTUPLES= NMR FID
##VAR_NAME=  TIME,          FID/REAL,        FID/IMAG
##SYMBOL=    X,             R,               I
##VAR_TYPE=  INDEPENDENT,   DEPENDENT,       DEPENDENT
##VAR_FORM=  AFFN,          ASDF,            ASDF
##VAR_DIM=   8192,          8192,            8192
##UNITS=     SECONDS,       ARBITRARY UNITS, ARBITRARY UNITS
##FACTOR=    0.0002768,     1,               1
##FIRST=     0,             0,               0
##LAST=      2.2672688,     0,               0
##MIN=       0,             -51346,          0
##MAX=       2.2672688,     72977,           0
$$ Real data points
##PAGE= N=1
##DATA TABLE= (X++(R..R)), XYDATA
0@%%%%%%%%%%%%%%%%%%%%%%Lj1J6j6J6j6J6j7K4l1L2l6M3m7N3o1O8p5Q4r4J04
$$ 0 0 0 0 0 0 0 0 0 0 0 0 0 0 0 0 0 0 0 0 0 0 0 3 -8 8 -8 8 -8 8 -9 15 -16 16 -20 23 -24 29 -32 36 -39 45 -49 55
43E5j16J29j43J58j74J90k10K34k57K82l11L42l77M18m64N15n75O46p27Q25r47
$$ 55 -61 68 -75 83 -91 99 -111 123 -134 148 -163 179 -198 220 -244 271 -304 342 -385 440 -507
64e07J102j306J582j979K575n529N4334r110k5677M1041j6043o0986l034K9603
$$ -507 595 -711 871 -1108 1467 -4062 50272 41162 15485 56526 40483 -20503 -23537 6066
78F066k6697k1009M0460J1049l6339K8097L9726l5089j7965L2696j1042l2769
$$ 6066 -20631 -41640 -1180 9869 -26470 1627 41353 6264 -11701 20995 9953 -22816
90b2816J6419K3942k3672j5318K9603J353k9841J9138K1498k5960KK3742j7424
$$ -22816 -6397 17545 -6127 -21445 8158 9511 -20330 -1192 20306 -5654 -5652 18090 666
103F66j7207J9373N357k3729L150L0648q238k3975K2678J0011l0626M339J9939
$$ 666 -16541 2832 8189 -15540 -12390 18258 10020 -13955 8723 18734 -11892 -7553 12386
116A2386j8887r027K0183Q30j6796P930J9684j4430j5981K2610J409k6548J2360
$$ 12386 -6501 -15528 4655 5485 -11311 -3381 16303 1873 -14108 8502 9911 -16637 -4277
129d277J8082j8157m345J8408O88j3167J571R821j0221j0623J3018j459j3444
$$ -4277 13805 -4352 -8697 9711 10399 -2768 -1197 8624 -1597 -12220 798 -661 -14105
142a4105J5289R559j4999K691J2103n952j0514K075P289o163n237J2337K07q792
$$ -14105 1184 10743 -4256 -1565 10538 4586 -5928 -3853 3436 -2727 -7964 4373 4580 -4212
156d212J1078K459j2690K753L624q007l238M487M353l911p01J1185k454q715R546
$$ -4212 6866 9325 -3365 -612 3012 -4995 -8233 -3746 607 -3304 -4005 7180 4726 -3989 5557
171E557J351j0468J166J261k960J639J970L128K45m00N408n560q408O945q00q620
$$ 5557 6908 -3560 -2394 -1133 -4093 -2454 -484 2644 2889 2489 7897 2337 -6071 874 74 -8546
187h546L242L373Q40J922o80M002J162m143K424k185n098M639j866l929N637L66
$$ -8546 -5304 -1931 -1091 831 151 4153 5315 1172 3596 1411 -3687 952 -914 -4843 794 1160
203A160j524K405o22J239k552m309M514j509n662N313J531j193M340q62k80K486
$$ 1160 -364 2041 1419 2658 106 -4203 311 -1198 -6860 -1547 -16 -1209 3131 2269 1989 4475
219D475k489n89k871k476N657k455n170P611J837m141J975k67m95j096l441K225
$$ 4475 1986 1397 -1474 -3950 1707 -748 -5918 1693 3530 -611 1364 1097 602 -494 -3935 -1710
235a710m92k610O323%k503P127o78m837K509j350l319k236q54N011j582l147P896
$$ -1710 -2202 -4812 1511 1511 -992 6135 5457 620 3129 1779 -1540 -3776 -4630 381 -1201 -4348 3548
252C548P58n035K840k049k736K314l090p40L011J173L254j301j090O284l208o173
$$ 3548 4306 -729 2111 62 -2674 -360 -3450 -4190 -1179 -6 3248 1947 857 7141 3933 -2240
268b240L584k089l589K023j385J584K817j037K866m22j926K600m304k583N110
$$ -2240 1344 -745 -4334 -2311 -3696 -2112 705 -332 2534 2112 186 2786 -1518 -4101 1009
283A009l526j620O178K45n9R51r63J914k921l919K379l132q29M503l853M06P344
$$ 1009 -2517 -4137 2041 2286 2227 3178 2215 4129 1208 -2711 -332 -3464 -4293 210 -3643 -3237 4107
300D107k114k126J779L63K21m606j530N188k931j224O250j315j51L480l900j543
$$ 4107 1993 -133 1646 2009 2230 -2376 -3906 1282 -1649 -2873 3377 2062 1911 5391 1491 -52
316e2N9l328r2j186J037M851k889R66O709l892k719K540k162n96q17k011L946
$$ -52 7 -3321 -3413 -4599 -3562 1289 -1600 -634 6075 2183 -536 2004 -158 -754 -1571 -3582 364
333C64Q20o81K688j659R52K069o822j039L263l895p17K012O66L512O7K46L060
$$ 364 1184 503 3191 1532 2484 4553 -2269 -3308 -45 -3940 -4657 -2645 -1979 1533 1600 1846 4906
350D906l035o80J222n694R73L113m486K128M595r36k29o66R99J24o986J88M679
$$ 4906 1871 1191 2413 -3281 -2308 805 -3681 -1553 3042 2106 1877 1211 2210 2334 -4652 -4464 215
367B15m433K2M190q74L373J832k473J322l73j387j383n190K855M150n405J799
$$ 215 -4218 -4196 -6 -880 2493 4325 1852 3174 2801 1414 31 -5159 -2304 1846 -3559 -1760
383a760N443j859k67p4j915N93l329j097K781j874K377L403k105L620J816n301
$$ -1760 3683 1824 1557 1483 -432 161 -3168 -4265 -1484 -3358 -981 2422 317 3937 5753 452
399D52R62J179l752j348j119J951K405l379K059L845k642J326m95m356K497J61
$$ 452 1414 2593 -1159 -2507 -3626 -1675 730 -2649 -590 3255 613 1939 1444 -2912 -415 -254
415b54m163J511K183K521J347k458L794J379o464K82M86m385J588O54o46L409
$$ -254 -4417 -2906 -723 1798 3145 687 4481 5860 -604 -322 164 -4221 -2633 -1979 -2625 784
431G84o5Q7J741k055R93j336m657M074R03m794L574L620k15Q61j834Q66R78m909
$$ 784 719 806 2547 492 1485 149 -4508 -434 469 -4325 -751 2869 2654 3515 1681 2547 3525 -1384
449a384q49j54k379L556J93k710N495J939k761P35q73j52q87l472K588J254k724
$$ -1384 -2233 -2387 -4766 -1210 -1017 -3727 1768 3707 946 1681 808 656 -231 -3703 -1115 139 -2585
466b585M324J576k712K760o97k711R72k381j555%j005L438k25k578O301J937m521
$$ -2585 1739 3315 603 3363 2666 -45 927 -1454 -3009 -3009 -4014 -576 -801 -3379 2922 4859 338
483C38J199k4j657j22k775Q66K709o40K809l66k527M069j816n503J842Q3j694
$$ 338 1537 1513 -144 -266 -3041 -2175 534 -106 2703 2337 -190 3879 2063 -3440 -1598 -1515 -3209
500c209R42m89K843J673k046L515L63l957K097j185k741K149j469q74L727K52
$$ -3209 -2267 -2756 87 1760 -286 3229 3592 -365 1732 547 -2194 -45 -1514 -2388 1339 1591
516A591j8o53r04L169l238n122M055M1l032L066N72L48L467k04p32j040r11K068
$$ 1591 1573 920 16 3185 -53 -5175 -1120 -1079 -4111 -1045 -473 -125 3342 3138 2406 1366 455 2523
534B523m449l238O327m55l895M445J531k243k07l18O37k748k520M583q67k536
$$ 2523 -1926 -5164 1163 708 -3187 1258 2789 546 339 21 658 -2090 -4610 -27 -894 -3430
550c430N545o8k176M174p89l231J62K63K71l609j612O315q47l912M491O37k239
$$ -3430 2115 2047 -129 4045 3256 25 187 450 721 -2888 -4500 1815 968 -2944 1547 2184 -55
567e5J484k445j497J650j165M70J63J214M320k152j377M411l604l604L169j853
$$ -55 1429 -1016 -2513 -863 -2028 -1558 -1395 -181 4139 1987 610 5021 1417 -2187 982 -871
583h71k216J311K40J194PPK788k218m84L387n223k149N637j487k884K909K656
$$ -871 -3087 -1776 -1536 -342 -335 -328 2460 242 -242 3145 -2078 -4227 1410 -77 -2961 -52 2604
600B604J166k666o16L161l602k833L160l137q80M640j661j113K865N00k88j890
$$ 2604 3770 1104 488 3649 47 -2786 374 -2763 -3643 997 -664 -1777 1088 1588 1300 -590
616e90j44K671l914j054N046k179j087M183p87n40O99k391k34p14j315N62k113
$$ -590 -734 1937 -1977 -3031 2015 -164 -1251 2932 2145 1605 2304 -87 -321 -1035 -2350 -1788 -3901
633c901K322M487m041m6N254k360k308P98r48L96q64j20K518j477J474L117m089
$$ -3901 -1579 2908 -1133 -1179 4075 1715 -593 205 -743 -347 -1211 -1331 1187 -290 1184 4301 212
650B12k83L168m194k067J679o88J6m29J851L466k365L20L778l445j511J134k948
$$ 212 -71 3097 -1097 -3164 -1485 -2173 -2157 -2586 -735 2731 366 686 4464 1019 -492 642 -2306
667b306J149J615j781J595J435J86M43l406N79K192m554m30K538j945J774J568
$$ -2306 -1157 458 -1323 272 1707 1893 2336 -1070 -491 1701 -2853 -3283 -745 -2690 -916 652
683F52j314K655J013j191J3j966Q10J20m805K502L457l809J296L626j423r01j177
$$ 652 -662 1993 3006 1815 1828 -138 672 792 -4013 -1511 1946 -1863 -567 3059 1636 735 -442
700d42J44q7l646J407K546k334K805L037l447J691K399k950j507l74J033j21l833
$$ -442 -298 -385 -4031 -2624 -78 -2412 393 3430 -17 1674 4073 1123 -384 -758 275 154 -3679
717c679K315L603l418R72K435k400P64l43k622J122m25N3J248o46K991K010l510
$$ -3679 -1364 2239 -1179 -207 2228 -172 592 249 -2373 -1251 -1676 -1623 -375 -1021 1970 3980 470
734D70K046J314m876j89K39j457J185m44P43K511r25Q51r5k974K717n45n068K836
$$ 470 2516 3830 -1046 -1235 -996 -2453 -1268 -1712 -969 1542 617 1468 1373 -1601 1116 571 -4497 -1661
752a661K518j998J049J657J325J76k545J381k71m253J705r2l205L160J563j820
$$ -1661 857 -1141 -92 1565 2890 3066 521 1902 1631 -2622 -917 -1009 -4214 -1054 509 -1311
768a311J978J249k65r42j892K124j066l923L522K085k874K686J389j326J027j278
$$ -1311 667 1916 1651 709 -1183 941 -125 -4048 -526 1559 -1315 1371 2760 1434 2461 1183
784A183j417m84j512J289j241k238N160J104l527K969J599k105k13j168P3J97
$$ 1183 -234 -718 -2230 -941 -2182 -4420 740 1844 -1683 1286 2885 780 567 -601 -528 -331
800c31j850K379P69j420L474o38l143K686j084l547Q66J25k0J38l89L614L07k657
$$ -331 -2181 198 967 -453 3021 2383 -760 1926 842 -2705 -1839 -1714 -1734 -1596 -1985 1629 1936 -721
818g21K850k2k575J481j552j461K710n93n95R01M68J852k030k629L135j176l772
$$ -721 2129 2107 -468 1013 -539 -2000 710 117 -478 423 891 2743 713 -1916 1219 43 -3729
835c729K293K0p12K452r5O97J281r30J033j739j983K792k178k369M201q4j937
$$ -3729 -1436 -1416 -2128 324 229 926 2207 1277 2310 571 -1412 1380 -798 -3167 1034 950 -987
852i87J845M84N7j388j882K122r18k685K475k17l24L786j399p63K898p89j679
$$ -987 858 1342 1399 11 -1871 251 -667 -3352 -877 -1094 -1418 2368 969 206 3104 2315 636
869F36j017r01J901j815j828L791l85j196K813j556r99J502k099o43N89m51J541
$$ 636 -381 -1282 619 -1196 -3024 767 382 -814 1999 443 -556 946 -1153 -1796 -1207 -1658 -117
886a17l72N48L554k451j274L503k150k627J097p32K59j53j003K418j53m89J806
$$ -117 -489 59 3613 1162 -112 3391 1241 -1386 -289 -1021 -762 -915 -1918 500 347 -142 1664
903A664k354n67L073k918j732K963k6L43J80K4K308j562j633J846k296j001K056
$$ 1664 -690 -1257 1816 -1102 -2834 129 103 446 626 650 2958 1396 -237 1609 -687 -1688 368
920C68k328P1K440j353M42J425n25K81j769M11K058l358k62L906j398l24J993
$$ 368 -1960 -1889 551 -802 -360 1065 540 821 -948 -537 1521 -1837 -2099 1807 409 85 2078
937B078j201O21J82k078j99j159L67J639l390J340M143k382n22K326j273k17n20
$$ 2078 877 1498 1680 -398 -597 -1756 -1389 250 -3140 -1800 2343 -39 -561 1765 492 275 -245
954b45o60J208j145K81K485j962O38K053k699L07Q46k684j04M10m43R05r98J204
$$ -245 -905 303 -842 -561 1924 -38 600 2653 -46 261 1107 -1577 -1681 -1271 -1714 -809 -1807 -603
972f03K958j864Q1J540k188O27L13l336J622J888j085K40KJ631N36l655P33J494
$$ -603 2355 491 572 2112 -76 551 864 -2472 -850 1038 -47 193 195 1826 2362 -1293 -560 934
990I34l738P47J676k021J778J798m64O37m26M50P3k843J646J045l926J987K663
$$ 934 -2804 -2057 -381 -2402 -624 1174 710 1347 921 1371 1444 -1399 247 1292 -2634 -647 2016
1007B016k567K25J395M2k42k448L13J317k581J169J489j954K871J851k683P67
$$ 2016 -551 -326 1069 1111 869 -1579 -1266 51 -2530 -1361 128 -1826 1045 2896 213 980
1023I80R96j187r10j577J192J276k473J711J517k318J569N21k516J271l59j701
$$ 980 1976 789 -121 -1698 -506 770 -1703 8 1525 -793 776 1297 -1219 52 -307 -2008
1039b008R26j91R18N39r41L241O34l694K064Q26l247J01j89o60J245l66O47Q61
$$ -2008 -1082 -1273 -355 184 -757 2484 3118 -576 1488 2314 -933 -832 -1021 -1681 -436 -802 -155 706
1057G06r69K129r07l510K806L20l335J693J554k29N30j09J608k7k742J628j06
$$ 706 -263 1866 959 -2551 255 575 -2760 -1067 487 258 788 679 2287 2260 -482 1146 1040
1074A040l519J699K41j993K164P50o11Q42p0J010j262k566K500J21l019K438J427
$$ 1040 -2479 -780 -539 -2532 -368 382 -229 613 543 1553 291 -2275 225 346 -2673 -235 1192
1091A192r87J873p79o41R32j347n37p88j362K293o76k017L656M76j921J779r6
$$ 1192 205 2078 1299 658 1590 243 -294 -1082 -2444 -151 -827 -2844 812 1288 -633 1146 1050
1108A050j083K95j128O21L5j112K425j15j400L028j056k617J911o69k101J64O9
$$ 1050 -33 262 -866 -245 -210 -1322 1103 988 -412 2616 1560 -1057 854 185 -1916 -1752 -1683
1125a683J436l61j143L324O5k107K052o90j935J713j051o90J275n3Q38l03q92
$$ -1683 -247 -608 -1751 1573 1638 -469 1583 893 -1042 671 -380 -1070 205 152 990 687 -205
1142b05K268j244k499K014j100j744J661l97L65J693o04Q47K59p04J224k023r82
$$ -205 2063 819 -1680 334 -766 -2510 -849 -1246 -881 812 208 1055 1314 610 1834 -189 -1171
1159a171K648k235j669L377k53q47Q92j09L55j153j253J388j517q02L138j712
$$ -1171 1477 -758 -2427 950 697 -150 742 633 988 -165 -1418 -30 -1547 -2349 789 -923
1175i23m53L531o52j384J117R3k31j827m96K329k016j470L462o04j086J882j006
$$ -923 -1376 2155 1503 119 1236 1329 1098 -729 -1225 1104 -912 -2382 1080 476 -610 1272 266
1192B66n86K74j382M46j69J32K061j216n0L089j622j350J730j304p16J75j122
$$ 266 -320 -46 -1428 -982 -1151 -1019 1042 -174 -224 2865 1243 -107 1623 319 -397 -222 -1344
1209a344R47l6l43J524j108K32J953k810n46K647k074q06J715K28O16k70L58J660
$$ -1344 -397 -433 -776 748 -360 -128 1825 -985 -1531 1116 -958 -1764 -49 179 795 525 883 2543
1227B543k147o91J948k646p66K051j819j9K012j85n0m93Q50R60l078j60L127k193
$$ 2543 396 -295 1653 -993 -1759 292 -1527 -1546 466 281 231 -262 588 1548 -1530 -1690 1437 -756
1245g56p17K462m16P2P27p03M84q07o92N55k164L97K131k214L96K739j245k54
$$ -756 -1473 989 573 645 1372 669 1153 346 -346 209 -1955 -1558 573 -1641 -1245 1494 249 -5
1263eQ09p05J81r61j66J503j288O33J725j921Q32J634k589k15J267j334l84q10
$$ -5 804 99 280 -681 -847 656 -632 1 1726 -195 637 2271 -318 -533 734 -600 -984 -1794
1281a794Q09J366j723Q31K341j877L40J281k209O91N02j203L11K02O32Q34j602
$$ -1794 -985 381 -1342 -511 1830 -47 293 1574 -635 56 558 -645 -334 -132 500 1334 -268
1298b68J115J008l035J24J283j975L27Q82k03J137k13K61R31j180O46J79k400
$$ -268 847 1855 -1180 -1056 227 -1748 -1421 -539 -742 395 182 443 1374 194 840 1019 -1381
1315a381J418J341k660Q45J536o90Q6o45L71O33k167K06P35j765J664J274j714
$$ -1381 37 1378 -1282 -437 1099 409 495 -150 221 854 -1313 -1107 -372 -2137 -473 801 -913
1332i13J591J113j102J73n62J93k15j915J428J145k247J186J396j558N96k2r61
$$ -913 678 1791 689 862 300 493 278 -1637 -209 936 -1311 -125 1271 -287 309 287 -674
1349f74N70q49l96P81n83J640M74j763K104J104k390N87O1j092K92r72J62J037
$$ -674 -104 -953 -1349 -568 -1151 489 963 -800 1304 2408 18 605 666 -426 -134 -1106 -944 93
1367I3p02Q79O01j589J404m3k289J224K14j163J103K25P34P05j288J170N69k524
$$ 93 -609 270 871 -718 686 643 -1646 -422 -208 -1371 -268 -43 691 1396 108 1278 1847 -677
1385f77Q36L2j468J058n18p56J622K9p7J07o76J393m76k116J502N12j361J502
$$ -677 159 191 -1277 -219 -737 -1493 129 158 81 188 -488 905 429 -1687 -185 327 -1034 468
1403D68J03k89J430p33n65K42j270N44o05j289J890j99j191K041K50j010O47m28
$$ 468 571 282 1712 979 414 656 -614 -70 -675 -1964 -74 -273 -1464 577 827 -183 464 36
1421C6J91q7j383J405L49j353J587J53q58J587p50j230L55n52k36l12r67K033
$$ 36 227 140 -1243 162 511 -842 745 898 40 1627 877 -353 2 -550 -786 -1098 -2065 -32
1439c2N04j298J715K39r81Q79j083n10R56r38J42O92l38J106j95j030J579j159
$$ -32 472 -826 889 1128 147 1026 -57 -567 389 -549 -407 285 -53 1053 858 -172 1407 248
1457B48j541J267q24o85R81m85Q42Q84n58Q42k83n66J231j669r67K057p44r40
$$ 248 -1293 -26 -850 -1535 -554 -1039 -197 687 129 971 688 122 1353 -316 -1283 774 30 -910
1475i10J241J44L06l18r24J128r21j268J492j015o35J992n44p4J445k63P1k55
$$ -910 331 475 781 463 -461 667 -254 -1522 -30 -1045 -1680 312 -232 -306 1139 876 947 692
1493F92p29R66j258j100J916o52p43J412k72q3O43j372O9M01p75M69m74K68J962
$$ 692 -37 929 -329 -1429 487 -165 -908 504 232 149 792 -580 -511 -110 -885 -416 -890 -622 1340
1512A340j293l23J988q07o64N76r81o7m0p76R70l49Q4J221j316Q1J661j789o80
$$ 1340 47 -276 1712 905 241 817 -164 -231 -271 -1047 -77 -426 -342 879 -437 -356 1305 -484 -1164
1531a164J280n67j97L66N05J188r11m44J689j250p54P55j296p5Q07j036O12N63
$$ -1164 116 -451 -648 -282 223 1411 500 56 1745 495 -259 496 -800 -875 -68 -1104 -492 71
1549G1K5O59j125j4J404j613n51J522q34L10Q51o15Q07K35p97M20q63j90M10j605
$$ 71 96 755 -370 -384 1020 -593 -1144 378 -456 -146 705 90 897 1132 335 755 -108 -298 112 -1493
1569a493M87J374j476M38J370m78J08j91k38P02r12l16J126q75O60R42j403N43
$$ -1493 -1006 368 -1108 -670 700 222 330 139 -99 603 -309 -625 501 -374 286 1228 -175 368
1587C68R18j474j19M2l44L49r20K56J514j177L95J139j018N04K74r84M32kn17
$$ 368 1286 -188 -307 -265 -609 -260 -1180 -924 590 -587 -192 947 -71 433 707 -277 155 153 -364
1606c64N49k24N16P10j482M97Q90j906J10L82q44P29K07k97R91k77L91K51j140
$$ -364 185 -39 477 1187 -295 202 1092 -814 -704 -322 -1166 -437 -230 -527 464 187 578 829 -311
1625c11R54K84j800P71R32j288L23L31k5L74q37L47L24j553N19O36j344J036Q35
$$ -311 643 927 -873 -102 830 -458 -135 196 171 545 -292 55 379 -1174 -655 -19 -1363 -327 508
1644E08r44Q56L71r6J8j009P32K77j901Q13J098j262O12N19o55L78m64m16L59
$$ 508 -436 420 791 695 713 -296 436 713 -1188 -375 723 -539 73 592 -63 315 -149 -565 -206
1663b06p71N90M77j132J222R27j417J127M71j103L67m37l55K24q89L37P37p27
$$ -206 -977 -387 90 -1042 180 1107 -310 817 1288 185 552 115 -240 -16 -905 -568 169 -558
1681e58R97J13j226J166k87j381Q00K50k64M18l08J087L02j196Q96J36j382Q48
$$ -558 439 552 -674 492 205 -1176 -376 -126 -390 28 -280 807 1109 -87 809 945 -437 411
1699D11l59j185R03J7m11M20k6Q08k97j238J392oj704J053N30o10O88J25J38M19
$$ 411 52 -1133 -230 -213 -624 -204 -230 578 281 -957 435 429 -1275 -222 308 -302 386 511 649 1068
1719A068r83N37k33j340Q69j46j275J339L30p94Q19O7K0O4q18O69N7j185J146
$$ 1068 85 622 389 -951 -82 -228 -1503 -164 166 -628 191 258 278 342 -476 193 250 -935 211
1738B11O1n90J327k71o92R28m37q65m8n34N62k84p33J627p9p67J402j10r04P05
$$ 211 272 -318 1009 738 46 974 537 -328 -376 -910 -348 -632 -1365 262 183 -584 818 708 -196 509
1758E09l38m35J81k57P36k58m85J706o52j291J285m07j363O24j88m6K19k76J011
$$ 509 171 -264 -83 -340 396 138 -347 1359 707 -584 701 294 -1069 -445 -633 -679 -460 -736 275
1777B75P3l88J219n99j109J580q39j108R65O4k36L12j80Q52o57q32J076q72r77
$$ 275 348 -40 1179 580 -529 1051 212 -896 69 133 -103 209 29 881 224 -608 468 -404 -1381
1796a381J372n93n28J489k15j01M67j1L99q31l67J300j135r65J476j45p06Q27
$$ -1381 -9 -602 -1130 359 144 43 510 499 898 67 -300 1000 -135 -1100 376 231 -475 352
1814C52j81OK2o37L59n92k74J252p53l28J833l75o20Q01k46l11o7o70O04n13m87
$$ 352 171 177 199 -438 -79 -671 -945 307 -446 -774 1059 684 64 865 619 308 241 -429 175 -338 -825
1835h25J096m61l07J217p76l77J057r84k77N08j05K43k76K13J249o49n00J072
$$ -825 271 -190 -497 720 -56 -433 624 -360 -637 -129 -234 9 -267 -54 1195 546 46 1118
1853A118q73m21M68j121j28Q91j66J67j01J6J028j295j06J125r99k45J082n91
$$ 1118 245 -176 292 -829 -957 -66 -232 -65 -166 -150 878 -417 -523 602 -397 -642 440 -151
1871a51K17M40j92M87l76k38N17j145j5P10j106q7J264p66R8N16m6L66n85k30
$$ -151 66 506 314 801 425 187 704 -441 -456 254 -852 -939 325 -441 -343 173 127 493 -92 -322
1891c22Q25p98m9Q43r44N02R53q70P1M21o26O7o40n8O09q38K12J096q24L45R01
$$ -322 503 -295 -344 499 -445 57 1010 140 211 632 6 73 -567 -625 -16 -854 -642 454 -370 -25 876
1912H76q57M44r4o65M94k85j9M32n87M20R43j353K04N27j032J16O3m88O95j9p2
$$ 876 19 463 369 -296 198 -87 -106 326 -261 159 1102 -251 -47 480 -552 -436 -373 -861 -166 -185 -257
1933b57O73m34N31K91j184N72N36j084K60L04k90K38j34J08N48j037K26L38j016
$$ -257 416 -18 513 804 -380 192 728 -356 -96 208 -82 156 22 130 678 -359 -133 205 -811
1952h11L21N25r61P54M25l01M75r0L00Q8j154N43M12j089M01M55n47M03m2m44
$$ -811 -490 35 -926 -172 253 -48 427 337 637 725 -429 114 526 -563 -162 293 -254 149 107 -337
1972c37N53m31j94K81o63M93N55r30Q80N04q47P77m9m08L14m70m24N02p55N69
$$ -337 216 -215 -409 -128 -791 -298 257 -673 207 711 -136 641 592 184 498 28 -396 106 -649 -80
1992h0J21o07R32P0j185P82J72q29K35m0M98L39o50P62M43j064O69j63q84N88
$$ -80 41 -566 366 436 -749 33 205 -624 -389 -429 69 408 -242 520 963 -101 568 405 -479 109
2012A09k59m76O10l70J77K79o64P89K81j115O59K12q94P30r8RO65m35J98L18o77
$$ 109 -150 -626 -16 -386 -209 70 -594 195 476 -639 20 232 -662 68 -30 -21 644 209 407 725 48
2033D8K30k61p84Q01j43q04R72o4k36M82l91K04K28p59N62N1o17J015l19n87J080
$$ 48 278 17 -767 34 -109 -913 59 -5 -241 241 -150 54 282 -477 85 136 -481 534 215 -372 708
2054G08j64o60M47k54o8l70o38R86k86o44J097J38m38O81m01k12M68m86k2L01
$$ 708 544 -116 331 77 9 -361 -999 -13 -299 -943 154 292 -146 535 134 -78 390 -96 -118 183
2074A83m92P50j02n54R85l19p95O38l81m49L93n29K58L36k81N18j3j36P80o45
$$ 183 -309 441 339 -215 770 451 -344 294 -87 -536 -143 -672 -414 -78 -359 159 146 10 790 145
2094A45n45J198p44n82O92j18k8O0q7N04n47m74P81p13l12R80n46k97R34j01J17
$$ 145 -400 798 54 -528 164 46 18 78 -9 495 -52 -526 255 -458 -770 210 -336 -633 301 200 317
2115C17O0j31N63p58n52J130o22o14P99j09k85N13l38N2K1n43L83l80k38J066
$$ 317 377 246 809 51 -501 629 7 -607 192 83 -202 311 -27 25 46 -497 -114 -494 -732 334
2135C34n92k09J262m81k51O17m30J05k91n06N36l73k10R16p67q4J071p77l53O77
$$ 334 -258 -467 795 314 63 680 250 355 64 -442 94 -279 -489 427 -340 -424 647 -130 -483 194
2155A94l75j16n4N9N57l89M2J110p62k70R10r57l22N60n18J4M2lN44n37QR88p98
$$ 194 -181 -297 -351 -292 265 -124 -82 1028 266 -4 906 -51 -373 187 -331 -317 -275 -278 266 -271 -263 725 -73
2178g3m25R33p05n8M69k74M05j71k5O76n88q7N66j013j89R08r31l1P07l26K10
$$ -73 -498 435 -270 -328 141 -133 272 101 76 752 164 77 643 -370 -559 349 -582 -613 94 -232 -22
2199b2P1r5N18n00j75O41p14m4Q63p41L69N48o16J69kl64J13n96L6P02p88J71
$$ -22 49 -46 472 -28 -203 438 -276 -320 543 -198 171 719 103 272 270 -94 19 -577 -541 161 -627 -456
2221d56Q91o58L06M74n34J66j22j68K55n34L86O73r26K21Q73r77j9K36n09J42
$$ -456 435 -223 83 557 23 189 67 -101 154 -380 6 679 -247 -26 847 -130 -149 87 -422 -280
2241b80j69j24N84m07K58P03o78K74N85q59J39M41o62J80m7m5M32n46K08N47r64
$$ -280 -449 -573 11 -396 -138 565 -113 161 746 -113 26 467 -195 -15 -62 -107 325 -221 -13 534 -430
2262d30R7N03p93K23L38l63L36K03%M54o22M23M22j177K18N90q70M06K95l96K71
$$ -430 -333 170 -623 -400 -62 -425 -89 114 114 568 -54 369 791 -386 -168 422 -448 -42 253 -143 128
2283A28k08l2K90o85L92L11r39N03O37p67M01M74k79O0o5j3K51q04R3M26o93M41
$$ 128 -80 -112 178 -507 -115 196 -743 -240 397 -370 31 505 226 286 221 208 459 -345 -252 174 -519 -78
2305g8L28o89N17J27o56L81j28n0K75n91N42N54o90L52L50o21M43mo63L32j76
$$ -78 250 -439 78 205 -451 -70 -198 -248 27 -564 -22 532 -158 194 544 -77 366 362 -301 31 -145
2326a45k02K57k49L75K2n91P58J94r19N11J72m68L12m2J05L91l73K91L2o26M85
$$ -145 -347 -90 -339 36 58 -533 225 419 -500 11 183 -285 27 -15 90 481 108 399 431 -195 290
2347B90j69q79N62K54o24L03J30K05M3m98M42L85r26N53J63o50O33K8k89L87j58
$$ 290 121 -758 -196 58 -566 -263 -133 72 115 -383 59 444 -482 71 234 -416 217 245 -44 343 185
2368A85N5j7m65M28j13j005Q11Q5m55M26K13k38M53l98J8L11m46K74l1m52P80
$$ 185 240 223 -242 186 73 -932 -121 -36 -491 -65 148 -90 363 -35 -17 294 -152 122 91 -361 419
2389D19n0o69N36J46o58J62q1j4L0l34N57rm15P95j55n83Q55k45m54L27k26P4
$$ 419 369 -300 236 382 -276 -114 -195 -209 -179 -513 44 35 -380 415 260 -323 532 287 -167 160 -66 8
2411HJk79N68J0o93P46j57o91N74l90k02N97k40nK21L9K51o9m35O45l10o13P26
$$ 8 9 -270 298 308 -385 361 204 -487 87 -303 -505 92 -148 -153 68 107 358 289 -146 499 189 -424 302
2434C02j75m32M15k75N7L27m43K86Lm82O50n53k39P81k93j01O09j27l9P0m88M01
$$ 302 127 -305 110 -165 -108 219 -224 62 65 -417 233 -320 -559 222 -71 -172 437 310 271 341 -147 254
2456B54j92m61O00l32k31N98m75L1N49m38j43J76k70L29j33k64P34q0l61P37m57
$$ 254 62 -399 201 -131 -362 236 -239 -208 341 -97 -240 -64 -334 -5 -138 -402 332 252 -109 628 171
2477A71j02L37n17jM6k82K16j35j06P11n23o5O71n34j25M21l90J89J92k35L67
$$ 171 69 406 -111 -112 -66 -348 -132 -267 -373 338 -185 -250 421 -113 -238 183 -207 -18 174 -61 306
2498C06q2j59M95n32o5L88o14j38N34m39P8L20k17K90q3k89M94l24j52M96n53
$$ 306 224 65 560 28 -37 351 -263 -401 133 -306 -228 92 -125 165 82 -207 287 -37 -189 307 -246
2519b46O9M38l25J12L30k59K5o7k94L97m77k35N41m47L28L06k45K02J35l04L13
$$ -246 -177 261 -64 48 378 119 144 77 -217 180 -297 -532 9 -438 -110 196 -49 153 288 -16 297
2540B97j33l31M69m29nM78m23K1L77m63R3J06k50J35j70j33M32l26J28N00n35
$$ 297 164 -167 302 -127 -132 346 -77 -56 321 -142 -49 57 -193 -58 -228 -361 71 -255 -127 373 -162
2561a62M24K33n51O7J83l34K31j69O6K55k63rL47o63J48L90n72K90K18m81L76
$$ -162 262 495 -56 11 194 -140 91 -78 -12 243 -20 -29 318 -345 -197 193 -379 -89 129 -352 24
2582B4J2O8L37m10J64L44o64p9M72m77J87l7j23L12j13j18J51l96J60K73m19J18
$$ 24 36 104 441 31 195 539 -125 -204 268 -209 -22 -59 -182 130 17 -101 50 -346 -186 87 -332 -214
2604b14L10k48L37O7j77L53l80l6K69l28J0P1l31K47J31m87N17O7l01R3j15J48
$$ -214 96 -152 185 252 75 428 48 12 281 -47 -37 34 -297 -50 81 -406 111 178 -123 -30 -145 3
2626CJ01m12L66M38m92L43M3m96K74J19n22J34m3R1M4m39M49K86o86L48L26n66
$$ 3 104 -308 58 496 4 347 390 -106 168 287 -235 -101 -144 -53 -9 -448 1 287 -399 -51 275 -291
2648b91L04r3n5K36k18J40M41m71L13O6o26L84j7n79M08q8j48K62j86J97K12l71
$$ -291 13 -80 -135 101 -117 23 464 -7 306 372 -254 130 113 -466 -58 -146 -294 -32 -218 -21 191 -180
2670a80J41K57m55L89J5m12N23k4m15L32%r2k4l06M71k10n72L75K21l01L36oj81
$$ -180 -39 218 -237 152 167 -245 278 254 -161 171 171 79 55 -251 220 10 -562 -187 34 -267 69 63 -118
2693a18L44k03O6L0l06L73o2m02M18Q2m14L10q1k15K31k60J05Q3k47K13J51l14
$$ -118 226 23 89 119 -187 186 124 -278 140 222 -192 118 37 -178 53 -207 -102 -19 -266 -53 98 -216
2715b16M72k1k99K36m2k71K47j57j8K21m05L94n3l27N50l25m35O39l84l19M85
$$ -216 256 235 -64 172 130 -141 106 -51 -69 152 -253 141 88 -239 311 -14 -449 190 -194 -513 -28
2736b8m2J08r3J5M87k36l67L62j70k92L64j12j19J63q1lJ19j63R2l7k77N00k82
$$ -28 -70 38 -55 -40 447 211 -156 206 36 -256 108 -4 -123 40 -41 -44 75 -88 4 -33 -310 190 -92
2759i2k92N34j3j28K02j04R7O0m23L67j80l02M72l60l00N37j34j48L60k43O9p1
$$ -92 -384 150 137 9 211 107 204 264 -159 208 28 -274 198 -162 -462 75 -59 -207 153 -90 -21 -92
2781i2j83L12P4l43M36n9j16L73k52k37M01k99j24L5j89L29l39p8N75j56l29N15
$$ -92 -275 37 111 -232 204 145 29 402 150 -87 314 15 -109 -74 -263 66 -273 -351 224 68 -261 254
2803B54j73j53R6p3K7J21j45K30n0p6L67l88k28K53j96k34K26p7J12k7k4L53k01
$$ 254 81 -72 24 -49 -22 99 -46 184 134 58 425 37 -191 62 -134 -368 -142 -219 -107 -134 -158 195 -6
2826fk74O45l21r7K53k28m4K91k96K14o8k2K05m20q8M73l96j27L77k06J9J86j79
$$ -6 -280 365 44 -53 200 -28 -72 219 -77 137 69 47 252 -168 -256 217 -179 -306 71 -135 -116 70 -109
2849a09K57O4j38J60k43j06L17j85r5M34k98o6Q9k18J18n5k49M14k50L5K54l00
$$ -109 148 212 74 234 -9 -115 202 17 -78 356 58 -8 81 -137 -19 -74 -323 91 -159 -124 130 -170
2871a70J04M52l55kL76k97l1m6p2L09m62P7L88l52j38L45l03J86J9j57Q5p7Q8
$$ -170 -66 386 31 29 405 108 77 31 -41 268 -194 -117 271 -81 -219 126 -177 9 28 -129 -44 -121 -33
2894c3J50j64k5M97m23jL21m88K3K30l23L05j68j09L06k45K7K93m78J8L60l60
$$ -33 117 -47 -72 425 2 1 322 -166 -143 87 -236 69 -99 -208 98 -147 -120 173 -305 -287 73 -287
2916b87R5L61k54K98l7q3K31k47JJ77n13J02K54l79Q3K30j66J7L0J21J0k87J59
$$ -287 -192 169 -85 213 176 93 324 77 78 255 -258 -156 98 -281 -198 32 -134 -117 -87 34 44 -243 -84
2939h4K57l71J41L79l94K40m1k4j00J09k73L00l99J53J03k65J16L82l46J51J89
$$ -84 173 -198 -57 322 -72 168 127 103 3 112 -161 139 -260 -107 -4 -269 -153 229 -117 34 223
2960B23l34K28j44J44L0k24J49K49l16J23K04n16J76P9l35J52j41J56J89l50K30
$$ 223 -111 117 -27 117 147 -77 72 321 5 128 332 -184 -8 71 -264 -112 -253 -97 92 -258 -28
2981b8L27l41J65K4k89K64O7k45K63p1n0J02k36L7L28n47J55K02m26K12k4k4K38
$$ -28 299 -42 123 147 -142 122 189 -56 207 136 86 188 -48 -11 317 -230 -75 127 -299 -87 -111 -135 103
3004A03o5p1K79j74N0nl41K72J36m09K60J8n1pj54P8R3k45K11Mk24J87J54k57
$$ 103 38 -33 246 72 122 117 -224 48 184 -225 35 53 2 -5 -159 -81 12 -233 -22 -18 -242 -55 99 -158
3028a58L25N3l97L06n3o5Q2k51J45J55l30L10ll25K78j76p8K00k52%K93j96K75
$$ -158 167 220 -177 129 76 11 93 -158 -13 142 -188 122 119 -206 72 -104 -182 18 -234 -234 59 -137 138
3051A38K7j88J41R6k35J50j7k71J64p5j41J95m1j6J9k66L28ol21L92j11o0K02
$$ 138 165 -23 118 214 -21 129 112 -159 5 -70 -211 -16 -57 -73 -54 -320 8 2 -319 73 -38 -98 104
3074A04o9Q2J36k40J48Ll03J97j10j90L07r6k06L11j23n0K37k33J48q3l6J24N3
$$ 104 35 117 253 13 161 164 -139 58 -52 -242 65 -31 -237 74 -49 -99 138 -95 53 -30 -66 58 111
3097A11k17L45k17N2K44l51J23n3j21l3l4j47K91r8j62N00k48j24J64j15K07P
$$ 111 -106 239 22 74 318 -33 90 37 -84 -117 -151 -298 -7 -105 -267 233 -15 -139 25 -90 117 124
3119A24j80K00Kk61L65j77j81K85o2k61J36j44M0L8j15J65J1j57M18o3j95K03
$$ 124 -56 144 146 -115 250 73 -108 177 115 -146 -10 -154 -114 -76 -191 -26 -15 -172 246 183 -12 191
3141A91k48j2K71k24J9J42n7J27k22J0J74k50k23M35k27m2K15l03J24K6K4K59
$$ 191 -57 -69 202 -22 -3 139 82 209 -13 -3 171 -79 -302 133 -94 -136 79 -224 -100 -74 -50 209
3163B09j69j40J95j18q2L10k01o3K27k78N4J04j21J91k69n7L25l36J20K85k08
$$ 209 40 -100 95 -23 -105 205 4 -59 168 -110 -56 48 -73 118 -151 -208 117 -219 -99 186 -22
3184b2Q9J66k22M1J49k31R4n2j26L97k34k27K88j60LR1k40J57O3j98J04N4j03
$$ -22 67 233 11 52 201 -30 64 12 -114 283 49 -178 110 -50 -47 44 -196 -39 24 -174 -70 -16 -119
3207a19K48j73N7L77m42J10M0j97P8q6j6J20qlR3k06Q2K40l54Q8J77j84K7J66
$$ -119 129 -44 13 390 -52 58 98 -99 -21 -107 -123 -3 -11 -14 79 -127 -45 195 -159 -71 106 -78 -51 115
3231A15q4J09j66P8K23l45J19R4l80J8K43j32J07rm1M2l1Q0N2j25m1J56r6P3K13
$$ 115 31 140 -26 52 275 -70 49 143 -237 -219 24 -108 -1 -10 -51 -9 -40 40 92 -33 -74 82 -14 59 272
3256B72k07R7Ok35J03n6o6J84m01K90P2k95J95Q9k77K23J08o9J22j14l6J72k26
$$ 272 65 162 168 -67 36 -20 -86 98 -303 -13 59 -236 -41 48 -229 -6 102 33 155 41 5 177 -49
3279d9R4J54k26N5J92m00K21Qq7L0j38J39M4j04M2J64k40J87J60k87J08P1j74
$$ -49 45 199 -27 28 220 -180 41 49 -38 -8 -146 -7 37 -67 -25 139 -101 86 246 -41 67 138 -36
3302c6R4p0J20j8k29J39J38l77K39Oj64K2O4m3J27K9n0J27j20L5Q6k98K01Q5k53
$$ -36 58 -12 108 90 -139 0 138 -239 0 6 -158 -136 -72 -115 12 41 -9 118 -2 33 119 -179 22 107 -146
3327a46K04j2J8p8q5OJ18k01L4K78j98J42j9j16K41n0j89J84j17J05j08j02J80
$$ -146 58 46 64 -14 -99 -93 25 -176 -142 136 -62 80 61 -55 186 136 -53 131 14 119 11 -91 89
3350H9K3k06J27L5k55L21j12j41K4J56j73J46j84K56P1l40K58R6k66L23k45j24
$$ 89 112 -94 33 68 -187 134 22 -119 -95 61 -112 34 -150 106 177 -163 95 191 -75 248 3 -121
3372a21K24j71j30K77k26J82o4j07J38J69k67J86j23kJ01q7M1J45k70J81q7j27
$$ -121 103 -68 -198 79 -147 35 -29 -136 2 171 -96 90 -33 -35 66 -21 20 165 -105 76 -11 -138
3394a38K19j9j61J28m7o2J06j54J31K2j02J69R1l91L26k3j43Q0o8Q0J10j28J02
$$ -138 81 62 -99 29 -18 -80 26 -128 3 25 -77 92 183 -208 118 95 -48 32 -36 44 154 26 128
3417A28l8k16O9M0j43K89j26p5J68n3n4J08r2J69Nk74P4N7r5J41N7k20K35p2k47
$$ 128 90 -126 -57 -17 -160 129 3 -72 96 43 -11 97 5 174 179 -95 -21 36 -59 82 139 -81 154 82 -165
3442a65J20m1p2J47q8R9k5l2J51M6k01K56j43N5j22R5qm7m9J62j87L1Q3l6k62
$$ -165 -45 -86 -158 -11 -99 0 -25 -57 94 140 -61 195 52 107 -15 80 72 25 -24 138 -49 -18 65 29 -233
3467b33J48L2L7L5l9J95K1k38J16M3k06J85n1j00J36qj09J82j61J3q8K2K05o3
$$ -233 -85 -53 -16 19 -20 175 196 -42 74 117 -89 96 45 -55 81 73 -36 146 -15 -2 -90 -68 137 74
3491G4k54J16j46J07J80q6j9J44m3Q9j65LJ28p2k16K11Lj71K26j60P0q7kj5L8
$$ 74 -180 -64 -210 -103 77 -9 -28 116 73 162 -3 0 128 56 -160 51 54 -117 109 -51 19 -68 -70 -85 -47
3516d7jJ22j90J08J91j36p2J53j60M9Oj8J39j06j25J32j26m7K13j05m4N3k2l1
$$ -47 -48 74 -116 -8 183 47 -25 128 -32 17 23 5 144 38 -87 45 -81 -128 85 -20 -64 -11 -33 -64
3540f4R4j1J01j69K7J20m3K2j6n6j27J35j80J34J55k15KR1j06J86p0p9J86m1r9
$$ -64 30 19 120 -49 -22 98 55 77 61 5 -122 13 -167 -33 122 -93 -91 0 -106 80 10 -69 117 76 -23
3565b3J05L1j0m5p2N5J38k22K4m6r2K48k13J0Q9j22J56J06k48J73j02p2J95K7
$$ -23 82 113 103 58 -14 41 179 -43 -19 -65 -157 91 -122 -112 -23 -145 11 117 -131 42 -60 -132 63 90
3589I0j35J73j84n6K01oj47P7q4mJ0l3J28k36J27J70j74kK73j53qk5k7jJ40j61
$$ 90 -45 128 -56 -112 89 83 -64 13 -71 -75 -65 -98 30 -206 -79 91 -83 -85 188 35 27 2 -25 -26 114 -47
3615d7L2j3N9n8p2J36J15k24ML7o6J19L8q5J59j00k8K10j87N3K5k42J47J5j05
$$ -47 -15 -28 31 -27 -99 37 152 -72 -68 -31 -97 22 60 -25 134 34 6 216 29 82 107 -135 12 27 -78
3640g8J53j35M3O6r9KR6j12J8J77j41p3K93k34n9J72j41J13k0n7J15j47L4J9j28
$$ -78 75 -60 -17 49 -50 -48 48 -64 -46 131 -10 -83 210 -24 -83 89 -52 61 41 -16 99 -48 -14 5 -123
3665a23J52k4j3J17k86J22O7r0J8R0m5J16J13k52K6J13k15P2Q3j24K20j51n1R5
$$ -123 29 5 -8 109 -177 -55 12 -78 -60 30 -15 101 214 -38 -12 101 -114 -42 41 -83 137 -14 -65 30
3689C0k00J07J90k11L6Q0n2l8M7M3J4jj3Q7j60p9J88k11J63k7j08J55j64j2K43
$$ 30 -170 -63 127 -84 -48 32 -20 -58 -11 32 46 45 32 119 -41 -120 68 -143 20 -7 -115 40 -124 -136 107
3714A07j87R8k7l3O1J27p7j10K0j12K11K2j47J07j60O2J35j15N1k4k9O8q8N5P0
$$ 107 -80 18 -9 -42 19 146 69 -41 -21 -133 78 100 -47 60 -100 -38 97 -18 33 9 -20 48 -40 15 85
3739H5j03o9J50r3R0p0PP7j14J1J28o2r8J25m4n1J19j08j01J26o2M5N6p2J20o4
$$ 85 -18 -87 63 -30 60 -10 -3 74 -40 -29 99 37 -61 64 20 -31 88 -20 -121 5 -57 -12 44 -28 92 28
3765B8l3J95j86j3N6j02J06j3j02k0O0q1J04n8k9K9NN5M7l2o3J81j72J17o4LP9
$$ 28 -5 190 4 -9 47 -55 51 38 -64 -84 -24 -105 -1 -59 -88 -59 -54 1 48 16 -47 134 -38 79 15 18 97
3792I7j15j85O3J01j8P7k04J77J18r4mk9o8O9K3kM9J0j31K58p0nq4j76J93R6k34
$$ 97 -18 -203 -140 -39 -57 20 -184 -7 111 17 13 -16 -84 -15 8 6 55 65 -66 192 122 117 33 -143 50 146 -88
3819h8J74j17j4R9j23J6P4j02J11m7l5O5P9k06K10Jk41L44k61n0N2j9J00r7l0
$$ -88 86 -31 -45 54 -69 -53 21 -81 30 -17 -52 13 92 -114 96 97 -144 200 -61 -111 -59 -78 22 -75 -105
3844a05Q8p5m4K64j26N0j1m3N9j83J13J3k0j31K33pj07O2q9p9J58o2l3O3M5l7
$$ -105 -17 -92 -136 128 2 52 41 -2 57 -126 -13 0 -20 -151 82 75 -32 30 -59 -138 20 -42 -75 -12 33 -4
3870dj10J55P0j61rK48j44j58J47l7p1K69j11j10Po0K02k28m7K95j65j24J57o9
$$ -4 -114 41 111 -50 -59 189 45 -113 34 -3 -74 195 84 -26 -19 -79 123 -105 -152 143 -22 -146 11 -58
3894e8R6J9r4O5Mr1J89j50J2J99k35J8J21j58r1M3L2ojl6J06p2Q0R2r6q9K21k11
$$ -58 38 57 -37 28 32 -59 130 -20 -8 191 -44 -26 95 -63 -154 -111 -79 -85 -86 -122 -16 -88 -8 84 -12 -101 120 -91
3922i1O0L9J45K8j94J4j9o4r4K71j78L9k3M4r4J74j21OR5l9J96j32j64K24j35
$$ -91 -31 8 153 181 -13 1 -18 -82 -176 95 -83 -44 -67 -23 -117 57 -64 -58 37 -2 194 62 -102 122 -13
3947a3m2Q5q1J66j63r3J25r8P0L0K6k3J15j23j1K8L6l4K03k35P3R2j49J46p7l1
$$ -13 -55 30 -51 115 -48 -141 -16 -114 -44 -14 12 -11 104 -19 -30 -2 34 0 203 -32 41 133 -16 130 53 22
3973B2N6j77m2J73j44K9J33j05MN6j43R7q8J09J42Pk44K16j81J07l2o7Q2K3j36
$$ 22 78 -99 -141 32 -112 -83 50 -55 -51 5 -138 -41 -129 -20 122 129 -115 101 -80 27 -5 -72 10 33 -103
3998a03P2j0n0J22j45J85kr3N4o8K6K7P0j36J49j25O0P4m6j02J25j62N8Q1j23
$$ -103 -31 -41 -91 31 -114 71 69 -24 30 -38 -12 15 85 -51 98 -27 33 107 61 -41 84 -78 -20 61 -62
4023f2J76j40j7O2o3O4R4k96K97k9j24J19n3q9J50lj03N8j1q4O6j86R3J13o6p1
$$ -62 114 -26 -43 19 -44 20 114 -182 115 86 -38 81 28 -61 89 86 -17 41 30 -54 12 -174 -81 32 -34 -105
4049a05J85j26J69j41Q5J26k03m7J08o2n9J34j74J42m3M0O8j57K3NJ9K7N2j72
$$ -105 80 -46 123 -18 67 193 -10 -57 51 -11 -70 64 -110 32 -11 29 97 -60 -37 -32 -13 14 66 -106
4073a06J40P2j94K17j69R6n1Mk8N1M2n4l3n8Q3M4p8l0J0j6J46p6O1K0M4r2K9r7
$$ -106 34 106 -88 129 -40 56 5 9 -19 32 74 20 -13 -71 12 56 -22 -52 -42 -58 88 12 73 93 137 45 74 -23
4101b3P9k0o6J08r2ln5k6J74p9j54J25J54k97J99j06N9O0n1N8O5j01j1O6j06p
$$ -23 56 36 -30 78 -14 -17 -72 -98 76 -3 -157 -32 122 -175 24 -82 -23 37 -14 44 109 8 -3 63 -43 -50
4127e0J63j92Q0l0l8J68k31n9J69j10N2J45j18Q3n7J26l7p1l6J45k4p3P0lr9J59
$$ -50 113 -79 1 -29 -67 101 -130 -189 -20 -130 -78 67 -51 32 -25 101 64 -7 -43 102 78 5 75 72 -27 132
4153A32k34M0J8Q0Roj13J36j2n9oMO5k0j05R4m5m9J57l1k2Km7q0J07j07J05o8
$$ 132 -102 -62 -44 36 45 39 -74 62 50 -9 -15 -11 54 34 -71 23 -22 -71 86 55 33 35 -12 -92 15 -92 13 -55
4181e5nO9P6j39J31j2j58K43o2n2oqm3O0m1L5j29m7J83r7j27J83K3j89K42L4n7
$$ -55 -60 9 85 -54 77 65 -93 150 88 36 30 22 -21 39 -2 33 -96 -143 40 -57 -184 -1 22 -167 75 109 52
4208E2o1q2J11pK9J9k1j98K11N2p3J0p2j41J32L8kK3j52K33j80K6M9O4l4J01K8
$$ 52 -9 -91 20 13 42 61 40 -158 53 105 32 42 -30 -171 -39 -1 -3 20 -132 101 -79 -53 -4 60 26 127 155
4235A55j78J30k00J97j49J1L3L0j67P4J10j98L21k84J16N0p3M1q8R2K3p7j2J61
$$ 155 -23 107 -93 104 -45 -34 -1 29 -138 -64 46 -152 169 -115 1 51 -22 19 -69 23 46 -31 -43 118
4259A18j38qQr1P7L9Ko7K8j9J59k04PJ75j61O8O4k5L7M6j41jQ5j36J40p7M9K7
$$ 118 -20 -28 -20 -111 -34 5 7 -60 -32 -51 108 -96 -89 86 -75 -7 57 32 69 115 -26 -27 58 -78 62 -15 34 61
4287F1Pj31J53j43L7o3J24oj9n7J09q0j6L2j31O5J45p6J4M8l5K0j24R0K7j10j06
$$ 61 68 -63 90 -53 -16 -79 45 39 20 -37 72 -8 -24 8 -123 -58 87 11 25 73 38 58 -66 24 51 -59 -165
4314a65J91j64J07N7m3N0Qm7O5M8j21K2J8M5j17j16J25J07j17k0Lo8J03p0l9J61
$$ -165 26 -138 -31 26 -17 33 41 -6 59 107 -14 8 26 71 -46 -162 -37 70 -47 -67 -64 -132 -29 -99 -138 23
4340B3k2j7J77j73J51o6k4m3j0nJ13Q8j94m8J15j1M1k26J43K7r9L3O6J09o1Pj31
$$ 23 1 -16 161 -12 139 73 49 6 -4 -9 104 192 -2 -50 65 54 95 -131 12 39 -60 -27 39 148 87 94 -37
4367c7J60j64J04J6k20J63Q8j99O9P7l0p7lM7K0n1M0J82k06n9J59k19K41l8j00
$$ -37 123 -41 63 79 -141 22 110 -89 -20 57 27 -50 -53 -6 14 -37 3 185 -21 -80 79 -140 101 63 -37
4392c7J05O8j86J05n3p1Q2n0p4J52k7n0M1j5J09q4m5N2l3l3J9O0j10J46j63J52
$$ -37 68 136 -50 55 2 -69 13 -37 -111 41 14 -36 5 -10 99 15 -30 22 -11 -44 -25 35 -75 71 -92 60
4418F0L4j44M5Q5j25M9j4o7J01L3p3K9k2M1P8j42PM2k9N2k0P0O0k29L9O1q8K6
$$ 60 94 -50 -5 80 -45 4 -10 -77 24 57 -16 13 -9 32 110 -32 -25 17 -12 40 20 90 150 -79 -40 21 -67 -41
4446d1N2q1M2KR1k4j5k3J30j26J04j27R5q7O9j45J80j37nKO9l3j16N7Q7l6j0k7
$$ -41 11 -70 -28 -26 65 41 26 3 133 7 111 -16 79 -8 61 -84 96 -41 -46 -44 25 -8 -124 -67 20 -16 -26 -53
4474e3P4l8P7j44P3l2pJ31R8j53j53R5RJ26j98O1J0Rn7P0l7L9M3p7J40Kj38J52
$$ -53 21 -17 60 -84 -11 -43 -50 81 179 26 -127 -32 -23 103 -95 -34 -24 -15 -72 -2 -39 0 43 -34 106 108 -30 122
4502A22j27m6K35j39k76J70rJ27j02MJ45m5j64K20j09p6J31j11R4L0q0p4J00r2
$$ 122 -5 -51 184 45 -231 -61 -70 57 -45 -41 104 59 -105 115 6 -70 61 -50 44 74 -6 -80 20 -72
4526g2J46q1l4J18k44J43K8k1n8L9N9m3L1p2M3J23k05J92j9j41J5N7L8p1o9J16
$$ -72 74 -7 -41 77 -167 -24 4 -17 -75 -36 23 -20 11 -61 -18 105 -100 92 73 -68 -53 4 42 -29 -98 18
4552A8rn1J62j97r8K31k5j08K9J5j5J24q6M8J6r8P1r0k2Q9k6q8N6l0J27k2j44
$$ 18 9 -42 120 -77 -175 56 31 -77 -48 -33 -48 76 -10 38 54 -44 27 -63 -85 4 -22 -110 -54 -84 43 21 -123
4579a23L3J59k80L09r1m0J07j39N7O2j62J23R1j48J77j70P4l4M9j55J60q9p9K18
$$ -123 -90 69 -211 98 7 -33 74 -65 -8 54 -108 15 106 -42 135 -35 39 5 54 -101 59 -30 -109 109
4603A09q1l6M1Jl3K3j04J77k0j95J04lN1l7j01J27o6p7J40o4j01O0R9j8m2J01
$$ 109 28 -8 33 34 1 24 -80 97 77 -118 -14 -17 34 -3 -104 23 -43 -120 20 -44 -145 -85 14 -4 -46 55
4629E5n6N0o2J4j9P4l4l0l8oQ3n9J23j74N7M8n9k9R1j40J50n7m2J00O9j33J54
$$ 55 -1 49 -13 1 -18 56 22 -8 -46 -52 31 -28 95 -79 -22 26 -33 -62 29 -111 39 -18 -60 40 109 -24 130
4656A30m8k9L2n9Rl2o2P1n5p0Q6Kj7P5n2l4K7j9J14j32N2k5J21q7N3k1l2J38j33
$$ 130 82 53 85 26 35 3 -59 12 -43 -113 -27 -25 -42 33 -19 -53 -26 -45 69 -63 -11 -36 85 -2 51 30 -2 136 3
4685Ck1K7o1Q6Om2Q8k17j9L03j65kM9j16J69q1n4J00p3L7rr1O5mno5P3K9j05J00
$$ 3 -18 9 -52 34 40 -2 86 -131 -150 153 -12 -14 35 -81 88 7 -47 53 -20 17 8 -83 -18 -22 -27 -92 -19 10 -95 5
4715Ej0j02K38k07J20l7rR4o1Q5O9j29n8R8o7K8j27l4%R4J7J40k66J05P9j88J86
$$ 5 -5 -107 131 -76 44 7 -2 92 31 116 185 56 -2 96 29 57 -70 -104 -104 -10 7 147 -119 -14 65 -123 63
4742F3k3m3L5m6j2O8J6K0m3q9R2N2j43R0O0j70J81q9r4J64j34O2J14j35o3K23
$$ 63 40 -3 32 -14 -26 42 58 78 35 -54 38 90 -53 37 97 -73 108 19 -75 89 -45 17 131 -4 -67 156
4768A56j13j4lk9M7o0j8L9N6m3j24R4o4P0K3mj2j27J15j6L4j4r6J56p6n1R0J28
$$ 156 43 29 26 -3 44 -16 -34 5 61 18 -106 -12 -76 -6 17 13 1 -126 -11 -27 7 -7 -103 53 -23 -74 16 144
4796A44j37m4Q4K3o0L5q3Q2p9J8pn9J80N5j29o8K37k63Q6P9j36P0j05P6l6n2J53
$$ 144 7 -37 47 70 10 45 -38 44 -35 -17 -24 -83 97 152 23 -45 192 -71 15 94 -42 28 -77 -1 -37 -89 64
4823F4n5n8J35j56p9R7J18o3R0j32N0J7j8rR5j75J01N4k46J29O8LP2j55M8j2K3
$$ 64 9 -49 86 -70 -149 -52 66 3 93 -39 11 28 10 1 96 -79 22 76 -170 -41 27 30 102 -53 -5 -17 6
4850FJ78j37p3JJ02j24J20l9oK2p0P9K2j31k5jL9P3j55J75j3N4o0m9Nm4N8J37
$$ 6 184 47 -26 -25 77 -47 73 34 28 50 -20 59 81 -50 -75 -76 -37 36 -119 56 43 97 37 -12 -7 -51 7 144
4878A44k21J67r3o3K5pJ77k26nJ12rj79J73L0mJ00n8kr9k0J04Mp9J21n2l1P3q1
$$ 144 -77 90 -3 -66 -41 -48 129 -97 -102 10 1 -178 -5 25 21 121 63 61 -38 -58 46 50 -29 92 40 9 82 1
4906AN8J6j28PL6k6P5p5j7P2r3J44K2n2J6k9r1O8o2P3M2j47O7M4k2n3J04k5K0
$$ 1 59 75 -53 -46 -10 -36 39 -36 -53 19 -74 70 92 40 56 27 -64 4 -58 15 57 -90 -23 21 -1 -54 50 25 45
4935D5p6o0n8J69j93J09M9K4Kp5J41J3j75J44ro1R1J1j75L3N3k0K0j07J64o6j15
$$ 45 -31 -91 -149 20 -173 -64 -15 9 11 -64 77 90 -85 59 50 -11 80 91 -84 -51 2 -18 2 -105 59 -7 -122
4962a22N8l6J30Q8nj26k6L8k0Q1l7J1J84k36Q6j16n6J56p3j9J1pQ5q6N4Q9n7j31
$$ -122 -64 -100 30 118 113 -13 -39 -1 -21 60 23 34 218 -18 68 -48 -104 52 -21 -40 -29 -36 49 -37 17 106 49 -82
4990h2O4oJ00k8m3j9K0j18J02j4j58J60m4L0M0J8K9q0o0J11j3l5%J92k03J07Q9
$$ -82 -18 -24 76 48 5 -14 6 -112 -10 -24 -182 -22 -66 -36 4 22 51 -29 -89 22 9 -26 -26 166 -37 70 159
5017A59j62J35j34L4O1j35O9J8p8Q3p4M2n5l2J76q0n4m1J46j11J3J04r0k9R4j27
$$ 159 -3 132 -2 32 93 -42 27 45 -33 50 -24 18 -37 -69 107 27 -27 -68 78 -33 -20 84 -6 -35 59 -68
5043f8J48k25Q8J81j52l9J35n3o0l7J1K2O4n1m2N6j1R7j57K9J2J5J15j02o4J59
$$ -68 80 -145 -57 124 -28 -67 68 15 -45 -82 -71 -49 15 -36 -78 -22 -33 64 -93 -64 -52 -37 78 -24 -88 71
5069G1j60K0L5J30j70J08q1J12Oj35J84Rj22N6q1k9Mr8MJ90j91J37q6PJ07p2m0
$$ 71 -89 -69 -34 96 -74 34 -47 65 71 -64 120 129 7 63 -18 -47 -43 -141 -137 53 -138 -1 -87 -80 27 -45 -85
5096h5J29k5j54K52j37j2J30j23J2O9j33PP5r9P4N3l5M4l3M8N5j59L4L2p0N2J10
$$ -85 44 19 -135 117 -20 -32 98 -25 -13 56 -77 -70 5 -94 -20 33 -2 42 9 57 112 -47 -13 19 -51 1 111
5123A11j59J04po2n0J36k39K02m3l6r5Q7L8J25k54J72p3l7N9rO2M9k3Ll6l7J75
$$ 111 -48 56 49 -13 -63 73 -166 36 -7 -43 -138 -51 -13 112 -142 30 -43 -80 -21 -30 32 81 58 61 25 -12 163
5150A63j55M0kQ4j56J3Q7p6l9O8r3K0qj3J23j38J17j3M9q2K5l7K2K9L6K2o3Q5
$$ 163 8 48 46 130 -26 -13 74 -2 -41 27 -66 -46 -54 -67 56 -82 35 22 71 -11 14 -23 -1 28 64 86 23 108
5178A08p5j14J67k4p0J7j11J28ml2J19nj71J3J64j23J1k4O1m1M3j20j4J03j18
$$ 108 33 -81 86 62 -8 9 -102 26 22 -10 109 104 -67 -54 110 -13 -2 -26 35 -6 37 -83 -97 6 -112
5203a12J69j32J35j39J04J24q1j11M2Jm6R8oN4j50%J9J82j48r4N2R3M4j96P4j
$$ -112 57 -75 60 -79 25 149 68 -43 -1 0 -46 52 46 100 -50 -50 -31 151 3 -91 -39 54 98 -98 -24 -25
5229b5j07J14J3Jj5N4n5P9Rj66J80j19r7K19j30N4lr9M7lk8J17O0j43R7J7n6J24
$$ -25 -132 -18 -5 -4 -19 35 -20 59 68 -98 82 -37 -134 85 -45 9 6 -93 -46 -49 -77 40 100 -43 54 71 15 139
5257A39j63L1J65k49L4L0Ml0N5j40R6L7n4N7m0l9J67j73k9J47K0p2J5l3MJN4j12
$$ 139 -24 7 172 -77 -43 -13 -9 -39 16 -124 -28 9 -45 12 -28 -67 100 -73 -102 45 65 -7 8 -25 -21 -20 34 -78
5285g8j3O6N6j47K10r6p4Q2j14Q0N6N0j22R5K9P2p0j33K29j40M1k9N0o1j28P4
$$ -78 -91 -25 31 -116 94 -2 -76 6 -108 -28 28 78 -44 51 80 152 82 -51 178 38 79 50 100 39 -89 -15
5311a5J0R2q7j18J51q8J69j67m6J80j04j2R9q2pK6l6N3M6n1m7kP6k0q6O0M5q8
$$ -15 -5 87 0 -118 33 -55 114 -53 -99 81 -23 -35 64 -18 -25 1 -35 18 64 13 -34 -36 40 20 -66 -6 39 -49
5339d9NK3K1K5n0r8K20j79Q0J13k07J35N6r2m5N5qp3mk7K3K2R7q5M0j40K05k7
$$ -49 -44 -21 0 25 -25 -123 97 -82 -2 111 -96 39 95 3 -42 13 5 -68 -72 -99 -76 -54 43 -42 -2 -142 63 36
5367C6J3N1j26J24j58m8R8k1J4j9N2o6J8o4R2J22k70K75l3j33K3P2j80J40n0J30
$$ 36 49 100 -26 98 -60 -108 -10 -31 -17 -36 16 -50 -32 -96 -4 118 -152 123 90 -43 -20 52 -128 12 -38 92
5393I2J11l37K01n5j02O9J06p1p4P1ml0J1j05J66j12K7J02n8J4m3J8K6p7p0K35
$$ 92 203 -134 67 12 -90 -21 85 14 -60 11 7 -23 -12 -117 49 -63 -36 66 8 22 -21 -3 23 -54 -124 111
5419A11q3L9n4j74J96Jm2j2J1r0O2o6J43l6j34J60O3r2J94m6n3l3n5K8J17k21
$$ 111 28 67 13 -161 35 36 -6 -18 -7 -97 -35 -101 42 6 -128 32 95 3 197 151 98 65 10 38 155 -66
5445f6J20j94J19m1L9j09Q9P5m4o7M9J14j03L4J03p4l0pk2r4J38m4p8R6r2J48
$$ -66 54 -140 -21 -62 -23 -132 -43 32 -12 -79 -30 84 -19 15 118 44 14 7 -15 -109 29 -15 -93 3 -89 59
5471E9K2j15qJ29r7R4j00K1M1m2K9N9k46J72j8p2k8J34n2R3q6j17J30l1J1j02
$$ 59 81 -34 -42 87 -10 84 -16 5 46 4 33 92 -154 18 0 -72 -100 34 -18 75 -11 -128 2 -29 -18 -120
5497a20J69k1J8r4O4J5l1kO6j38J17pj25J06k9n2N0k58K91R2k12J89j49O3L3N3
$$ -120 49 28 46 -48 16 31 0 -2 64 -74 43 36 -89 17 -12 -64 -14 -272 19 111 -101 88 -61 2 35 88
5523H8j8j07J4P7P4q1j01R8n1q3Q2p8K02n7j54J45o4j00R4rR4J13l32K67k3j85
$$ 88 70 -37 -23 54 128 47 -54 44 -7 -90 -8 -86 116 59 -95 50 -14 -114 -20 -29 65 178 -154 113 90 -95
5549i5J68j21P1P1j34J38o5m4M8N5j12m4Q9N3j05oJ09j05NrJ33o3K3Lo2J33r4
$$ -95 73 -48 23 94 -40 98 33 -11 37 92 -20 -64 25 78 -27 -33 76 -29 -24 -33 100 37 60 63 1 134 40
5576D0m8J88k52N0R3q2L7k2j57J22l5RK3J04j44J03j09J08Q7j48RR5j19J39p9
$$ 40 -8 180 -72 -22 71 -11 26 4 -153 -31 -66 -57 -34 70 -74 29 -80 28 115 -33 -24 71 -48 91 12
5601A2j24J46j18J8J07j62%J35l3K5P2o5J0n7R3k6m2R7Pj26JM7j24J02n8RJ10
$$ 12 -112 34 -84 -66 41 -121 -121 14 -19 6 78 13 23 -34 59 33 -9 88 95 -31 -30 17 -107 -5 -63 -54 56
5628E6j24q9J85q2N1n0L1J52j50j8N2J2m0K05k24m9M1j6P7Q4k17J31m0pJ02j89
$$ 56 -68 -157 28 -54 -3 -53 -22 130 -20 -38 14 26 -14 191 -33 -82 -41 -57 20 104 -113 18 -22 -29 73 -116
5654a16Q7j5Q0j07N7L0k5O3On5P8m1J02j25j10J41p2k0L1p7O3l9R4n4J31j25J8
$$ -116 -29 -44 36 -71 -14 16 -9 54 60 5 83 42 144 19 -91 50 -22 -42 -11 -88 -25 -64 30 -24 107 -18 0
5681@J9O5jm3n5J84r9r0O7j38J29M1k01K08j74N3N1L9n0p1J9J09L5o1LP1j37J14
$$ 0 19 84 83 40 -15 169 70 -20 47 -91 38 79 -122 86 -88 -35 16 55 5 -66 -47 62 97 36 39 110 -27 87
5709H7P7k99J67l6J2J20j38lPj01M3O4J1p3lJ9J17Qj19Q7n6j8R7p9j3j5o2J64
$$ 87 164 -135 32 -4 8 128 -10 -13 -6 -107 -64 0 11 -62 -65 -46 71 79 -40 47 -9 -27 70 -9 -22 -37 -99 65
5737F5nj16J07p6O6j02n7L1J60j7m6l3L9M9m9o6J23q8N8O7j48O4jk2L3l3j16Q4
$$ 65 60 -56 51 -25 41 -61 -118 -87 73 56 10 -23 16 65 16 -50 73 -15 43 110 -38 26 25 3 36 3 -113 -29
5765b9q1J49L6M2j76M8j4o4J53j27J03o6p0J08Pk0J0l3J30j48L0Lj6M1J2n3m1
$$ -29 -110 39 75 117 -59 -11 -25 -89 64 -63 40 -26 -96 12 19 -1 9 -24 106 -42 -12 -9 -25 16 28 -25 -66
5792f6J30m8k1n3J91n0n3l4op6N3j1J10p4L8r2J4Q6j05K0J18j43K43j34j09J36
$$ -66 64 16 -5 -58 133 83 30 -4 -10 -86 -33 -44 66 -8 30 -62 -48 38 -67 -47 71 -72 171 37 -72 64
5818F4j07l4R6j2Kk6ko7P8q4kK00k54J56Q9j86J34L4r2J21j84J28Njj4k1m9N4
$$ 64 -43 -77 19 7 9 -17 -19 -86 -8 -92 -94 106 -148 8 97 -89 45 79 -13 108 -76 52 57 56 42 21 -28 26
5846B6N2o9j9L4ol4K8l2J1l9k2J04k4Q8j43l4Q9j0p6J41q6k4N9l3P6n6K4Q4j41
$$ 26 78 9 -10 24 18 -16 12 -20 -9 -48 -70 34 10 98 -45 -79 10 0 -76 65 -21 -45 14 -19 57 1 25 109 -32
5875c2O5M1j73J26l5p1K6J51m0O2j66j8J15j44N7J01j7P7r0j5k7Ko0K1L9J32j88
$$ -32 33 74 -99 27 -8 -79 -53 98 58 120 -46 -64 51 -93 -36 65 48 125 35 20 -7 -5 -65 -44 -5 127 -61
5902f1k5R3l8L5l5J15o0J6m9p0J59j38q5J81r6j49L15m0l8p3Mm1J82p0JK0p9P6
$$ -61 -86 7 -31 4 -31 84 24 40 -9 -79 80 -58 -143 38 -58 -207 108 68 30 -43 -39 -80 102 32 33 53 -26 50
5930E0p6M8j01N4J7n9j1K46j88O0lm8N1O3l2kk8o8N5M1o3k3J42j93J38mr8P1q3
$$ 50 -26 22 -79 -25 -8 -67 -78 168 -20 40 37 -11 40 103 71 69 41 -27 28 69 6 -17 125 -68 70 66 -32 39 -44
5959d4rO9p3J74j12m3N9M8j00pq4J86j6J0J8Qr5L7L3j30J96j67J0l2M7L6N1j23
$$ -44 -53 16 -57 117 5 -38 21 69 -31 -38 -122 64 48 58 76 84 -11 26 59 -71 125 -42 -32 -64 -17 19 70 -53
5987e3P5r3M1Q2np2k2O9NQ7j81J30M5j00l9Q9j03J12%o5n4L4n4O6p8J42jo6J21
$$ -53 22 -71 -30 52 47 -25 -47 22 27 114 -67 63 108 8 -31 58 -45 67 67 2 -52 -18 -72 -6 -84 58 57 -9 112
6016A12n2NL2j10O8%Jr2M1j01L8J9m3O2J17j99J31p0K2J05j1j2q2L8O4k1j36M6
$$ 112 60 65 97 -13 55 55 56 -36 5 -96 -58 -39 -82 -20 97 -102 29 -41 -19 86 75 63 -19 19 83 62 -74 -28
6044b8L8L8j39N7l5J3j8o5K22r6K1J26j52Q9j53Q4J16j16N2n7J1K5O1p9l3k6j5
$$ -28 10 48 -91 -34 -69 -56 -74 -139 83 -13 8 134 -18 71 -82 2 118 2 54 -3 8 33 94 15 -18 -44 -59
6071e9r6J16p5R1N2L4K0j37K2J55j88O2L5q2L6J07m6Qn5m3k0J26l4q3q1O2L9k7
$$ -59 -155 -39 -114 -23 29 63 83 -54 -32 123 -65 -3 32 -50 -14 93 47 55 0 -43 -63 63 29 -54 -135 -73 -34 -61
6099f1J03p5o1Q1M3l2L2l1J0p5J03j9m6p1K19Mj61m7K5J31j16R8j5%j28Q5j8J4
$$ -61 42 -33 -94 -13 30 -2 30 -1 9 -66 37 18 -28 -99 120 124 -37 -84 -59 72 -44 54 39 39 -89 -4 -22 -8
6127hL8j6k4j7K1O2j25l1J20o2P5on1j2M0r2O5N8j11j5N2M5M6j2mM7j0n7J55j34
$$ -8 30 14 -10 -27 -6 56 -69 -100 20 -42 33 27 -24 -36 4 -88 -23 35 -76 -91 -39 6 52 40 36 83 73 16 171 37
6157C7m7L1m9K8Q2j32j3N7l6o1P9lJ70%j22P2j23K3P4j48N8Q1o5Qo3K3R2p8Q2
$$ 37 -10 21 -28 0 82 -50 -63 -6 -42 -103 -24 -27 143 143 21 93 -30 -7 67 -81 -23 58 -7 1 -62 -39 53 -25 57
6186E7m5K6q2Q9j34J65j48J03l1l2j26K46L7j16K0q0K0J10j23krJ03p3J6m0R1
$$ 57 12 38 -44 45 -89 76 -72 31 0 -32 -158 88 125 9 29 -51 -31 79 -44 -46 -55 48 -25 -9 -49 42
6212D2n1Qn6K2N8lo2J03l3q2K08j96k9M7N9M5p3m5J4P8r5P9o2j34K20j05m7K02
$$ 42 -9 -1 -57 -35 23 20 -42 61 28 -54 154 -42 -71 -24 35 80 7 -38 -24 54 -41 38 -24 -158 62 -43 -90 112
6240A12j69P1o7k2J05O7j65Q3n0L5J3J6r0P9m3M5r2J21O9m4j13O5N3q6N9M0r3
$$ 112 -57 14 -53 -75 30 97 -68 15 -35 0 13 29 -61 18 -25 20 -72 49 118 74 -39 26 79 -7 52 92 -1
6267anj17jJ13K2m5j7O3k4m5l9J41j01j7J29l2P4L5j45L2J4M8j04j05J15L5qj05
$$ -1 -6 -123 -124 -11 11 -34 -51 12 -12 -57 -96 45 -56 -73 56 24 98 133 -12 20 34 82 -22 -127 -12 23 15 -90
6295i0J77j67K35q1j20K1J4j09O9J88p9%j16R1J06k46K02m1p0L1j27N7J16j50
$$ -90 87 -80 155 74 -46 -25 -11 -120 -51 137 58 58 -58 33 139 -107 95 54 -16 15 -112 -55 61 -89
6319h9P2m4K6L9K3o4N1L3n2l5O7j6L3lj7k8L4p3J02o5N1r5R8j26N6P7m5n1P8J3
$$ -89 -17 -61 -35 4 27 -37 14 47 -5 -40 27 11 44 41 24 -4 30 -43 59 -6 45 -50 48 -78 -22 55 10 -41 37 50
6349E0j46Q7O1jm1J6nJ37j40J12j17j9J4OL2j40K04j38l1J67j03Q6j1j88K66j96
$$ 50 -96 -9 52 51 10 26 21 158 18 130 13 -6 8 14 46 -94 110 -28 -59 108 5 91 80 -108 158 -38
6375c8N1k6l7k8J94j64nK1pJ1N4n7O8o5N0o4Kn1Q1oo4J41j67J31M5j3n8o2R8q
$$ -38 13 -13 -50 -78 116 -48 -53 -32 -39 -28 26 -31 37 -28 22 -42 -40 -91 -10 -16 -80 61 -106 25 70 57 -1 -63 35 27
6405B7j11j6Q3M0L6L2j70R6m9J40K2o5m3K9j39J4J33j82K09j9l9mo7k5M8RO1k2
$$ 27 -84 -100 -17 23 59 91 -79 17 -32 108 130 65 22 51 -88 -74 59 -123 86 67 28 24 -43 -68 -20 -11 50 28
6433B8j22J16M4o9K00j63j76R7P3J9qj43J35J1l2rj2j02R3M0j18L7m7J22P4j49
$$ 28 -94 22 66 -3 197 34 -142 -45 28 47 39 -104 31 42 10 1 -11 -113 -20 20 -98 -61 -108 14 88 -61
6459f1k2J74o7NJ65l44J24P3q5mnM0P0r8o3J05l6R3m3M6l1j9o7n7J30r9P3j4J28
$$ -61 -83 91 24 29 194 -150 -26 47 -38 -42 -47 -7 63 -35 -98 7 -29 64 21 67 36 17 -50 -107 23 -76 -3 -17 111
6488A11k14Q9J37j79J7M1K5L1q5R3p8%p2Q3k3j18L3J69p9J28q2n1P9p7J0Q0k5
$$ 111 -103 -14 123 -56 -39 2 27 58 -27 66 -12 -12 -84 -1 -24 -142 -109 60 -19 109 27 -24 55 -22 -12 68 43
6515D3l9M6j01J3M1N8q2J4P0q2J12j69O4N1m8J26j45R0p6K8J3J00j81R8J0J3j00
$$ 43 4 50 -51 -38 3 61 -21 -7 63 -19 93 -76 -12 39 -9 117 -28 62 -14 14 27 127 -54 44 54 67 -33
6542c3NrK5K9j8J6J5L1N5r8J8L7j03L4J1O1j14P9L4j29P2M5L7m3k2k52J22Q7j
$$ -33 -28 -37 -12 17 -1 15 30 61 116 18 36 73 -30 4 15 76 -38 41 75 -54 18 63 100 57 35 -217 -95 -8 -9
6571iRJ5q4N9j0j8R3k13J20P5p2L2N8j27Q5l0QK9l8j14P8o5J12j21K22r9K6l3
$$ -9 0 15 -69 -10 -20 -38 55 -158 -38 37 -35 -3 55 -72 13 -17 -9 20 -18 -132 -54 -119 -7 -128 94 -5 21 -12
6599a2qQNQ2Rj92J35L3n7J0Q4p9m8M9jJ04k02P0q5J55pq8J3O0Q7q9ql8R3N4k23
$$ -12 -20 -12 -7 75 84 -108 27 60 3 13 97 18 -30 19 18 122 -80 -10 -95 60 53 -35 -22 38 125 36 28 -10 83 137 -86
6630h6J0jR1j43O1J61j03m6J37j28K9K2Q2j48O2j7J01jj73M3K1l4N1j6N8%j0r4
$$ -86 -76 -77 14 -129 -68 93 -10 -56 81 -47 -18 4 86 -62 0 -17 84 83 -90 -47 -26 -60 -9 -25 33 33 23 -71
6658g1M2k7j6Q1l4r7J51qP8Ll5P5j75M1R7j06LJ6j8PM1l5k5k5o2N7O6n5J14j3
$$ -71 -29 -56 -72 9 -25 -122 29 21 99 102 67 142 -33 8 105 -1 2 18 0 7 48 13 -12 -37 -99 -42 24 -31 83 70
6688G0q2J06j02L4J16j36Qm3rP7m2j5O3j29J39N6j57J19p8r2J00J16j82J3N2L7
$$ 70 -12 94 -8 26 142 6 14 -29 -38 39 -3 -18 45 -84 55 111 -46 73 -5 -97 3 119 -63 -50 2 39
6714C9Mo3j19J66j20J03Op8R8Nj11J11Ok2R1j02o5J81k44K2J07p9R1noO0o7r3
$$ 39 43 -20 -139 27 -93 10 16 -62 36 41 -70 41 47 25 116 14 -51 130 -114 -92 15 -64 27 22 16 76 9 -84
6742h4Q4j36R9k9p2J86j10M2m3R8m2j8K3R7q4j03N1N7L4k03J00P1%j4j05Q9n4
$$ -84 0 -136 -37 -66 -138 48 -62 -20 -63 35 -7 -25 -2 95 11 -92 -41 16 50 -153 -53 18 18 4 -101 -12 -66
6769f6M3O3j31K00q9M6n6JM9k0j13M6O0j22J35j9k41J81k2M2J28j80J05l4Q0n4
$$ -66 -23 40 -91 109 20 66 10 11 60 40 -73 -27 33 -89 46 27 -214 -33 -55 -13 115 -65 40 6 86 32
6795C2O5r7l2J04j20N7K9j27L6N1j18M4N2q8J05o5M2K5k0K2lM7n8n2J98q4O8j24
$$ 32 97 0 -32 72 -48 9 38 -89 -53 -2 -120 -76 -24 -112 -7 -72 -30 -5 -25 -3 -6 41 -17 -69 129 45 113 -11
6823a1O7Oj5K4j21L6K5j8n1Q7j10%K02j69J05r7MK8pP2k6Q6op5j06O3N0j17J36
$$ -11 56 62 47 71 -50 -14 11 -7 -58 29 -81 -81 121 -48 57 -40 -36 -8 -15 57 31 117 111 36 -70 -7 43 -74 62
6852F2j56J6M0K2N8Nj18K20k6q9l5pJ68o7o4p4P9j73J59K6r2R1j32O1J1Q7k10
$$ 62 -94 -78 -38 -16 42 47 -71 149 123 34 -1 -8 160 93 29 -45 34 -139 20 46 -46 45 -87 -26 -15 72 -138
6879a38J09Q6p5Rj34J96n4J1Q1k39Q4P9r0M7p5L5Q3L2jn3K5r0k7J34j30J04k02
$$ -138 -29 57 -18 -9 -143 53 -1 10 91 -148 -64 15 -75 -28 -103 -68 15 47 46 -7 18 -72 -99 35 -95 9 -193
6906a93J76N9q3R6M6r0j25R8Q0n6R9j07M2m3qrM3q7Q0p3k5J50p9n5J70j51M1L9
$$ -193 -17 42 -41 55 101 11 -114 -16 64 8 107 0 42 -1 -9 -18 25 -62 18 -55 -80 70 -9 -64 106 -45 -4 35
6934C5l9O5o9ln9J18j81J70j15J90m4j58O3M9J1K1Nr3J28r2K2l5j5q7J59j09R2
$$ 35 -4 61 -8 -11 -70 48 -133 37 -78 112 68 -90 -27 22 33 54 59 -34 94 2 24 -11 -26 -113 46 -63 29
6961B9q9K09k26L3j5J9L0M9j03L3J09k07M2KN1J5O6j03J60j52Q5p3P0j12J10j3
$$ 29 -60 149 -77 -44 -59 -40 -10 39 -64 -31 78 -129 -87 -85 -34 -19 47 -56 104 -48 37 -36 34 -78 32 19
6987A9j10k4N6R7po1n7O0k7J64k8j22M9k0M3O7p3Q7k7j18RN1p5l9K0M1N1j04Q3
$$ 19 -91 -115 -59 38 31 -30 -87 -27 -54 110 82 -40 9 -11 32 99 26 113 86 -32 -23 28 -47 -86 -66 -25 26 -78 5
7016ElP8j45J35r0Q6nLl2K9%r5pK2q8R7Ro3J35L3j04K4M9j92J00P8j07J08ol7
$$ 5 2 80 -65 70 -20 66 61 64 32 61 61 -34 -41 -19 -107 -10 -1 -64 71 104 0 24 73 -119 -19 59 -48 60 54 17
7046A7J11j14j7L2j6L2q3m5R8rj2K6k9o4k1J25j59K79j85J10o0M5N0o9O5j88J58
$$ 17 128 14 -3 29 13 45 -38 -83 15 6 -6 20 -9 -73 -94 31 -128 151 -34 76 16 61 111 42 107 -81 77
7073G7j27PN9j89J81n1k5J52j22M1%l3P8o7j5J45j79K9K3%L1k6K1m1J6n6P3L0
$$ 77 -50 -43 16 -173 8 -43 -68 84 -38 3 3 -30 48 -19 -34 111 -68 -39 -16 -16 15 -11 10 -31 -15 -71 2 32
7101C2n6K5J9L0j7l4k8jJ35j28m3K4J03j0K5k4oM0o9K2j24K12j35mL6Jl3n1J23
$$ 32 -24 1 20 50 33 -1 -29 -30 105 -23 -66 -42 61 51 76 52 46 86 17 39 -85 127 -8 -12 24 25 -8 -59 64
7130F4p0r3Q4N1Q0j90J50j18O0N3k26J87j74P7J36L7j30N4k7o1L6J42j74nR7o6
$$ 64 -6 -99 -15 36 116 -74 76 -42 18 71 -155 32 -142 -65 71 108 -22 32 5 -56 -20 122 -52 -57 40 -26
7156b6M8q5Q1j8L7o0o9K4O2p5R8K9l1j31R4n4O5m1J3N1o0O5J56j49R7j16o1J94
$$ -26 22 -63 18 0 37 -23 -92 -68 -6 -81 17 46 15 -116 -22 -76 -11 -52 -39 12 -48 17 173 24 121 5 -56 138
7184A38j22l5MJ3M3n6mJ1J95k51N1P0j25J22j22J06J4LL6j4P2j77J20K5j89K1
$$ 138 16 -19 -15 -2 41 -15 -19 -8 187 -64 -13 57 -68 54 -68 38 52 55 91 77 149 -28 92 117 -72 -51
7210e1p8J08n8pN6p4K06j2q4l8N2Nj4Q8j72o9J00N7J20o9r6K3M8l5j3Qkn9k4N9
$$ -51 -129 -21 -79 -86 -30 -104 102 90 6 -32 20 25 11 99 -73 -142 -42 15 135 66 -30 -7 41 6 -7 1 -1 -60 -84 -25
7240b5M3K6O9r2K0ml4J06n7n4p3O0M8k82J98m0R5JL3j5N3j04N9n2QK4j42J13N5
$$ -25 18 44 113 21 41 37 3 109 52 -2 -75 -15 33 -249 -51 -91 4 5 38 23 76 -28 31 -21 -13 11 -131 -18 37
7269C7o5l2k4K8m7k9Q8j9O1l6L4k5j2J8n8L3Ll4J01q0LJ02K3r0k3K0Q9r1nJ45
$$ 37 -28 -60 -84 -56 -103 -132 -44 -63 -2 -38 -4 -29 -41 -23 -81 -48 -45 -79 22 -58 -55 47 70 -20 -43 -23 66 -25 -30 115
7299A15j29J16j76N9O2q6P8j17J47q3P4Ro7N2q0MQm9J54j25kJ43j15n3J0M9j01
$$ 115 -14 102 -74 -15 47 -39 39 -78 69 -14 60 69 2 54 -26 -22 -14 -63 91 -34 -36 107 -8 -61 -51 -2 -103
7326a03J30j06J89kl7K6j17r4J92p1J39r0j95J08J01p0q2M4L3R4o9j37Q3N3Qk9
$$ -103 27 -79 110 108 71 97 -20 -114 78 7 146 56 -139 -31 70 0 -82 -38 -5 89 20 -117 -34 19 27 -2
7352bj45K09r3Lr9K25r0Q3n9m1j7N0m0l3LnO2n4N1n3p2K09q3l8N5l8m5N1k0J3
$$ -2 -147 62 -31 -28 -127 98 8 91 32 -9 -26 24 -16 -49 -46 -51 11 -43 8 -45 -117 92 9 -29 26 -12 -57 -6 -26 -13
7382a3J61k1j20O2j72P9P8m0Q0j35Q0r0l6Q8N4j68J41j3l5J01l6j06J01n3J9L1
$$ -13 148 127 7 69 -103 -24 54 14 94 -41 39 -51 -87 1 55 -113 28 15 -20 81 45 -61 40 -13 6 37
7408C7j1K3j52R0K6l3J33j28M1o6Q2j49N0J25l5n5M3J5r4Q1L1j56J18R7l4o4o
$$ 37 26 49 -103 -13 13 -20 113 -15 26 -40 42 -107 -57 68 33 -22 21 36 -58 23 54 -102 16 113 79 15 9
7435Ij44Q4J48j20Jm6O3N5O4j72l4O1N9p0N2kp0K06p9j59J29j07O8l7M0L6j42
$$ 9 -135 -51 97 -23 -22 -68 -5 50 114 -58 -92 -31 28 -42 10 8 -62 144 65 -94 35 -72 -4 -41 -1 35 -107
7462a07O0P3p2J7J5O4Op3j3Q9j18M5N3j16J68o8K0j47Q4M0n9M7p4P7m5O5j2j21
$$ -107 -47 26 -46 -29 -14 50 56 -17 -30 59 -59 -14 39 -77 91 23 43 -104 -20 20 -39 8 -66 11 -34 31 19 -102
7490a02J29k0m0J95j55j9K8q0N7J13j19J6O4kj06M0J4j02N2J9L0j5j8QO1P1j13
$$ -102 27 7 -33 162 7 -12 16 -64 -7 106 -13 3 67 65 -41 -1 13 -89 -37 -18 12 -3 -21 -13 48 119 6
7517Fj0L2rM3J9j1k8p8n2M1l0Rl4N8M3KJ1j09J55r1K0m9J2pR3j17P1nJ7Q8K8j46
$$ 6 -4 28 19 62 81 70 42 -36 -88 -47 -77 -68 -102 -44 -1 1 12 -97 58 -33 -13 -62 -50 -57 36 -81 -10 -15 2 90 118 -28
7549b8Q2L0j64L5M6QR0j02N4o7l9L9KN4q9J20j73L9J9K5NL2n4L1N1nK6p1q0N6
$$ -28 54 84 -80 -45 1 9 99 -3 51 -16 -55 -16 -14 40 -49 71 -102 -63 -44 -19 -14 18 -36 -5 46 41 67 -4 -84 -28
7579b8K5M7j00%j9J85j1k26J05NR8l1l1l9n7Q9m8p4J52j23J47no5p5Q3KL3jo7
$$ -28 -3 44 -56 -56 -75 110 99 -127 -22 -17 81 50 19 -20 -77 12 -36 -110 42 -81 66 61 -4 -79 4 6 39 38 -29
7608b9J46k26K75k72J05n6P8q1N6j7K9j90M2K18l7k5K8j5J4o2K0j2M2l7K8J08
$$ -29 117 -109 166 -106 -1 -57 21 -60 -4 -21 8 -182 -140 78 41 16 44 29 43 -19 1 -11 31 -6 22 130
7634A30p1j07J5j7O8K1l0L4J5pj3j29R9l6Q4n3J44j25l8J92j79J04j5j08R3p9
$$ 130 59 -48 -33 -50 18 39 9 43 58 51 38 -91 8 -28 56 3 147 22 -16 176 -3 101 86 -22 71 -8
7660hM6m2o4L9J17j34N9n3L6J37j54J3N0j28M2L5p6p9O0P2N5R2j76J22o0j29J14
$$ -8 38 -4 -68 -29 88 -46 13 -40 -4 133 -21 -8 42 -86 -44 -9 -85 -164 -104 -32 23 115 -61 61 1 -128 -14
7687a4No2J02n4j20J93K0n0%m4K1m4pJ13m5j29J53N5PK2j69j2O1%n8J42j9oOj73
$$ -14 -9 -71 31 -23 -143 50 70 20 20 -24 -3 -47 -54 59 14 -115 38 93 100 122 -47 -59 2 2 -56 86 67 61 67 -106
7717a06J23NN7p5N2j05L3n5J76j03j10J42m5PN9Mq2qM3M5q9P7lK5M3j07L3p0j
$$ -106 17 22 79 4 56 -49 -16 -71 105 2 -108 34 -11 -4 55 59 -23 -31 12 57 -32 45 42 67 110 3 36 -34 -35
7746c5q8J15ol5l1K9k4K14j98O5q8J0J5N3N6J14n1j41J03J8M9j85n1J02k2Rl6
$$ -35 -123 -8 -14 -49 -80 -51 -75 139 -59 6 -82 -72 -57 -4 52 166 115 -26 77 95 144 -41 -92 10 -12 -3 -39
7773c9l5J6J38j36l2R8O5j05J28j05o9J49p9kJo6J75J3j47J62j60J21q1j44oJ80
$$ -39 -74 -58 80 -56 -88 10 75 -30 98 -7 -76 73 -6 -8 -7 -73 102 115 -32 130 -30 91 10 -134 -140 40
7799D0p0j9J43j45Q0j1k7N2K6m1j0j7p0Q0j17J36j7r3J44n2m4J24j90N1J59j79
$$ 40 -30 -49 94 -51 29 18 -9 43 69 28 18 1 -69 11 -106 30 13 -80 64 12 -32 92 -98 -47 112 -67
7825f7P6PL8p7O5j37J49J3l8R6j78Q1j58J07j0Q5p6Nm7k6K8P4M7j8J26k66K22
$$ -67 9 16 54 -23 42 -95 54 67 29 125 -53 28 -130 -23 -33 52 -24 -19 -66 -92 -64 10 57 39 165 -101 121
7852A21j17J8q3J93q7j3n8J07l4j95Q5oN2J4q8MK7N6M4n1o4K11j71K8N8r2MOL1
$$ 121 4 22 -61 132 45 32 -26 81 47 -148 -63 -69 -17 -3 -91 -87 -60 -4 40 -11 -75 136 -35 -7 51 -41 -37 -31 0
7881@qP5j58Q1PJ1N3j79J10P1n7m5J34k8q9R2j68J9J41n6m6o6J44K4k16J26Pr1
$$ 0 -8 67 -91 -10 -3 8 61 -118 -8 63 6 -39 95 67 -22 70 -98 -79 62 6 -40 -106 38 62 -154 -28 -21 -112
7909a12Q5P2qn5J40j70j0P0k7L4Q1r3J2L1J13r0q7l7%J0J43o1p6MR1j30P2R0l3
$$ -112 -27 45 37 -18 122 -48 -58 12 -15 19 100 7 19 50 163 73 -14 -51 -51 -41 102 41 -35 -31 60 -70 2 92 59
7938E9q5M4N8j28R2P2j27q8J38m7J38j32j16K5J09n7L5j4k3J18p7Q6j24QP8Q3
$$ 59 -26 18 76 -52 40 112 -15 -103 35 -12 126 -6 -122 -97 12 -45 -10 -24 -47 71 -6 80 -44 -36 42 125
7964A25j46M7K7r2J12J5n6k4r9m4J70n4L3K4p1R5Pj12O2q8N1k2kO0oj34J68k3
$$ 125 -21 26 53 -39 73 88 32 8 -91 -135 35 -19 14 38 -33 62 69 -43 19 -69 -18 -40 -42 18 12 -122 46 23
7992B3ln7N9r8L6K8N5j9m6K14j79m2k0l4l8R3J7n0j8P1k3rK8RK7M3j06j6RL3j0
$$ 23 20 -37 22 -76 -40 -12 43 24 -22 192 13 -29 -49 -83 -121 -28 -11 -61 -79 -8 -31 -40 -12 -3 24 67 -39 -55 -46 -13 -23
8023b3R5n7k9QP7k10J36R6r6j1ln7K0j7J66p1j7O2q5j49K00o9m1J46j06K6r6Q5
$$ -23 72 15 -14 -6 71 -139 -3 93 -3 -14 -17 -74 -54 -71 95 24 7 69 -16 -165 35 -34 -75 71 -35 -9 -105 -20
8051b0N7N0j49ol6P8L2k2m1J18k2j5l9p7P4j4O3n7RJ4j08J77j32l7Q1l6M5J08
$$ -20 37 87 -62 -68 -104 -26 6 -16 -57 61 39 24 -15 -92 -18 -32 31 -26 -17 -3 -111 66 -66 -103 -22 -58 -13 95
8079I5k4k6j58K35j47l0J72j9j66K4L7J19k2r4o0J93j75N1rm4NL7R3K1j38R3j68
$$ 95 71 45 -113 122 -25 -55 117 98 -68 -44 -7 112 90 -4 -64 129 -46 5 -4 -48 -43 -6 87 108 -30 63 -105
8106a05L7Q9p5Q8k9J6o6R1p7l1j9J07n2O7K9p8Q7j40R5k4l4M1J6q6J42j27R5K6
$$ -105 -68 21 -54 34 5 21 -45 46 -31 -62 -81 26 -26 41 70 -8 79 -61 34 10 -24 17 33 -53 89 -38 57 83
8134H3r2J7p0M8N8N8j75J37m1N8L0jj35K9l2J19o6q3P7K1p5J04l0r9L5J07M1j46
$$ 83 -9 8 -62 -14 44 102 -73 64 23 81 111 110 -25 4 -28 91 25 -58 19 40 -35 69 39 -60 -25 82 123 -23
8162b3O7o8j4Q5L0L0k04O4N9l3j2K8O5k5l9m4PL7L2Jj26L5L5PK8JnK2l4
$$ -23 44 -24 -38 47 77 107 -97 -33 26 -7 -19 9 74 49 10 -34 -27 10 42 43 -83 -48 -13 -6 22 23 18 40 6
8191F
$$ Imaginary data points
##PAGE= N=2
##DATA TABLE= (X++(I..I)), XYDATA
0@%%%%%%%%%%%%%%%JrJ6j6J6j6K4l2L2m0M8n2O0p2Q1q9J04j20J36j52J70j93K17
$$ 0 0 0 0 0 0 0 0 0 0 0 0 0 0 0 0 1 -8 8 -8 8 -8 16 -16 16 -24 24 -28 32 -40 41 -48 56 -64 72 -80 90 -103 114
38A14k42K71l02L35l72M13m57N05n57O14o77P45q20R05r96J098j214J344j492
$$ 114 -128 143 -159 176 -196 217 -240 265 -292 322 -355 390 -430 475 -521 577 -637 707 -785
57g85J658j852K082k355K686l098L632m353N379o973R806j6348O0650K2848p8289
$$ -785 873 -979 1103 -1252 1434 -1664 1968 -2385 2994 -3979 5827 -10521 50129 72977 -5312
72e312K5874j5829n5130r49M9836j1130j7969L6705K3871l8717J1436L7876l3954
$$ -5312 20562 4733 -50397 -51346 -1510 -12640 -30609 6096 29967 -8750 2686 40562 6608
85F608l3320L4523M30l2255J4681L0043j9832j8639K6408R874l1482R289K6370
$$ 6608 -26712 7811 8241 -24014 -9333 20710 878 -17761 8647 18521 -12961 -3672 22698
98B2698k4952j2684K5226j1410k0907J9359J2056j9791P08K8592m139k8509J5000
$$ 22698 -2254 -14938 10288 -1122 -22029 -2670 9386 -10405 -9697 18895 14756 -13753 1247
111A247J7307k8781l320K6535j2749j4070K0906M281j8568L290J7520j1788j9482
$$ 1247 18554 -10227 -13547 12988 239 -13831 7075 11356 -7212 -3922 13598 1810 -17672
124a7672J8265R313k5521O627K4699j5630j0031J9471K028j5844m76J0653n951
$$ -17672 593 9906 -15615 -8988 15711 81 -9950 9521 11549 -4295 -4771 5882 -69
137f9j1255J2327N886j3882R434J1988j6891m036J2819o257j1522M000R322k348
$$ -69 -11324 1003 6889 -6993 2441 14429 -2462 -6498 6321 64 -11458 -7458 1864 -484
151d84n650J0698M327j1222O048N474j3781j96P773o204k566O476M061l132l268
$$ -484 -6134 4564 8891 -2331 3717 9191 -4590 -4786 2987 -3217 -5783 693 4754 1622 -1646
166a646P476j023j1854N582M774j1486Q20O874j534K475L632J396j5k852J774
$$ -1646 5830 4807 -7047 -1465 3309 -8177 -7357 -483 -2017 458 4090 5486 5471 2619 4393
181D393l325q739O076L741q496L101O625j200J00j382K64J178n593K81J508m303
$$ 4393 1068 -7671 -1595 2146 -6350 -3249 3376 2176 2276 894 1158 2336 -3257 -2976 -1468 -5771
197e771M548K788l993N420K513l770J664p67j563j348m214L235J715n973M395
$$ -5771 -1223 1565 -2428 2992 5505 1735 3399 2632 1069 -279 -4493 -1258 457 -5516 -1121
212a121M134l554K227k3k991J947j760j881Q79j015N245J214n473O138L532o919
$$ -1121 3013 -541 1686 1663 -1328 619 -1141 -3022 -2143 -3158 2087 3301 -2172 3966 7498 579
228E79j81P17k664m25k365J563K400k731M445K307n179M263Q37p145J927J464
$$ 579 398 1115 -1549 -1974 -4339 -2776 -376 -3107 1338 3645 -1534 2729 3566 -3579 -1652 -188
244a88l111Q19J472M518Q48m328M787J644q510O04M98m170K507l1j323M511J250
$$ -188 -3299 -2480 -1008 3510 4358 30 4817 6461 -2049 -1445 -947 -5117 -2610 -2641 -3964 547 1797
261A797P92n97k924M342j374p284L966J988l753L397J371q4K861k049o00j20m137
$$ 1797 2589 1992 -932 3410 2036 -5248 -1282 706 -3047 350 1721 1637 4498 2449 1849 1729 -2408
278b408Q07j535l409N663J45k839O423J321k944R08j196O5j104l611K979Q03j947
$$ -2408 -1601 -3136 -6545 -882 -737 -3576 2847 4168 1224 2132 936 1001 -103 -3714 -735 68 -1879
295a879M768j350k414O107k245n743J660Q1j250k187j088O103L05k898O274J18
$$ -1879 2889 1539 -875 5232 2987 -2756 -1096 -1015 -2265 -4452 -5540 563 868 -2030 4244 4362
311D362l331K651l033l215J953j625K67J674N83L901k214k793M944l579n941L214
$$ 4362 1031 3682 649 -2566 -613 -2238 -1971 -297 286 4187 1973 -820 4124 545 -5396 -2182
327b182k20j356J917l32L792K596k384J553n03k076J759m942k379N536j880j857
$$ -2182 -2402 -3758 -1841 -2173 1619 4215 1831 3384 2881 805 2564 -2378 -4757 779 -1101 -2958
343b958M076L38J146j01k829J441k436k840K654k601L37O048k171N35N500k071
$$ -2958 1118 1456 2602 2501 -328 1113 -1323 -4163 -1509 -4110 -3773 2275 104 639 6139 4068
359D068k444l05r42L0m807p60O622k268k198N391o77l51J519l762n28P00k072
$$ 4068 1624 1319 377 407 -4400 -5160 1462 -806 -3004 2387 1710 1359 2878 -884 -1412 -712 -2784
376b784M21j579K676O206l687p33O143k845l553K79k567M8r19j389L872J85o8
$$ -2784 -2363 -3942 -1266 4940 1253 520 6663 3818 265 544 -2023 -1975 -2894 -4283 -411 -226 -294
393b94L691k375j43K336n794n40L598k848l22K186J833K909k773k32L888l629
$$ -294 3397 1022 879 3215 -2579 -3119 479 -2369 -2691 -505 1328 4237 1464 1232 5120 1491
409A491k411P22m176J200K596l708J730M223P01N65k690P36K198o036r50M134
$$ 1491 -920 -198 -4374 -3174 -578 -4286 -2556 1667 2368 2933 243 979 3177 -2859 -3809 325
425C25k538J376L641j215J902Q6k735O49k547j259L34l454K936L885m362K454
$$ 325 -2213 -837 2804 1589 3491 3577 842 1491 -1056 -2315 -1981 -5435 -2499 1386 -2976 -522
441e22N131k031r09j056q34J495l476j173L178p29K449K002l715K943J867n333
$$ -522 4609 2578 1669 613 -221 1274 -2202 -3375 -197 -926 1523 3525 -190 2753 4620 -713
457g13j188P0j350N11j673K294L783k383K551K913l956O71O95l631R76l19j596
$$ -713 -1901 -1831 -3181 -2670 -4343 -2049 1734 -649 1902 4815 859 1530 2225 -1406 -430 -749 -2345
474b345J682J09K076J026l626L345K104o796p63J963j947O75k01J367M135l36
$$ -2345 -663 -554 1522 2548 -1078 2267 4371 -2425 -3188 -1225 -3172 -2497 -2698 -1331 2804 2468
490B468M67O59l595J849R8n944J851K713k091J160P13P87J475l171P10J120m589
$$ 2468 2935 3594 -1 1848 1946 -3998 -2147 566 -1525 -365 348 1135 2610 -561 149 1269 -3320
507c320P30J834k624K838J378j388L876N54j971j58j656J128j421n025L774K861
$$ -3320 -2590 -756 -3380 -542 836 -552 3324 3878 1907 1749 93 1221 -200 -5225 -1451 1410
523A410m027K309K100j575J873q43k708k76p09J935r95k654O538K254n194L136
$$ 1410 -2617 -308 1792 217 2090 1247 -1461 -1737 -2446 -511 -1506 -4160 2378 4632 -562 2574
539B574K400m302j094l3l68j330j966L955J254l600L843J482m361K527M17m385
$$ 2574 4974 672 -422 -455 -823 -2153 -4119 -164 1090 -2510 1333 2815 -1546 981 1398 -2987
555b987J003J695L16j009q72N630J015n712K714J724m412J74j123k034K407J47
$$ -2987 -1984 -289 27 -982 -1854 3776 4791 -921 1793 3517 -895 -721 -1844 -3878 -1471 -1324
571a324j02J535L80K662j398l630L574j208m703M020J049k661K553J342n6K20
$$ -1324 -1426 109 489 3151 1753 -1877 1697 489 -4214 -194 855 -1806 747 2089 2033 2253
587B253j307J212j844k840K617k799l036O083O63l981L464K813p43k294j480K825
$$ 2253 946 2158 314 -2526 91 -2708 -5744 339 1002 -2979 485 3298 2555 261 -1219 1606
603A606j598l339L945J4k143M681o03l410K432p8k182j336q10K449j881j708N588
$$ 1606 8 -3331 614 628 -1515 3166 2563 -847 1585 1507 -675 -2011 -2821 -372 -2253 -3961 1627
620A627m6k974M198j9k533R63j654q63J066q92J097q0O17L808l618k878M668k260
$$ 1627 1581 -1393 2805 2786 253 1216 -438 -1301 -235 -1127 -30 -110 507 4315 697 -2181 2487 227
638B27m476K108J88K32P63J86K564L1p16L053l353k404L845k845k919L246M56
$$ 227 -4249 -2141 -1953 -1721 -958 -772 1792 1823 1107 4160 807 -1597 2248 -597 -3516 -270 186
655A86o09O91N26K317k584k402L095k505l061K950o92N74L599j185O04J851j171
$$ 186 -423 268 794 3111 527 -1875 1220 -1285 -4346 -1396 -2088 -1514 2085 900 1504 3355 2184
672B184n84k250o60K788l216j543L992r29k11K272j998N77J200k553o63n32M85
$$ 2184 1600 -650 -1310 1478 -1738 -3281 711 -218 -429 1843 -155 422 1622 -931 -1594 -2126 -1641
689a641J669k510J839N161k954j045L987k280k805l66n24N52k079N67L959j841
$$ -1641 28 -2482 -643 4518 1564 519 4506 2226 -579 -945 -1469 -917 -2996 -2429 1530 -311
705c11L01L397l830p94L052l014j752J687J340P57k209J599M510l071j525K778
$$ -311 -10 3387 -443 -1237 1815 -1199 -2951 -1264 76 833 -1376 223 4733 1662 137 2915
721B915k646j591J024k774Q16J399m74J649n1R87J773l785k08K571l981m49L245
$$ 2915 269 -1322 -298 -3072 -2256 -857 -1331 318 267 1254 3027 -758 -966 1605 -2376 -2825 420
738D20q36J355R38m10J730j387j474l8k956R64J292m276K222M603k400M7K102
$$ 420 -416 939 1877 1467 3197 1810 336 298 -2658 -1694 -402 -4678 -2456 2147 -253 -206 1896
755A896J90m36k588K48J395l038J041K803k583K105K663k978K80R62k202j165
$$ 1896 2086 1650 -938 -690 705 -2333 -1292 1511 -1072 1033 3696 718 998 1960 -242 -1407
771a407j519J029R17l003K929L981k902Q14K395k282j44m34j866R13n44R58Q42
$$ -1407 -2926 -1897 -980 -3983 -1054 2927 25 839 3234 952 808 374 -1492 -579 -1123 -165 677
788F77k084L458J889n165Q72K279l571q89J72K34J492p51J653K328j672J545M95
$$ 677 -1407 2051 3940 -1225 -353 1926 -1645 -2534 -2362 -2128 -636 -1387 266 2594 922 2467 2962
805B962m067J325Q10l633J347J669n76N46m90J896L23l948J229J281l471J058
$$ 2962 -1105 220 1030 -2603 -1256 413 -163 383 -107 1789 2112 -1836 -607 674 -2797 -1739
821a739R58j552L119Q22j361J455K71K33j120l191K465O30m170K028K107j915
$$ -1739 -781 -2333 786 1608 247 1702 1973 2206 1086 -2105 360 990 -3180 -1152 955 -960
837i60J935K77j101O46j593n0k51j988K900N59k406L962J534l181J292O74j491
$$ -960 975 1252 151 797 -796 -846 -1097 -3085 -185 374 -2032 1930 3464 283 1575 2249 758
854G58r35j899J456N41k829K107J571j554K526o59k557K559n30k408J91K47K027
$$ 758 -177 -2076 -620 -79 -2908 -801 770 -784 1742 1083 -1474 1085 555 -1853 -1662 -1415 612
871F12J24j806L371J025l006J544q20k553J270j194j441J977r0R18N35o39K361
$$ 612 736 -1070 2301 3326 320 1864 1044 -1509 -239 -1433 -2874 -897 -987 -69 466 -173 2188
888B188j447k810L242n33l391K254R48k96J023p92J408M51k151Q21j438j986K735
$$ 2188 741 -2069 1173 640 -2751 -497 451 155 1178 386 1794 2245 94 915 -523 -2509 226
905B26j388k438L583Q54q30N75m20J296o60k403J972l91j522K760o55j024K823
$$ 226 -1162 -3600 -17 837 7 582 162 1458 798 -1605 367 -24 -1546 1214 559 -465 2358
922B358j268j238J439j266q63p14o29K233j797j127M548l36j866K334p35q29R20
$$ 2358 1090 -148 1291 25 -838 -1552 -2181 52 -1745 -2872 1676 1340 -526 1808 1073 244 1164
939A164j907k01N13J54J906j966l98M183k355k940K359j068j426N51n27J452K12
$$ 1164 -743 -944 -431 -277 1629 -337 -735 3448 1093 -1847 512 -556 -1982 -1431 -1958 -506 -294
956b94k37K614r36j131K338j874j342K145k099p20J971n22M39j43q9K178k018
$$ -294 -531 2083 1147 16 2354 480 -862 1283 -816 -1536 435 -87 352 209 120 2298 280
973B80j922J788j686n41J727j894J308L312j205m05P52J96L56k989n42K457k484
$$ 280 -1642 146 -1540 -2081 -354 -2248 -940 2372 1167 762 1514 1710 2066 -923 -1465 992 -1492
990a492n24L173j673K85K147j668n86n5n90N00j719R96K640k774Q90L967k416
$$ -1492 -2016 1157 -516 -231 1916 248 -338 -393 -983 -483 -2202 -1206 1434 -1340 -450 3517 1101
1007A101j053K034q38j024j622k80K063j729k2K478j605O96K235l358m60J806
$$ 1101 48 2082 1244 220 -1402 -1682 381 -1348 -1370 1108 -497 199 2434 -924 -1384 422
1023D22j440m30K2J196K349j805L23K509k539k91J173k637L0R07j864R56P95J00
$$ 422 -1018 -1448 -1426 -230 2119 314 637 3146 607 316 1489 -1148 -1118 -211 -2075 -1119 -324 -224
1041b24Q52p55J131J211l804O04K320l042J39J915m47J570J58o57J026j572J11
$$ -224 628 -127 1004 2215 -1589 -985 1335 -1707 -1568 347 -100 1470 1628 971 1997 425 536
1058E36k00l456J647K210l500J056K934q73J02j18N13M26k699Q35J621k829J150
$$ 536 336 -3120 -1473 737 -2763 -1707 1227 354 456 338 851 1277 -1422 -587 1034 -1795 -645
1075f45K365k041J277J516j970J87k50q42n69k223J831J840k777J753K830j855
$$ -645 1720 -321 956 2472 502 689 439 -403 -972 -3195 -1364 476 -2301 -548 2282 427
1091D27N97K16j586R47n79r63O94o63J690O77k457K480J079l582N93O85k001K09
$$ 427 1024 1240 -346 601 22 -941 -247 -910 780 1457 -1000 1480 2559 -1023 -430 255 -1746 -1537
1109a537kL46J242p44J559J152k089J784J27l376J603P93k502Q14R74O71K1j658
$$ -1537 -1539 -1193 49 -695 864 2016 -73 1711 1838 -1538 65 858 -1644 -830 144 815 836 -822
1127h22J934M79l311R61N88k403J595O86r69K007M98j24K43j141J316n03k965
$$ -822 1112 1591 -1720 -759 -171 -2574 -979 -293 -1262 745 1243 1119 1362 221 1537 1034 -1931
1144a931J769O16k272J786O98q87J338p70o97O56j355N06n20j267K805j86j983
$$ -1931 -162 454 -1818 -32 666 -221 1117 347 -350 306 -1049 -543 -1063 -2330 475 289 -1694
1161a694L444P76k229J001j75o98m91j501J166j31j416K637k98j814K955j56k898
$$ -1694 1750 2526 297 1298 1123 425 -66 -1567 -401 -532 -1948 689 391 -1423 1532 1376 -1522
1178a522J294K53o05m35n99K741l30j837L181L89k632J366o35j815Q16q96q9R27
$$ -1522 -228 25 -580 -1015 -1614 1127 797 -1040 2141 2530 -102 1264 629 -1186 -370 -1266 -1355 -428
1196d28k96J526m58j411K661r02k672K209k14j095J104j11M94J184j047Q77n72
$$ -428 -724 802 344 -1067 1594 692 -1980 229 15 -1080 24 -87 407 1591 544 1421 849
1213H49j148J523k119j743K910r20j761K467N26k04k2k40J270j422j533K353j222
$$ 849 -299 1224 -895 -2638 272 -648 -2409 58 584 380 358 118 1388 -34 -1567 786 -436
1230d36j158K924p04r89K269m32j215l26l48P16k163r13L415q32j703K903N7j045
$$ -436 -1594 1330 626 -363 1906 1474 259 -67 -415 301 -1862 -2775 640 -192 -1895 1008 1065 20
1248B0J046p08l8q4q00Q56r32l02K818j532r55K761j502j817J139r26l46J0k43
$$ 20 1066 358 320 236 -564 292 -640 -942 1876 344 -611 2150 648 -1169 -30 -956 -1302 -1292 -1535
1267a535J768j50n59K144j141n82K091k076r93J916q09p94L24N06J245j337n51
$$ -1535 233 83 -476 1668 527 -55 2036 -40 -1033 883 74 -720 -396 110 1355 18 -533
1284e33K079j776j146J545j474l08J783j019M71J119K21N82j060k60J450k397
$$ -533 1546 -230 -1376 169 -1305 -1613 170 -849 -378 741 962 1544 484 224 1674 -723
1300g23p13K244j264m94J843q00K30J18q65O86q95m98J082j642Q05K391k036K66
$$ -723 -1436 808 -456 -950 893 93 323 441 -424 262 -633 -1131 -49 -1691 -886 1505 -531 -265
1318b65K446r39p04j53l42N20j502l86J621j238L92J917j968M44J416j714o78
$$ -265 2181 1242 538 385 43 563 -939 -1325 296 -942 -550 1367 -601 -157 1259 -455 -1133
1335a133M96j14O65j019Q77K237j803J56K039j904m99N60j385L28Nr15J029oM32
$$ -1133 -637 -751 -86 -1105 -228 2009 206 362 2401 497 -2 558 -827 -499 -494 -1409 -380 -386 46
1354D6J046j996P63J704k505j67J322q60M65J92k9J588n37k53P58j944J56M38
$$ 46 1092 -904 -141 1563 -942 -1109 213 -647 -182 10 -19 1569 1032 779 1537 -407 -251 187
1372A87k223P72J330j223P96R08k08M80j021K83J007k153L07J410j308Q99O19
$$ 187 -2036 -1264 66 -1157 -361 547 339 819 -202 81 1088 -1065 -758 652 -656 243 862
1389H62j125J450K00j300J75p50K11P9j959J083J620j659J147R13r28R77k97j100
$$ 862 -263 1187 1387 87 262 -488 -277 -198 -2157 -1074 546 -1113 34 947 19 996 699 -401
1407d01O39n92K04M96r49J255R09j960J098N18k123L57O1m55K82q62J099J222
$$ -401 238 -354 -150 346 -603 652 1561 -399 699 1217 -906 -549 -488 -943 -661 -1523 -424 798
1425G98j341J081R37j470J154j04j892O72J21m46N57p37J361Q71j847M62O02j876
$$ 798 -543 538 1475 5 1159 1055 -837 -165 -44 -490 67 -670 691 1562 -285 177 779 -1097
1443a097M54j35r49J401rj55J364k44L50M94j507Q32l54j795J351K06j285J473
$$ -1097 -643 -778 -1727 -326 -335 -490 874 630 980 1474 -33 799 445 -1350 1 207 -1078 395
1461C95j00k53P63p58k81J76j150R87l83j334K558L85j641J606O00n55k21r50
$$ 395 295 42 805 47 -234 -58 -1208 -221 -604 -1938 620 1005 -636 970 1570 1015 794 -156
1479a56N40j80j493J048J94j222J875m0j114J055k09p71L4m46N89R8j039K051
$$ -156 384 204 -1289 -241 -47 -1269 606 566 -548 507 298 -473 -439 -885 -296 -198 -1237 814
1497H14M05j258J333Q0j062L65j078m97P41p98K08M93k81J311n21j289J920l89
$$ 814 1219 -39 1294 1374 312 677 -401 -898 -157 -955 -747 -254 -535 776 255 -1034 886 497
1515D97j571J096l98o2Q10m90P22N63p26R06q44j141J330j246j299J708k06m29
$$ 497 -1074 22 -376 -438 372 -118 604 1167 441 1347 503 -638 692 -554 -1853 -145 -351 -780
1533g80P10K26O37l71j149J563n01j464J367l94m07J609o24q1R06o45r9p28q80
$$ -780 -70 156 793 422 -727 836 335 -1129 238 -156 -563 1046 422 341 1247 602 503 -225 -1105
1552a105J326j087j045J844m9l98J257l50L6M06r67K22J9o70R60o93q2J719r94
$$ -1105 221 -866 -1911 -67 -116 -514 743 393 429 835 -132 90 109 -561 399 -294 -376 1343 349
1571C49o23J475r17p93J32o57M92r6m69J355k22j72J426j077l35J398j143p04
$$ 349 -274 1201 284 -509 -377 -1034 -542 -638 -1107 248 26 -146 1280 203 -132 1266 123 -581
1589e81Q54l05L44n54p4J354q95o60J143j081l49P23j009K71Q36n77Q09L36K1
$$ -581 273 -32 312 -242 -316 1038 143 -517 626 -455 -804 -81 -1090 -819 17 -560 249 585 606
1608F06P12j043n05J297j472m72J336o94N4P32p41N54j41p14N46r54J38J067j527
$$ 606 1318 275 -230 1067 -405 -877 459 -235 -181 551 -190 364 223 -491 55 -899 -761 306 -1221
1627a221M00J910j022nR51k88J46o94k56O13j196k08J319j154L27J338j334K14
$$ -1221 -821 1089 67 62 1013 725 871 177 -79 534 -662 -870 449 -705 -378 960 -374 -160
1645a60O53q06o7m42L95Q53j186O12J696j043j73R07r92j26n6q45M27l1j65P11
$$ -160 493 -313 -380 -822 -427 426 -760 -148 1548 505 332 1239 247 121 65 -780 -353 -384 -549 162
1665A62q77M98J133j418M9J129r82j46L88m64Q29j93KJ147p05P2L92j535K23M52
$$ 162 -715 -217 916 -502 -453 676 -306 -452 -64 -528 301 108 110 1257 552 624 1016 -519 -296 156
1685A56j577M46R36m26K78Q2K81O19j155R8R04j263L47O97j007Q59P84p66K63
$$ 156 -1421 -975 -39 -465 -187 -105 176 795 -360 -262 642 -621 -274 423 -584 275 1059 293 556
1704E56j83J34j59j422N67Q30j779O17J318p84L07N65k78L15p11L9L71j019O15
$$ 556 373 507 348 -1074 -507 323 -1456 -839 479 -305 2 567 289 604 -107 -68 303 -716 -101
1723a01Q47j315J113P48j420K52K36o08r3o51K47N61p97N48J144r88R47M07j324
$$ -101 746 -569 544 1292 -128 124 360 -248 -341 -992 -745 -184 -981 -433 711 -277 670 1077 -247
1742b47P64J33j038R6K4M46J73q65J039M17j508P20J63j475N50K47o09N37K37
$$ -247 517 650 -388 -292 -268 178 351 -514 525 942 -566 154 317 -1158 -608 -361 -970 -433 -196
1761a96L68L28n31J201j20j630J027L46j628N11M84m12M96l42K70L56j082P39
$$ -196 172 500 -31 1170 1050 -580 447 793 -835 -324 160 -252 244 -98 172 528 -554 185
1779A85j93j335J199K69j302J246O92m04K62l3K23j19j209O06n6j115J185Q9r81
$$ 185 -8 -1343 -144 125 -1177 69 761 357 619 586 809 690 -519 87 31 -1084 101 190 -791
1798g91J112M4q29N09j08j11l10n74J432k70j283J846N58j179P77l7o95K04o07
$$ -791 321 365 -464 45 -63 -174 -484 -1058 374 104 -1179 667 1225 46 823 786 91 295 -312
1817c12j54J93o31J109j44r51J530N1j484Q34J53p36M26k32N72K56n88Q89J54
$$ -312 -466 -273 -904 205 61 -890 640 691 -793 41 194 -542 -116 -348 224 480 -108 781 935
1836I35q66P62m42j030Q50n66p73P32PJ89K22l18J170l61j110J109m13p37Q89
$$ 935 69 831 389 -641 209 -357 -1130 -398 -391 -202 20 -298 872 511 -599 510 97 -640 249
1855B49k73l80J230j84j59P5m03L57p66q93J256n45q41J370j67k61O96k33L32
$$ 249 -24 -404 826 642 483 558 155 512 -254 -1147 109 -436 -1277 93 -74 -335 361 128 460
1874D60j66m29N61n14m07J200p59m32J495n19p81O29l00j84l79m72R80m10m26
$$ 460 294 -135 426 -88 -495 705 -54 -486 1009 490 -291 338 38 -146 -525 -997 -17 -427 -853
1893h53J200k92j32J224q50m22R09o61j95J1j64P74m39m45J124q30l96R29q24
$$ -853 347 55 -77 1147 297 -125 784 123 -72 -61 -225 549 110 -335 789 -41 -437 492 -332
1912c32l32N67o07L63L22l08P73j07p6R52j017n28R93q57l71O40m69M19L20m97
$$ -332 -664 -97 -704 -341 -19 -327 446 339 263 1215 198 -330 663 -194 -565 75 -394 25 345 -152
1932a52L99k86l63O63j025J08J107r43K1J067k69J00J45j70M71r13j28N90j002
$$ -152 247 -39 -402 261 -764 -656 451 -492 -471 596 327 427 572 402 873 -40 -168 422 -580
1951e80m9R51p83K58O34o21J04J20l09L53p26j0J177p57K3J174o73J40L08q93
$$ -580 -629 322 -461 -203 431 -190 -86 34 -275 78 -648 -658 519 -238 -215 959 286 426 734 -159
1971a59L37j64o02M98l56M3P29q53K21Q12q44K35M00p49M65o0m34Q26j49J13N76
$$ -159 178 14 -588 -90 -446 -403 326 -527 -306 506 -338 -103 297 -452 13 -47 -481 345 196 309 885
1992H85p02K30K91j409M23N08j071K86K64K43M23p52K24P35q71O3O11r34O23L08
$$ 885 183 413 704 -705 -282 226 -845 -559 -295 -52 371 -381 -157 578 -293 -230 381 -553 70 378
2012C78o53O88P8k98L37n69J32L14j128K23N09p94M33M35k35O35r9n50P02o14
$$ 378 -275 413 491 193 530 -39 93 407 -721 -498 11 -783 -350 85 -150 485 386 -164 538 -76
2032g6o5L29p12P39L75q87P10K78q71K32q3l52K56n25O7O86o90O05M58p24O73
$$ -76 -141 188 -524 215 590 -297 413 691 -180 52 -31 -383 -127 -652 -585 101 -589 16 474 -250 423
2053D23L45j074M85J21m39J69n80P95L99j103O68L95r11J88J3p03O16j96j63O02
$$ 423 768 -306 179 300 -139 30 -550 245 644 -459 209 604 -307 -119 -106 -809 -193 -389 -552 50
2073E0j48L88M04p75O61K56j231O70q6o07N42k38k17N65l84K30Q3n98N15k56p79
$$ 50 -98 290 694 -81 580 836 -395 275 189 -418 124 -114 -331 234 -150 80 163 -435 80 -176 -955
2094i55J044M9q43R17K77k10L20m43L63j50r36P10j57o47R45r9q17Q38m5m21J88
$$ -955 89 138 -705 212 489 279 599 156 519 369 -567 143 -14 -661 284 185 -632 206 161 -260 -72
2115g2k52M10r0q81J174N6q04J098P4n16M73l96l46K76o00J46l6k92Q92k33p90
$$ -72 -324 86 -4 -885 289 345 -459 639 713 197 670 274 -72 204 -396 -250 -286 -578 314 81 -709
2136g09J096n1q33O24j80j65J67k43M96N4l91Q64l30n38R52o52q61Q07l56m31
$$ -709 387 336 -497 127 -53 -218 -51 -294 202 256 -135 729 399 -139 813 161 -700 107 -249 -680
2156f80L03J12M17o5l50R18m84o81R51m42n82Q98k04j22L47N7J57l20n86P83o11
$$ -680 -377 -265 152 87 -263 655 171 -510 441 -1 -583 315 111 -11 336 393 550 230 -356 427 -184
2177a84q96J150l97m58O19Q8K8L85l62K52J09o72P02l93m15J023m51n38R54l35
$$ -184 -1080 70 -327 -785 -166 -78 -50 335 -27 225 334 -338 364 -29 -444 579 128 -410 544 209
2197B09k56J82l91L19k66o14Q01k63l63J184m62k32Q23n08k38L31k50J00k76j21
$$ 209 -47 135 -256 63 -203 -817 -16 -279 -642 542 80 -152 671 163 -75 256 6 106 -170 -291
2217b91Q50n69l34Q27m62l94O45n87j05L13l61L17Q1n4Q21n54l36J194p68n05
$$ -291 559 -10 -344 483 21 -373 272 -315 -420 -107 -468 -151 -70 -124 697 143 -193 1001 233 -272
2237b72N13m40o7K62k51M05j9l86P11n66k90O63o80j54P72m40J81M02j87M24m07
$$ -272 241 -199 -266 -4 -255 150 131 -255 456 -110 -400 263 -417 -571 201 -239 -58 344 157 581 174
2258A74j31O49p47j83O46q30O4M92m72J29M29k75J71l37j28O36p73l8J003m16
$$ 174 43 692 -55 -238 408 -422 -358 134 -338 -209 220 -55 116 -221 -349 287 -486 -524 479 63
2278F3o1N65l25M4J37n12K49l83j92N58o71R4Q82p97j7Q15m80Mk2j03L32l86n6
$$ 63 2 567 242 286 423 -89 160 -223 -415 143 -528 -434 448 -349 -366 449 -31 -27 -49 -152 180 -206 -262
2301b62Q86n26QN20o85J42M23q73LK98k75K59k23j5Q06o57l7N90n14O7M20n93
$$ -262 624 98 106 626 -59 83 506 -367 -364 -66 -341 -82 -305 -320 486 -171 -208 382 -132 -65 355 -238
2323b38L63K47m43M56k43kL36o96K10L88r74J42M92n34J89M19l89N46k45l1N23
$$ -238 125 372 -71 385 142 140 476 -220 -10 378 -596 -454 38 -496 -307 112 -277 269 24 -7 516
2344E16p20R2N67p76L12O19o87J64J90k00J79p02J12N53p33L7O36n56K19O36m89
$$ 516 -204 -112 455 -321 -9 610 -77 87 277 77 256 -446 -334 219 -514 -477 159 -397 -178 458 -31
2365c1K67J83m30L47m56J90L12q15M98M36o87M8M73n40J56j09k89L20j45L2L43
$$ -31 236 419 -11 336 -120 70 382 -433 65 501 -186 -138 335 -205 -49 -158 -447 -127 -272 -240 103
2386A03l86N28M70q65L55L73p60K50L4k73K99m28K51L69n44K45J71n72M51o7n61
$$ 103 -283 245 715 -150 205 578 -182 68 102 -171 128 -300 -49 320 -224 21 192 -380 71 4 -557
2407e57M37J85k96L15N5K16J78o54L06K72q36L13J56n05N53o9l88L85j31P7Q3
$$ -557 -120 65 -231 84 139 355 533 -121 185 457 -379 -66 90 -415 138 69 -319 66 -65 12 95
2428I5o16N22J11o77N55K37l35M53%j60J60l57kJ67n66L81r5m34P08J7n78O04
$$ 95 -521 1 112 -565 -10 227 -108 345 345 185 345 -12 -14 153 -413 -32 -127 -561 147 164 -414 190
2450A90l2l29K22k78K58Q4k98L85J54l57N56k07n38M26j64m67M26l73J35Q5k79
$$ 190 158 -171 51 -227 31 115 -183 202 356 -1 555 348 -190 236 72 -395 31 -342 -207 -122 -401
2471d01N16P8m57N50Po22M58j84k07N84l16J6K74k60L70k24o31O83k48n53M23
$$ -401 115 193 -264 286 293 -329 129 -55 -262 322 6 22 296 36 406 182 -449 234 -14 -567 -144
2492a44j78JM51k32J45K48m10L42q8m46O45k58l90O15k62k3K43k18N2L2o30L83
$$ -144 -322 -321 130 -102 43 291 -119 223 135 -311 334 76 -314 301 39 16 259 41 93 125 -505 -122
2514a22l5l26M69j80j86Q33m23j67N73k82lL4k74L17k29l84P63k32l98O69m43
$$ -122 -157 -483 -14 -194 -380 453 30 -137 436 154 151 185 -89 228 -1 -385 378 146 -252 417 -26
2535b6k36L47l93K10R1k81M32j11j09N06k00j73L99l48j14J30l75K83Q9m48L05
$$ -26 -262 85 -308 -98 -7 -288 144 33 -76 430 230 57 456 108 -6 124 -251 32 121 -327 -22
2556b2J40l04K62l48N3K35m01J8M51j99K61M9j09L78k87k15L91l90j64M38m19
$$ -22 118 -186 76 -272 -219 16 -385 -367 84 -115 146 195 86 464 177 -38 353 -37 -201 237 -182
2577a82j89N36j80K2J12k37K17j86j81N35n88Q6N61l58P7L81l42K16Pl69K15k49
$$ -182 -371 165 -15 7 119 -118 99 -87 -268 267 -321 -235 326 -32 45 426 84 300 307 -62 153 -96
2599i6k06M17m64J05M86m76J04L60k47L5P2k67L61l5k58M03k98R3K45l93J63J73
$$ -96 -302 115 -349 -244 242 -234 -130 230 -17 18 90 -177 184 149 -109 294 -4 89 334 -59 104 277
2621B77n50R1J08k58J96n6N6M31l90M2L62m96m5M63l79K11L9o5K72l90K34J75
$$ 277 -273 -182 -74 -332 -136 -192 -136 295 -95 -53 309 -187 -232 231 -148 63 102 37 309 -81 153 328
2643C28n72l8O33p12m9K82k03K88k4P1K03k33J7M96p26K40L07n33L54N0j90J20
$$ 328 -244 -282 351 -361 -410 -128 -331 -43 -67 4 207 -26 -9 487 -239 1 308 -225 129 179 -11 109
2665A09K4j91K35l89q0L58m44J58K97l44L53J14j94J27J16j69L2k24J32K39m89
$$ 109 133 -58 177 -212 -292 66 -378 -220 77 -267 86 200 6 133 249 80 112 -112 20 259 -230
2686b30P6M71o03K75J71m02K53j70q2K53l05J80K76l62K85M28n89K42J17l39J33
$$ -230 -154 317 -286 -11 160 -242 11 -159 -241 12 -293 -113 163 -199 86 514 -75 167 284 -55 78
2707G8r0q1K65m12K19K36m04L17L0m68J72J69l74K92K9K5K10r9M6J94m16J55L9
$$ 78 -12 -93 172 -240 -21 215 -189 128 158 -310 -138 31 -343 -51 -22 3 213 114 160 354 -62 93 132
2730A32m38L65k8m19L78P0j12J31k45K57K9n71M29J81l33K58K08l38L20rj07N4
$$ 132 -306 59 31 -388 -10 60 -52 79 -166 91 120 -451 -22 159 -174 84 292 -46 274 265 158 212
2752B12l38J98j6l79L34jm01M10R7l66K96o1oJ88k50J09K2k77M82q8l14N79k12
$$ 212 -126 72 56 -323 11 10 -391 19 116 -250 46 -15 -21 167 -83 26 48 -229 253 165 -149 430 218
2775B18l44J69m8j39K0k10K09P8k85N02N9l99L76n4k93K84j64q0L01p6j09P1k24
$$ 218 -126 43 -5 -144 -124 -334 -125 -47 -332 170 229 -170 206 152 -141 143 -21 -101 200 124 15 86 -138
2798a38L80l7n81N18j08m16K60n3J31J15j90K32k6j96L25j23k39L55j22k76K50
$$ -138 242 205 -376 142 34 -382 -122 -175 -44 71 -119 113 87 -109 216 93 -146 209 87 -189 61
2819F1R2q3K5k35L04j20l89L69l1k90K63N5p6L45j44j26K53j53Q6j33k42M05k72
$$ 61 153 70 95 -140 164 44 -345 24 -7 -297 -34 21 -55 290 146 20 273 120 206 73 -169 236 -36
2842c6k71L83r0J6O8k37Q6J45l69K11J23k25L50k01j14N44j72k54L33j32q7J0
$$ -36 -307 76 -14 2 70 -167 -81 64 -305 -94 29 -196 154 -47 -161 383 211 -43 290 158 71 81
2864H1k38J42J31l86M08j33k62K75p9r8J51j86k4K52j14L36j28l7K30k47r4K96
$$ 81 -157 -15 116 -270 138 5 -257 18 -61 -159 -8 -194 -218 34 -80 256 128 91 321 74 -20 276
2886B76j89k52L20k77o2J78p7J69j37o8L49l39k15N50k24j49L40j90J63J73l73
$$ 276 87 -165 155 -122 -184 -6 -83 86 -51 -119 230 -109 -324 226 2 -147 193 3 166 339 -34
2907c4K81j52l53L54j96j87M55l52o3M48j82N4q0p3J65j93p3M69l51j47N76l69
$$ -34 247 95 -258 96 -100 -287 168 -184 -247 201 19 73 -7 -80 85 -108 -181 288 -63 -210 366 -3
2929co8M52l34j22J34k33J57l52O7M25l77m2N71k26q4K48j17r9J06j69K11j00
$$ -3 -71 381 47 -75 59 -174 -17 -369 -302 123 -254 -296 275 49 -35 213 96 -3 103 -66 145 45
2951D5J1K36l89M0L82m08j47K97k10J1l9j0K35j89L2K98k03PK69m34J22K78m04
$$ 45 56 292 -97 -57 325 -83 -230 67 -143 -132 -171 -181 54 -135 -103 195 -8 -1 268 -166 -44 234 -170
2974a70K63j00MJ49j70m7K68m07j2K90m03K22K48l72K82Q4r0J85k70R3K67m24
$$ -170 93 -7 -3 146 -24 -71 197 -210 -222 68 -335 -113 135 -237 45 129 39 224 -46 47 314 -110
2996a10N8K71k89M3K53l34N3J4k52L86k56p0L57l52J91K60k90L0M21l98R6J77
$$ -110 -52 219 -70 -27 226 -108 -55 -41 -293 93 -163 -233 124 -228 -37 223 -67 -37 384 -14 82 259
3018B59l31J32k04j00L97j84o5K71l02K09l3k42J76Q7k79K33N0j35K99l15J08
$$ 259 -72 60 -144 -244 153 -31 -96 175 -127 82 49 -193 -17 70 -209 24 74 -61 238 -77 31
3039C1K41m04K51l6k45K47p1j42J80k6r4J93k92K42J92n77K46K48k96K49P4k17
$$ 31 272 -132 119 83 -162 85 14 -128 52 26 -68 125 -167 75 267 -310 -64 184 -112 137 211 -6
3061fJ83j39l4J00k44J45J50m89L22Qk10K38J01j68J10j49P3J67k57R0J53p5Q0
$$ -6 177 38 4 104 -140 5 155 -334 -12 -4 -214 24 125 -43 67 -82 -9 158 -99 -9 144 69 149
3084A49n6j99L48j11j68Q8j41m4P2k66L80R6l11J77K1o4J44q8p0J53j71K7N4m9
$$ 149 93 -106 242 131 -37 51 -90 -134 -62 -328 52 148 -163 14 35 -29 115 27 -43 110 -61 -34 20 -29
3108b9J60O3l70L08n1k18Q0J02k18R4j05Q0K64k54J96J32k78K37j3k71J61J3j89
$$ -29 131 194 -176 132 81 -137 -57 45 -173 -79 -184 -104 160 -94 102 234 -44 193 180 -91 70 83 -106
3131a06J24N7n6Pk23J82O7k76K11j16q9L73j36r3L07j4k46J75j01j9j7l04M30
$$ -106 18 75 19 26 -197 -15 52 -224 -13 -129 -218 155 19 -74 233 219 -27 148 47 28 11 -293 137
3154A37q6j83K78q2k40K73j78j0J68k38R1Q1k49M42p7j18K43j09p4P2j34J00Q
$$ 137 51 -132 146 64 -176 97 -81 -91 77 -161 -70 11 -238 204 127 9 252 143 69 141 7 107 115
3177A15k60J55L8k87K75o2j37K82j45q9K43k75K7L74m26K26O4n4J74j65j75J71
$$ 115 -145 10 48 -239 36 -26 -163 119 -26 -115 128 -147 -120 254 -172 54 118 64 238 73 -102 69
3199F9jj61J20k07J46l6J1O6J1k06M37k09k59M26k56j3J91r6p9L35k74J39K2l45
$$ 69 68 -93 27 -180 -34 -70 -59 7 18 -188 249 40 -219 207 -49 -62 129 33 -46 289 15 154 176 -169
3223a69K68k57j07K54o8p6K34j95J57P5k46J47k9j87K11Ok17L10Mj53L09l44R5
$$ -169 99 -158 -265 -11 -79 -155 79 -116 41 116 -130 17 -12 -199 12 18 -199 111 115 -38 271 -73 22
3246B2N8j41J39j68j35L59k08m4K94r6j48J19K0J6M4k17K28j52rL30k63j22J12
$$ 22 80 -61 78 -90 -225 134 -74 -118 176 80 -68 51 71 87 131 -86 142 -10 -19 311 48 -74 38
3269C8k68J75J15l19J36M3m1J91n3p8K93l28kK90k69l9K57o6m7kqL3pj49J95j80
$$ 38 -230 -55 60 -259 -123 -80 -121 70 17 -61 232 -96 -98 192 -77 -116 141 75 28 26 18 51 44 -105 90 -90
3295i0K6J20r3r7K49k09J70J54k02P2m1j41K99k28r9K03k29j9K12j30jO1j74K47
$$ -90 -64 56 -37 -134 115 -94 76 230 28 100 59 -82 217 -11 -110 93 -136 -155 57 -73 -74 -13 -187 60
3319F0j12O0J33l54J72K96k39N7J05k56J88jj39N1j2o7J46j89J64J16l95K14J08
$$ 60 -52 8 141 -213 -41 255 16 73 178 -78 110 109 -30 21 9 -58 88 -101 63 179 -216 -2 106
3342A06k44J45J2k10K13q0J15J88k48N5J67l23J73L0j40K6j52L3N7M9M1Q9k44
$$ 106 -138 7 19 -191 22 -58 57 245 -3 52 219 -104 69 99 -41 -15 -167 -134 -77 -28 13 102 -142
3365a42J03J93k44J33R7r7r1N0K5J81j64m1P0j42Q4l8k17R9K48k21P8R3k31L12
$$ -142 -39 154 -90 43 140 43 -48 2 27 208 44 3 73 -69 15 -23 -240 -141 107 -114 -36 57 -174 138
3389A38k41J17J33k29J12k0j41J12K09k50J43o2k9j5j91L7L08k34L4J70j17R5
$$ 138 -103 14 147 -82 30 10 -131 -19 190 -60 83 21 -8 -23 -214 -177 131 -103 -69 101 -16 79
3411G9K3j80J30J31k48J74j89Q1R0j56J12J0k15J50J27k69J5N5R0N6k05K29j67
$$ 79 102 -78 52 183 -65 109 -80 1 91 -65 47 57 -158 -8 119 -150 -135 -80 10 66 -139 90 -77
3434g7Q1J58o8k56K26j5j82K01l6m2M5j25Q7M5j81Q3R7j26O9M8k25J68N2j2N2
$$ -77 4 162 94 -162 64 49 -133 68 32 -10 35 -90 -3 42 -139 -56 41 -85 -16 32 -193 -25 27 15 67
3459F7j1J63r1j95K18q6k57J56J24k47K34j11N9p1r9P9J85k68J66m7j26L18o1
$$ 67 56 219 128 -67 151 65 -192 -36 88 -159 75 -36 23 -48 -147 -68 117 -151 15 -32 -158 160 99
3482I9k05J99m3J33k6k25M9J08k22J71r4j05K39j47O5J30r5q6Q3o6J08J6r8J43
$$ 99 -106 93 50 183 157 -68 -19 89 -133 38 -56 -161 78 -69 -4 126 31 -55 28 -38 70 86 -12 131
3506A31k7j85K31j23m8o5O7j14LM3R5Pl11M83k54p1K15Q2k21K17j39L3l3j6O0
$$ 131 104 -81 150 27 -21 -86 -19 -133 -130 -87 8 15 -296 187 -67 -138 77 159 -62 155 16 49 16 0 60
3531F0J0j42J14Lk17J66n7l9R9nlJ1p6J35J3j17J16k2j28R2m6J70K2n9l2%j36
$$ 60 70 -72 42 45 -172 -6 -63 -102 -3 -8 -11 0 -76 59 72 -45 71 49 -79 13 -33 137 159 100 68 68 -68
3558f8O2Kj89K13Pj28J77l9m7R9j14J13qj98J82j49J16O4kj84K07o5j00Q4o8p6
$$ -68 -6 -4 -193 20 27 -101 76 37 -10 89 -25 88 80 -118 64 -85 31 95 93 -91 116 51 -49 35 -33 -109
3584a09J83j80N4q2J31J64j39k8M9l5nR0j12l4J25j38P3k5lQ7j01m3oQ2j41J35
$$ -109 74 -106 -52 -134 -3 161 22 -6 43 8 3 93 -19 -53 72 -66 7 -18 -21 66 -35 -78 -84 -2 -143 -8
3610hl0k9J44j00N6q3J46N9q0j91L50k17k49J84j3M3j8L0n4O5j03R8r6J52Q6k34
$$ -8 -38 -67 77 -23 33 -50 96 155 75 -116 234 17 -232 -48 -61 -18 -36 -6 -60 5 -98 0 -96 56 142 -92
3636i2N0J17L5k5K8m0Jj46j2J76n4j40Q1q1nJ53r9o0J46j43J59o7n5K06k17J29
$$ -92 -42 75 110 85 113 73 74 -72 -84 92 38 -102 -21 -102 -107 46 -53 -113 33 -110 49 -18 -73 133 -84 45
3662D5P4o0n2P6oJ6l3j19R1jm7L9j12J17J63k73J18M4j13L4L2j07R6M5J9q7jl0
$$ 45 119 59 7 83 77 93 60 -59 32 31 -16 23 -89 28 191 -82 36 80 -33 1 33 -74 22 67 86 -1 -2 -32
3690c2K27l54J00K51l26J45p7P3q4Q5O8J9j40M4P5n1NN4m0QN7j30R3l6p9k5J22
$$ -32 195 -159 -59 192 -134 11 -66 7 -77 8 76 95 -45 -1 74 23 28 82 42 50 107 -23 70 34 -45 -70 52
3717E2j26R4r3J4M8L3J23J3k25K20j54n5J46j75J1Q9j03MJ92r2k2R6k35J70M5
$$ 52 -74 20 -73 -59 -11 22 145 158 -67 153 -1 -56 90 -85 -74 15 -88 -84 108 16 -6 90 -145 25 70
3742G0r2M5o7R4m3l1Q1K06l03J9K09k34NK6k3K51k64k3J11j49oJ12j62J90M0j32
$$ 70 -22 23 -44 50 7 -24 57 263 -40 -21 188 -46 -41 -15 -38 213 -51 -74 37 -112 -118 -6 -168 22 62 -70
3768g0J53j3p2N1k9NP3j60O0J12j80J13j55J9J94r3j5l3oJ56j38m8O1O0o4N7L6
$$ -70 83 70 -2 49 20 25 98 -62 -2 110 -70 43 -112 -93 101 8 -7 -40 -46 110 -28 -76 -15 45 -19 38 74
3795G4o8M3k5M1j3j04r7J27p1K9J65k28KJ87k5K6l0J01j45N4j13K43l3j63J01
$$ 74 6 49 24 65 52 -52 -149 -22 -93 -64 101 -127 -125 62 37 63 33 134 -11 43 -70 173 140 -23 78
3820G8n5r6P2Rj37J14ML7j57K12p8RjJ2m6J7K28o6j63nq8J58j5j22J71j64J22
$$ 78 23 -73 -1 8 -129 -15 -11 26 -131 81 3 12 11 23 -23 -6 222 156 -7 -12 -100 58 43 -79 92 -72 50
3847E0qk51K71q8j58J75r5J62K7j01K4o2K4J53l7j65J22M6j67J33m3r8J91j69
$$ 50 42 -209 62 -26 -184 -9 -104 58 85 -16 8 -54 -30 123 86 -79 43 89 -78 55 12 -86 105 -64
3871f4J09K2j26J06M8p9l6K9j9NJ9P4Pj44P7Oj60J33Pl6J48j05j30J76r2j16J75
$$ -64 45 67 -59 47 95 16 -20 9 -10 -5 14 88 95 -49 28 34 -126 7 14 -22 126 21 -109 67 -25 -141 34
3898C4n5k5m0L1R6m8P8q9R4j69J29j4o3P2j18P7l6l7J36Q1j87M5R1j32J26j05
$$ 34 -21 -46 -86 -55 41 -7 71 -18 76 -93 36 22 -41 31 -87 -10 -46 -83 53 134 -53 -8 83 -49 77 -28
3924b8j07L03j91P2P7j67J08N6j80M1Kj45K48j66P5m1P1k00K00j9k6K6j62K06
$$ -28 -135 168 -23 49 126 -41 67 123 -57 -16 -14 -159 89 -77 -2 -43 28 -172 28 9 -17 9 -153 53
3948E3J6j93J76O7j40pr7J02O2j01O5L0k17J74Oj37J74N6m7n0P1LK5j80K01k7
$$ 53 69 -124 52 119 -21 -28 -125 -23 39 -62 3 33 -184 -10 -4 -141 33 89 42 -8 63 66 91 -89 112 85
3974H5j66K03j33r9K03p2n2M6r4O7Q5k00J58n8o7J50j08j11J88N0po3r5J31m0
$$ 85 -81 122 -11 -110 93 21 -31 15 -79 -12 73 -127 31 -27 -94 56 -52 -163 25 75 68 5 -90 41 1
3999AMo4J04k05K52j52o9J34K6l2M0j66J59Mj74K91j58L2K4m0j5K0r0Q7l2l2P8
$$ 1 5 -59 45 -160 92 -60 -129 5 31 -1 39 -127 32 36 -138 153 -5 27 51 11 -4 16 -74 13 -19 -51 27
4026B7J7j44K09j72JK26j39n2J13j63R2J43j68K0l9NN5kJ3j33J22j55R5l6J3l
$$ 27 44 -100 109 -63 -62 164 25 -27 86 -77 15 158 -10 10 -29 -24 31 29 42 -91 31 -124 -29 -65 -52 -55
4052e5M5P0j05O3Q2j97J08J30k56J45P9r4K8k9Rk1o8rP4J9q2J31j52rJ61j99Q7
$$ -55 -10 60 -45 18 100 -97 11 141 -115 30 109 15 43 14 23 2 -66 -75 -1 18 -64 67 -85 -94 67 -132 -45
4079d5l3N6J50q9K2M4j76R4N7j19m3J03n9L4j3r3J63j22q2K15J02j76J41j93l1
$$ -45 -78 -22 128 39 61 105 -71 23 80 -39 -82 21 -38 -4 -17 -110 53 -69 -151 64 166 -10 131 -62 -93
4104i3J88m5R9j22l2J14r7P6q5j09J20mn6n1K7K0Qj2J9M4j2O5o1j6J3L9j04KO1
$$ -93 95 50 149 27 -5 109 12 88 3 -106 14 10 -46 -97 -70 -50 -42 -54 -35 9 -3 62 1 -15 -2 37 -67 -65 -4
4133dL1Q5l5j66O0kp0l3nO9J02j2j2J02q1N1J34k65Q5l7qM9l1j42J45j42K20N1
$$ -4 27 112 77 -89 -29 -31 -101 -134 -139 -70 32 20 8 110 29 80 214 -51 34 -3 -11 38 7 -135 10 -132 88 139
$$ [...]
8191h0
##END NTUPLES=NMR FID
##END=
