##TITLE=1H_DE-80H_X3
 200.13MHz, d2o
 8 sc
 
 19ns.26.2.2025
##JCAMPDX= 6.0         $$ Bruker NMR JCAMP-DX V2.0
##DATA TYPE= NMR FID
##DATA CLASS= NTUPLES
##ORIGIN= UXNMR, Bruker Analytische Messtechnik GmbH
##OWNER= pz
$$ XWIN-NMR		Version 3.5
$$ Tue Dec 23 10:32:07 2025 Russian Standard Time (UT+4h)  Yarkov@DPX200
##.OBSERVE FREQUENCY= 200.1313
##.OBSERVE NUCLEUS= ^1H
##.DELAY= (6, 6)
##.ACQUISITION MODE= SIMULTANEOUS
##.ACQUISITION SCHEME= undefined
##.AVERAGES= 8
##.DIGITISER RES= 18
##SPECTROMETER/DATA SYSTEM= spect
##.PULSE SEQUENCE= zg30
##.SOLVENT NAME= CDCl3
##.SHIFT REFERENCE= (INTERNAL, CDCl3, 0, 14.3821)
##AUDIT TRAIL= $$ (NUMBER, WHEN, WHO, WHERE, WHAT)
$$ ##TITLE= Audit trail, XWIN-NMR		Version 3.5
$$ ##JCAMPDX= 5.01
$$ ##ORIGIN= Bruker BioSpin GmbH
$$ ##OWNER= Yarkov
$$ C:/Bruker/XWIN-NMR/data/yarkov2/nmr/H-C/1/audita.txt
$$ ##AUDIT TRAIL=  $$ (NUMBER, WHEN, WHO, WHERE, WHAT)
(   1,<2025-12-23 10:30:20.32 +0400>,<Yarkov>,<DPX200>,
      <created by zg, POWCHK disabled, PULCHK disabled
       configuration hash MD5:
       00 E9 B6 7A A2 85 ED C7 34 08 36 98 17 FE 4E 26
       data hash MD5: 16K
       00 23 66 C7 D3 64 76 31 B5 A4 0A 4E A4 05 CE E8>)
$$ ##END=
$$ 
$$ hash MD5
$$ 94 28 73 DE F7 EC B7 EB CF B3 B7 34 5C A5 22 54
##$RELAX= 
##$RELAX= 
##$RELAX= 
##$RELAX= 
##$RELAX= 
##$RELAX= 
$$ Bruker specific parameters
$$ --------------------------
##$DU= <C:/Bruker/XWIN-NMR>
##$EXPNO= 1
##$NAME= <H-C>
##$PROCNO= 1
##$TYPE= <nmr>
##$USER= <yarkov2>
##$AMP= (0..31)
100 100 100 100 100 100 100 100 100 100 100 100 100 100 100 100 100 100 
100 100 100 100 100 100 100 100 100 100 100 100 100 100 
##$AQSEQ= 0
##$AQ_mod= 1
##$AUNM= <au_zg>
##$AUTOPOS= <>
##$BF1= 200.13
##$BF2= 200.13
##$BF3= 200.13
##$BF4= 200.13
##$BF5= 200.13
##$BF6= 200.13
##$BF7= 200.13
##$BF8= 200.13
##$BYTORDA= 1
##$CFDGTYP= 0
##$CFRGTYP= 5
##$CHEMSTR= <none>
##$CNST= (0..31)
1 1 145 1 1 1 1 1 1 1 1 1 1 1 1 1 1 1 1 1 1 1 1 1 1 1 1 1 1 1 1 1 
##$CPDPRG= <>
##$CPDPRG1= <>
##$CPDPRG2= <>
##$CPDPRG3= <>
##$CPDPRG4= <mlev>
##$CPDPRG5= <mlev>
##$CPDPRG6= <mlev>
##$CPDPRG7= <mlev>
##$CPDPRG8= <mlev>
##$CPDPRGB= <>
##$CPDPRGT= <>
##$D= (0..31)
0 0.7 0 0 0 0 0 0 0 0 0 0.03 0 0 0 0 0 0 0 0 0 0 0 0 0 0 0 0 0 0 0 0 
##$DATE= 1766471419
##$DBL= (0..7)
120 120 120 120 120 120 120 120 
##$DBP= (0..7)
150 150 150 150 150 150 150 150 
##$DBP07= 0
##$DBPNAM0= <>
##$DBPNAM1= <>
##$DBPNAM2= <>
##$DBPNAM3= <>
##$DBPNAM4= <>
##$DBPNAM5= <>
##$DBPNAM6= <>
##$DBPNAM7= <>
##$DBPOAL= (0..7)
0.5 0.5 0.5 0.5 0.5 0.5 0.5 0.5 
##$DBPOFFS= (0..7)
0 0 0 0 0 0 0 0 
##$DE= 6
##$DECBNUC= <off>
##$DECIM= 32
##$DECNUC= <off>
##$DECSTAT= 4
##$DIGMOD= 1
##$DIGTYP= 9
##$DL= (0..7)
0 120 120 120 120 120 120 120 
##$DP= (0..7)
150 150 150 150 150 150 150 150 
##$DP07= 0
##$DPNAME0= <>
##$DPNAME1= <>
##$DPNAME2= <>
##$DPNAME3= <>
##$DPNAME4= <>
##$DPNAME5= <>
##$DPNAME6= <>
##$DPNAME7= <>
##$DPOAL= (0..7)
0.5 0.5 0.5 0.5 0.5 0.5 0.5 0.5 
##$DPOFFS= (0..7)
0 0 0 0 0 0 0 0 
##$DQDMODE= 0
##$DR= 18
##$DS= 0
$$ [...]
##$SUBNAM2= <"">
##$SUBNAM3= <"">
##$SUBNAM4= <"">
##$SUBNAM5= <"">
##$SUBNAM6= <"">
##$SUBNAM7= <"">
##$SUBNAM8= <"">
##$SUBNAM9= <"">
##$SW= 18.0517328524113
##$SWIBOX= (0..15)
0 0 2 0 0 0 0 0 0 0 0 0 0 0 0 0 
##$SW_h= 3612.71676300578
##$TD= 16384
##$TD0= 1
##$TE= 0
##$TE2= 300
##$TE3= 300
##$TEG= 300
##$TL= (0..7)
0 120 120 120 120 120 120 120 
##$TP= (0..7)
150 150 150 150 150 150 150 150 
##$TP07= 0
##$TPNAME0= <>
##$TPNAME1= <>
##$TPNAME2= <>
##$TPNAME3= <>
##$TPNAME4= <>
##$TPNAME5= <>
##$TPNAME6= <>
##$TPNAME7= <>
##$TPOAL= (0..7)
0.5 0.5 0.5 0.5 0.5 0.5 0.5 0.5 
##$TPOFFS= (0..7)
0 0 0 0 0 0 0 0 
##$TUNHIN= 0
##$TUNHOUT= 0
##$TUNXOUT= 0
##$USERA1= <user>
##$USERA2= <user>
##$USERA3= <user>
##$USERA4= <user>
##$USERA5= <user>
##$V9= 5
##$VALIST= <valist>
##$VCLIST= <CCCCCCCCCCCCCCC>
##$VD= 0
##$VDLIST= <DDDDDDDDDDDDDDD>
##$VPLIST= <PPPPPPPPPPPPPPP>
##$VTLIST= <TTTTTTTTTTTTTTT>
##$WBST= 1024
##$WBSW= 4
##$XGAIN= (0..3)
0 0 0 0 
##$XL= 0
##$YL= 0
##$YMAX_a= 107690
##$YMIN_a= -55802
##$ZGOPTNS= <>
##$ZL1= 120
##$ZL2= 120
##$ZL3= 120
##$ZL4= 120
##$ABSF1= 10
##$ABSF2= 0
##$ABSG= 5
##$ABSL= 3
##$ALPHA= 0
##$AQORDER= 0
##$ASSFAC= 0
##$ASSFACI= 0
##$ASSFACX= 0
##$ASSWID= 0
##$AUNMP= <proc_1d>
##$AZFE= 0.1
##$AZFW= 0.1
##$BCFW= 1
##$BC_mod= 2
##$BYTORDP= 1
##$COROFFS= 0
##$CY= 83.5205535888672
##$DATMOD= 1
##$DC= 2
##$DFILT= <>
##$DTYPP= 0
##$F1P= 10.8118882576601
##$F2P= -7.23987719738617
##$FCOR= 0.5
##$FTSIZE= 0
##$FT_mod= 4
##$GAMMA= 1
##$GB= 0.15
##$INTBC= 1
##$INTSCL= 1
##$ISEN= 128
##$LB= 0.25
##$LEV0= 0
##$LPBIN= 0
##$MAXI= 10000
##$MC2= 0
##$MEAN= 0
##$ME_mod= 0
##$MI= 1.114404
##$NCOEF= 0
##$NC_proc= 0
##$NLEV= 6
##$NOISF1= 3.799351
##$NOISF2= 2.8
##$NSP= 1
##$NTH_PI= 0
##$NZP= 0
##$OFFSET= 14.38212
##$PC= 1
##$PHC0= -5299.955
##$PHC1= 10.82193
##$PH_mod= 1
##$PKNL= yes
##$PPARMOD= 0
##$PSCAL= 0
##$PSIGN= 0
##$REVERSE= no
##$SF= 200.129724274929
##$SI= 16384
##$SIGF1= 3
##$SIGF2= 2
##$SINO= 400
##$SIOLD= 16384
##$SREGLST= <1H.CDCl3>
##$SSB= 0
##$STSI= 0
##$STSR= 0
##$SW_p= 3205.1282051282
##$SYMM= 0
##$S_DEV= 0
##$TDeff= 0
##$TDoff= 0
##$TI= <>
##$TILT= no
##$TM1= 0
##$TM2= 0
##$TOPLEV= 0
##$USERP1= <user>
##$USERP2= <user>
##$USERP3= <user>
##$USERP4= <user>
##$USERP5= <user>
##$WDW= 1
##$XDIM= 8192
##$YMAX_p= 0
##$YMIN_p= 0
$$ End of Bruker specific parameters
$$ ---------------------------------
##NTUPLES= NMR FID
##VAR_NAME=  TIME,          FID/REAL,        FID/IMAG
##SYMBOL=    X,             R,               I
##VAR_TYPE=  INDEPENDENT,   DEPENDENT,       DEPENDENT
##VAR_FORM=  AFFN,          ASDF,            ASDF
##VAR_DIM=   8192,          8192,            8192
##UNITS=     SECONDS,       ARBITRARY UNITS, ARBITRARY UNITS
##FACTOR=    0.0002768,     1,               1
##FIRST=     0,             0,               0
##LAST=      2.2672688,     0,               0
##MIN=       0,             -55802,          0
##MAX=       2.2672688,     107690,          0
$$ Real data points
##PAGE= N=1
##DATA TABLE= (X++(R..R)), XYDATA
$$ [...]
1515i77k43J058q32L45P10j143K89O38R1J519N35k26M4k072j216k45j253Q43J492
1534f43L52J543R76m61M49j161j071J88q16j46O79q80j59k70o19J330R26P68J847
1553B832j97q85n29k480j340L25l05J326J888R77R67n88r33j67j769o14J302n49
1571g39K98N83j161n53K91O9J469J111Q56R27j596o98l73k478o33J140m09J002
1589h94J658M54M23l29m65k26j343K20M60j379L35P18j434P58J773M54O02N32
1607B317j19j039k113j83r9j486J366J517r37J197R06j319J61K67K51k51N5P99
1625A290q93k380P14K5j320K215K239j1O69K53j644j835j269P6p37j78K789P05
1643G08q82J988K65k144K36Q19o02k79M61J60j574j279J184m39n70L178O52j136
$$ plain form
1515 -977 -1220 -162 -994 -649 61 -1082 -793 -155 -64 1455 1990 1764 1808 -264 -1480 -1725 -2978 -2135 -643
1534 -643 -291 1252 2228 1767 2216 1055 -16 172 -644 -790 -111 -991 -1150 -1420 -2039 -709 217 985 2832
1553 2832 2635 1750 1221 -1259 -2599 -2274 -2579 -1253 635 1612 2579 1991 1058 891 -878 -1492 -190 -739
1571 -739 -441 142 -1019 -1572 -1281 -1212 257 1368 2224 3151 1555 857 484 -1994 -2627 -1487 -1896 -894
1589 -894 764 1218 1641 1312 847 621 -722 -502 -42 -1421 -1086 -368 -1802 -1044 729 1183 1785 2317
1607 2317 2198 1159 -954 -1137 -1236 -2722 -1356 161 -776 421 1327 8 169 436 687 436 491 1290
1625 1290 397 -1983 -1269 -1244 -2564 -349 1890 1879 2548 2801 1157 -678 -1947 -1871 -2608 -2786 3 708
1643 708 -174 1814 2079 -65 171 990 388 109 570 730 -844 -2123 -939 -1378 -1948 1230 1882 746
1661G46J150j07k304p59M83j24j024P53K087q16n54K422l98j577J790K1j930j76
1679c17j58j428j069J121J759n18J091K761j448j788J367j186k070R60J029n98
1695d92r7J077K44j809M73J835j347J63K647j288k163P34r77k222K91K193J215
1712D77o0K095J289k771q64J012k559j166K456j99q97J078Q94j154q28J780Q39
1729A422j853J283J631k986j037J538j621q99K117J461m32K84J674q89k279Q76
1745B90M21k922O61K181k000l57K107n3j187Q15J925m24j042J534l81l419M92
1762a359P58k129J124K985j55n31J147P7k286j357J845n08j743K080R18k534Q32
1779h36J695j272J43K240J60j494K9M58k000j890K326l3j817K392J536j949M08
$$ plain form
1661 746 1896 1789 -515 -1274 -791 -915 -1939 -1186 901 85 -469 1953 1555 -22 1768 1789 -141 -317
1679 -317 -475 -1903 -2972 -1851 -92 -610 481 3242 1794 6 1373 187 -1883 -923 106 -492
1695 -492 -589 488 732 -1077 -604 1231 -116 47 2694 1406 -757 -23 -1000 -3222 -2931 -738 477
1712 477 417 2512 3801 1030 166 1178 -1381 -2547 -91 -290 -1187 -109 785 -369 -1197 583 1422
1729 1422 -431 852 2483 -503 -1540 -2 -1623 -2522 -405 1056 624 908 2582 1693 -586 290
1745 290 711 -2211 -1550 631 -1369 -1726 381 328 -859 -44 1881 1457 415 1949 1568 -1851 -1359
1762 -1359 -601 -2730 -1606 1379 1224 693 1840 1917 -369 -1726 119 -389 -2132 -52 866 -1668 -836
1779 -836 859 -413 -270 1970 2130 636 665 1123 -877 -2767 -441 -474 -2291 101 1637 -312 96
1796I6J591p48j377O56M92j835o40K213j080j421K919M68j889J686J449j637r69
1813b6M15o98k362M4K346m97K6K978o15k232J299K22j706P41J488n17j798L09
1831e83M13k228K18L306k47p14K519n42k704m2J65j556l41J879J012j285J293
1848E63J987k222o16K255j370j874J633K12j681J5J121m64j379J487J642j484
1864a75P96K017j996j672J228q22j806J406J690l81m92J532J54k242P98J695j942
1881b12l07J676j913j737J093P39l17Q05K352L0j896Q16J65k756L94J615j506
1898i59l25J572J14r40M92Q78n87j074J773K11k139J041O41k403j82J620m02j26
1916g95J781J308q33p55Q54j317k305J072M99j428J429J623j215k39Q45j19o89
$$ plain form
1796 96 1687 939 -438 218 710 -1125 -1765 448 -632 -2053 866 1334 -555 1131 2580 943 -26
1813 -26 389 -309 -2671 -2627 -281 -778 -752 2226 1611 -621 678 900 -806 -65 1423 906 -892 -583
1831 -583 -170 -2398 -2180 1126 879 165 2684 2142 -562 -604 -439 -1995 -2336 -457 555 -730 563
1848 563 2550 328 -288 1967 597 -1277 356 568 -1113 -1098 23 -441 -1820 -333 1309 -175
1864 -175 621 2638 642 -1030 198 -624 -2430 -1024 666 285 -207 1325 1479 -763 35 1730 -212
1881 -212 -519 1157 -756 -2493 -1400 -661 -978 -173 2179 2209 313 1129 1294 -1462 -1068 547 -959
1898 -959 -1284 288 402 -538 -46 832 245 -829 944 1155 -984 57 698 -1705 -1887 -267 -669 -795
1916 -795 986 2294 1461 706 1560 243 -2062 -990 -491 -1919 -490 1133 -82 -321 524 405 -284
1933b84N90J363r73j465J106o43j966J410J249o52R39J113o41r70q0K29j357l24
1951a356J576p84j157J979L52j601J157J159n92j02O35k06j459n39P80j186m43
1968a787K003R2o40J652K51j439r2J36n32r08L91J385j003r9J689j019q19J592
1986H53Q7o78P56J12j158q90j44P6p13Q46K005q10q7J404r87j126N30N4m51R1
2006b30J75J8q21M95R29r55N70J620j192m99O28j193r36J65M21K89oR63P17r54
2026B04L47O03j123j25O72p91m69M00P3m66k56P65K91m73J010R40j125r3R8j427
2046i45m37L03K30O93O72O57P6q20J68k25j188M86Q31j023O9K78p03J9J04O28
2066a27O75K03O46n0j462ok71j146R06N47k44N74J64o0J8m17N24j93p93M69j43
$$ plain form
1933 -284 306 1669 696 -769 337 -306 -2272 -862 387 -265 674 1787 1146 176 96 325 -1032 -1356
1951 -1356 220 -564 -1721 258 610 -991 166 1325 733 631 1266 1060 -399 -938 -158 -1344 -1787
1968 -1787 216 308 -332 1320 1571 132 40 176 -356 -1264 -873 512 -491 -590 1099 80 -739 853
1986 853 940 262 1018 1130 -28 -918 -1062 -986 -1699 -853 1152 342 255 1659 672 -454 76 130 -321 -230
2006 -230 -55 -37 -858 -363 566 -389 181 1801 609 110 738 -455 -1391 -1226 -805 -516 -522 441 1158 204
2026 204 551 1154 31 -94 578 -213 -682 -282 -209 -675 -931 -166 125 -348 662 1602 477 384 482 -945
2046 -945 -1382 -1079 -849 -156 516 1173 1249 429 597 372 -816 -330 501 -522 -453 -175 -878 -859 -755 -127
2066 -127 548 751 1397 1347 -115 -121 -392 -1538 -632 -85 -329 245 409 349 367 -50 474 281 -512 -43 -186
2087a86n77M45p2l88P60J75K09O05l1K30l41j049l4l83p63P03L81P0O67J07j37
2108C91J50n42R4O7l50M10k76o94L89k32%J041K48K37L30p64m93l34p21K90K10
2129e49n3O05j20o1M82l55M03M82k88Jj42o87j04k61l33M99L23L30N02j10K21
2150G85j12j084Q7r6o57O08J45n0O85J06q6K20m27L29l5j73M25m00j033L10l11
2171g64n39O90N46O70L27j67k0o88p94N40k00k47Q93j78m26N83Jl65M66J47J41
2192F16m24m26J76o49n59P93J1o7R64J17j96L60j24j57m16P2O4o90j47J003o29
2213c08l65J104k63k19M42K32k62l73j23j66q60J24R76l68N99J228m64o44M44
2232G34n01o77q5L37K85n37J22M73r79J30J253o17M24R42n21o51j91j40o01k17
$$ plain form
2087 -186 -763 -318 -390 -778 -18 157 366 971 940 1170 829 -220 -254 -637 -1400 -697 -316 -246 421 528 391
2108 391 541 -1 93 160 -190 220 -56 -750 -361 -593 -593 448 696 933 1263 499 6 -328 -1049 -759 -549
2129 -549 -602 3 -117 -178 304 -51 352 834 546 547 405 -282 -386 -647 -980 -481 -158 172 674 564 785
2150 785 673 -411 -324 -420 -1077 -469 -324 -374 311 417 331 551 124 453 418 245 670 270 -763 -453 -764
2171 -764 -1303 -613 -67 603 930 763 743 55 -739 -199 -399 -646 247 69 -357 226 227 -138 328 475 616
2192 616 192 -234 -58 -707 -1266 -473 -462 -529 435 552 356 716 592 435 19 91 155 -535 -682 321 -308
2213 -308 -673 431 168 -51 391 623 361 -12 -135 -301 -1161 -1037 -61 -429 170 1398 934 290 734
2232 734 233 -444 -529 -192 93 -444 -322 151 -828 -698 555 -62 362 1304 783 132 -59 -199 -800 -1017
2252a017O85P02o48N21R43j045PO15q99m99N18j78k39r9N05K21p06R51O28r66
2272@N21P70j104n31K74l53m42K24O35J75m10R68P8j292N82L92j068K84O50m79
2292a26m82K89K54k63JJ400M0j026P91j29j673J87N17p26K39R00P2m14J67Q10
2312H28o38n80J129j67j230Q73J38j100J07P14m4k10O29O51q70l47O60p31j000
2331a188J090P3j083Q25Q18n84mP31R3p76J05P52r52n82J001n63j145J001L93
2350El35O56P43j81r10j9J19j253J5J480m23l57J236j55r47M37L60k76k72O60
2370E83K8j215j2O64j176k6J575p0n03Q93K58q06k84M61j63j054N04P00j082K95
2390d30J255p40j52Q06l03p04O7M93l80q03P29J96j076O38J264p14J26J125q29
$$ plain form
2252 -1017 -332 370 -278 243 1186 141 148 763 -136 -635 -117 -295 -534 -633 -128 93 -613 338 966 0
2272 0 521 1291 187 -344 -70 -423 -865 -641 -6 169 -241 727 805 -487 95 487 -581 -297 353 -126
2292 -126 -608 -319 -65 -328 -327 1073 1113 87 878 749 -924 -737 -220 -946 -707 193 265 -149 18 828
2312 828 190 -390 739 572 -658 215 353 -747 -640 74 30 -180 449 1100 230 -117 543 -188 -1188
2331 -1188 -98 -25 -1108 -283 535 -49 -53 678 771 -5 100 852 -100 -682 319 -244 -1389 -388 5
2350 5 -330 326 1069 888 -22 -41 78 -1175 -1160 320 -103 -460 776 621 -326 111 471 195 -77 583
2370 583 611 -604 -616 48 -1128 -1154 421 351 -152 741 999 193 -91 370 207 -847 -343 357 -725 -430
2390 -430 825 85 -67 739 436 -268 -201 292 -88 -891 -162 34 -1042 -404 860 146 272 1397 568
2409E68r98L31P4m87m6R28l7j232P20L89r82N91J413q61k88N37m99r04j33Q58
2429e8j47k31J136K82j147N87M33j336o7R03m79o43M55L85l87j98J095j60q22
2448c99R35K04j003N06N34j030l85L26M7m43M07J348m50p45Q47l43j242N53N78
2467B45q08J96O60k83n59M97O87o03L4R79n14j116R23l79r89M49O53j60j50O07
2487C69K02p98N2P68n98m37Q71l43q18O16K77m66L55N21Qn45J14N33j007k48Q41
2508B67p50n16R40J99m58O61M30l88l81L01J92r33K10P21p76l34Q45n35l99P77
2528G3M30q2p1K24l12r06J31M57o26K70J046n17j69O12j96n43K32M38j59p47K24
2549a91J44p37L0Q75k92J04Q32l63m71M04j22k81l29L81O9o77N17N55o47K40O98
$$ plain form
2409 568 -430 -99 -25 -512 -558 370 333 -899 -179 210 -772 -181 1232 371 83 620 121 -783 -916 -58
2429 -58 -205 -436 700 982 -165 422 855 -481 -548 355 -124 -767 -312 73 -314 -512 583 423 -399
2448 -399 536 740 -263 243 777 -253 -638 -312 -265 -708 -301 1047 597 -148 699 356 -886 -333 245
2467 245 -563 -367 293 10 -549 -52 635 32 66 1045 531 -585 338 -41 -1030 -581 72 -88 -238 369
2487 369 571 -227 -175 593 -5 -442 429 86 -732 -116 161 -305 50 571 579 34 148 681 -326 -574 267
2508 267 -483 -999 -59 140 -318 343 773 385 4 305 497 -436 -226 495 -281 -615 230 -305 -704 73
2528 73 503 421 350 574 262 -644 -513 -56 -682 -412 634 117 -52 560 364 -179 53 491 332 -415 -191
2549 -191 -47 -784 -754 121 -171 -67 765 402 -69 335 213 -68 -397 -16 53 -624 -107 448 -199 41 739
2570G39n34l86K59J30n04j27M54j97n58N27L27n34Q08N61n77j42K02n83m46J39
2590d42M09m8q0M40m3n87M55j7j84L09K10m61k32KO8k59L2P70N7m58N47J28o96
2613h0L69j37n63J65j16o9M4J97M28pj83N30k00p68N61r7k37J82J1o5q9P3J19
2636F8Q0j5L70k83l88K71k50l85L97P5j64M4M5K75j08J15M94j88l18J71n35n34
2658g63L85m9K01L47J5R1l2j97J78l51k5L71k45j67L34k10q5L56r7J43Ol9J08
2681B75k79j2J6l87M6J28k47K56L03K13J02q4j64K7k15j93R2j65J65J86o6l4J51
2704A14j90J95O9J9O6k42l51K0k06K68K99k7J62M4k12K24o6j32J90j10k22j15
2726b03k48J89J08r8K69J55L4M5o7j63K10l57j55J99r8j9K24P2J59Q1k01J78l67
$$ plain form
2570 739 205 -181 78 208 -296 -423 31 -166 -724 -197 130 -404 404 965 388 246 448 -135 -581 -442
2590 -442 -33 -81 -161 279 236 -351 104 87 -97 212 422 -39 -271 -269 -201 -460 -428 342 399 -59 488 616 -80
2613 -80 289 152 -411 -246 -362 -431 -387 -190 238 231 48 578 378 -390 171 74 -163 19 30 -35 -124 -51 68
2636 68 148 133 503 220 -168 103 -147 -532 -135 -60 -224 -180 -135 140 32 147 641 453 135 306 -229 -763
2658 -763 -378 -427 -226 121 136 227 195 -2 176 -175 -200 171 -74 -241 93 -117 -202 154 57 200 206 167 275
2681 275 -4 -16 0 -387 -341 -213 -460 -204 99 312 414 330 166 193 -22 -215 -123 -288 -123 63 -3 -37 114
2704 114 -76 119 188 207 273 31 -320 -300 -506 -238 61 34 196 240 28 252 186 54 244 134 -88 -203
2726 -203 -451 -262 -154 -252 17 172 206 251 184 21 231 -126 -281 -82 -180 -199 25 97 256 337 136 314 -53
2749e3p5K04k02q5J46k35oK24j10K04J01K23K08l17j10L4n01qL49j90K81K21j41
2772A62j45N0lJ39k10J13j7m61P7K17k69J93M41q0Q9O5j53r2j69k6q5l30L16K01
2796B3m03L13L62l30q6K77M2r4j09J64J2m20K25Q7l68L69K15l55L45J23k39r7
2818E6k85Lk03j9M93nk69M32L3m03L69J73j39j25Jk14j84N5K00L9k86P13n7n60
2842a82L48L6m14J30J04j20OOK61l25q1O29j63k67N28r0o30K44p8j77k91L32K25
2865C1k38J92M65l02l37N26k95l31K18Q5j80l7M85j10k66oL64l44l4N95m48l55
2887c22M51k00m04N4L70l9j9M02J43m27J84K36o40q2N24l35j29K95Q0l18J11K49
2909A84M0m15K73K23o04L5N46m14j85M64M9l30J42L98k50q9K02M3o12J16M27n69
$$ plain form
2749 -53 -128 76 -126 -211 -65 -300 -306 -82 -192 12 113 336 544 227 117 151 -350 -358 -9 -199 82 303 162
2772 162 17 67 64 203 -7 106 89 -372 -295 -78 -347 -154 287 207 296 361 208 116 -53 -79 -164 -494 -178 23
2796 23 -380 -67 295 -35 -121 156 198 104 -5 159 171 -249 -24 63 -305 64 279 -76 269 392 153 56
2818 56 -229 -226 -429 -448 45 40 -229 203 236 -167 202 375 236 111 112 -102 -286 -231 -31 8 -278 435 378 -182
2842 -182 166 202 -212 -82 22 -98 -92 -86 175 -150 -231 398 235 -32 496 406 -224 20 -58 -235 -526 -194 31
2865 31 -207 -15 450 148 -189 337 42 -289 -71 14 -166 -203 282 172 -94 -100 264 -80 -114 481 33 -322
2887 -322 129 -71 -475 -421 -51 -90 -109 293 436 9 193 429 -211 -293 231 -104 -233 62 142 -176 -65 184
2909 184 224 -191 82 305 -299 -264 282 -132 -317 147 196 -134 8 406 156 67 269 312 -300 -184 243 -326
2931c26j23N83j67j60L50R1l0j86L66k61m39J92K70o51L83N08l77P1K24r3n33
2952c08J06K62k41o8L74O4o76L40K95l77K81M14j32l83J89Oj90k78M77j86n44
2973e75M99L31n64L88L58l25k15K39j08l81K18L90j99k09M20l9n86M83J89l09
2993EJ16J16k73l93R7K88j32QN37k60m15O57n0m36J93L76m22k49J90R6k60N2N43
3016C84k86k94N46k35n65N43m6l58K7L43q7l27L46L18l86J8N18l36l23M00j89
3037A1k85J95J42k02j98L16K34k76J56L61n51j30L12k04j59K47J94j82J2J74L8
3058B05m92M74K02m93O1K74m04k21M27k6l55K06L46k5j45K06J43n73P8K33l73
3079b52J30K02j72o2K31J61j68k36K45J31o14M05J36m12J31K34k31mL66M4q1k56
$$ plain form
2931 -326 -449 134 -33 -193 157 248 218 32 398 137 -302 -110 160 -491 -108 400 23 94 318 225 -308
2952 -308 -202 60 -181 -249 125 189 -487 -147 148 -229 52 466 334 -49 140 146 -44 -322 155 -31 -575
2973 -575 -76 255 -309 79 437 112 -103 136 28 -353 -135 255 56 -153 267 228 -358 125 314 5
2993 5 121 237 -36 -429 -332 -44 -176 -168 369 109 -306 351 301 -135 58 434 12 -237 -47 49 -211 -159 384
3016 384 98 -196 350 115 -450 93 47 -311 -284 59 -28 -355 -9 309 -77 -59 459 123 -200 200 11
3037 11 -274 -79 63 -139 -337 -21 213 -63 93 454 -97 -227 85 -119 -278 -31 163 -19 -7 167 205
3058 205 -287 187 389 -104 -43 231 -173 -394 33 7 -348 -142 204 179 34 240 383 -190 -112 121 -252
3079 -252 -122 80 -92 -154 77 238 70 -166 79 210 -404 1 137 -275 -144 90 -141 -145 221 265 184 -72
3101g2L46j26m23L92o8m50L61J66l38J19K15m2p6R6J86k80j87L10j35l13K71K69
3123B21l85K37J06j33j02J41M0k84j2K58j64k92M63k0k94K49K09j11j5M6J4k41
3145f9j8J49j21j61L66j97p0K52Q5l21J41Q2j79q4j5J11j41r2M69k25L9K60q1
3168A80k20J73l6j05J0m3Rj88O9K93k08o6K44o0k27L04K3j33N6o3n7j20m1L29
3192A23j81R1L73l07p8N2j77j64K70j03n2J27R5P9j40K05M6l24rK30l10J6J95
3215E7n3o3m5J6R5j46J93Rj60J60L2j89n8J25m8r2J39Q1K3j5Q8Jj58J00l1j41
3241h0%O6j16j4J16L3R1r7J12K0k03J5J12j60l0J67r0N3O6o2P3j02J34K6k7k8
3267G5l5j42O4m6j0J98m6o1J46J41j63O0j32p9L9k53J82p5L9J18K1j6J13j97K0
$$ plain form
3101 -72 274 148 -275 117 49 -401 -40 126 -212 -93 122 80 4 100 286 6 -181 129 -6 -319 -48 221
3123 221 -164 73 179 46 -56 85 125 -159 -171 87 -77 -369 94 74 -220 29 238 127 112 158 172 -69
3145 -69 -87 62 -59 -220 146 -51 -121 131 216 -105 36 118 -61 -145 -160 -49 -190 -282 187 -38 1 261 180
3168 180 -40 133 97 -8 2 -41 -32 -220 -151 142 -66 -132 112 52 -175 129 152 19 75 12 -45 -165 -206 123
3192 123 -58 33 406 99 21 73 -104 -268 2 -101 -153 -26 69 148 8 213 259 -65 -74 156 -154 -138 57
3215 57 4 -59 -104 -88 7 -139 54 63 -97 63 95 -94 -152 -27 -75 -167 -28 53 76 61 149 150 -8 92 61 -80
3241 -80 -80 -14 -130 -144 -28 5 96 -1 111 131 -72 -57 55 -105 -135 32 -58 -5 61 -1 72 -30 104 130 103 75
3267 75 40 -102 -38 -84 -94 104 58 -3 143 284 121 181 49 -30 9 -244 -62 -137 -98 20 41 25 138 -59 -39
3292c9P9p8J18n1j50J99j01n9K19j28M4J28k33J17R0l07OM4l8K4J29j12Q1k1O6
3317B7J78j41OJ3k5q0j3q9k3R9pJ83k4j93J95j11M2m4J3k5n7K5J9J48n0j03J06
3344F9N5Q8j53mJ22l65J06Q4j96J64jO2J19p9o6%L3J40k36q6J94M4j99J09R7j31
3370c0K32l2k6j58J4Qk8j11O9L0n0J06L0n2Q4k8P1p1ROj58R0Q8j92RJ72j27L6
3398iJ16q6K9l5M8j44L4j94K22n4lL23j35K1Q1p0k45nR4N1k09J34M2n5k1K18j44
3425Dj61K93j33k3j2K30j94rj19J32r0J35P4j24j23L54k18l5Q2j84mk2J54K7o5
3450c1J31k4j15Q1R1k61J55R4j56nJ67j20j52L8K34L7k67L6J52j58J27N3k19J03
3474iN7J32l10R3K38o1j57K70j20k49L0K10l01O6Q8P1j57J01Q9rl8J046r46J85
$$ plain form
3292 -39 40 -38 80 29 -121 78 -23 -82 137 9 53 181 -52 65 155 -152 -146 -102 -140 -116 13 -99 -18 -39 27
3317 27 205 64 70 83 58 -22 -35 -124 -147 -48 -55 128 104 -89 106 -5 37 -7 6 -19 -76 -51 -32 116 66 -37 69
3344 69 124 212 59 55 177 -188 -82 2 -194 -30 -31 31 150 71 5 5 38 178 -58 -144 50 94 -105 4 101 -30
3370 -30 202 170 144 -14 0 8 -20 -131 -62 -32 -82 24 54 2 86 58 129 58 67 73 -85 5 93 -99 -90 82 -45 -9
3398 -9 107 21 50 15 63 -81 -47 -241 -19 -73 -76 247 112 133 214 144 -101 -106 -12 39 -170 -36 6 -49 -70 148 4
3425 4 -157 136 3 -20 -32 198 4 -5 -124 8 -82 53 127 3 -120 234 16 -19 63 -121 -125 -147 7 34 -31
3450 -31 100 76 -39 42 133 -128 27 121 -35 -40 127 7 -145 -107 127 164 -103 -67 85 -73 54 107 -112 -9
3474 -9 48 180 -130 -37 201 140 -17 253 133 -116 -86 124 -177 -111 -23 48 -109 -8 81 72 34 1080 134 319
3498C19m49n18J88N70k84p79R75J6N4k23J44o0n6j75N78o6m31J67P4Np8J29k5
3521G5k05J60K6r5n6O8M8l10L44Jk10J29J45l0k62J21J19j24k8K14j53j56K49
3544G0J0k37K54M3r0p5J64P5l89J76M1n5j43K49j4j27K81k22%P2P7m7j37j01K37
3569A12k43P7J34j95J3K54j13j84M1J41l5j2MM5k08R9K09j48N1J92j66j12J07
3592F3l7j46J67N7j06k19J96J38j41O4P1j62O9P0K4j62l2K04j27O1o6j4j19J93
3616D6J56j95k1L1j8n7J8P6r8l7P2N7r5K06mk14J55J7j28k0N7oj5o1R2m3k1j31
3644a81K90j94J37j0kj14N2N6j76J69J38j64P4J32j06j66R0J7k00J27N1j44oJ08
3668b2k3N5P1M3j29o4J30O1j81r3K39j00K6M3L7Pj05J18l7k25K72r1k49K98j5
$$ plain form
3498 319 -130 -648 -460 110 -174 -953 22 38 92 -131 13 -47 -103 -278 300 234 -197 -30 44 49 -29 100 75
3521 75 -130 30 56 -39 -95 -27 21 -289 55 56 -154 -25 120 90 -172 -51 68 -56 -84 130 -23 -179 70
3544 70 80 -157 97 140 50 -25 139 214 -175 1 42 -13 -156 93 79 -48 233 11 11 83 160 113 -24 -125 112
3569 112 -131 -54 80 -115 -102 152 39 -145 -104 37 2 -10 -6 39 -169 -70 139 -9 42 234 68 -44 63
3592 63 26 -120 47 104 -2 -221 -25 113 -28 36 107 -55 14 84 108 -54 -86 118 -9 52 -14 -28 -147 46
3616 46 202 7 -14 17 -1 -58 -40 36 -62 -99 -27 30 -65 141 137 -77 78 95 -33 -53 4 -2 -17 -78 14 -29 -50 -181
3644 -181 109 -85 52 42 40 -74 -22 34 -142 27 165 1 75 207 101 -65 25 42 -158 -31 20 -124 -130 -22
3668 -22 -45 10 81 124 -5 -69 61 122 -59 -152 87 -13 13 56 93 100 -5 113 76 -149 123 32 -217 81 66
3693F6j29K18j06k0n6J47M1p1q7Q6j29j07J40J5j66J74J8kl5J48j30l2j0O1j61
3718a27m4K50L9j06P6m6m9J19k06J53j38J0Q5j17j3J98j34K4O8J6j1kM3p5Qo7
3744d6J87k23J53L8j93L5J70j10q4J16L2j20Q7j8p7n5KJ39j42J45Q9r5rJ22j23
3769B0j22J21M8r1JP0m4q4R9P1j07M5R6k20P3K55l59qK8J06r6J37N4N4k26M9J25
3796I5j86JJ03l1M4r1L9K0o4O5k4P2j86J86n5P1k5p5M6L2j16J50j70J44J6r4m3
3823g6J33m9M4p6r0O5J06p9r6J49L9J4j72K14j12k27J83qJ8l4J01koj5p5J38j79
3850i2J78Lo7j0n2L9k0J6J7P0m9M9l6j3Mj45R1J72j74n8J57p7j00L7O9j6M3r4
3878e8j5M4N8j00Q0knMJ0J1r0Q4J2K7o0K6j29R5J06j11M9Kj7K5q7O0m5J01n9L1
$$ plain form
3693 66 -63 155 49 29 -27 120 161 90 3 89 -40 -147 -7 8 -158 16 34 32 -3 145 15 -17 -27 34 -127
3718 -127 -171 79 118 12 88 42 -7 112 -94 59 -79 -69 16 -101 -114 84 -50 -26 42 58 47 45 88 13 21 -46
3744 -46 141 -82 71 109 -84 -49 121 11 -73 43 75 -45 42 24 -53 -108 -106 33 -109 36 125 30 21 143 20
3769 20 -102 19 67 -24 -23 47 3 -81 18 89 -18 27 123 -97 -24 231 -128 -136 -108 -2 -98 39 93 147 -79 -30 95
3796 95 -91 -90 13 -18 26 -65 -26 -6 -70 -5 -29 43 -143 43 -12 59 34 -41 5 37 -79 71 -99 45 61 -33 -76
3823 -76 57 8 52 -24 -114 -49 57 -22 -118 31 70 84 -88 126 14 -213 -30 -38 -20 -54 47 45 39 24 -51 87 -92
3850 -92 86 89 22 12 -40 -1 -21 -5 12 82 33 82 46 33 37 -108 -17 155 -19 -77 80 3 -97 -60 9 -7 36 -58
3878 -58 -73 -29 29 -71 9 7 2 6 16 27 -63 21 33 60 0 26 -103 -8 98 -13 36 38 21 46 -41 19 -26 75 16 47
3908D7j54J48j6nn2L6K5m4n5K32q1j48J39j62J35r1K10k29R3m4J9R7l1o2p1K6
3934c8LQ1q6P2j01J2M5k6P1o7K9N2n9j5J07n3L2J6q1J6j27J85j00p9J90j62j2
3961i5N5L9l9o7J33ql4l4K03j99N1k3K3Q2j46k9j5O9M4r8n6R9J15r3J35m6J7j66
3989h3Q9k2m4J24J6J1o8l5Ko1O5KJj01K2K09j88J8N2j6K2M1J2L0p3o1o7L9ML7
4019b3l2M9L5nj6N8q3N8n1j25M5K8N5J9n1M3K3m3P0o7q0R5N4l3n2QK4q9MK11j43
4050a4J20q6O9j93P3O0N1j61L3R5p4r9J66r3J5R0K2j47J15M0j22m0L9N9j1M7q6
4077c2R2j9M1J8k15J48mk37K05m8P4j01Q8M4r8m2J57n9n9J7J27k13J32N7j20L1
4103a6J15M3j21r3K49o57P53m33J85P0k83M17o68J255r37K08j91K21l5j07K6k
$$ plain form
3908 47 -107 41 25 20 -32 4 29 -15 -70 162 81 -67 72 -90 45 -46 164 -65 28 -16 3 100 69 7 -64 -38
3934 -38 -35 46 -40 32 -69 -57 -12 -38 33 -34 -5 47 -12 -27 80 27 59 75 -6 10 -117 68 -32 -111 79 -83 -95
3961 -95 -40 -1 -40 -107 26 18 -16 -50 153 -46 5 -18 5 87 -59 -88 -103 -34 10 -88 -144 -45 70 -23 112 66 83 -83
3989 -83 6 -16 -60 64 80 91 23 -12 -10 -71 -6 -4 -3 -104 -82 127 -61 -43 9 -7 15 56 68 98 25 -36 -103 -64 -60 -23
4019 -23 -55 -6 29 24 8 66 -17 41 -10 -135 -90 -62 -7 12 -39 4 27 -16 54 -13 -93 2 56 23 -29 -21 3 -86 -82 129 -14
4050 -14 106 20 89 -104 -31 29 80 -81 -48 47 -27 -126 40 -53 -38 52 74 -73 42 82 -40 -80 -41 18 7 54 -32
4077 -32 60 41 82 100 -115 33 29 -208 -3 -51 23 -78 10 54 -44 -86 71 12 -47 -30 97 -116 16 73 -47 -16
4103 -16 99 142 21 -72 177 -480 273 -160 25 95 -188 229 -439 816 -121 87 -104 117 82 -25 1 -1
4125am9p8J25O7j93J81k6n2O6P5P9j79j02J10j51J17R5m4j53Q9R6p0M9o0j6k1
4151d6J04m6j16Q3N3r5L6J61o3j16nJ25j08M7O9o3j18K04l9j17P7q1n4O6J50j15
4177gj04J03M2K9j36K61q9j68l2K40j95O5Qk7K6J5n4J01j33O4K7j14J58n6l4r
4203a9J45j66p6J9L3J24q2QJ2J7m5M7j16R5N2r1M3qQ6L1r8j14J0O2J51q4l5n0
4231d9N3l9lQ6k5MO0m2oj62K21k41R5K6O%R0jl6P1O1K62n62K60k1o5j17J53j30
4260e1m3J01l2m4J14j38K67j0k28J07kj7M1j42jJ54j03j9J53j07J33j04j9K3k7
4285Fp4J50j50j2J82j86Q9m6O8j0l8J10j75L97j43k15j57J66K93l75K68Jm70M02
4309H1j84L94K34j289J95M39l8L33ol63J84O1Q9j39O6n5K9j79J60m9o9J20Jj36
$$ plain form
4125 -1 -50 -128 -3 64 -129 52 26 -26 40 115 194 15 -87 23 -128 -11 84 40 -113 -24 72 2 51 -9 -25 -46
4151 -46 58 12 -104 -21 32 -63 -27 134 71 -45 -50 75 -33 14 83 20 -98 106 67 -50 27 -54 -108 -42 108 -7
4177 -7 -111 -8 34 63 -73 188 99 -69 -101 139 -56 9 17 -10 16 31 -23 78 -55 9 36 -78 80 24 -10 -19
4203 -19 126 -40 -116 -97 -64 60 -22 -14 -2 15 -30 17 -99 -4 48 -43 0 -8 78 109 11 -103 -93 -31 120 36 1 -49
4231 -49 4 -35 -38 48 23 27 87 45 39 -123 98 -143 -48 -22 -16 -16 74 73 37 108 169 431 -131 129 108 43 -74 79 -51
4260 -51 -94 7 -25 -69 45 -93 174 164 -64 43 41 24 65 -77 -78 76 -27 -46 107 0 133 29 10 33 6
4285 6 -68 82 -68 -80 102 -84 5 -41 27 17 -21 89 -86 311 168 -47 -204 -38 255 -120 148 149 -321 81
4309 81 -103 291 525 -764 -569 -130 -168 165 159 -204 -20 41 130 -9 57 2 31 -148 12 -37 -106 14 15 -121
4333a21J31J13j55j02J31j2k3L8P3k24J36L4M5n1L5P0k20J11J6j9J0J2Mj49K6
4358i1K33j57J2oL1j28J94o4L7p5O0m7m4N9k0j8j19J54J0m3J70j50o0R4k0p3r2
4385a53J08p9J52q6K9O0m3P1Jo6N4n2p5K6pL9K4N1n1J17j99J32l4L1k9n2J05o8
4413Fo6K15j10n4K6l2K3J05q8l1K7j16Q2P7k6m1L3k5q5R9l0J27k16P3O6k2m3l7
4441f3J15p0J09j34J06l9J55l19M42o19LQ28q35L33r7R6QP0n7k0M8n6o2j9J01
4466B4p2M4Po9K4O0M9l2J5j05J01j18R1j09O3k8J04o6J53j09l9l9J47j17m9J88
4492A18j94L7r7N7oJ3K38k22K09j38K47m08L10j99J58q30O84M35m32J20l35N01
4514B66k93J64k74Q7p8J31o8J14j09J28q1%J11M3j90J60l06K95k88n7J23N09o73
$$ plain form
4333 -121 10 123 -32 -134 -3 -15 -38 0 73 -151 -15 19 64 13 48 118 -102 9 25 6 16 28 32 -117 -91
4358 -91 142 -15 -3 -9 22 -106 88 24 61 -14 46 -1 -45 14 -6 -24 -143 11 21 -22 148 -2 -62 32 12 -61 -153
4385 -153 -45 -124 28 -58 -29 31 -12 59 60 -6 48 -4 -79 -53 -60 -21 3 54 3 120 -79 53 19 50 21 -31 74 6
4413 6 -60 155 45 -9 17 -15 8 113 25 -6 21 -95 -13 64 38 -3 30 5 -80 19 -11 116 -100 -27 39 17 -26 -63
4441 -63 52 -18 91 -43 63 24 179 -140 302 -317 -314 514 -321 12 -85 11 19 89 32 12 60 4 -58 -77 24
4466 24 -48 -4 3 -66 -42 18 67 35 50 -55 46 -72 19 -90 -27 -55 49 -17 136 27 -12 -51 96 -21 -70 118
4492 118 -76 -39 -136 -79 -85 -72 166 -56 153 15 262 -146 164 -35 123 -707 -23 412 -20 100 -235 266
4514 266 -27 137 -137 -50 -128 3 -65 49 -60 68 -13 -13 98 141 -49 111 -195 100 -188 -245 -122 387 -286
4537b86J53J76m4J36j48k32J19J00J15j11n1N9k24M22R8n61j11L85k50R3M98l42
4559fk4J34j86J5K6NM25J83o12L40J44k23k61L19o81N51l55L96k91OJ27J27j63
4582dN6j48J29j11m3J54L7q6m6O3k0J95o2j60j4K42m68J42j99K30n0j75L62L67
4606C91o02Q5J79K62K38o23RN9jj59J99r0J26k25J50J72k55J2J22Lo5m0M7Rp0
4631f7j5J24j87K37r4J3l9J32j64k6J66m8j35J64o2Jp9J81m0n6O0k6r6j3J28%
4657E9m2j2k6M4J45o2n1o9N3k0M0p7Pj54M9J32P5m0j31J08n3Q0NK1j48J22l1k9
4685eJ5l1L9r2N3j9Q7j18o2R0j9O0Q3j16N1L3o7N4KJ06l4j87R5N9n8q0O7n5N0
4714AL6l2r6O8Mn4l2K52k25l3J62M0j51J07Jj38J37lm9LL2qJ9j43J69p7M8p1J72
$$ plain form
4537 -286 -133 43 -1 135 -13 -245 -126 -26 89 -22 -73 -14 -238 184 282 -279 -390 -5 -255 -162 336 -6
4559 -6 -30 104 -82 -67 -41 -36 389 572 -40 300 444 221 -40 279 -402 149 -206 190 -101 -95 32 159 -4
4582 -4 52 -96 33 -78 -121 33 70 -16 -62 1 -19 176 114 -46 -60 182 -286 -144 -343 -113 -163 -338 24 391
4606 391 -211 -126 53 315 553 -70 -61 -2 -3 -162 37 -53 73 -152 -2 170 -85 -73 49 52 -13 -53 -6 3 -67
4631 -67 -82 42 -145 92 -2 11 -28 104 -60 -86 80 32 -103 61 -1 0 -79 102 62 6 66 40 -56 -69 59 59
4657 59 17 5 -21 23 168 106 55 -14 39 19 59 -18 -11 -165 -116 16 91 51 -80 28 -25 55 60 81 -67 55 24 -5
4685 -5 10 -21 18 -74 -21 -40 47 -71 -133 -43 -62 -2 81 -35 16 49 -18 36 38 144 110 -77 18 77 19 -61 6 -49 1
4714 1 37 5 -91 -23 -19 -73 -105 147 -78 -111 51 91 -60 47 48 -90 47 44 -5 -2 30 22 41 -102 67 -10 38 -33 139
4743A39k41R6J9n4K1Ll1J58j48J11n5n1J20j16l2k1Q8O9j24J53j46n0M7O4l5j33
4769a49K40j3j73J85j05Jj5J17j67O6o9M2Q3j00J65j01Kl6O8j70J28J22j92JN1
4794a9J37j36R4j5oo3L1Mom7K6K7n7j8n7o0K01J28j33k8M0j08J5R2j6p4J54k9
4822G7j75M6L4N2j17J47M3j65JJ17p8oL33n83J50K36K53k10K78m1j13n35K88O3
4846I5n9j12J18l2j1mO9j15K0K05j49j58J68P5j96oP8j1o5J37J05r4j07K16k01
4871c4j22k95O44l59J108p68j04k62j68N50k18P9qO3k29J35n3kL6R7j55M0N9m0
4895fJ9O2q7j9OK5l5J2J78M1j96L6K7K7p4K7p9l9R8j3j27J19nk5lK4j8N3j9Q4
4925I3j29M6n8J22j68K0J50k8j90K12n4o3K6Q5j6o5j7LO3j1OQj16R9q1j5Q8j6
$$ plain form
4743 139 -102 -6 13 -41 -20 -17 -48 110 -38 73 18 -33 87 -29 -61 -82 6 75 -49 104 -42 -92 -45 19 -16 -149
4769 -149 91 78 -95 90 -15 -14 -29 88 -79 -13 -82 -40 43 -57 108 7 9 -27 41 -129 -1 121 -71 -70 -19
4794 -19 118 -18 76 61 55 -8 23 27 21 -26 0 27 -30 -48 -105 -165 36 164 31 3 43 -65 -50 42 26 -48 106 77
4822 77 -98 -52 -18 34 -83 64 107 -58 -57 60 -18 -24 309 -274 -124 112 365 155 433 392 279 -256 32 95
4846 95 36 -76 42 10 -1 -5 64 -51 -31 174 25 -133 35 110 -86 -92 -14 -25 -90 47 152 58 -49 167 -34
4871 -34 -156 -451 193 -166 942 174 70 -192 -360 190 -28 51 43 106 -123 12 -41 -43 -7 90 -65 -25 34 -6
4895 -6 13 75 -12 -31 -25 0 -35 -23 155 196 0 36 63 90 16 43 -36 -75 23 10 -117 2 -3 -28 -31 -7 -25 28 9 93
4925 93 -36 10 -48 74 -94 -74 76 48 -142 70 16 -47 -21 64 48 -17 -34 -31 32 21 27 35 -81 18 -63 -78 10 -6
4953fM5l2N5j53J31n5J08k01J14O3j38N3Q5l5q2N6L9q7P3K0o5J0J07o6j60J33
4979A2l9MQO3q1k3P2J4L0q1N8Nj36M9J06n9n5N5J2r1J35L5j24N5j02J15j81J72
5007B8q4N4q5J26m2J04p7O1l2O9j65J3L5q2m6J29J3m3jO1r1O2j52O9J8J05o8L0
5035Ij9q1J76o3j07L7J42p9K3L0j13k3N8l6o7J01J46j28K0l6kJ05k13m8K35j05
5061c8N1O1n9n5J06j76J54J6l4k4Qj01J80j37l2J1K14k47J20J7k8K3o1J05j35
5086f1L8R3j49R4N6j49P1M6OMp4mJ77k14MJ14j44J32O8j81j40L69j67j17J54j9
5112GN1p2l1P5j37M4J8k3J8O9kj6L5k2n5pL1L9j18N5P0p1J31m9m8l6O6l6L2q0
5142f2N5L7j01J9R5k50J19N2Q9n8Q0K9j20J5K6j02J24Q6j78n4J39j43P6j4J9p9
$$ plain form
4953 -6 39 7 62 -91 40 -15 93 -108 6 69 -69 -16 69 34 -48 8 47 -40 33 53 -12 -2 105 39 -121 12
4979 12 -27 -23 -15 48 -33 -56 16 30 60 -21 37 42 -94 -45 61 2 -53 2 14 -77 58 93 -31 24 -78 37 -144 28
5007 28 -56 -2 -87 39 -3 101 24 85 53 122 -43 -30 5 -77 -123 6 19 -24 -25 36 -55 7 -145 -76 -58 47 -21 9
5035 9 -10 -91 85 22 -85 -48 94 15 38 68 -45 -68 -10 -46 -113 -12 134 6 26 -10 -12 93 -120 -168 67 -38
5061 -38 13 74 15 -40 66 -110 44 60 26 2 10 -91 89 -48 -80 -69 145 -102 18 35 7 30 -31 74 -61
5086 -61 -23 70 -79 15 71 -78 -7 39 45 49 -25 -29 148 -66 -62 52 -92 40 108 -73 -213 156 -11 -128 26 7
5112 7 58 -14 -45 30 -107 -63 -45 -68 -50 19 17 1 36 14 -41 -48 -17 22 -96 -41 29 -42 89 40 -8 -44 22 -14 18 -62
5142 -62 -7 30 -71 -52 43 -207 -88 -36 53 -5 75 104 -16 -1 25 -77 47 133 -45 -99 40 -103 -27 -41 -22 -101
5168a01M0K9J49n9k79M02j83R1l5m5q1L9J61o1n5K0k9R0r1N7q6p3M3J91j26r6
5194h8O9J8k1J4M5l1Nk7L2m1K1P2k7j82J61p6PL6M0k4l8J83o4k89K97P1j74R1
5222H0kj54j4P9o5J45m3M2j60N1R4q1n6Q6J63j54P8m6l1m2M1N4q1J09J7j34m5
5249f9N8M1ML8K7k50K29O7j59o7LJ98j84J96k8p1p5P9N8r6p3O0nM6J41j07p1j68
5277a78L17j95p4K53j56m6J00j14O2m1R0M7j23O4P2j01R8j30l5n5K62Kj41j5J47
5302A10j98k6M3N5K2l9J10j43Q7L3L0j96R3J06j55K48j30j4N5n8J24l09K18lm6
5327A7p5O0M3n3j16K20n1p7J63lk52J27J73k76R0jQ6j03J05r5m9LJ21m0o6J47
5353I8Qj84J99l8m2r7P1R7k00L5M5K2j8q1M0p9J27J48l14J26k2O1K2m1k0N9l0
$$ plain form
5168 -101 -61 -32 117 58 -221 181 -2 89 54 9 -72 -33 128 67 12 32 3 93 2 59 -27 -100 -57 134 8 -88
5194 -88 -19 -1 -22 -8 37 6 11 -16 16 -25 -4 68 41 -141 20 -56 -49 -13 27 3 -35 148 84 -205 92 163 -11 80
5222 80 78 -76 -90 -11 -76 69 26 68 -92 -41 53 -28 -84 2 165 11 89 43 12 -30 11 65 -16 93 110 -24 -69
5249 -69 -11 30 34 72 99 -151 78 145 -14 -81 -78 120 -64 132 104 33 -42 37 95 -1 -74 -14 -19 27 168 61 -10 -178
5277 -178 139 -56 -130 123 -33 -79 21 -93 -31 -72 18 65 -58 6 78 -23 75 -55 -90 -145 117 119 -22 -37 110
5302 110 -88 -114 -71 -16 6 -33 77 -66 21 54 84 -112 -19 87 -68 180 50 36 91 33 157 -152 66 63 17
5327 17 -58 2 45 -8 -124 96 45 -32 131 128 -124 3 176 -100 -10 -11 75 -28 77 -18 -67 -64 57 17 -49 98
5353 98 106 -78 121 83 41 -56 15 112 -88 -53 -8 14 -4 -85 -45 -124 3 151 -163 -37 -59 2 24 -17 -37 22 -8
5380hM4j38l1Q6o1oJ68r9r2J71r8J17j26P6J31j33%j1J15r5n3J13r2J35p7o6r0
5407a20J75o9J6l6pk6O1Q4l1n9Lj3N2j16K75j49j09N4O8p5K4mj14LK39r8mJ9K0
5436F3p5q7O8qk5M3Q1J3r4J19k9p9l1N9m8m4J07jj38J02Mn8M7J1k0L1%l7Qj7L5
5467@o0P8N0J6j49J99j36k9L3J45j04j03R6j26R3n6J26j15k4J49l9j42R9L9m2
5492bl1J39r7j06Q9R9j71M0J21L5j27J35O8j32j01J4M0m5J6Q7Nj11O6P0j32J25
5518I4q3j64J02N2R0q0n4N2L4p4Q2J6j06K48j46k50K90j58k9J19q3O2q9j9J37
5543D3j23J6J6n6R3R2k05J07M4Q4n7j45M1N3J44j76J44j01k3k1O3l4m1J38j37
5568d1P0j4rq5J16j7p4J02k9N7r1J2P0J3o2K8n5q3J00l8J2m7J80j85J43p1L1J8
$$ plain form
5380 -8 36 -102 -133 -47 -108 -114 54 -45 -137 34 -64 53 -73 3 134 1 1 -10 105 10 -43 70 -22 113 36 -30 -120
5407 -120 55 -14 2 -34 -41 -67 -6 78 47 -12 -9 -22 30 -86 189 40 -69 -15 53 -22 2 -2 -116 -113 126 28 24 43 63
5436 63 -12 -99 -31 -39 -64 -21 60 73 -21 98 69 -10 -41 18 -30 -74 33 32 -106 -4 0 -58 -11 0 -20 11 11 -26 -18 -35 0
5467 0 -60 18 68 84 -65 134 -2 -31 2 147 43 -60 36 -90 3 -53 73 -42 -66 83 44 -98 1 40 -2
5492 -2 -33 106 9 -97 -8 91 -80 -40 81 116 -11 124 192 60 -41 -27 13 -32 -16 71 76 -35 31 101 -31 94
5518 94 11 -153 -51 1 91 11 -43 9 43 -31 51 67 -39 209 63 -187 103 -55 -84 35 -48 14 -75 -94 43
5543 43 -80 -64 -48 -104 -11 81 -124 -17 27 111 54 -91 -50 3 147 -29 115 14 -9 -30 33 -1 -42 96 -41
5568 -41 29 15 6 -79 37 20 -54 48 19 76 -15 -3 67 80 18 46 -9 -92 8 -30 -18 -65 115 -70 73 2 33 51
5596E1p8M5p7J36j03J31o0m0n7K8n1R3M7m6q3L6RN7mKr9J30o8n2R1%No5J2m1K8
5627b3q0J06K2j33J08j5N6j34R0p5R3k2O6j40J17Mk7k0pn1J33K4j47K5r1K24p7
5654B6l4k0Ml6J7K3O4o7J26q3l7N6m0N3Qpj43J69k11K53j54J03m5j51P1N4o3Q9
5682B5P1M1j25r0L9M2k9J30n3m1P4j22J6q2Q9k1J82r0k2l6nn5K0n8J86j59J55
5709H2q5Nm7R2j63O4J51j07o6oJ52j54O4k6Q3q2J5P7n4K2mJ9j51K94Qk06K8j2
5737gj6p1q3K30k9l3N1l1j8J90l31J56K0r0M8M3pJ01k47PJ86o0J0J15j72m9J40
5764E3m7N4j72J39O0k25K65m5j48K4J02m0p5J67j10P3o2L5qj29P3k6K4JP1j16
5790f2J00K2m9l8Q9J2mMp6Q1j23J02j23nqJ49k0q2K7O2q8J6J6l0r2R6J10j12O2
$$ plain form
5596 51 -27 18 -59 77 -26 105 45 5 -52 -24 -75 18 65 19 -64 -28 -19 38 34 36 -63 67 -1 -53 38 38 43 -22 -10 -51 -23
5627 -23 -103 3 25 -108 0 -15 41 -93 -3 -78 15 -7 59 -81 36 40 13 -7 -14 -65 68 92 -55 -30 -121 103 26
5654 26 -8 -28 -24 -60 -43 -20 44 -23 103 20 -17 39 -1 52 60 53 -90 79 -132 121 -33 70 25 -126 -55 -1 -64 25
5682 25 96 137 12 -78 -39 3 -26 104 51 10 84 -38 -22 -104 -15 -36 146 56 34 -2 -7 -62 -42 -100 86 -73 82
5709 82 -3 2 -45 47 -116 -52 99 -8 -74 -80 72 -82 -18 -44 39 -43 -28 49 -5 17 13 32 -119 175 183 -23 5 -7
5737 -7 -23 -94 -177 53 24 -9 42 11 -7 183 -148 8 28 -62 -14 29 22 123 -124 -117 69 9 19 134 -38 -87 53
5764 53 6 60 -112 27 87 -138 127 82 -66 -42 60 20 -55 112 2 75 13 48 40 -89 -16 -42 -18 -17 54 -62
5790 -62 38 60 11 -27 62 74 70 74 -2 79 -44 58 -65 -70 -78 71 51 -31 -4 58 -30 -14 2 -28 -120 -24 86 -26 36
5819C6n3q2K4Q3K3J63j70R9j72j4k3O8KJ4rk9k8R7j48J29q8R8p2PR6o1J7Q4q8
5848Cr7J08qo9Q8K3j05k0Q1J06j60N2N8j70r5K60q5P5j35J72J07j94p4J01r6j6
5874i0J02L8j15J40l2j15R6J3j63P3K19j78lR8j16Pq2K24r2j32J86j3n5N1L0j63
5900g2l3K52k06p0L9M4J4M6k6J6L0L2k4Q9o3K0p8j83J70o3j9K5J94j22j55J42
5926al2k4KR2K6K6nn6q1J32Jj87Q7J73k20o2J02M4o2J48L4J8j45KL8j42K4J44
5954G6l2p3J11Mj87J34r0K0m4K00O4l04J84l8j98J20P8j88J29M4J7Mr5J22j02
5979d4r0K22L1j84Q0P5j10n2k7N2Q2p5K36k84N5N3Jq9P6R9j66J23Q0Ok64kJ63
6006D7j35R8J2n7NJ77p2k18NK34p9N5rLo6j89L16j55q1K11L5q8k0NRj23M2O5J7
$$ plain form
5819 36 -17 -99 -75 8 31 194 24 123 -49 -63 -86 -18 -16 -2 -11 -40 -68 29 -119 10 -78 20 -52 -45 51 -10 7 91 3
5848 3 -94 14 6 -63 25 48 -57 -77 4 110 -50 2 60 -110 -205 55 -30 45 -90 82 189 -5 -79 22 -74 -90
5874 -90 12 50 -65 75 43 -72 24 37 -126 -53 166 -12 -15 83 -33 -26 -108 116 24 -108 78 65 10 61 91 -72
5900 -72 -105 147 -59 -129 -90 -46 -32 14 -12 4 34 66 42 131 68 88 10 -173 -3 -66 -85 -60 134 12 -143 -1
5926 -1 -33 -57 -55 37 63 89 84 28 -53 79 80 -107 -20 153 -67 -129 -27 17 -45 103 137 155 10 12 50 -92 -68 76
5954 76 44 -29 82 86 -101 33 -57 -37 -81 119 183 -121 63 25 -173 -53 25 -163 -34 10 27 31 -64 58 -44
5979 -44 -134 88 119 -65 15 90 -20 -72 -99 -47 35 -40 196 -88 -33 20 21 -68 8 107 -59 64 144 150 -114 -116 47
6006 47 -88 10 22 -35 -30 147 75 -143 -138 96 17 72 63 66 0 -189 127 -28 -109 102 137 49 29 34 43 -80 -38 27 44
6035D4n2O0p6O8nj16q5J82R1j50J04Kn5l1M5n2j22K5J86k1m4j13J03m4RJ64m6
6062G1m2J12j10j75J10R1j13P9J23j41m9J17n9n7m9J44m1j4N3K1J0PKj48J01l
6088D0o4l1J35j5j84JR8l5JJ51j9Jq1M3n6n8M7M2O8j74Q0k8kJ05l3m8J40K1j79
6117c4N6J04j36Or8Q8M0m9K15j54n3J84j53j71J25J66M3j93K8K7r6J22q2J5k8
6142b8J24j23o3J38j39j22J51J07J03j76P7RJ9j06Q1q9p0J36O5n8l5k0N4n2M3
6167B6K9l6j52K29j91O3R7L38Oj114J239o48M17j64r36J053K19m14l21K40O55
6188F35j77n33K54nj04k95K68p63M10N87j592J012N60m79J040o09p09K76k16J635
6208A195J07q88M9j71l99K77o27P42n09R0J27oL39j71k84K16K8nj17k8o0J37j1
$$ plain form
6035 44 -8 52 -24 44 39 -77 -162 20 111 -39 65 67 12 -19 26 -26 -148 -123 63 42 -2 -115 -12 -56 -47 117 71
6062 71 29 141 31 -144 -34 57 -56 23 146 5 -44 73 14 -43 -92 52 11 -3 50 71 81 88 90 -58 43 40
6088 40 -24 -55 80 65 -119 -118 -20 -55 -54 97 78 79 -2 41 -15 -73 -26 16 84 -90 -10 -38 -40 65 32 -16 124 145 -34
6117 -34 22 126 -10 -4 -102 -14 26 -23 192 38 -15 169 16 -155 -30 136 179 -14 14 41 -55 67 -15 0 -28
6142 -28 96 -27 -90 48 -91 -213 -62 45 148 -28 49 58 77 -29 52 -37 -107 29 94 36 1 -19 35 -17 26
6167 26 55 19 -133 96 -95 -32 65 403 409 -705 534 -114 303 139 -797 256 475 61 -260 -20 635
6188 635 458 -75 179 174 70 -225 43 -720 -310 277 -1315 -303 257 -222 818 209 -500 -224 -440 1195
6208 1195 1302 414 463 292 -107 170 -457 285 -224 -134 -7 -13 326 155 -129 87 115 110 -7 -35 -95 42 31
6231C1J5l3j34l9J13O3q1J05k7m6J10r4J81k26ON4P1J%j62J96j6j17J2J11j41
6257d7j83K77l61L67j67J12r4K0Q1K1lR9Oj54l2L3P2K8K4K4j20L3k0nM7m5o0N8
6285A1K8p6L1N1J8j6j01O2Ok6J7N6l7n4pk3K6L1m7j5O4MK5j18P6j0K4m2R7j44
6315h9M7P2Qm1J7L5q0M0n2L1j11R4J27j4n7j5r4J16ooK4l7J11p8N5o8qj13J42
6344E0k8pM3j7j87J06K2J2o0N9L8P2j07R9r8n9R2K8J1rM6q5j01J50j78L9J10J35
6372A76k69l5K16k9p2o1J23j58J35J10j29R6j70J19j26J5J76j61R9K6j96J14j7
6395a8K0J9o5P9j32M2J15j0j7o9l1J04j42R7J13q6ON0o8q0J66q4j45J22J22q5
6421B3j53K9J11M4j28J25l1j80R8J39j60N7J22j83P2J43q9j12J00L5p7q3J83Q4
$$ plain form
6231 31 46 13 -121 -160 -47 16 -65 40 13 -33 77 -17 164 -62 -56 -2 69 70 70 -92 104 88 -29 -17 94 -47
6257 -47 -230 47 -314 53 -114 -2 -96 -76 5 26 23 122 128 -26 -58 -25 47 75 99 123 3 36 16 11 58 13 -47 11
6285 11 39 -37 -6 45 63 47 -54 8 14 -12 5 61 24 -30 -37 -60 -34 -3 -50 -65 -1 3 28 -90 -14 -24 0 -42 55 -89
6315 -89 -42 30 38 -3 14 49 -31 9 -43 -12 -123 -29 98 84 27 12 -82 34 28 22 46 9 120 42 97 29 21 -92 50
6344 50 22 15 58 41 -146 -40 -18 -6 -66 -7 31 103 -4 95 -3 -62 30 58 69 60 106 21 -80 70 -108 -69 41 176
6372 176 -93 -128 88 59 -13 -74 49 -109 26 136 7 103 -67 52 -74 -59 117 -44 55 81 -115 -1 -18
6395 -18 2 21 -44 35 -97 -55 60 50 33 -36 -67 37 -105 -8 105 19 25 75 7 -73 93 9 -136 -14 108 23
6421 23 -130 -101 10 54 -74 51 20 -160 -62 77 -83 -26 96 -87 -15 128 39 -73 27 62 -15 -98 85 169
6445A69j89K7j8q4R4O0o0N1j8K6n8j67J96m0q3Q0J52j10j3K2j29R7n1R2r7R3Q6
6472A28j57j27K17p7j09J30N2l9n9J13Or9J28j4j12K2O4o3j17J86J3j86J62j4
6496D8P2j42J9J74k64R6M5j85OK00J1q9N0N6k75J47N1n2J8O3n1J3j22J06K8j7
6522Fj8l2Q4j08m9R2%pL9k5R5L1n8k25K20o0L1K9O4o6R0j28M4j9l4N4j63R9J0
6551dJ16k31Q0n9J7J12L1K2q8J49q2o0o0J3m5N0J12n9o4N5J01k08P8N3q5J4Q1
6578C9Jq6N0n9N2M1Q0r1l4N5j1q6J7N3Q2j58M0R6p0k8L2j33NJ68j0K6j27J39k1
6607F2j71J65r7j0L8M3o6M0L5q3m7M8Q2j9m8R5J5j63j9J15n3n5J95l8q2J36j05
6634A3q1j20J45R1j42K22l2j00KJ10j95P1L8R0l7j8M4j09j14O7R4j40J76K9p4
$$ plain form
6445 169 -20 7 -11 -95 -1 59 -1 50 32 58 0 -167 29 -11 -94 -14 138 28 15 37 -92 5 -46 46 -51 42 128
6472 128 -29 -156 61 -16 -125 5 57 18 -41 72 78 -21 107 93 -19 3 67 4 -113 73 86 -100 62 48
6496 48 120 -22 -3 171 -93 3 48 -137 -131 69 80 -9 41 97 -178 -31 20 -32 -14 49 -2 11 -111 -5 23 6
6522 6 -12 -44 40 -68 -117 -25 -25 -32 7 -18 77 108 50 -175 45 -15 16 45 109 43 133 5 49 30 -4 50 -113 -14 -4
6551 -4 112 -119 -39 -98 -81 31 62 84 -4 145 63 3 -57 -44 -89 -39 73 14 -50 5 106 -102 -24 29 -56 -42 39
6578 39 40 -46 4 -55 -3 38 118 27 -7 48 37 -49 -32 21 103 -55 -15 81 11 -17 15 -118 -113 55 45 71 -56 83 62
6607 62 -109 56 -41 -51 -13 30 -36 4 39 -44 -91 -43 39 20 -28 67 82 -81 -100 15 -38 -93 102 64 -18 118 13
6634 13 -68 -188 -43 48 -94 128 96 -4 -2 108 -87 -16 22 112 75 57 101 -8 -122 -55 39 -101 75 104 30
6659C0o2l5q9J02Q8J64k70R6L8o1Om0O9j04J32j0k5J8m6J07j44pJ01j46J9R8q5
6686e6NL6l6m5q7K53l2j22J99j01r3Kj7M2J5Q5p8J23j18q2M2m0K39j28llj1n2
6714f3J07p2k5j5J71J8j40J11j31L5j23J80m1l3J43j25j91J73m0O5o2J17l0L0
6738E9j09M2K2j00R9P9j91R9J56k22J77k30J19L2q9K0Q9r8J52j02l9L6O2j06M8
6763EJRK3j34J18lj12l6M6mP8M3M2r5o7M7M4Q4Rj19k3J65o4r8J38J5o5M8k9o0
6793Fj0j43K2P3P2KpP4q8L3j44M6M6N4J05j57L3o9J1qN5j25K41K3j80J20j82O6
6821c1o2J18J5k0m9N3n3lK1Ol1J92j19J7J8o8j03J29j03P6m3jR2j11K05j35M8
6848E8o3N4j23Q2j4m6J65j54N7k2P9K3m5j9lr3M3M6l1k4R3J17j16n8JO9j13nK0
$$ plain form
6659 30 -32 -67 -156 -54 34 198 -72 24 62 1 7 -33 36 -68 64 54 29 47 1 108 -36 -43 58 -88 -69 29 -56
6686 -56 -51 -15 -51 -96 -183 70 38 -84 115 14 -79 -77 -94 -52 -37 48 -30 93 -25 -107 -65 -105 134 6 3 0 -11 -63
6714 -63 44 -28 -53 -68 103 121 -19 92 -39 -4 -127 53 12 -21 122 -3 -194 -21 -61 4 -58 59 29 59
6738 59 -50 -8 14 -86 13 92 -99 0 156 -66 111 -119 0 32 -57 -37 52 -46 106 4 -35 1 63 -43 5
6763 5 6 15 38 -96 22 19 -93 -129 -83 -87 -9 34 76 -19 -86 -39 5 89 98 -21 -44 121 57 -41 97 112 47 95 66 6
6793 6 -4 -147 -125 -52 20 22 15 89 1 34 -110 -64 -18 36 141 -16 17 -52 -41 -49 6 -119 122 145 -35 85 -97 -31
6821 -31 -93 25 40 20 -29 24 -29 -32 -11 -5 -36 156 37 54 72 4 -99 30 -73 3 -40 -41 51 -60 145 10 58
6848 58 -5 49 -74 8 -6 -52 113 -41 16 -6 73 96 51 32 29 -64 -21 25 -6 -30 63 180 64 6 7 76 -37 -42 -22
6877b2%j8J08j08J03r5m2N7R1j09N4M0r5J20l3p0L3j10P5M1m9Q9q0o2N4oQ1o8
6905b1J25j29k2o0J0J28j64J34Qo2J15J11j82n0J02m9N5j09J92j03o0P0n9m9p
6930g6Q6p6J0J21p5n6J9R3n7M1j5K3m0K4J35l54K82n0Lk1o3J86j94N5K5qj2N2
6958E8Rk17J34KQ6j60N4P2j1p8R3%j65J14rn9J42R7j40j1o8J28j25M6j5L0j6R8
6986H9l2k05J14J8J6j13O6N9L8n0P9j02k2J53j02j34K21Qj61J10n9k5J0M2N9j55
7012g8m5K87l11Q5l9Q3L1Q2n3k2k9M5n2lk2J51j10K2L7n2j10J47n2j48K56p8K9
7039E1l4m2R5j08P3J7j35j0L07j67Lo4O0p0o6J49O1l9Lq8j24R7M5o3l3K21r4l0
7067A5j03Q6k1J01j71J47m2K9L8j15k6N8m2P5J51k35J1JK2O6j45J55L2j92J71
$$ plain form
6877 -22 -22 -40 68 -40 63 -32 -74 -17 74 -35 19 59 -36 84 51 -19 14 -96 -21 20 -29 60 -20 -82 -28 -34 47 -21
6905 -21 104 -25 -47 -107 -97 31 -133 1 9 -53 62 173 -9 -59 43 -6 49 -60 132 29 -31 39 -20 -69 -76
6930 -76 10 -66 -56 65 -10 -66 -47 46 -11 30 15 38 -2 22 157 -197 85 35 38 17 -46 140 -54 1 26 18 6 58
6958 58 67 -150 -16 -14 72 -88 -34 38 27 -51 42 42 -123 -9 -18 -77 65 162 22 11 -57 71 -54 -8 -23 7 -9 89
6986 89 57 -148 -34 -16 0 -113 -47 12 50 0 79 -23 -45 108 6 -128 93 101 -60 50 -9 -34 -24 18 77 -78
7012 -78 -123 164 -147 -62 -101 -18 13 95 42 20 -9 36 -16 -19 -41 110 0 22 59 7 -103 44 -8 -156 100 22 51
7039 51 17 -25 70 -38 35 52 -83 -93 214 47 50 -14 46 -24 -90 59 120 81 84 -4 -128 -31 14 -49 -82 139 45 15
7067 15 -88 -2 -23 78 -93 54 12 41 79 -36 -62 -4 -46 29 180 -55 -44 -43 -21 45 -100 55 87 -105 66
7092F6rm6r4J03l0P3o2J6J58j77K29k85j06O0Q4K0k8Q1j05j4J03rk5j7J33o3r0
7119c4R3k8J0j28Q2Lo0O4m3j2Q0m8o4jJ05l6j29K72lrk56K09o0k6n5J11p0J18
7147H5j08k8k9K1M8k1J4l7mP6l0n6l6L6J67j49N6P1j34M3o1R7j7J5N3j38LJ08
7175D5J4j42L7N3OpK7p6J58k21J53K7j41J53L3j71J3M9J1r2m8J63m2J14m4L0j40
7202c8L2%r8J27J1Mj3N6N4j03P1m0m7L0l2m5L6P8l8k49J48L7pJ29j64K3n2M1j08
7231a57K40j70J09Mj9npm3N7R0j07K8R1p1o1j4m0R4p5N8K03l03K39j17o1M6J3
7258B2qJ23q4k0q3p0J78r3l0J34n5k5K7L1r1l2M0N3N0r0J6k3Q1K0j06q1K5j2Q7
7287a6n9M9N6j59R8k2k3l2K17j69R3M7Qj73L6J24j15J10j09J69j80J9J5N5o3M7
$$ plain form
7092 66 57 11 -83 20 -10 63 1 17 175 -2 227 -58 -164 -104 -20 0 -28 53 -52 -66 37 28 3 -14 119 56 -34
7119 -34 59 31 41 -87 -5 -2 -62 2 -41 -53 27 -21 -85 -86 19 -17 -146 126 123 114 -142 67 7 -19 -74 37 -33 85
7147 85 -23 -51 -80 -59 -11 -32 -18 -55 -59 17 -13 -69 -105 -69 98 -51 5 76 -58 -15 -76 21 4 19 72 -66 -63 45
7175 45 59 -83 -46 7 13 6 33 -43 115 -106 47 74 -67 86 119 -52 -39 10 21 -71 -119 44 2 116 72 102 -38
7202 -38 -6 -6 -104 23 34 38 25 81 135 32 103 63 16 46 14 -31 5 83 45 -204 -56 -19 -26 103 -61 -38 -90 -49 -157
7231 -157 83 -87 22 26 7 2 -5 -48 9 99 -8 20 111 40 -21 -35 -75 19 -56 2 205 -98 141 24 -37 9 22
7258 22 14 137 53 33 -50 -120 58 -35 -65 69 14 -11 16 47 -44 -76 -36 17 67 -23 -7 -30 51 71 -35 -116 -91 -103 -16
7287 -16 -75 -26 30 -129 -31 -53 -76 -108 109 -60 33 80 88 -85 -49 75 -40 70 -39 130 -50 -31 -16 39 -24 23
7313B3J03r2p6L1j6r4J05l7%O7K5r9r4J67p4n6J28r6L2Q8j23N0Pj75K23M4m6J56
7341A71k05N4N9Jj73J71j11nqO3J1o4r9Q7j08J92j4j2L0m5l0J01m3N3J13j13n8
7368A8r1L0P5q9j8Q6J9j01J85l7m5q1k6P3RO8m0R6j34J30k28J36m2L5J2J7n3K6
7396C0K1j59J28o3j3P2L1k53K25O4j33j7l8J35O3q3j3o9j3Q0n5N7L9L2MN5j08
7423A9l0p1L9k4J16J3kN4o9n7l4JK4J24j42J70j23q3j2P4Nm7Q4Rn2Q0q0m6J28
7452F8Nq0o0Q1m5L4KrJ21k53J48R7j86O3n1P0j72Q0j0K7P4J27j96N1L0n6o7J17
7480A0J15k0m8k8Q0j49qoQ3MnN3j96J74p0j93J88QL0jm2Q5o8J17j56J55k12J40
7508D0j5n5J82j45l0l2M0j06J22K9Q8j83J12K0j32j13L60r1j89J32j48n2N5J18
$$ plain form
7313 23 126 34 -42 -11 -27 -121 -16 -53 -53 14 39 -60 -154 13 -61 -117 11 -85 -53 35 -88 -38 -31 -206 17 61 15 171
7341 171 -34 20 79 80 -93 78 -33 -38 -46 17 28 -36 -135 -48 -156 36 22 10 40 -5 -35 66 23 76 189 76 18
7368 18 -73 -43 32 -57 -75 11 30 -71 114 77 32 -49 -75 -2 7 75 35 131 -3 127 -101 35 -7 28 40 57 4 30
7396 30 51 -108 20 -43 -56 16 47 -206 19 83 -50 -67 -105 30 93 10 -3 -72 -85 -5 -60 -3 36 68 72 127 19
7423 19 -11 -82 -43 -67 49 62 60 114 45 -12 -46 -45 -21 103 -39 131 8 -75 -87 -13 -8 -55 29 38 -14 66 -14 -60 68
7452 68 73 -7 -67 14 -31 3 5 -4 117 -136 12 109 -77 -14 -65 5 -167 -87 -97 -70 4 131 -65 -14 16 -40 -107 10
7480 10 125 105 57 29 109 -40 -48 -54 29 33 28 81 -115 59 -11 -204 -16 -8 22 21 -21 64 -4 113 -43 112 -100 40
7508 40 25 -30 152 7 -23 -55 -15 -121 1 30 118 -65 47 67 -65 -178 182 91 -98 34 -114 -166 -111 7
7532GK7q2jJ56j62J10N6j37Km7L8M8Q9j25R8j7p5k2o2K9K14j65O8Nj60O3R9j44
7560i0K20J8j10Nj10J74j67L6M9K3r2J14q7M8j35K6J2K0m0J03J3r0J33k3m3q6
7586g9P0J56j21K0q0P1j23J68j53n9J82k9j06Q7p1M0N6j90J14J9J59q4N0k08J92
7611H1r7q9K26r4Mr4R6m1j0J9m7K3o5J24N3j30K6J16j36N2J2j6k3J3J6j01j09
7638a91K15j5q2R4k6m5J72j12Q8p0n9L4n7R5r4J7M4M1k01J46J50k19J29jl3j77
7664a57J5J15M2j6p1R9q8RR1j39K8J83j79KJ20m9M3n2j10K15n2n9J60j59k0n3
7690h2k1N9j2M2nl1J64o1l07K68P6j02n2J35n6o2Q4j18n4J12N3p8Q2o7J13j12
7716c2J11k9j06J53q0Nj04P3L1k8q4K15j51J4O5n0p4j2J02Mn1O2n2l3Q2N0j73
$$ plain form
7532 7 34 -48 -49 107 -55 55 111 -26 -24 -71 -33 15 104 -21 77 60 -15 -37 -99 -70 144 -21 47 52 -108 -45 54 -90
7560 -90 130 148 38 43 -67 107 -60 -24 25 48 -44 70 -17 31 -104 -78 -66 -46 -86 17 30 -60 73 50 7 -79
7586 -79 -9 147 26 46 -34 37 -86 82 -71 -130 52 23 -83 4 -67 -27 29 -161 -47 -28 131 47 97 -111 81
7611 81 -16 -105 121 27 31 -63 33 -8 -18 1 -46 -23 -88 36 89 -41 -15 101 -35 17 29 13 -10 3 19 -82 -191
7638 -191 24 9 -73 21 -5 -50 122 10 98 28 -31 3 -54 41 -53 -36 8 49 -152 -6 144 -75 54 53 20 -157
7664 -157 -142 -27 15 -1 -72 27 -61 -52 39 -100 -72 111 -68 -66 54 5 48 -4 -114 101 49 -10 150 -9 -29 -82
7690 -82 -103 -44 -56 -14 -19 -50 114 53 -254 14 90 -12 -64 71 15 -47 37 -81 -135 -23 30 -48 34 -33 80 -32
7716 -32 79 50 -56 97 17 22 -82 -9 22 -6 -90 125 -26 -12 53 3 -71 -83 19 23 -28 34 -18 -51 31 81 -92
7743i2jJ39O0j63P4J65j91M8j2m6K7l6J12q0r0J00Ok2R5k6j65J21M4n5p8J47j28
7770d7M1p7N3N2k1Lk2p2J33j31L4L4M5Nr5K2J59j27n5J03k1q2O3Q1q6N9j0J24
7798A65k36L4N4K1j20K42k06l9o95L24J111l27l78Q1J16k01J54k27K2J18N6j48
7820g9J24l11j27K51J95q0l4O3J4j7ON2j46M6NM2m5R7l8m4J16j51L5K3j16K40
7846A21j18j0j0r9O1K00k26J19J18k06J48p3L8m9j87J63N5p6J38j42L7n4k7P1
7870hJ1M6M5mj23K5O1j62P2J07m2R2m7p1M3r5M3l5P8mn4rJ0P6k29K32q5M3K12
7899B28j05k69J44Pn3k8O5R8q7m2J38j81P6j4j03j5K54r0k1K6J7o2o4K5L0j4J39
7926I9n4n1M5k9k6Pn3L1J1mj4o8Q0n0O2o2Q1J58j77K5l5L4Nl6l8J45j36J6K0j02
$$ plain form
7743 -92 -93 46 106 -57 17 182 -9 39 27 -19 8 -28 84 4 -86 14 20 -2 93 67 -98 23 67 12 -66 81 -47
7770 -47 -6 -83 -30 22 1 4 -18 -90 43 -88 -54 -20 25 30 -65 -43 116 -11 -66 37 16 -66 -3 78 -8 51 41 165
7798 165 -71 -37 17 38 -82 160 -46 -85 -780 -456 655 328 -50 31 147 -54 100 -127 -105 13 69 -79
7820 -79 45 -266 -393 -142 53 -27 -61 2 16 -1 5 57 -89 -43 -38 4 -41 56 18 -26 90 -61 -26 -3 -119 121
7846 121 3 -7 -17 -116 -55 145 -81 38 156 -50 98 25 63 14 -173 -10 45 -31 107 -35 2 -52 -79 -8
7870 -8 3 49 94 90 -33 -8 53 -109 -37 70 28 120 73 2 45 -50 -7 -42 36 32 -22 -31 -21 55 -174 58 -27 16 228
7899 228 123 -146 -2 5 -48 -76 -11 87 0 -42 96 -85 -9 -23 -126 -141 113 23 2 28 45 -17 -81 -56 -26 -40 99
7926 99 45 -6 39 10 -16 -9 -62 -31 -20 -24 -38 -106 -26 -76 -14 -76 5 163 -14 11 -24 10 15 -21 -59 86 -50 -34 -14 -116
7956a16K7m9N4J5L5J35r7N6j07K9K9L6k3n9K6P8q1N9J3m3j01J17n6Or0K2j5P5
7984b5o1J22j24P9M8J0P4j45m4J07j46O2jR8m1K7j27O8O5l1MJ23j29J11nj51K3
8011iQK4q3J54Oj94oQ7kl5O2Pk4O6p3j36R5M1o1L5J2N6j38J72l4O5j48J09o4N3
8041D5l9k8L2M1j72K0P6L6O6j20O8q6Jn0J72o4J17j02K7O1Q5k41K6M8k4R4K1l6
8069G4j34qQ7j06M3K7r9J21Jn7J10Qj85R5J5q1O4J03K4kj14K0j3k2j16Q7J8L9
8097al1j3kJ85j09L3l3L9n9LK9j25O3J9J02r1L8R0k52P2O7qk8%J59p7q5q0J89
8126I4j18K6M9n8m0M2N4j47n6J84l9q4J22J09j20Ko9K7qK9N2M1J9p5k31J51N6
8153A2q9O6N7lj26O8l4J05j62J9O0k5J19Jj30JJ37o9j54J49J41m1j41l4O3j23
$$ plain form
7956 -116 -89 -138 -84 -69 -34 101 4 60 -47 -18 11 47 24 -35 -9 69 -12 47 60 17 -84 33 -23 -17 -107 -85 -100 -25
7984 -25 -86 36 -88 -9 39 49 123 -22 -66 41 -105 -43 -44 54 13 40 -87 -19 46 15 19 142 13 124 119 -32 -9
8011 -9 -1 23 -60 94 100 -94 -100 -13 -15 -50 12 19 -5 61 -12 -148 -53 -12 -73 -38 -26 30 -108 64 30 95 -53 56 -8 45
8041 45 6 -22 10 51 -121 -101 -25 11 77 -43 25 -61 -60 -110 62 -2 115 13 40 101 186 -55 -29 19 -5 89 110 74
8069 74 -60 -68 19 -87 -44 -17 -116 5 6 -51 59 67 -118 -23 -8 -89 -25 78 102 100 -14 6 -7 -29 -145 -58 -40 -1
8097 -1 -32 -45 -47 138 29 62 29 68 9 12 41 -84 -21 -2 100 9 47 137 -115 -43 24 16 -12 -12 147 70 -15 -95 94
8126 94 -24 2 51 -7 -47 -5 49 -98 -154 30 -9 -93 29 138 18 20 -49 -22 -30 -1 51 92 111 36 -195 -44 12
8153 12 -77 -11 46 43 -83 -15 -49 56 -106 -87 -27 -52 67 68 -62 -61 76 7 -147 2 143 102 -39 -73 -10 -133
8179a33J15J4K2J4m7O2o4j6P7r5O2j5
$$ plain form
8179 -133 -18 -4 18 32 -15 47 -17 -33 44 -51 11 -4
8191d
$$ Imaginary data points
##PAGE= N=2
##DATA TABLE= (X++(I..I)), XYDATA
0@%%%%%%%%%%%%%%%Qj6J6j6J6j7K5l2L2m0M8n6O6p4Q8j04J17j31J50j69J87k11
37a13K36k61K92l26L64m04M48m96N49o06O67p36Q12q95R86j084J196j323J463
56G69j622J803k016K268k564K924l377L960m745N870p621J0753j8092O8840N0540
71A07690p8551j8571l9451k6919M181K4859o450M476L3097K6019j8229M904J5310
84C2365j7800n758K3420k2059l6715m98O957j2086J400K2420J0130k629L1438
97C0585K7028k1853j4606M52l4528k8230M896l346p828K3574L8676J3434l022
110B5232J4517r36k8675P67P616l2946k2811M246p206r6L0147L1222Q072L499
124C2648J1830j5039l4590k432O02k2091M814J7438j1252n998J7364J2841M143
$$ plain form
0 0 0 0 0 0 0 0 0 0 0 0 0 0 0 0 0 8 -8 8 -8 8 -9 16 -16 16 -24 24 -32 34 -40 48 -56 61 -70 80 -89 98 -113
37 -113 123 -138 154 -172 192 -212 236 -260 289 -317 350 -386 426 -469 517 -567 629 -694 769
56 769 -853 950 -1066 1202 -1362 1562 -1815 2145 -2600 3270 -4351 6402 -11690 57150 107690
71 107690 29139 10568 -28883 -55802 -51621 -26762 -33212 -28736 4361 30380 12151 17055 32365
84 32365 14565 8807 32227 10168 -26547 -27045 -20088 -32174 -30774 -8354 1776 -853 30585
97 30585 57613 35760 21154 21606 -12922 -41152 -36256 -39602 -47430 -23856 14820 28254 25232
110 25232 39749 38813 10138 10905 18521 -14425 -37236 -32990 -40196 -40292 -10145 21077 29149 32648
124 32648 44478 29439 -5151 -7583 -6981 -29072 -24258 -6820 -18072 -24070 -6706 6135 10278
137A0278J4013J9498p379k1838l339j8090l4799m41J1903k879J7434L0153J0505
150B5019N06O976K703j9172j9690k74j3904j9607J2866J1270n400J4715J9101
163A5109R44K852J0159O79j5406j2398m473k2237j9429J2271P915L548K8863K2580
177C0977j636o09r67j3162j7548n811J525j1924o887J1040l317k779K2734J4989
191A6625L015J2815M210j5531k0633j3423j0815j4510K722K1251P792Q934K2344
204B4796K483p461L599n365j4324q276m509q917j0964K792J1598j54J0053K2985
218A8336M280J070Q266p597j8413j2863j2034j0917m066J1240J6263O792J3978
231A4335J4510q374n790L089j1432j1503j516n588q834m715M996Q238N247J8211
$$ plain form
137 10278 24291 43789 36410 14572 11233 -6857 -41656 -42097 -30194 -33073 -15639 14514 25019
150 25019 25525 32501 35204 16032 -3658 -3932 -17836 -37443 -24577 -13307 -18707 -3992 15109
163 15109 16053 18905 29064 29743 14337 1939 -2534 -24771 -44200 -31929 -24014 -20466 8397 30977
177 30977 29341 28732 27765 14603 -2945 -8756 -7231 -19155 -26042 -15002 -18319 -21098 1636 16625
191 16625 19640 32455 36665 21134 501 -12922 -23737 -38247 -35525 -14274 -6482 2452 24796
204 24796 27279 19818 23417 18052 3728 -4548 -9057 -17974 -28938 -26146 -14548 -14702 -4649 18336
218 18336 22616 23686 31952 24355 5942 -6921 -18955 -29872 -33938 -22698 -6435 357 14335
231 14335 28845 20471 14681 17770 6338 -5165 -6681 -12269 -21103 -25818 -20822 -12584 -7337 10874
245A0874J8819l47Q10k606k3192j8102p099p887r3J0237J3868Q894K444Q882N385
260B0887q089J211J610j4387p731l586j0712l851M064Q806R953J0645J5512N372
274B9704o040k919r825k1678r629k767m962N918J2860R749R158N003N538j242
288A8868p519M38n717j3199k341m010j0263K263Q051Q650J2486J1622Q566j957
302B5938j1572p771j2484j4439M30Q01n23J0159P913M333Q309N592L558l29n908
317A4007l502j1813j5053l846m562p22J2626J2205J0417J0978K257k633o487j1024
331B848o333q015o249L542J01J426J0064M869M825P637J991J281j810q611o886
346F80j1314j1827j913j63O906J5871J0839J0010P336m511o690q683j1694m926
$$ plain form
245 10874 29693 29346 30156 27550 4358 -13744 -20843 -28730 -28823 -18586 -4718 4176 6620 15502 20887
260 20887 12798 14009 15619 1232 -6499 -10085 -20797 -24648 -20584 -11778 -1825 8820 24332 29704
274 29704 23664 20745 10920 -10758 -20387 -23154 -28116 -22198 -9338 411 9569 14572 20110 18868
288 18868 11349 11787 6070 -7129 -9470 -13480 -23743 -21480 -13429 -4779 7707 19329 27895 25938
302 25938 14366 6595 -5889 -20328 -19898 -19097 -19620 -9461 -1548 2785 11094 16686 20244 19915 14007
317 14007 10505 -1308 -16361 -20207 -24769 -25491 -12865 -660 9757 20735 22992 20359 13872 2848
331 2848 -3485 -11500 -17749 -14207 -14106 -12680 -2616 2253 7078 14715 16706 17987 16177 7566 680
346 680 -10634 -22461 -24374 -24537 -17631 -1760 9079 19089 26425 21914 15224 6541 -5153 -10079
360a0079m263k792M963K133K533P548L926O361O921l95O15o314j3415r479q802
375b0539n547N843Q715J0460J3517N298K056j853p992l740o480p459l82l587m767
390a6457L459K432M062R300O966P625L232l856l946j0745j3599n388n930p00J1901
405a1644J0187R111J0855K327k899o686q143m098p165m827L136k488k094O823
419g605K305M078J0579O327L934L69n661r249j4835r889p6j557O847J6113O250
434G930K736M984k954m374k733l130l248p145m038k03m704L987J1668L456O835
449I067J1208m93m681m239q366j0562j0230j428L793J147R951J2769N95L308M643
464A6482o559n043l17m970n890l659M64j286m089P917J0035J396R523R593o563
$$ plain form
360 -10079 -14342 -17134 -12171 -10038 -7505 43 3969 10330 17251 16856 17471 11157 -2258 -11737 -20539
375 -20539 -26086 -20243 -11528 -1068 12449 17747 19803 17950 9958 6218 -262 -7721 -8103 -11690 -16457
390 -16457 -12998 -10566 -6504 2796 9762 17387 20619 16763 12817 2072 -11527 -16915 -22845 -23545 -11644
405 -11644 -1457 7654 18509 20836 17937 11251 3108 -990 -8155 -12982 -9846 -12334 -14428 -7605
419 -7605 -5300 -1222 9357 15684 19618 19987 14326 5077 -9758 -19647 -19723 -21280 -14433 1680 7930
434 7930 10666 15650 12696 8322 5589 2459 -789 -7934 -11972 -12175 -16879 -12892 -1224 2232 9067
449 9067 20275 19782 15101 10862 2496 -8066 -18296 -19724 -15931 -14784 -4833 7936 8531 11839 16482
464 16482 9923 4880 4563 -407 -6297 -9956 -9492 -10778 -14867 -6950 3085 4481 14004 23597 17034
479A7034p616o785j2696r289m82N807N441M498J0399M030n375N345M342p706r46
494F001O78r730q549k649l63J21M737J3234P612P72P419j395j4212m535l787j0776
510a5422j580O360L943K158N872Q672n79k970O658j555r712J866k589j2214l168
525a4260R35k224K787J1466J2270L389J979M996j0691j5400r98m826p960P206
539a1331Q376N70K687N544K092l021K228O431o581p113K071r754j1899M711L988
554a1001M95J0176J2388L905k481J93j619j3094p057L898o246l694R380J012l206
569f951P148O416J25J391N413p85j1585m685m25j2069l357J0961K351L143J3822
584A0913O443l251j914k469r254j1345R75L547n742M453R995n703k056R300J660
$$ plain form
479 17034 9418 2633 -10063 -19352 -19834 -14027 -8586 -4088 6311 10341 4966 10311 14653 6947 6001
494 6001 6679 -3051 -11600 -14249 -14612 -14491 -9754 3480 11092 11864 19283 17888 3676 -859 -4646 -15422
510 -15422 -17002 -10642 -6699 -4541 1331 10003 9424 6454 13112 11557 1845 3711 1122 -11092 -14260
525 -14260 -13325 -15549 -12762 -1296 10974 14363 16342 21338 10647 -4753 -5751 -10577 -18537 -11331
539 -11331 -2955 -2385 302 5846 7938 4917 7145 13576 6995 -118 1953 -7801 -19700 -14989 -11001
554 -11001 -10506 -330 12058 15963 13482 13675 12056 -1038 -8095 -4197 -10443 -14137 -4757 -3745 -6951
569 -6951 197 6613 6738 8129 13542 12757 1172 -3513 -3938 -16007 -19364 -8403 -6052 -2909 10913
584 10913 17356 14105 12191 9722 468 -10877 -9902 -6355 -12097 -7644 2351 -3352 -5408 3892 5552
599E552p33O665L902o501r604l393o403j0685N420J1515J321R208J2818m068p063
614G951m22n661r468k866M813j351m872P438N518m630O924R670m662p74L602n746
630E464r602j775m67n969k665J0342M781j986J0840O967q682j502J449q673o508
645g986J679M77m078R19Q052L40p93J2167M785p060K420j149j4663q256O01p70
661a3315J01Q325J1685R4k120O223l771q521N477J190q479OJ656o436l971M695
677g161O163k01N022J1625k310p356K593p334j3612P3K349j986M753J0088M739
692G445j883L037M650q339n258N487n964q499M559J36o217K504O784K614J821
707B877P838M999q127m904J97j1257o723Q219J589j283Q277N594k696j765M015
$$ plain form
599 5552 4819 11484 15386 8885 -719 -4112 -10515 -21200 -15780 -4265 -2944 6264 19082 15014 7951
614 7951 7529 1868 -7600 -10466 -5653 -7004 -11876 -4438 1080 -3550 3374 13044 8382 7608 11210 5464
630 5464 -4138 -5913 -6380 -12349 -15014 -4672 109 -1877 8963 15930 7248 5746 7195 -1478 -7986
645 -7986 -6307 -5830 -9908 -8989 -937 -597 -1390 10777 15562 8502 10922 9773 -4890 -13146 -12545 -13315
661 -13315 -13214 -4889 6796 6890 4770 10993 7222 -1299 4178 5368 -3111 -3105 -1449 -7885 -11856 -7161
677 -7161 -998 -1199 3823 15448 13138 5782 8375 1041 -12571 -12498 -10149 -12135 -7382 2706 7445
692 7445 5562 8599 13249 4910 -348 5139 -825 -9324 -4765 -4629 -10846 -8342 -1558 1056 2877
707 2877 10715 15714 7587 2683 2880 -8377 -15100 -6881 -5292 -6575 1702 7296 4600 2835 6850
722F850O66o829J212L517r645m897M044n307k939R695O736K288N588M893m325
737A1547j0285k695k021r658J663R433j981R67Q537j98l220K752K231l229l976
752a33K193k400r220J211L919n374L951J1173J210Q80N192j114p798o195q20l963
768g288n183O168N263l744M784O211m270K20N543j226l667r69o18o833o564M259
784g914K403j343R875Q715k942N47K62q159o607r01L40j717R24N976o93l477O705
801A994L285l074N131L601n783l971k167m144m991q7N254J527K126R138J712m331
817E220K527k541q800j503Q44j754m04K951L765j234k1O381%j684N165j660o616
834F36j490l736n697o57L593M906L030M865N644l929n036J414m176m157L369J81
$$ plain form
722 6850 7516 687 1899 5416 -4229 -9126 -5082 -10389 -13328 -3633 3103 5391 10979 15872 11547
737 11547 1262 -1433 -3454 -13112 -11449 -2016 -3997 -3030 5507 5309 2089 4841 7072 3843 -133
752 -133 2060 -340 -9560 -8349 -4430 -9804 -5853 5320 6530 7410 12602 11488 3690 -2505 -3325 -7288
768 -7288 -12471 -6303 -1040 -4784 0 6211 1941 2161 7704 6478 2811 1842 1224 -5609 -12173 -7914
784 -7914 -5511 -6854 3021 11736 8794 9341 9603 1444 -5163 -6064 -5724 -7441 -6517 -541 -1234 -4711 1994
801 1994 5279 2205 7336 10937 5154 1183 -984 -5128 -10119 -10206 -4952 -3425 -1299 7839 9551 5220
817 5220 7747 5206 -3594 -5097 -4253 -6007 -6411 -3460 305 -929 -950 5431 5431 3747 8912 7252 636
834 636 -854 -4590 -10287 -10944 -7351 -2445 585 5450 11094 7165 2129 3543 -633 -4790 -1421 -1240
850a240k582J22M3L63J319M164N696q31m41J324p395o561L49l106j517M753M468
867a072L820K352J798J045m325k223Q99m309j010K495l126j738K045k89J052L159
883E73M169L358j224q37j551q038m541j8k025L480P306L455L113Q67k438k642
899C007l630k72J164k529O96P19m767r04K254P74M286M656K122J438l029l682
915B303l529n615p55J479q4M871M672L84J994j14k544j118k198q06j29k493j85
932c867K55k529K169L122J470N471J928p46k41m663m564k796l298J338L075J512
948b364M376K080j095L64j471r74J408j546n06l1l992j787J66n1M177M113K486
965E353L454j514k978k270n180k298N4j706K618L407N57K491J481l02O98j314
$$ plain form
850 -1240 -3822 -3700 -3657 -3294 -1975 2189 7885 7054 6613 7937 542 -6019 -5670 -8776 -10293 -5540 -1072
867 -1072 2748 5100 6898 7943 3618 1395 2294 -2015 -3025 -530 -3656 -5394 -3349 -3638 -2586 573
883 573 4742 8100 6876 6039 4488 -3550 -8091 -8109 -10134 -6654 652 4107 7220 8087 5649 3007
899 3007 -623 -895 269 -2260 -1564 -845 -5612 -6516 -4262 -3488 798 5454 7576 9014 5985 2303
915 2303 -1226 -6841 -7596 -6117 -6201 -1330 3342 3726 5720 5606 3062 1944 -254 -1060 -1189 -3682 -3867
932 -3867 -3612 -6141 -3972 -850 620 6091 8019 7273 7032 2369 -2195 -4991 -8289 -6951 -3876 -2364
948 -2364 2012 4092 2997 3361 1890 916 2324 778 272 241 -3751 -5538 -5372 -5423 -1246 2867 5353
965 5353 8807 7293 4315 2045 -3135 -5433 -5379 -7085 -4467 -1060 -503 1988 3469 3167 3865 2551
981B551k86N82l603j030n59l665J067K387O79M344L180J98k37k644k438k813l911
998f198J224J887j119L260K626j754J363J377l2J653K55l46k339m797j389k292
1014f621k378N006M414J174M676K016l256k940k761k389j586m98L332J340r73
1029a444L320l15k851L414J448j496J701L51k602l897k865l8j842k8O972K885
1045B713N41M881p16n091j378k111l146k04J707K207j184N41L654j977j339N383
1061D481m01l006J867j508m449k086j78N35J14L788N888q10O5L096m663m504K097
1078C26j484k964J603J324j061j523K241K982j523K391M983l466k300J200n009
1093b280m751J654J344M17L209N231J888l657L56O23o427r08L954l018j249L074
$$ plain form
981 2551 2265 2847 -756 -1786 -2345 -6010 -4943 -2556 -1877 2467 5647 5845 5608 2964 526 -2287 -6198
998 -6198 -4974 -3087 -4206 -946 1680 -74 1289 2666 2634 4287 4542 4196 1857 -2940 -4329 -6621
1014 -6621 -8999 -3993 421 1595 6271 8287 5031 2091 -670 -3059 -4645 -5143 -1811 -471 -1444
1029 -1444 1876 1561 -1290 2124 3572 2076 3777 4128 1526 -2371 -5236 -5274 -7116 -7144 -172 2713
1045 2713 3254 8135 7419 2328 950 -1161 -4307 -4511 -2804 -597 -1781 -1240 2414 437 -902 4481
1061 4481 4080 1074 2941 1433 -3016 -5102 -5280 -4745 -4631 -843 5045 4235 4300 7396 2733 -1771 326
1078 326 -1158 -4122 -2519 -1195 -2256 -3779 -1538 1444 -79 2312 7295 3829 1529 2729 -2280
1093 -2280 -7031 -5377 -4033 -3616 -407 4824 6712 3055 3411 4034 -2393 -3301 653 -2365 -3614 -540
1109e40r35k089J046K990P81j18M553J549n700m17M29p140j800M320L8Q66M611
1126B444L014j260k337J275j867n434K375K004m728J754L708k992o51M219J569
1141C093p24J107K842k797n742J262j367n381L223M702k099J932M173j374k289
1156E61J082J668k914k126L360k286n637L444K196k966M117N226j251j204Q98
1171D168j665n079k254K640k149j844O747J507l203M028J757m416k77K666o20
1186B006k327O17J663n011l073M269o16j352P095L059l213R46j02n184m082R94
1202d311J562j918K466O453j983k613M481j670m060L255J861l170j466P95j970
1217b288m109K082M606k066J792O878k132l666K704k176n751l89K289j61m46M258
$$ plain form
1109 -540 -1475 -3564 -2518 472 1253 1135 5688 7237 1537 1120 1549 -5591 -7391 -3071 -3033 -2167 2444
1126 2444 5458 4198 1861 3136 1269 -4165 -1790 214 -4514 -2760 948 -2044 -2695 1524 3093
1141 3093 2369 3476 6318 3521 -2221 -959 -2326 -7707 -4484 218 -1881 51 4224 2850 561
1156 561 1643 3311 397 -1729 1631 -655 -6292 -2848 -652 -3618 499 5725 4474 3270 4168
1171 4168 2503 -2576 -4830 -2190 -4339 -6183 564 2071 -1132 2896 4653 237 -40 2626 2006
1186 2006 -321 296 1959 -3052 -6125 -1856 -2472 -3824 3271 6330 3117 4063 3961 -1223 -5305 -4311
1202 -4311 -2749 -4667 -2201 4252 2269 -344 4137 2467 -1593 1662 3523 353 -1113 -318 -2288
1217 -2288 -6397 -4315 291 -1775 17 6895 4763 1097 3801 1625 -4126 -4515 -2226 -2387 -2833 1425
1233A425K760m178K41L512m171q69N057j804m140J011l06l556p45M848K638j903
1249a80L960L606n266j511K392m797l079L035N14j670J855L432j137k640L689
1264B203J747m725J608K994n539k456K731j285j582L460L722l71l90L300j434
1279C983n834J508R57n387J196M795k202j594K719L12k061Q88M761r5k778K683
1295C851j735p008P22K199k632K332N398O05j586Q33J138m132l190K894j076l603
1311d990L892K219l319J555K683j851m49K872J457k416q15J852m142m268L324
1326b396N20k287M613L549j937k5J017j732l420J68K295k396p01M208j782l002
1342c308L973J243j847K759K232k334k976n43q20l718M09M677n71j34M858p83
$$ plain form
1233 1425 4185 7 248 3760 -411 -1280 3777 1973 -2167 -1156 -1462 -5018 -5763 -915 1723 -180
1249 -180 3780 7386 2120 609 3001 -1796 -4875 -1840 -1326 -2996 -1141 2291 1154 -1486 2203
1264 2203 3950 -775 833 3827 -1712 -4168 -1437 -2722 -4304 -844 2878 2507 2117 5417 3983
1279 3983 -1851 -343 614 -4773 -3577 1218 -984 -2578 141 453 -1608 -720 4041 3946 1168 3851
1295 3851 2116 -4892 -4170 -1971 -4603 -2271 3127 3732 2146 2979 4117 -15 -3205 -311 -1387 -4990
1311 -4990 -1098 1121 -2198 -643 2040 189 -260 2612 4069 1653 838 2690 -1452 -5720 -2396
1326 -2396 -1876 -4163 450 3999 2062 2037 3054 1322 -2098 -1930 365 -2031 -2732 1476 -306 -3308
1342 -3308 665 1908 61 2820 5052 2718 -258 -801 -1621 -5339 -4930 -253 -824 -958 3900 3117
1358C117l093J728n7k543k16J644j1k606O41J976l195j25M755m68p79L550o85
1375C633l650j319n33j857j310K708L053p06J922L227l338j891K230k074k221
1390b126J936Q49j372j445J089N9k237K525L661j403Q63K018l765k695M85j187
1406b745r43J623L040Q38j134J759P35l631O26J831k603l24J224j760j328K14
1422b578R73L84P88L263J182k244J144l18m460r85J213j288P05K435J372kn43
1439A041P13q96k093J607M63k308J234P12k936lJ175K08J072J740K179l57j950
1456A601oj828l201J134O73p41K064J255o69J07L05M74n21l24J452j047k372R16
1474g28p36j617J859J471O33J671L30j19j329j900k79j606r75K219J30l13K034
$$ plain form
1358 3117 24 1752 1695 -848 -1064 580 569 -2037 -1396 580 -2615 -2740 2015 1547 768 4318 3633
1375 3633 -17 -1336 -1869 -3726 -5036 -2328 725 19 1941 5168 1830 -61 2169 95 -2126
1390 -2126 -190 659 -713 -2158 -1069 -1010 -3247 -722 2939 1536 2399 4417 652 -2043 -1558 -2745
1406 -2745 -3688 -2065 975 1813 679 2438 3173 -458 168 1999 -604 -928 296 -1464 -2792 -2578
1422 -2578 -1605 -1221 -433 2830 4012 1768 2912 2594 -1866 -2851 -1638 -2926 -2221 214 1586 1584 1041
1439 1041 1754 858 -1235 372 835 -1473 -239 473 -2463 -2466 -1291 -1083 -11 1729 3908 3551 1601
1456 1601 1595 -233 -3434 -2300 -1627 -2368 -304 951 282 389 694 1168 647 323 1775 728 -1644 -728
1474 -728 -1464 -3081 -1222 249 882 2553 2883 2764 1435 -465 -744 -2350 -3325 -1106 -976 -1289 745
1491G45J30q25O30J87K95K82l36N12j604j740K20j104k87K601R63R50J531o11
1509B539j191j323j650l26l22J96J933NqJ182o06m1J245k57N19q0j684p87j336
1528a992j091Q85L51J112K113J7M18L67j512m08o41j104Q41J40l90J021k25m31
1546e29P59j52J005R49m16L73j174k390o32j108k86K185J188J359J811p2o76j141
1564A053j591j27o66k78J846k1o15O82r42o70J144L88J032P80n93k29j923j365
1582b095M08p28K05K492O88L63J326j90r91q43j100k63q32k0J139r13J29J544
1600C19q29M07K076j42l83l30q72j123j379M41J269l20J061K042j292j76Q61j657
1618b7n74O08j93k30l50K88l67j718J008J995o50J695K384j394j143n67j881j418
$$ plain form
1491 745 875 50 680 867 1162 1444 1108 1620 16 -1724 -1504 -2608 -2895 -294 669 1619 3150 2539
1509 2539 1348 25 -1625 -1951 -2273 -2077 -144 -139 -147 1035 429 388 1633 1376 1895 1815 131 -656 -1992
1528 -1992 -3083 -2198 -1847 -735 1378 1395 1813 2180 668 260 -381 -1485 -644 -504 -894 127 -98 -529
1546 -529 230 78 1083 2032 1616 1989 815 -1575 -2207 -3315 -3601 -1416 -228 1131 2942 2870 2194 1053
1564 1053 -538 -665 -1331 -1609 237 216 -399 283 -659 -1329 -185 203 1235 2015 1422 1193 -730 -2095
1582 -2095 -1687 -2415 -2210 282 970 1333 2659 2469 1478 635 -465 -728 -1560 -1580 -441 -1354 -1225 319
1600 319 -510 -103 1973 1831 1448 1118 246 -877 -2256 -1815 -546 -866 195 2237 945 769 1630 -27
1618 -27 -601 7 -186 -416 -766 -478 -845 -2563 -1555 440 -210 1485 3869 2475 1332 765 -1116 -2534
1636b534j13J053Q74J15K252P72k062N35M29k502q1J551n88l91M61K00r07o59
1654a595J737R43p78K165N10k612q3j03k397l42J143N13o8O26J988m86j217J630
1672A574J76k278R39L95k263r2O47n34Q2J553K054o56o84J534j612l030J279L3
1690h83j767J439J895m50k92Q90L86j363M5J963j046j034K033j174l027Q00K83
1707a302j151J120K740R71q27J75L66l054j634J946q86j002L190P68j511Q43Q90
1724A642j257q77J273P74j931j45J500k551j625K591j10p38K494J435j143n06
1740H26O45p55k397P69J327k180K64K924j094j261J985K17j651L45J455p18j712
1757a011P86Q5k750N01K668q32O03L384p15j901J93l86k120p96J986N68j896J587
$$ plain form
1636 -2534 -2647 -1594 -720 -605 1647 2419 357 892 1321 -1181 -1262 289 -299 -690 -229 -29 -936 -1595
1654 -1595 142 1085 307 2472 2982 370 287 184 -2213 -2555 -1412 -899 -967 -341 1647 1161 -56 1574
1672 1574 1750 -528 411 806 -1457 -1549 -902 -1436 -1354 199 2253 1597 913 2447 835 -2195 -916 -883
1690 -883 -2650 -1211 684 234 -58 832 1218 -145 -100 1863 817 -217 1816 642 -2385 -1585 -1302
1707 -1302 -2453 -1333 1407 2378 1551 1726 2092 -962 -2596 -650 -1536 -2538 652 1420 -91 752 1642
1724 1642 385 -492 781 1555 -376 -521 979 -1572 -3197 -606 -716 -1454 1040 2475 1332 826
1740 826 1471 716 -1681 -912 415 -1765 -1501 1423 329 -932 1053 1270 -381 -36 1419 701 -1011
1757 -1011 -225 -140 -2890 -2389 279 -553 50 3434 2719 818 1011 625 -1495 -2291 -305 263 -1633 -46
1775d6J462k550K18K418j060n67J718k68j818o28R75j131j290K704J265j864J516
1792A054J903k524q32J457r76j665M34Q76j095n37K222L27j556K067J388k555
1808a2N89J624k124j636P82K2j248N50K776J68j287J776m79l071Q31J161j733
1825a311N92J674p80j691L94J409j019J39L374k36k195J236o18l215O6J232o51
1842a600K27J847J158j353J36J533j774j623K169m29k176J665J076j610J06J273
1858F25j4j133R55J637j569o76J565j877k240J692L09j199J646K021n70r12Q27
1875A087L32k096J10K160j775j018J524j138j393J655J312l26M42J240o67k469
1891a020J8R93k010J12K687o94p54J988J7j212K46Q06n97j280J000M98k233K77
$$ plain form
1775 -46 1416 -1134 -916 1502 442 -125 1593 1325 -493 -1121 -146 -1277 -2567 137 1402 -462 1054
1792 1054 2957 433 -399 1058 82 -1583 -1149 -273 -1368 -1905 317 644 -912 1155 2543 -12
1808 -12 577 2201 77 -1559 -777 -755 -2003 -1453 1323 1491 204 1980 1501 -1570 -739 422 -1311
1825 -1311 -719 955 175 -1516 -1122 287 -732 -593 2781 2545 350 1586 968 -2247 -2181 -949 -1600
1842 -1600 -1373 474 1632 279 415 1948 174 -1449 720 291 -1885 -220 856 -754 -648 625
1858 625 611 -522 433 2070 501 -175 1390 -487 -2727 -1035 -726 -1925 -279 1742 1172 260 1087
1875 1087 1419 -677 -567 1593 -182 -1200 324 -814 -2207 -552 760 434 876 2116 1449 -1020
1891 -1020 -1002 -9 -2019 -1907 780 86 -668 1320 1337 125 371 1177 580 -700 300 798 -1435 -1158
1909a158J440k001l9K395j0l83J314M30j269j284L80l47j911J451J797j147P69
1926D27J671j414j087J024k73p40Q8R34p67j761R57P50j426J462K151j094K5Q67
1944A794j136j390P9M45o03m45J604N8j382J302Q89j710N05J325j208m39L59k17
1962a70j218o8J263K0m75K117M58j487P24L1j805m28N73l63m35O91J113m55o95
1981f09J476k54j220J328M35j139K81J22j184n73N54O26m2N98J658p99j355P36
1999F39p66j540R14M76m79J70N39K65l74K01J115m59l05J162j090j379N52l81
2017g40q96P60R64L63m9L94M13j163n19R53q83n64J152n17m57Q68J89l57J86N47
2037F44M15o08JP48j460r15N71r18j46J272O03N57M14K6m32q64k20N11q69J51
$$ plain form
1909 -1158 282 -1719 -1758 637 627 244 1558 1988 719 -565 -185 -532 -2443 -992 805 -342 427
1926 427 2098 684 -403 621 348 -392 -304 630 -137 -1898 -941 -191 -1617 -155 1996 902 927 1794
1944 1794 658 -732 -653 -208 -811 -1256 348 406 -976 326 1215 -495 10 1335 127 -312 47 -170
1962 -170 -1388 -1456 -193 -173 -648 1469 1927 440 1164 1195 -610 -1038 -465 -828 -1263 -572 541 86 -609
1981 -609 867 613 -607 721 1156 17 298 420 -764 -1337 -783 -157 -199 399 2057 1258 -97 639
1999 639 -127 -1667 -753 -277 -756 -586 -47 218 -156 45 1160 701 396 1558 468 -911 -359 -740
2017 -740 -1636 -876 88 451 402 796 1209 46 -473 480 -403 -967 185 -332 -789 79 268 -89 97 644
2037 644 1059 451 452 1200 -260 -1175 -604 -1522 -1668 -396 207 764 1178 1204 772 -92 -312 199 -670 -519
2057e19J181q58j38N07n25P2M13N91L39l81k09m37j344m6O71m02Q46J196l15J69
2077H11J07l10j83m86M8O8o96K10K47o62N02L09k82N16M65j64K00k20l53l17r40
2098a130K97L33k85J155O85l25K59l20n43j4m32j00R1l03K90J5o08N68N18n8R04
2119I97K94n70n7q34o52K48l43M86O23j51M55j66l45L06j27j41L34m82j56K8o45
2140h98J00N56j18P12N52%J74k71n40k05r94O5M69m17M50P43k62L76n1l47Q7j89
2162hJ8K89m00N9J28j035L78M84k02Q06O16j45j91n81n97k81p07N49N91k49Q89
2183D11R6o44N34J90l18K15R6j01n97m61K22k00m08J087L71m87O03K36p54l8j55
2204a02l16k47N9M75j86j41J071q0o71R68j1p91K08J96o29m92j56L5q8J08J333
$$ plain form
2057 -519 662 -196 -334 173 -352 -280 133 724 1063 682 473 36 -1308 -1354 -683 -1085 -239 957 642 811
2077 811 918 608 425 -61 -13 55 -641 -431 -184 -846 -344 -35 -317 199 664 500 700 480 127 -190 -1130
2098 -1130 -833 -500 -785 370 1055 730 989 669 126 112 -320 -420 -329 -632 -342 -327 -935 -367 151 93 997
2119 997 1291 721 664 -170 -822 -574 -917 -431 192 41 496 330 -15 291 164 23 357 -125 -281 -253 -898
2140 -898 -798 -242 -360 352 904 904 1078 807 267 62 -932 -867 -398 -815 -365 378 116 492 441 94 181 -8
2162 -8 10 299 -101 -42 86 -949 -571 -87 -289 517 1133 988 797 216 -381 -662 -1369 -820 -229 -478 411
2183 411 507 -137 397 587 269 484 580 479 -118 -579 -357 -557 -965 122 493 6 609 845 91 53 -102
2204 -102 -418 -665 -606 -131 -317 -458 613 533 -138 830 819 28 236 432 -197 -689 -845 -810 -898 -790 543
2225E43K3k01R20n83j198L42j27m50L29N24K49m45N1N03n76k29J213k92n43O24
2245F77p11r49O8K37K0P9R25P71o08p9R04j243n47Q78n06p46M51K55j79l6O71
2266C32K53p90M05P40r94k71R91r76p57Q20j0k11O40P46o2o38L54K01j418J59
2286d86Q44r87q3J041n01o38O71L12jj79J036Q8j311J48K14j364J47J360l75L2
2306c2Q58j04n54k34N15m02p99Q19J43j209M88Q51r22O4J266j43l17L83K29q06
2326I4p13P24k97j097J117P28j090N84P74o13l89N11L3p92j13Q66l82r28J089
2345A06J55j049J028Q93o99K4N04m37j294n4N28o82k3J655L0j028J055n0j171
2364e09M08P71l71l88K52J78j134o4J106n05k55J507n1j167O59j9r25l17N20j0
$$ plain form
2225 543 566 365 1285 702 -496 -154 -281 -731 -402 122 371 -74 -23 480 -96 -325 888 596 53 677
2245 677 -34 -983 -915 -678 -658 -579 346 1117 509 430 1334 91 -456 422 -84 -830 -379 -124 -303 -339 332
2266 332 585 -205 200 940 -54 -325 666 -310 -1067 -247 -257 -468 172 918 856 218 572 773 -645 -486
2286 -486 358 -629 -712 329 -172 -810 -139 173 172 -7 1029 1117 -194 -46 168 -1196 -1049 311 -64 -32
2306 -32 826 722 168 -66 449 47 -752 67 210 -999 -511 340 -582 -518 748 605 288 671 900 94
2326 94 -619 105 -192 -1289 -172 556 -534 50 824 211 -178 333 366 -426 -539 327 -55 -983 106
2345 106 261 -788 240 1133 434 458 962 525 -769 -823 -295 -977 -1000 655 685 -343 712 662 -509
2364 -509 -101 670 299 -89 163 341 -793 -857 249 -256 -511 996 945 -222 437 418 -507 -824 -304 -314
2384c14n87M40J057o31j06J396n19r71P25o7j004J67N89l91o28M72O40q32L12
2403b52J438o61o58R18q68j055P05M53k97J44P85%j186L90R39j077J18J250p99
2422B87j078O26l05o36L62R53K60m43P52M79j574J74O90j005k50J063l79n51M17
2441a58N48l86k25P73Q6j153M09O58j088J48P97p87n01P97L78j90J09R67m40j107
2461c65L48J95j306O42R62o99j96Q17l43m14K23P46l45m45Q15m12j222O45M05
2480E1q48N65J173m16m43L47mp01k45P18l20q13R15Q0r38P30O63n49J70O12k37
2501E10n47n6N02o67n12Q44j24p76J061L47o68L19L48n56n49K29K92n72O5J050
2521E40m74o23R62L5o24O90L26m96m40J07k97n88J20Q74l53m3J039l19p26N88
$$ plain form
2384 -314 -901 -461 596 -35 -141 1255 736 -235 490 423 -581 -414 175 -216 -844 -372 268 -564 -252
2403 -252 1186 525 -133 785 -83 -1138 -433 20 -277 -133 652 652 -534 -144 795 -282 -164 1086 287
2422 287 -791 -165 -470 -1106 -744 209 469 26 778 1257 -317 -143 547 -458 -708 355 -24 -575 -158
2441 -158 390 4 -221 552 638 -515 -106 552 -536 -388 409 -378 -879 -82 296 106 215 1182 742 -365
2461 -365 -17 178 -1128 -486 476 -223 -419 398 55 -359 -136 610 265 -180 635 223 -999 -354 51
2480 51 -797 -232 941 525 82 429 425 -276 -521 197 -123 -936 -21 59 -879 -149 514 -35 135 747 510
2501 510 -37 -93 409 -258 -770 74 -50 -826 235 582 -86 233 581 25 -524 -295 -3 -575 -510 540
2521 540 66 -557 405 440 -184 506 832 336 -104 3 -294 -882 -762 112 -241 -284 755 436 -290 298
2541B98l2o90L24M61k64n39Q4N00n32R7J058m87j84M46l19o08K48l4l46o6M21
2562a64L35n79M25R07q62oO42m94n43K88M7k56p7K88j03l90N87M34n75L26N46
2583G76q28m25K90j84l11N31M35R5k96M55p8p20K26L75m34P7L75n80m20K51J82
2604b08m3J58N80N8n02K05J85p07J06K76n84J73L12R3m6K85J84k15l85K05j22
2625Ho95L52M23l68J16L29j57N8Q7J37Q2j94K09k53n96L30J13m90L21L87k72J3
2647f0J42J41J12k42L43l15n71K40j19k97N92K78n6L92n9k17l67j48J85l01j09
2668d36M37j00k85M32o2j30L18J11m3J44k58J5j81k65L11j67j68K99l3K9L11J69
2690D48k24j62k77j19n4P8K57O8m9K19k5q2L07j92J28N4k23j70k14k41K37rK2
$$ plain form
2541 298 266 -424 -100 361 97 -442 -358 142 -390 -293 765 278 94 540 221 -387 -139 -173 -519 -585 -164
2562 -164 171 -408 17 924 62 56 698 204 -339 -51 -4 -260 -337 -49 -152 -542 45 479 -96 230 776
2583 776 -52 -477 -187 -371 -682 -151 284 379 83 538 460 -260 -34 341 -93 -16 359 -221 -641 -390 -208
2604 -208 -251 -93 487 545 43 248 433 -274 -168 108 -476 -303 9 102 56 341 525 310 -75 130 8
2625 8 -687 -335 88 -280 -164 165 8 66 153 290 372 178 387 134 -462 -132 -19 -509 -188 199 -73 -60
2647 -60 82 223 335 93 436 121 -450 -210 -329 -626 -34 244 188 580 521 304 -63 -211 -26 -327 -436
2668 -436 1 -99 -384 48 -14 -144 174 285 242 386 128 143 -38 -303 8 -159 -327 -28 -61 -32 279 448
2690 448 224 62 -215 -334 -388 -310 -53 15 -34 185 160 78 385 193 321 375 152 -18 -232 -473 -236 -245 -223
2713b23N48p1o5R2m20Q4J89l55K72m4k58J82n2J0L04K5qK68l45q9j6l64J36j20
2737c20k72M82oQ1L36J66r8m7k06q3k25q8L80k90lL65j79j38L08j72J20R0j13
2760H8j35j60j31J97k52lN75p6N8L00k76q9Rj00mn9m0Q2m67M0N29j94J06M15k01
2785B12pj8k66J4j96J61J36l23K56M43l37k4L76l94q8L22m02l4r1J29L4j80J24
2808a53L70m33L20L52k59j64L58m00k36l4R3l2QM22J35n25K67K58o67J92M72m79
2830a35j18P4K1p6N3M11j07j11M60l7n71Q5J42l03k12L80k25K7j0M61k02j53M62
2853C16J03n11L25o5m98p0N02k84m5L30K14j97K5L69j69o97L41o8m48L66K52k76
2875a85J62N14l28j60k0L72m16r8N51j97o56M06J5l49Q6M34J41k90K14J70n62
$$ plain form
2713 -223 325 254 189 281 -139 -55 134 -221 51 7 -251 -69 -121 -111 193 218 210 478 133 44 28 -336 -200 -320
2737 -320 -592 -110 -116 -35 301 467 369 322 116 33 -192 -280 100 -190 -193 172 -7 -145 163 -9 111 201 88
2760 88 -47 -207 -338 -141 -393 -396 179 103 161 461 185 96 105 5 1 -58 -98 -16 -483 -443 86 -108 -2 413 212
2785 212 205 187 -79 -65 -261 -100 36 -287 -31 412 75 51 427 33 -55 267 -135 -169 -260 -131 -97 -277 -153
2808 -153 217 -216 104 456 197 33 391 -9 -245 -279 -186 -218 -210 212 347 -178 89 347 -320 -128 344 -135
2830 -135 -253 -179 -158 -234 -181 230 123 12 472 435 -136 -51 91 -212 -424 -44 -269 -242 -252 209 7 -146 316
2853 316 419 -92 233 168 -330 -400 102 -182 -227 103 317 120 145 514 345 -352 -11 -79 -527 -161 91 -185
2875 -185 -23 491 163 3 -17 355 -61 -159 392 195 -461 -55 -40 -389 -303 131 272 -18 196 366 -196
2896a96j14L09j63j94O29j95k96L93K06l65J13K18q2n64J11L05m19k00N10j23
2916a17k23N68Ol44J46L34j79l23J48J67l91l6M97l98n4N34q2m54L06J11j44j29
2938e7L6K7n42J29L77p9j8O33k03l47K65k6m08M4L44q5k94J47J81m16J69N20l87
2961A0o9M76k69l45r0L08n9l31M97P1n44M86L51m46LK88m50k86K60Q5k81N1N54
2984B70k43k94M01K17n48K89M47l96k15K05k63j27J14L95k23j18N16j77m58K06
3004bJ84m16N3L72k41l17L50J28l15P4P39k04m78K40M6p33L98K30k71m7J75K09
3026A74l53J37M14l93j55M78k95m31M05J20k90J09L17j58q2J51K68n42Q6L89m07
3047e8m22M04j5k96M07K84j59k46L02n3l36J87K07l47j38L70k05k32L63P3k37
$$ plain form
2896 -196 -310 -1 -164 -358 271 76 -220 173 379 14 127 345 263 -301 -190 115 -304 -504 6 -117
2916 -117 -340 228 234 -110 36 370 191 -132 16 183 -208 -244 253 -145 -199 335 253 -201 105 216 72 -57
2938 -57 -21 6 -536 -407 -30 -109 -127 506 303 -44 221 195 -213 -169 175 90 -204 -57 124 -292 -123 397 10
2961 10 -59 417 148 -197 -287 21 -38 -369 128 199 -345 141 492 46 49 337 -113 -399 -139 -54 -335 -284 270
2984 270 27 -267 134 351 -197 92 539 143 -72 133 -130 -257 -143 252 29 -89 427 250 -208 -2
3004 -2 182 -234 -181 191 -50 -367 -17 111 -204 -130 609 405 -73 167 213 -520 -122 108 -163 -210 -35 174
3026 174 -179 -42 372 -21 -176 302 7 -424 -19 101 -189 -80 237 79 -3 148 416 -126 -40 349 -58
3047 -58 -480 -76 -91 -387 20 304 145 -101 201 148 -188 -1 206 -141 -279 91 -114 -346 17 90 -147
3068a47K12K85k90j97J13J85n24J22L74j92k62N56m6k82L17J47k73m6j2R0m62
3089c32K84K37l63q9M70j81j98M44r1k07n6J90n5l98L29J04l05J98M19m17JK47
3111B31j23k12M8K05k74j77K62O0l59L16L33k69J49J90l53j50K28Rk89P0J74K6
3133I5l54L09J61m62L29J52l38M8K8o3j50J00K22o4j52K89k0j46J62J56l49M2
3155eJ23j10k52O8M2K3oK35L8k57K63r0j84M8J93k63RK01ro5p6K79j20r5P8l1
3181C7k54K61p7q5N3J8j46l3J84K64j25p9L60k21k42J05j34j45J60J41j56PK98
3204A91j16j46R7Q5k06k2K67p2k03K33j59rQ3J22J8n3j56J65j58n3J41j92j14
3227b57K02n6J14J07K6Mj11N5J6j95k8J18o9k3J45q2P0O0P9j15m2mn8k21K35J36
$$ plain form
3068 -147 65 350 60 -137 -24 161 -363 -241 133 -59 -321 235 189 -93 224 371 98 52 40 130 -332
3089 -332 -48 189 -174 -263 207 26 -172 272 181 -26 -82 108 53 -345 -16 88 -217 -19 400 -17 -16 231
3111 231 108 -104 -56 149 -125 -302 -40 20 -339 -23 310 41 190 380 27 -123 105 114 -175 -105 69 95
3133 95 -259 50 211 -251 78 230 -108 -60 -32 -95 -245 -145 77 13 -139 150 130 -16 146 302 -47 -5
3155 -5 118 8 -244 -176 -134 -111 -117 118 156 -101 162 72 -112 -64 129 -134 -125 76 67 2 -74 205 85 -10 68 37
3181 37 -217 44 -33 -118 -65 -47 -193 -226 -42 222 97 18 378 157 -85 20 -114 -259 -99 42 -114 -107 191
3204 191 75 -71 26 111 -95 -117 150 78 -125 108 -51 -60 23 145 163 110 -46 119 -39 -92 49 -143 -257
3227 -257 -55 -111 3 110 136 140 29 84 100 -95 -123 -5 -74 -97 48 -34 36 96 175 60 18 14 -44 -265 -30 106
3253A06k74J21Q0l2R8R8j66N6n1J0L9j05l1Lj10p4L06j39R1Q0j47J27K8j23Oj24
3279a27L2J81j86J19QRJ06j07J1Q4n8j48R4j06n6J18L9j2l2k4J66P2j72O4j24
3304d9j5J07j28l1J51n0N6O1j12L8m9J08J14j55j62P1o7PQ6rK5J97q9J3M3j59
3330BO3q5j18R9K4k6J50k00J40N0q6J8j8L8m3n6M7J24k30J16J10j62J31m1J7l6
3356B8K7Oj07p2o3J31oO0m2LR2J26k1j64J81p5j35L6J0q6j82L83o1p8P3J34l53
3383a55J07R6k0l5n6P7k9p4R1R2j02R1N7k65K36j10n4K0J4j22j16O3K45q9q6L33
3409B09j86k2N5K6l27K61NJ8m4j3K04j45j31L60k11j26J92j18o9J16j6k51J33
3432h0Q1J21j68M0J06j44JK75k18j18Q7P1j80R2J56k04Q7L4J54l00n5L02j76l8
$$ plain form
3253 106 -168 -47 33 1 99 197 31 87 36 46 85 -20 -51 -48 -158 -232 74 -65 26 106 -41 86 114 -9 -3 -127
3279 -127 -95 86 -100 19 27 36 142 35 46 130 72 -76 18 -88 -144 -26 13 1 -31 -55 111 183 11 75 -49
3304 -49 -64 43 -85 -116 35 -15 41 102 -10 28 -21 87 201 46 -116 -45 -112 -105 -19 -28 -3 194 105 118 161 2
3330 2 65 -20 -138 -39 -15 -41 109 -91 49 99 13 31 13 51 8 -48 -1 123 -107 9 119 -43 88 47 64 28
3356 28 55 61 -46 -118 -181 -50 -56 4 -38 -35 57 183 162 -2 179 104 -31 5 15 -71 -253 130 69 -9 64 198 -155
3383 -155 -48 48 28 -7 -63 14 -15 -89 2 94 -8 83 140 -125 111 1 -53 -33 -19 -141 -257 -194 51 -38 -124 209
3409 209 23 1 56 82 -245 16 21 39 -5 -18 186 41 -90 270 59 -67 125 7 -62 54 38 -213 -80
3432 -80 1 122 -46 -6 100 -44 -43 232 14 -104 -17 54 -126 -34 122 -82 5 39 193 -107 -162 140 -36 -74
3456g4J38n0j74R9J95n2k3p0J01k29Q2K96l01q5J28j00o7J55K5J21j51O3N7j30
3480d6J58Pk66J08R2j51M7J11n7j1J0O2qk92j79J5m9M28K96j25L65l46J53j4o9
3505B39j41o7r6J46K94j220M62M23k28Q5K35n7k9M8o2K9r6O5l5j2O5J25k64J26
3529C5K09k23O2Q7n7j87R5q9n6o8K28m1j09K31J2j66JJ58j03p4K02j22q4K5J38
3554A04q5p7J75M2k47L9J48j12M9j20P3j17L4J77j04m5K14o0k78L52n1j54J3J27
3578I7Kk03J83p1k87K33K34o1k16K24o4j62K28Rk40M0R6Nj41P5J43j1o9mm1k24
3604b25K42r9l6n5L32j68k13K30J14l07J25J91j11n2J03j77RJ98m2j06J15k7M6
3627H7j76O0J52j45j31K51j73J0J96o4Oj46R6L6M9j1N5k30QJ44j40k6J76o9m1
$$ plain form
3456 -74 64 14 -160 -61 134 82 59 -11 90 -139 -57 239 -62 -147 -19 -119 -186 -31 -6 115 -36 27 84 -46
3480 -46 112 119 -147 -39 53 -98 -51 60 3 -8 2 64 56 -236 -415 -400 -449 -21 275 150 515 169 322 308 239
3505 239 98 31 -65 81 375 -845 -383 40 -188 -103 132 75 46 94 32 61 -35 30 -5 -17 48 173 -91 35
3529 35 244 21 83 170 113 -74 21 -68 -124 -192 36 -5 -114 117 129 -37 -36 122 19 -55 147 25 -59 -34 104
3554 104 19 -58 117 159 -88 -49 99 -13 36 -84 -11 -128 -94 83 -21 -66 148 88 -190 162 111 -43 -30 97
3578 97 99 -104 79 8 -279 -46 188 127 -89 135 71 -91 137 146 -94 -54 42 47 -94 -19 124 113 44 40 -1 -225
3604 -225 17 -82 -118 -173 159 -9 -222 8 122 -185 -60 131 20 -32 71 -106 -97 101 59 -47 68 41 87
3627 87 -89 -29 123 -22 -153 98 -75 -65 131 67 73 -73 23 59 108 97 152 -78 -70 74 -66 -92 84 15 -26
3652b6J50o4p8j03K42k1j99M5J94k72J22R4j39M7l6P3m2M8P4k41L3Q0J09k93J12
3677i1J45p0QJ22L6j43o2L3J53k04L7k1P4J0N7j52R6J4j19j3K13j37Rj18J34m1
3703c0o0K18k8k55J31O2K2jp4J9j28P2J66k01L6K05ml07J52N5j53M9J26j26J78
3728A24p7qj0M5rL3k27K20p3r2k2J55k95J46Q5K3j19L0K35j73p0J29J6p4NM6q6
3755d3p2O8O1M9j43J28j99Q4J67n8j34K13j47k7J01k8q4Q0P0o1J17l3m9j55M2
3780e3M3P0k03K35J46k88j1Q5P8j42O9J08j60RJ14j87J10oj1Q2n8J6j4j56J95
3805G1n7j44J05N8m7R3M1j02J6P2j6j04K1o0K13q2n6J21j88p0J52k20J75K5L0
3830D7K6r4M2M3l0n0J18k46J56rm1q6J64nQ9m4l6j00k8J33M5j53k9J13j08J62
$$ plain form
3652 -26 124 60 -18 -121 121 100 -99 -54 140 -132 -10 84 -55 -8 -44 29 -13 35 109 -132 -99 -19 90 -203 -91
3677 -91 54 -16 -8 114 150 7 -55 -22 131 -73 -36 -57 17 27 84 -68 28 42 -77 -90 123 -14 -5 -123 11 -30
3703 -30 -90 128 100 -155 -24 38 60 59 -15 4 -124 -52 114 -87 -51 154 150 -157 -5 50 -103 -54 72 -54 124
3728 124 47 39 29 74 65 98 -129 91 18 -74 -96 59 -236 -90 -5 18 -101 -71 164 -9 -79 50 66 -8 -3 43 -43
3755 -43 -115 -47 14 63 -80 48 -151 -67 100 42 -92 121 -26 -53 48 20 -64 16 86 25 142 109 60 -95 -53
3780 -53 -10 60 -143 92 238 -50 -61 24 102 -40 29 137 -23 -14 100 -87 23 17 6 88 30 46 32 -124 71
3805 71 14 -130 -25 33 -14 79 120 18 34 106 90 -14 7 -53 160 78 22 143 -45 -115 37 -183 -8 17 47
3830 47 73 -21 21 64 34 -16 102 -144 12 3 -38 -124 40 35 124 80 44 -56 -84 49 94 -59 -88 25 -83 79
3856G9q5r0J81o6J1l5k9m8%J5O4K6P5K0j88J6J28l5j6n3l5L2R3n8K5j5LQ0m5n6
3886fJ31j04no0j0J24k6n4o5J73r5k2m1mJ55j38l9J13kp0K0l4P4l6O0J1K7k8j01
3915e2R2q8Q6j07qJ76k33J68Qo5K8J1l3R8j16j09K38l3L5n9q1N1K7j40j4J75j01
3942d6J15j02m4J04q2Q0o8NJ5P3n2J48r6j1n1p9L7j7P9L3J4p1k0J44j19K2J17
3969A28k42R2jK1n1J8J37j81J03M4o7J01q9R2j69R2o7k4rM5J50r5p0K88n0k16
3995b0k8K33j96L0Q6j90P5m6L0M5p5P7L3j85J07NJ6m9Rl6J24l6O3k3n9P0rr7J73
4024A27j29q7k6Q9K9rM0j15K4R8N4j55k2K63j71j58J60q3J34p0J21j02m2MR0j40
4050g6J3Q8r8kK10k21J82Pq5l3P2k0o9J54j07O2j49k6M9L0l5J25o8RR6q6O3k76
$$ plain form
3856 79 -6 -96 85 19 30 -5 -34 -82 -82 -67 -3 23 98 118 -70 -54 74 39 23 -30 -65 -33 60 2 27 12 15 95 50 -6
3886 -6 125 21 16 -44 -54 70 44 -10 -75 98 3 -19 -60 -64 91 -47 -86 27 25 -45 -25 -59 15 -21 39 50 77 49 -52
3915 -52 40 -48 38 -69 -77 99 -134 34 42 -23 5 16 -17 81 -35 -144 94 61 96 37 -44 7 34 -106 -120 55 -46
3942 -46 69 -33 -77 27 -55 25 -43 -38 -23 50 -2 146 50 39 -12 -91 -54 -71 8 41 55 -16 -36 108 -11 11 128
3969 128 -114 -22 -23 -2 -53 -35 102 -79 24 68 1 102 13 105 -64 28 -39 -63 -72 -27 123 28 -42 246 196 -20
3995 -20 -48 185 -11 19 105 -85 -10 -56 -26 19 -56 21 54 -131 -24 -19 -3 -52 -43 -79 45 9 72 49 -10 60 51 -46 127
4024 127 -2 -89 -115 -26 3 -6 34 -81 -57 41 95 -60 -82 181 10 -148 12 -71 63 -7 114 12 -30 -26 64 -76
4050 -76 -63 25 -73 -75 135 -86 96 103 18 -15 57 37 -32 122 15 77 -72 -98 -49 -19 -54 71 3 12 108 22 85 -191
4078a91L14j94l0L6J35Op5On5k9J01O8j80k1K08r5j76K63o4J0Km1j55Q7J18n6
4104hP4j12J15j03L76m29J76O1L15l55n0L99o95j2L05j25J51l15J59M6P2j42J89
4127I2j71N6rJ11r2Q6K9j61o2J59l0N3j61P8J25j12M9J01r9j12J17m1m3Q8R1n5
4153H7j3k7o8j01P8Q7j14j03J50op8J15Lj97K13O1Pj00O1j17R3k5R0k56J07J41
4179H8j39K5J1J22j59J6L6r4m8J70o3j58K36Rom0M3k0p8R0k8o1q8K56k22P5N8
4206C1p9Lj3Q5N5k27K69r5j32jJ59r2J1m6J195j033o1J33j43k6N1q2n7J18K6j93
4232a44K13m4j08J77k19J10K7J8m5o3L9P0o6p7P6k87L07J49O0n18K79k1O6j0p9
4257i0Q0M0p0J91j09q1O9l5J58p5NLl92K81Q9l5k15J89pJ9Q5m5j3M4J7j41n1P1
$$ plain form
4078 -191 123 -71 -101 -65 70 76 1 7 -48 -77 24 92 -88 -109 99 4 -172 91 27 37 39 -2 -157 -70 48 -8
4104 -8 66 -46 69 -34 342 -87 89 150 465 110 60 459 -236 -248 57 -68 83 -232 -73 -27 45 -97 92
4127 92 -79 -23 -32 79 -13 73 102 -59 -121 38 8 61 -100 -22 103 -9 40 141 42 -70 47 6 -37 51 142 87
4153 87 74 47 -21 -122 -44 43 -71 -174 -24 -30 -108 7 10 -187 26 87 94 -6 55 -62 31 6 96 -160 -53 88
4179 88 -51 -26 -15 107 -52 -36 0 -94 -142 28 -35 -193 43 52 46 6 49 29 -49 41 13 -48 -136 120 -102 -27 31
4206 31 -48 -45 -58 27 82 -145 124 29 -103 -104 55 -37 -26 -72 1123 90 29 162 19 -7 44 -38 -95 23 49 -144
4232 -144 69 25 -83 94 -125 -15 12 30 -15 -78 -39 31 -35 -112 -36 -323 -16 133 193 -325 -46 -67 -1 -11 -90
4257 -90 -10 30 -40 151 42 -39 30 -5 153 78 83 86 -306 -25 64 29 -186 3 -4 15 100 55 42 86 103 -38 -89 -18
4285a8mL7j16J40qj20J99On9j02K1P2J90J24o64N09l01r2K6r8M29J51n08K41r6
4310d1M55l36L17k23l30O99o21L45k56M0r1M3J31j11m1MP1l5k5j5M4Qj08J90k21
4335a07O1n8M5J38j49J15j64J36L2l0p4QK1o0J35rJ9o9N4q2R3r6j8J27rj14P9
4362B4k8J7k5n7K2J02m4J0r2J00q0k6P4o2n0O2J85k27P4mj84J81P3k4J8n8L4Q0
4390I5j84R0j9N4q8M5J1J1j4K2N0l1l1Km3Mk4QJ5P1j72M7L8O2L7q7N8m7K5l2O3
4421C6m5k3P1r7M5o0KP0j20J5K1M6k5L0K5J2M1j1j02K22q2j9j24K03k21J31M15
4448D56n30N2J93n59L05m1K10k3j45J51q2K3j17J88Or3L4K5j49J92j61j6l8J11
4472hj6O8j62Q2KJ06l1K5r6qJ00o4M5j19J42j17N8j0j6RrK1J13j79J30Mj01j9
$$ plain form
4285 -18 -22 15 -101 39 31 -89 110 116 57 -45 -24 48 238 362 -302 207 -94 -186 -160 -258 171 322 -186 55 -41
4310 -41 414 78 395 172 -158 541 -80 265 9 49 -42 1 132 21 -20 -16 55 20 -5 -20 24 32 -76 114 -107
4335 -107 -46 -104 -59 79 -70 45 -119 17 49 19 -55 -47 -26 -86 49 40 59 -10 44 -38 55 -41 -59 68 59 -55 24
4362 24 -4 13 -12 -69 -47 55 11 21 -71 29 -51 -77 -3 -65 -115 -53 132 -95 -21 -25 -209 -28 45 21 39 -19 15 95
4390 95 -89 1 -18 36 -52 -7 4 15 1 23 73 42 11 13 -30 -26 -50 -42 -27 44 -128 -81 -43 19 56 -31 27 -20 5 -27 36
4421 36 -9 -32 39 -58 -13 -73 -71 -1 -121 -106 -85 -39 -64 -34 -9 3 44 33 -69 153 71 52 -72 131 -90 41 456
4448 456 -74 -22 171 -388 -83 -124 86 63 -82 69 -13 10 -107 81 87 -6 28 53 -96 96 -65 -81 -119 -8
4472 -8 -24 44 -118 -36 -34 72 41 66 -30 -38 62 -2 43 -76 66 -51 7 -3 -19 -10 -19 2 115 -64 66 70 -31 -50
4500e0O4o5Q2j03J47k08N60M77o25l31j33K01m77M21Q2R9k53J54O2k77P0N6K58
4523B11k14J15q6l1k5J22j43P1om9M1L5j35J01L21p82P72j45K02k63m8JJ02j53
4547A4m3Pp5J68J56l22l71M52N47l08k02J43q7r4Q6j4k3L01nJ15l68k62L98L04
4571E17M83n86p23J01M20j24j69P4o3J08l8J03j94M5j13K43j22J27j39J88j84
4592d6J55n1p7K4J15k13N7r8M5k25J75k93M02K56n75M16m10L96l08L71k13K10
4614A13j89J66q3J63j74j6QR9j60K8kR0r0J42k06L7R0J2j26J2P7Nj80J41J43j52
4640e2n5L29P1k71N8j11K1rQLr7J4J49k69K98qj01j0J53m9j49J09J3m9j25J40
4666A1q4O1J15K0p3l9q2J14l9L9j6m0J4J07k49R1J50p4l4M7J42k07L3j9J72j57
$$ plain form
4500 -50 14 -51 31 -72 75 -133 427 904 279 -52 -185 16 -461 -40 42 141 -112 42 104 -173 -103 -47 211
4523 211 -3 112 26 -5 -30 92 -51 20 14 -35 6 41 -94 7 328 -454 318 173 375 112 64 65 167 14
4547 14 -29 -22 -97 71 227 -95 -466 -14 533 225 23 166 79 -15 71 57 34 335 330 445 77 -185 213 517
4571 517 1000 414 -309 -208 212 88 -81 -7 -70 38 0 103 -91 -46 -159 84 -38 89 -50 138 -46
4592 -46 109 58 -19 5 120 -93 -36 -134 -89 -314 -139 -432 -30 226 -349 67 -343 53 -255 116 -97 113
4614 113 -76 90 7 170 -4 -20 -12 87 -73 -45 -47 43 -47 95 -111 -74 16 28 -98 -86 -9 -4 -184 -43 100 -52
4640 -52 -107 222 293 22 80 -31 -10 -19 -11 -8 -105 -91 58 -211 87 79 -22 -32 121 72 -77 32 45 -4 -129 11
4666 11 -73 -12 103 123 50 11 -71 43 4 43 27 -13 1 108 -141 -50 100 26 -8 39 181 -26 7 -12 160 3
4692Cn4K3K3j2J54j69N7jOn5J13K0R1j60j08J49j88K1K49k56Q3J00q8j40K05n3
4718A3o4j08J43M4j67J20P9j11KK03k51O4K6PL1j27J03L7j67Q8P9j89M5J76j41
4743f5J0p8Q1mO8N8k0j55J02O1j05J3M2J9jM7j44o5R4J07j86J07Q8j01o1J45m9
4770Hn8J5Q8m6r7J52l6r8J38j93J83j52J64j1j61J75k9q1Q2O5o3j08QJ35j25J09
4796F4k1q7j18J64m0k8O5O8Jk08J12mn8J09k1p1O9o4P5mM8n0l2J8J74k38J55n2
4824B6J3j4K5O4j93nJ27j07q1j78O64j62l18L22O4K4m29P41m62M3n3m31L20J59
4848A59p2j32M9q9L5j23J91q0K2O6ll8N2N2p4L1m9K9j15K8Oj6R41o06L55p76j59
4875c16J003r48P01l57p0L51n81L07j60J55o0J28k59M8J64j01m8R4o4n6j3L8J03
$$ plain form
4692 3 -51 -28 -5 -17 137 -32 25 24 30 -25 88 108 199 39 -69 80 -108 -87 162 -94 -11 89 1 -139 66 13
4718 13 -51 -159 -16 28 -139 -19 60 -51 -49 154 -97 -33 -7 0 31 -96 7 44 -123 -35 44 -145 -100 76 -65
4743 -65 -55 -133 -52 -56 12 70 50 -105 -3 58 -47 -34 8 27 26 73 -71 -136 -42 65 -121 -14 74 -27 -88 57 8
4770 8 -50 -35 53 7 -90 62 26 -72 66 -127 56 -96 68 57 -104 71 42 -39 43 108 45 -63 -55 80 -45 64
4796 64 43 -44 -162 2 -38 -66 -1 67 68 -140 -28 -32 -90 19 -2 -73 -4 -68 7 3 51 1 -31 -13 161 -77 78 26
4824 26 39 25 50 114 -79 -84 43 -64 -145 -323 341 179 -139 183 247 271 -158 583 121 164 111 -320 0 159
4848 159 87 -45 4 -85 -50 -173 18 -62 -40 26 23 -15 37 89 15 46 -3 26 -89 -61 -55 -71 870 264 619 -157 -316
4875 -316 687 -261 440 83 13 364 -217 90 -70 85 25 153 -106 -58 106 5 -43 51 -13 -69 -82 -44 59
4898E9j91K14r0n9QJ10m3R1p0r8R9PJ7j03Q4J9K6j00J25j70O7Ll4o7N4Q3m5j9
4926b3N6p1J01r2QJN0r6J28k2J6lj3k3q7Q8r5J6O4j9MP3j37p5P6J02j02M7K1N8
4956E1k26J81L2J12j49k5LL2j6R7l00J87J06j15P0O3r5n8J20l2n8K8k1j13N9O4
4982cP6j32M5M8N5j47J60m7k2k5O2o2R7l1j02J24r5K31k26J6J5n7o4J03O3j51
5008f9NR1k0J14o9q0j6r1J44q5j9J25n6L3J3P5j87J31m3j8Jr3J02oK1J6j08Q8
5036aQ8p5J64j38L4m0k7Ol7M6J7N5m2o2J7r4J66m7j36qJ92p2k1j5k2J29n2j8L0
5065C7l6o2O1n4J45j49L4PK4L1k6L6j46J00J79j17K1n0l0N2j28N9M4j01K1J46
5091I8j25Q5j07k0Q1Jj45J51j55J55O0j78J10n7M2Q5j11j1l5R2K1mKM5j16k6J06
$$ plain form
4898 59 -132 82 -8 -67 -59 51 8 99 29 -69 30 37 54 -49 35 54 80 -20 105 -65 2 5 -29 -96 -42 41 -4 -23
4926 -23 33 -38 63 -29 -21 -20 30 -66 62 40 56 53 40 17 -70 18 -77 -61 3 -16 -12 61 -76 -151 -75 27 -75 -28 -7 51
4956 51 -175 6 38 150 1 -24 -21 11 -5 92 -208 -21 85 -30 40 103 8 -50 70 38 -20 8 -13 -126 -67 -3
4982 -3 73 -59 -14 34 89 -58 102 55 33 8 70 8 105 74 -28 96 1 232 6 22 37 -20 -84 19 82 -69
5008 -69 -64 27 7 121 52 -28 -44 -135 9 -76 -95 30 -26 7 20 95 -92 39 -4 -22 -21 -114 -12 -18 3 19 -89 -1
5036 -1 87 12 176 38 72 32 5 11 -26 20 37 92 50 -12 5 -89 77 30 -106 -114 78 6 -15 -30 -52 77 25 7 37
5065 37 1 -61 0 -54 91 -58 -24 -17 7 38 12 48 -98 2 181 64 85 35 5 57 -71 -12 32 -69 -48 98
5091 98 -27 58 -49 -69 12 13 -132 19 -136 19 79 -99 11 -46 -4 81 -30 -41 -76 16 37 33 35 80 -36 -62 44
5118D4mj05R7Po7J23j93O8N6k9J30j00n3O6lj49J33j24J59Jj0k3kL8o8k0J20K5
5146A17j5j57K7JK9p2L8jk1P9O4k1q6M2q9L7J47q6m5M4J0m9q8L5N8p7L1J33o2
5175B3R1j41pOn6J19Q3j29j1Nm6R0n5j20K51l3j42O5Ro8P1k1n0j2N9J11q1l7J19
5204I3j3l3p7J9Jj2k6K1M3J9n9J6j14K02o2l3O3nl8NJ59k02J38j54J4K8q4L0J00
5233C9r3R8L4j30L0kL9o0o7J75l6n5Q7j2r9J33j20M0K0Lj02J11j02K4J11q8J37
5260A15r0q9K16j55j07J35M7jj04J08j4q6J00j52J0K4J00r5j01R5Q6m2k2J7P5
5285G0j18Q1j03P6QM8j60O9J41j20j9Q0nJ8r9L5l4o5K3J37j98J63mml8Q8k4j15
5313f9J75j01Lj08K0K82l14O0M3l6J34k3j08J70j6j77J06j04J09l5l8J85o1j15
$$ plain form
5118 44 40 -65 32 39 -28 95 -98 -30 26 -3 127 27 -26 40 37 -112 21 -103 56 57 47 24 22 60 -8 -28 92 117
5146 117 102 -55 -28 -27 2 -70 -32 -33 -54 25 89 68 -18 24 -65 -28 119 33 -12 32 42 -7 -95 -60 -2 -79 -48 85 23
5175 23 114 -27 -34 -28 -84 35 118 -11 -22 -17 -63 27 -28 -148 103 70 -72 -7 2 -66 5 -16 -66 -78 -19 92 11 -26 93
5204 93 80 47 -30 -11 -10 -22 -48 -27 16 35 -24 -8 -122 80 18 -15 48 43 5 10 169 -33 105 -49 -35 -7 -91 -61 39
5233 39 -54 44 78 -52 -22 -24 15 -45 -112 63 27 -28 59 47 -52 81 -39 1 21 24 -78 33 -69 -45 66 -22 115
5260 115 25 -64 152 -3 -110 25 72 71 -33 75 61 -25 75 -77 -67 -43 57 -38 -139 -44 42 0 -22 -5 70
5285 70 -48 33 -70 6 14 62 -98 -29 112 -8 -27 53 48 66 -33 2 -32 -97 -74 63 -135 28 24 20 -18 70 46 -69
5313 -69 106 5 8 -100 -80 202 -112 -52 -9 -45 89 66 -42 128 112 -65 41 -63 46 11 -27 158 97 -18
5337a8P1qp7j8J20pq5j05J34n2p9J81p3o5Q3N1p4j07K17j07k1J06n8k1j1l1O6
5364A2q5p3J41j43J38J14l9Nj00M7l9k6P0N2qL0j0j85J25n5k2Q9k0J8p4QN7j79
5392a52QJ52q0J8M3K2j94K01kl0l4R2j1P4r7J22j79j5J45j47P8P3o1j09P5q3J48
5419E7o4k7Q7l3l5J84j72OL2j03k2J30k5p7Q8Q7r9j17n6J97r3O4n3mK1j1L0Nk5
5448b8oJ77n5l8K0p1q4K91k25j1K25j57j02M1R1r4j7O1Q4n8j4P4l31J18J54p9
5474c4L2Ql2j6q0J43k5j90J15J25L2r7Q9j61J6J97j69%J00k1Oq4J45j39RJ02j27
5501e6k2P7J15j17ql1P5j04R1O3j9j57M9PJ6J1K4n4J09Q0j00j16O7J3r9m4J58
5528B8o4K9n2P8o2j1O6m0J3R0J29k51Q7pj11J26o4o0M6K2K6j39P6L1L4k8J2P9
$$ plain form
5337 -18 53 45 -32 -50 70 63 -22 -127 7 -45 -124 57 -16 -81 2 53 -21 -128 89 -18 -39 67 9 -12 -23 -54 12
5364 12 -73 -146 -5 -148 -10 104 65 70 -30 17 -22 -48 22 74 66 96 86 -99 26 -29 -51 38 18 36 -38 -30 27 -152
5392 -152 -144 8 -72 -54 -11 11 -183 18 16 -14 -48 44 33 107 10 132 -47 -62 83 -64 14 87 26 -83 -8 -91 57
5419 57 -7 -34 53 20 -15 169 -3 3 35 -68 -90 40 15 -62 26 113 14 -103 -159 38 -55 9 -44 -48 -27 -38 -8 -3 -28
5448 -28 -34 143 88 50 70 -1 -85 206 -19 -30 195 38 -64 -23 68 -26 -43 18 102 44 30 104 -227 -109 45 -34
5474 -34 -2 6 -26 -42 -122 21 -4 -194 -79 46 78 -19 70 -91 -75 122 -47 -47 53 32 38 -46 99 -40 -31 71 -56
5501 -56 -78 -1 114 -3 -11 -42 33 -71 20 83 64 -93 -44 -37 -21 -10 14 -40 69 149 49 -67 0 13 -86 -130 28
5528 28 -36 -7 -59 19 -43 -54 12 -28 -15 75 204 -47 40 33 -78 48 -16 -76 -30 -8 18 -121 -45 -14 20 -8 4 83
5556H3p7m5R5O0j85J7J19o3K7j02J05j34N0N5r5j48J72N5N7j35O1m6R1O8%q2O2
5583F5O7j25k3P4q2n4R1j51O9l7%kJ07k3K0JN6p4j1J79j31j99J96n7L1N1M0p4
5611DJ15k80O9K23j47j1n8O0MN8q4J33j63P2Q3PJ03j37q3%J6k8Q7K8k7l8L1o4
5639b7rl2Q3q8R4p9O5L6j53J58j4k1m8k7Q3j40J63n4r3J19Pk7K1P9k23J04J49
5666A26j76L4kJ37m0j61J7N2r8J00lJ55r5k5L9o7m7O8O9n5k3jn4Q7Nk0j72J15
5694c5j34K02o4N7J2j90J37l5M3j7l2MJ22j31k5J3J02L4j01J14lqm4j4Mj6k0o9
5722i4R3M6k7L2q6n5P8k8p0J71q2J66j08j8k9K8l1N4o4k2R7o7mJ07j26l0J66m4
5750E3m5r0Q0j3J7p0J57j11O0M6j0k31K66j23n0Q1M8p3LJ00n9j7j42J59j17M5
$$ plain form
5556 83 6 -39 56 116 -69 -52 67 4 31 -71 34 -100 -50 5 -90 -238 -66 -11 46 -89 -28 -74 17 85 85 3 65
5583 65 132 7 -16 58 -24 -78 13 -138 -69 -106 -106 -108 -1 -24 -4 -3 53 -21 -32 147 16 -183 13 -44 -13 38 78 4
5611 4 119 -161 -92 131 -16 -27 -85 -25 -21 37 -47 86 -77 -5 78 85 188 51 -32 -32 -16 -44 43 71 44 6 37 -27
5639 -27 -36 -68 15 -73 21 -58 7 43 -110 48 34 13 -35 -62 21 -119 44 -10 -103 16 23 -4 17 96 -127 -23 126
5666 126 -50 -16 -18 119 79 -82 -65 -13 -111 -11 -14 141 46 21 60 -7 -54 14 83 28 5 4 -50 37 42 22 -150 -35
5694 -35 -169 33 -31 26 38 -152 -15 -50 -7 -24 -56 -52 70 -61 -86 -73 29 63 -38 76 73 65 21 7 11 -5 -25 -94
5722 -94 -1 45 18 50 -36 -91 -13 -41 -111 60 -22 144 36 18 -11 17 -14 40 -24 -46 51 -16 -20 87 -39 -69 97 53
5750 53 8 -82 -2 -15 2 -68 89 -22 38 84 74 -157 109 -14 -64 17 65 -8 -5 95 36 19 -123 36 -81 -36
5776c6N5j4k1o9J12q8R7O0K5q2%Q0j90rJ75j44L4J4k0R0M3j18r2O9O2p5j4O1j6
5805a1P1j57Q3L0M5j35P5j1kpM0j91J48J43j58J30j56J08j62K36kk15oJ45L3n8
5831A6n3J1l2J5K18j99l9Q8K8q4n3R5n6l7J36L7j09J4L8j1n5J29j65j7J10L8p8
5858a5n6Q6n7K3NJ45j47k6J73j90m1Q1L9p5m2J11J3QM9Lk86J71M1m7O9j7r5k1
$$ plain form
5776 -36 19 5 -16 -85 27 -61 36 96 121 39 39 119 -71 -80 95 -49 -15 -1 -21 69 112 -6 -98 -29 33 -42 -56 5 -11
5805 -11 60 -97 -14 16 61 -74 1 -10 -12 -19 21 -170 -22 121 -37 93 -63 45 -117 119 117 -98 -104 41 74 16
5831 16 -37 -26 -58 -43 175 -24 -63 25 53 -31 -84 11 -45 -82 54 91 -18 -4 34 23 -32 97 -68 -85 25 63 -15
5858 -15 -71 15 -42 -19 -14 131 -16 -42 131 -59 -100 -19 20 -55 -97 14 27 35 84 87 -199 -28 13 -34 35 18 -77 -98
$$ [...]
8191I
##END NTUPLES=NMR FID
##END=
