##TITLE=1H_DE-80H_X3
 200.13MHz, d2o
 8 sc
 
 19ns.26.2.2025
##JCAMPDX= 6.0         $$ Bruker NMR JCAMP-DX V2.0
##DATA TYPE= NMR FID
##DATA CLASS= NTUPLES
##ORIGIN= UXNMR, Bruker Analytische Messtechnik GmbH
##OWNER= pz
$$ XWIN-NMR		Version 3.5
$$ Wed Jan 28 14:49:19 2026 Russian Standard Time (UT+4h)  Yarkov@DPX200
##.OBSERVE FREQUENCY= 200.1313
##.OBSERVE NUCLEUS= ^1H
##.DELAY= (6, 6)
##.ACQUISITION MODE= SIMULTANEOUS
##.ACQUISITION SCHEME= undefined
##.AVERAGES= 8
##.DIGITISER RES= 18
##SPECTROMETER/DATA SYSTEM= spect
##.PULSE SEQUENCE= zg30
##.SOLVENT NAME= D2O
##.SHIFT REFERENCE= (INTERNAL, D2O, 0, 14.3821)
##AUDIT TRAIL= $$ (NUMBER, WHEN, WHO, WHERE, WHAT)
$$ ##TITLE= Audit trail, XWIN-NMR		Version 3.5
$$ ##JCAMPDX= 5.01
$$ ##ORIGIN= Bruker BioSpin GmbH
$$ ##OWNER= Yarkov
$$ C:/Bruker/XWIN-NMR/data/yarkov2/nmr/H-C/1/audita.txt
$$ ##AUDIT TRAIL=  $$ (NUMBER, WHEN, WHO, WHERE, WHAT)
(   1,<2026-01-28 14:47:51.75 +0400>,<Yarkov>,<DPX200>,
      <created by zg, POWCHK disabled, PULCHK disabled
       configuration hash MD5:
       00 E9 B6 7A A2 85 ED C7 34 08 36 98 17 FE 4E 26
       data hash MD5: 16K
       73 E7 E3 B8 B4 BF 98 6B EF 90 D7 41 C5 10 DF 99>)
$$ ##END=
$$ 
$$ hash MD5
$$ 25 C8 AD 21 E4 6B 42 07 DA BE B6 D5 71 E8 1A 32
##$RELAX= 
##$RELAX= 
##$RELAX= 
##$RELAX= 
##$RELAX= 
##$RELAX= 
$$ Bruker specific parameters
$$ --------------------------
##$DU= <C:/Bruker/XWIN-NMR>
##$EXPNO= 1
##$NAME= <H-C>
##$PROCNO= 1
##$TYPE= <nmr>
##$USER= <yarkov2>
##$AMP= (0..31)
100 100 100 100 100 100 100 100 100 100 100 100 100 100 100 100 100 100 
100 100 100 100 100 100 100 100 100 100 100 100 100 100 
##$AQSEQ= 0
##$AQ_mod= 1
##$AUNM= <au_zg>
##$AUTOPOS= <>
##$BF1= 200.13
##$BF2= 200.13
##$BF3= 200.13
##$BF4= 200.13
##$BF5= 200.13
##$BF6= 200.13
##$BF7= 200.13
##$BF8= 200.13
##$BYTORDA= 1
##$CFDGTYP= 0
##$CFRGTYP= 5
##$CHEMSTR= <none>
##$CNST= (0..31)
1 1 145 1 1 1 1 1 1 1 1 1 1 1 1 1 1 1 1 1 1 1 1 1 1 1 1 1 1 1 1 1 
##$CPDPRG= <>
##$CPDPRG1= <>
##$CPDPRG2= <>
##$CPDPRG3= <>
##$CPDPRG4= <mlev>
##$CPDPRG5= <mlev>
##$CPDPRG6= <mlev>
##$CPDPRG7= <mlev>
##$CPDPRG8= <mlev>
##$CPDPRGB= <>
##$CPDPRGT= <>
##$D= (0..31)
0 0.7 0 0 0 0 0 0 0 0 0 0.03 0 0 0 0 0 0 0 0 0 0 0 0 0 0 0 0 0 0 0 0 
##$DATE= 1769597271
##$DBL= (0..7)
120 120 120 120 120 120 120 120 
##$DBP= (0..7)
150 150 150 150 150 150 150 150 
##$DBP07= 0
##$DBPNAM0= <>
##$DBPNAM1= <>
##$DBPNAM2= <>
##$DBPNAM3= <>
##$DBPNAM4= <>
##$DBPNAM5= <>
##$DBPNAM6= <>
##$DBPNAM7= <>
##$DBPOAL= (0..7)
0.5 0.5 0.5 0.5 0.5 0.5 0.5 0.5 
##$DBPOFFS= (0..7)
0 0 0 0 0 0 0 0 
##$DE= 6
##$DECBNUC= <off>
##$DECIM= 32
##$DECNUC= <off>
##$DECSTAT= 4
##$DIGMOD= 1
##$DIGTYP= 9
##$DL= (0..7)
0 120 120 120 120 120 120 120 
##$DP= (0..7)
150 150 150 150 150 150 150 150 
##$DP07= 0
##$DPNAME0= <>
##$DPNAME1= <>
##$DPNAME2= <>
##$DPNAME3= <>
##$DPNAME4= <>
##$DPNAME5= <>
##$DPNAME6= <>
##$DPNAME7= <>
##$DPOAL= (0..7)
0.5 0.5 0.5 0.5 0.5 0.5 0.5 0.5 
##$DPOFFS= (0..7)
0 0 0 0 0 0 0 0 
##$DQDMODE= 0
##$DR= 18
##$DS= 0
$$ [...]
##$SUBNAM2= <"">
##$SUBNAM3= <"">
##$SUBNAM4= <"">
##$SUBNAM5= <"">
##$SUBNAM6= <"">
##$SUBNAM7= <"">
##$SUBNAM8= <"">
##$SUBNAM9= <"">
##$SW= 18.0517328524113
##$SWIBOX= (0..15)
0 0 2 0 0 0 0 0 0 0 0 0 0 0 0 0 
##$SW_h= 3612.71676300578
##$TD= 16384
##$TD0= 1
##$TE= 0
##$TE2= 300
##$TE3= 300
##$TEG= 300
##$TL= (0..7)
0 120 120 120 120 120 120 120 
##$TP= (0..7)
150 150 150 150 150 150 150 150 
##$TP07= 0
##$TPNAME0= <>
##$TPNAME1= <>
##$TPNAME2= <>
##$TPNAME3= <>
##$TPNAME4= <>
##$TPNAME5= <>
##$TPNAME6= <>
##$TPNAME7= <>
##$TPOAL= (0..7)
0.5 0.5 0.5 0.5 0.5 0.5 0.5 0.5 
##$TPOFFS= (0..7)
0 0 0 0 0 0 0 0 
##$TUNHIN= 0
##$TUNHOUT= 0
##$TUNXOUT= 0
##$USERA1= <user>
##$USERA2= <user>
##$USERA3= <user>
##$USERA4= <user>
##$USERA5= <user>
##$V9= 5
##$VALIST= <valist>
##$VCLIST= <CCCCCCCCCCCCCCC>
##$VD= 0
##$VDLIST= <DDDDDDDDDDDDDDD>
##$VPLIST= <PPPPPPPPPPPPPPP>
##$VTLIST= <TTTTTTTTTTTTTTT>
##$WBST= 1024
##$WBSW= 4
##$XGAIN= (0..3)
0 0 0 0 
##$XL= 0
##$YL= 0
##$YMAX_a= 345851
##$YMIN_a= -315841
##$ZGOPTNS= <>
##$ZL1= 120
##$ZL2= 120
##$ZL3= 120
##$ZL4= 120
##$ABSF1= 10
##$ABSF2= 0
##$ABSG= 5
##$ABSL= 3
##$ALPHA= 0
##$AQORDER= 0
##$ASSFAC= 0
##$ASSFACI= 0
##$ASSFACX= 0
##$ASSWID= 0
##$AUNMP= <proc_1d>
##$AZFE= 0.1
##$AZFW= 0.1
##$BCFW= 1
##$BC_mod= 2
##$BYTORDP= 1
##$COROFFS= 0
##$CY= 83.5205535888672
##$DATMOD= 1
##$DC= 2
##$DFILT= <>
##$DTYPP= 0
##$F1P= 10.8118882576601
##$F2P= -7.23987719738617
##$FCOR= 0.5
##$FTSIZE= 0
##$FT_mod= 4
##$GAMMA= 1
##$GB= 0.15
##$INTBC= 1
##$INTSCL= 1
##$ISEN= 128
##$LB= 0.25
##$LEV0= 0
##$LPBIN= 0
##$MAXI= 10000
##$MC2= 0
##$MEAN= 0
##$ME_mod= 0
##$MI= 1.114404
##$NCOEF= 0
##$NC_proc= 0
##$NLEV= 6
##$NOISF1= 3.799351
##$NOISF2= 2.8
##$NSP= 1
##$NTH_PI= 0
##$NZP= 0
##$OFFSET= 14.38212
##$PC= 1
##$PHC0= -5298.097
##$PHC1= 7.62193
##$PH_mod= 1
##$PKNL= yes
##$PPARMOD= 0
##$PSCAL= 0
##$PSIGN= 0
##$REVERSE= no
##$SF= 200.129724274929
##$SI= 16384
##$SIGF1= 3
##$SIGF2= 2
##$SINO= 400
##$SIOLD= 16384
##$SREGLST= <1H.CDCl3>
##$SSB= 0
##$STSI= 0
##$STSR= 0
##$SW_p= 3205.1282051282
##$SYMM= 0
##$S_DEV= 0
##$TDeff= 0
##$TDoff= 0
##$TI= <>
##$TILT= no
##$TM1= 0
##$TM2= 0
##$TOPLEV= 0
##$USERP1= <user>
##$USERP2= <user>
##$USERP3= <user>
##$USERP4= <user>
##$USERP5= <user>
##$WDW= 1
##$XDIM= 8192
##$YMAX_p= 0
##$YMIN_p= 0
$$ End of Bruker specific parameters
$$ ---------------------------------
##NTUPLES= NMR FID
##VAR_NAME=  TIME,          FID/REAL,        FID/IMAG
##SYMBOL=    X,             R,               I
##VAR_TYPE=  INDEPENDENT,   DEPENDENT,       DEPENDENT
##VAR_FORM=  AFFN,          ASDF,            ASDF
##VAR_DIM=   8192,          8192,            8192
##UNITS=     SECONDS,       ARBITRARY UNITS, ARBITRARY UNITS
##FACTOR=    0.0002768,     1,               1
##FIRST=     0,             0,               0
##LAST=      2.2672688,     0,               0
##MIN=       0,             -315841,         0
##MAX=       2.2672688,     345851,          0
$$ Real data points
##PAGE= N=1
##DATA TABLE= (X++(R..R)), XYDATA
$$ [...]
1514A699j134j700R94J509j459j073O51J166m25j792N10K009m17j671L27J400
1530E94O87j389j013K009O72j853k61J154N74j415j298J774J159k318j181J949
1546a56J429j330k009J396K629j521k058J437J647m71j654K58J933r21j884J299
1562B4J125j081j474O67J910q22k457J262K173r18j544L20J668L75j823N9J665
1579A129k75p57k86M77L90q98o15J206k29q61J03K39O51l51r77Q83R60o75k37
1598a23o2Q40K84j235R2J157l80p96k43N92O33j240o10J168K78j085j03P03P83
1617F53o80r15J482N04j225r7P66N62o86j128J037P62j503n42J142K63p40o80
1635a025O00J014r30m76J121K30o24k6L46P45o49o63R58P1p12NJ8N0k5n50L27
$$ plain form
1514 1699 565 -1135 -141 1368 -91 -1164 -513 653 228 -1564 -1054 955 538 -1133 -806 594
1530 594 1281 -108 -1121 888 1560 -293 -554 600 1174 -241 -1539 235 1394 -924 -2105 -156
1546 -156 1273 -57 -2066 -670 1959 438 -1620 -183 1464 993 -661 -403 1530 609 -1275 24
1562 24 1149 68 -1406 -739 1171 349 -2108 -846 1327 409 -1135 -815 853 1228 -595 -536 1129
1579 1129 854 97 -189 288 678 -220 -835 371 142 -719 -616 -377 274 -77 -1054 -171 789 114 -123
1598 -123 -185 655 939 -296 -204 953 573 -223 -466 126 759 -481 -1091 77 355 -730 -833 -130 653
1617 653 -27 -942 540 1044 -181 -278 488 1050 364 -764 273 1035 -468 -1010 132 395 -345 -1025
1635 -1025 -425 589 -341 -817 304 534 -90 -116 230 975 326 -337 621 692 -20 -15 3 53 28 -522 -195
1656a95K7m35M48R9l42M33Q0j02J00LM51m5p33P22K30r51j1M68J05m22q49O38
1678b81Q84j251l03P89M98l17o55P39J016j056n30J138K89j014l38P41O84j137
1696a04q39J206K40j174j14L85N26m30m75Q14L58p49L26N40k02r1k86N53K05p52
1716f3K5K19l49K16j59m20L09j42J58P8m07L72O20n45j28M87J20J30n53L21P13
1737A002j008l69Q00q3p20k44M04O67r81n20J095M01r05j67N96O00l85o15Q12
1756C80N25p84j40M45K8l33n55L92N72j051j21N39j06j46j80L00M52k73o2N60
1776D42l31O3J93k27J56N3l00K87l51l03L82l00k99L54k8P3j78k08P90k02m76
1797d10M61L98j64j03j49N96o3p79K76L60m44j84m2K36J92q94J40P91l29m11L04
$$ plain form
1656 -195 -168 -603 -155 -56 -398 35 115 13 113 116 567 522 -211 511 741 -210 -221 247 352 -70 -919 -281
1678 -281 603 -648 -951 -162 336 19 -636 103 1119 63 -467 671 960 -54 -392 349 1033 -104
1696 -104 -943 263 503 -671 -785 -400 126 -304 -779 35 393 -356 -30 510 308 217 -69 484 689 -63
1716 -63 -38 181 -168 48 -111 -531 -222 -364 -206 -128 -535 -163 457 -88 -216 271 391 521 -32 289 1002
1737 1002 -6 -375 425 342 -378 -622 -218 449 -532 -1052 43 444 -461 -628 -32 568 183 -432 380
1756 380 905 121 -19 426 454 121 -434 -42 530 -521 -642 -103 -209 -355 -535 -235 217 -56 -118 442
1776 442 111 174 367 140 296 349 49 336 -15 -318 64 -236 -535 -181 -209 -136 -314 -522 268 66 -410
1797 -410 51 449 285 182 33 629 566 -213 63 423 -21 -205 -247 -11 181 -713 -573 218 -111 -522 -218
1818b18K21M42m82k44Q76n1n10O9J50Q3j89n79L99J85n76P0l3J42J98n42K53M97
1840A61k77J87J3J4M52k36l86M61J65l75k45j47M46p1p67J60N82l73k63r1O24
1861C4L45p27o1R75j76n62J67M81M50r79m75J024Q1j024n3N10J29o12n04J029
1881E2L31j005P8O30K96l58m13O28O91q54k65P13j99o9m83n7N09j85o06K94J11
1902a61J8k0m06N51K55m64Q9L71J16O7o67L58N46l95m92K97J94l6p82r1R89k27
1924A10q20J77O88J06o60k17J060L06j084J74Q37r3n16m01P19L28j007l19R03
1943B91j79m85k11K84N81o36l56P35K36l09q1J20N21r2o44M42K73k43p9l46L51
1964A73N8o62m2N60k29q2j65J21N82m13k95M89J56k7k29n8O97j99q05M38M13l99
$$ plain form
1818 -218 3 445 -37 -281 595 544 34 103 253 336 147 -432 -33 152 -424 -354 -387 -245 -47 -589 -336 161
1840 161 -116 71 84 98 550 314 -72 389 554 179 -66 -213 233 162 -605 -445 137 -236 -499 -590 34
1861 34 379 -348 -409 566 390 -172 -5 476 926 -53 -528 496 577 -447 -500 10 139 -473 -977 52
1881 52 383 -622 -544 86 382 24 -389 239 930 76 -189 524 325 256 -227 -284 225 40 -566 -272 -161
1902 -161 -143 -163 -569 -18 237 -227 -138 233 349 416 -251 107 653 258 -234 63 257 221 -561 -652 337 110
1924 110 -710 -533 155 261 -399 -616 444 750 -334 -160 677 584 68 -333 386 714 -293 -612 291
1943 291 112 -373 -584 -300 281 -355 -711 24 260 -49 -130 -10 511 419 -225 217 490 247 168 -178 173
1964 173 231 -431 -473 87 -142 -224 -389 -268 314 -99 -394 95 251 224 -5 -63 634 435 -370 68 481 82
1986H2m51k17P76J41j139K51Q79k93n33J19N49N05q56k41J250k36p19J46L43J78
2006E34n87m19P71K2p58k7M33Ok35l75O27L30o15M0N61r9o7o6J08L89n06j32R2
2029B7n9N4l8m09K86J06k54k8k0K65K56m36J68M21j76j74j5M23L11p77j84P61
2051E08n6q46M8L46L16q29j96R51p5q44K03P93%n51k06R66J18r22K66N78l73k55
2073f0k32N93Jr20K12O24m03m26L93J38n4k10L26M84m53o9L95j05q9J16P5o7l62
2096i3k8N49o00l23K89K07l40j24L35L90m10m05Q59K73q27R5O34N7n60k34Q54
2117E98K4j147K29P01l24m84j72Q42q3j029M88R52n22o01O70L88k54n04L77O33
2137G82o14m79O80P0m84k84K58K13n04k20O95k42l47L32M01q7l17K5O79k43n81
$$ plain form
1986 82 -369 -586 190 331 -808 -557 322 29 -504 -385 164 669 -187 -428 822 586 -133 13 356 534
2006 534 -53 -472 299 321 -437 -464 -31 -25 -260 -635 -8 322 -293 -253 308 209 142 76 184 573 67 -65 27
2029 27 -32 22 -16 -425 -139 -33 -287 -315 -335 -70 186 -250 -82 339 163 -11 -26 397 708 -69 -253 508
2051 508 452 -394 -346 0 316 -513 -709 242 167 -677 -474 319 319 -232 -438 528 646 -276 -10 568 195 -60
2073 -60 -292 301 302 -618 -406 218 -185 -611 -218 -80 -134 -344 -18 466 13 -56 339 234 145 261 336 269 -93
2096 -93 -121 428 -172 -495 -206 1 -339 -463 -128 262 -148 -553 306 579 -248 -153 481 538 -22 -256 598
2117 598 622 -525 -296 405 81 -403 -575 267 184 -845 -357 595 73 -528 142 530 276 -228 149 782
2137 782 168 -311 369 439 -45 -329 -71 142 -362 -582 113 -129 -476 -144 257 170 -147 -122 557 314 -267
2158b67P52J89p90j96N11M3l91m44O87J12r02J17Q14j70o24JR10Q5r36K70J264
2179A035p54p10N83M96k51r47L12J016q11o58O67L83o04m07L80P16n29m22P64
2198B59L37p24Q1M07J80n20k37O92rr41L57L89l75m64L58L12j90m99N50L68p46
2219d15J80N23rm60L0O13J36r53K59P01l35o63J70M78j28q19K99Q36o59n57N86
2240a87N73m26m22N11P07n59n69Q48J84p49j59M13L35o20m58O72J08q64K44N56
2260A38k48j45j67P19J1o99M93N78n90j68M23Mj38n88O06K69q59j46P39k15m69
2281d52P0M69N7n91R3R56k92p07M85M37k76m75K75N65m76o63O40K33n93j66K99
2302a12L44n25k75O40J59n65J01L76L8j38j50N50k2n62J38L99l87k63K52K01k32
$$ plain form
2158 -267 485 674 -116 -312 199 242 -149 -593 94 206 -696 -579 235 65 -559 -558 352 437 -499 -229 1035
2179 1035 281 -429 154 650 399 -548 -236 780 -31 -689 -22 361 -243 -650 -270 446 -83 -505 259
2198 259 596 -128 -47 360 540 20 -217 475 466 -475 -118 271 -104 -568 -210 102 -88 -587 -37 331 -415
2219 -415 -235 288 279 -181 -151 462 598 -355 -96 605 270 -393 -223 255 127 -692 -393 443 -216 -773 -187
2240 -187 386 -40 -462 49 756 197 -372 476 660 -89 -248 165 500 -120 -578 94 202 -662 -418 138
2260 138 -110 -255 -422 297 308 -391 102 680 90 -78 345 349 211 -377 229 498 -361 -507 232 17 -452
2281 -452 -382 87 144 -447 -354 602 310 -397 88 525 249 -226 49 614 138 -525 115 348 -245 -411 -112
2302 -112 232 -293 -568 72 231 -334 -233 143 181 43 -107 443 421 -141 -3 396 9 -254 -2 199 -33
2323c3l29J44M73o62J11M72j72l12J90K91L25o14p5R59l55o04K21L17k21m37K4
2344b87N62k01q03N69M62n26j96K14N84l37m90P16L26m63j90M00R0l76l53N11
2364B12J35n83l0L56k39j94J02J60K36n39K24M27j37l17L52N5j21m7R1K42m37
2385e2k9L06n8l59L9J91j35k28n3N44k19m62N64L57l53o5J13M14j93n99M47L35
2407E05o21r8K73P9k88k87L33L33o09j2N13q4k31J6L15J80l42K2M12r3k80O0k9
2430F7K00l48j18J88j2k83L00j28j63K05j7K43j25K9K12n7l24M31Jj09j53J19
2452A58j35o0l02L35J07m14Q0J65J91k02k84M75Qm19J85L97p5j43N8J37K6k49
2474C9r1K39r9k95R2K7Mj84j22M88p9k96K77M2O0k9o4K08k3j03K7J49k98L7p5
$$ plain form
2323 -33 -362 -218 255 -407 -296 176 4 -308 -118 173 498 -116 -191 768 413 -191 30 347 126 -311 -287
2344 -287 275 74 -729 -160 302 -224 -420 -206 378 41 -449 267 593 130 -60 340 430 54 -299 212
2364 212 347 -236 -266 90 -149 -343 -241 -81 155 -384 -160 267 130 -187 165 220 99 52 143 385 -52
2385 -52 -81 225 167 -192 -153 38 -97 -325 -378 166 -53 -515 49 406 53 -12 101 515 322 -277 170 505
2407 505 -116 -214 59 138 -150 -437 -104 229 -380 -392 121 37 -194 -178 137 317 -25 -3 409 316 36 96 67
2430 67 267 -81 -199 -11 -23 -306 -6 -134 -297 -92 -109 134 9 38 250 193 -131 300 301 192 39 158
2452 158 23 -37 -339 -4 103 -311 -231 -66 125 -77 -361 114 122 -297 -112 285 210 67 125 262 288 39
2474 39 -52 187 88 -207 -115 -88 -84 -268 -390 98 19 -277 0 42 102 73 9 217 194 91 118 267 -31 6 -69
2499f9kN0j70L3R4j45L5J79j56J32L7o0J20OJ31J27k33L3Q2k25n3K2n8R5k26k4
2525b45J30q2j32L71p6L4N7jJ3P4j14J23o8n4J55j31R2k02r8J51q6j89J31j9o
2550a72K9l8J20ROJ96P4j56J34j81R8N6j86LJ91k89l9J21j01L3MOL5j58J23J83
2576A01j65J55J06j79J71P4k22K05j77Kr4l4j76K28q7r5K07p8o9j07J23K71q7
2599G3p5J37M0P0r4n2P4L2l15P1Q0j04m0r7P3J44k73J03M9p3J22O3P8M1K4J3J89
2626C53r5j53Oj13J10p3j28MJ8n9J0p7k9K30j85R5J74l2K2n1l5K10m4k15M10j56
2652A97r0J3k00J80k41j74K57Pk95K72oR3m1nJ73J51k19p6J92Oj4k76N4K57k51
2677c6p3m4J68k33J82r7K00k88P8J96L6o9R8o0J07M5j66J17j29Q1r3j00kJ57j26
$$ plain form
2499 -69 -71 -21 -191 -158 -64 -209 -174 5 -151 -19 18 -42 78 84 215 342 109 142 224 -1 -54 -32 -90 5 -221 -245
2525 -245 -115 -197 -329 42 -34 0 57 56 69 143 29 152 84 30 185 54 146 -56 -154 -3 -89 -278 -147 -166 -172
2550 -172 -143 -181 -61 -52 -46 150 224 68 202 21 119 175 -11 -8 183 -106 -145 -24 -125 -92 -88 -82 -47 -205 -82 101
2576 101 -64 91 197 18 189 263 41 246 69 71 -23 -57 -233 -5 -92 -187 20 -58 -127 -234 -111 160 73
2599 73 -2 135 175 245 151 99 173 205 -110 -39 41 -63 -103 -200 -127 17 -256 -153 -104 -177 -55 8 86 127 151 164 353
2626 353 258 105 111 -2 108 35 -93 -89 -71 -130 -120 -197 -226 4 -181 -86 88 56 78 27 -8 202 158 -57 353 197
2652 197 107 120 -80 100 -141 -315 -58 -51 -346 -74 -80 13 -28 -33 140 291 72 -4 188 194 180 -96 -42 215 -36
2677 -36 -109 -153 15 -218 -36 -133 67 -221 -143 53 89 20 118 58 165 210 44 161 32 113 20 -80 -82 75 -51
2702e1k41K25j35J95j80n8K40P7r0j6J57J05n2k11J67K03k75K4o7K0j21r4J41
2725c7J20k36j37J26O6%m1Q9K55q3j88L21r2j08J37j41J08j62q5J16pj84RO9o6
2750a51L7k2J12oo3K94n8j85K68j34q0J16n5P6j27j03m9J46j66k9J13m0m8kJ31
2775b5J85k45K2K39p4j3pL6J12r5k19K52j49j01l0k8J17j39j08K54L2k38K44q
2799A4N8m2p3J99m8m4M0qj55k9%J44j02r8L3J10j40J2N9j41J94j09PK70k00Q1
2825C2J55q4nJ82j79j09r4QR7k4k32K42n1j12L4P6j6Ml2J38J36j45L1J68r7o5
2851E8m8J35P8m15R4P6j00p6L9N2j43O8L4K25m3p9J88j16K58m2j85R3k8k28J80
2876G5kj22k7O7N2n1j18J40o2k05K20j04L6J60N7kJ0j5R2R4l23J7J44j27k3k13
$$ plain form
2702 -51 -292 -67 -202 -7 -187 -245 -5 72 -18 -34 123 228 176 -35 132 335 60 84 17 37 -84 -178 -37
2725 -37 83 -153 -290 -164 -98 -98 -139 -50 205 122 -66 255 163 55 192 51 159 -3 -88 28 21 -163 -154 -85 -151
2750 -151 -114 -136 -24 -30 -93 201 143 -42 226 92 12 128 73 149 22 -81 -130 16 -150 -179 -66 -106 -154 -156 -25
2775 -25 160 -85 -63 176 102 89 82 118 230 135 -84 168 19 -82 -112 -140 -23 -162 -270 -16 16 -222 22 14
2799 14 72 30 -43 156 108 64 104 96 -59 -88 -88 56 -46 -144 -111 -1 -141 -129 -70 -211 -17 -126 -119 151 -49 32
2825 32 187 103 98 280 101 -8 -102 -94 3 -21 -253 -11 -62 -174 -140 -64 -80 -76 -108 30 166 21 52 220 123 58
2851 58 10 145 223 -192 -98 -22 -122 -198 -159 -107 -250 -182 -148 77 34 -45 143 27 285 243 58 151 123 -105 75
2876 75 73 -49 -76 -9 43 -8 -126 14 -48 -253 -33 -137 -101 59 116 114 124 109 201 295 -28 -11 133 6 -17 -230
2902b30J19K2j50J67P3n1j2n5J24J39j91O7J33p4J4M9o0O1k01o2J45o6j20P6M4
2927c9q8J13o7R5q0Q9q8J03J7P6n5m5J43j14L3n6k00J65rk02J82m3j04R0J02j38
2953a20J33j4k6J95j39N1Q4p1J22j91J4O2q2j1L8j32M5n8m4J38m3j12K38r0R4
2978H1j01L0J65K3j10L6J05j89R1j62J8m2o7J2N1l7o9P5J06k4j15N9L07k56N9
3003D6J1%O5J05k22M8o8k2P5Jj05J3q0KN9J59j01P3q6J10J0m6j4L6p4J01o1nJ27
3032A57r2N5j98PJ9q6J15K8r1R7l1M9m5P7K8J63j30j13J38n0l6k9r7O1M0o6m8
3059g8K1m7O1j41L7O6NJ41L0r5J08r1K5J52n3j22J0K9q7J5mr1PN6M6l5n2O9k5
3088d3m7N7J71l1j05j9J88j40j14K67j85o1N6m5Q5k6j28P2n7P5q0J77j52K5K13
$$ plain form
2902 -230 -111 -89 -239 -72 1 -50 -62 -117 7 146 -45 22 155 81 95 144 84 145 -56 -118 27 -39 -159 -83 -39
2927 -39 -127 -14 -81 14 -66 23 -65 38 55 131 76 31 174 60 93 37 -163 2 -7 -209 -27 -70 -174 -84 18 -120
2953 -120 13 -1 -27 168 29 80 164 93 215 24 38 100 18 7 45 -87 -42 -100 -144 -6 -49 -161 77 -13 81
2978 81 -20 10 175 198 88 124 229 40 131 -31 -13 -55 -122 -110 -59 -96 -165 -90 16 -8 -123 -64 243 -13 46
3003 46 57 57 122 227 5 53 -15 -37 38 39 -66 -53 -133 -131 -72 87 -14 59 -27 83 93 47 33 69 -5 96 35 30 157
3032 157 65 120 -78 -71 -52 -138 -23 5 -86 11 -20 29 -16 61 89 252 122 9 147 97 61 32 -65 -4 36 -30 -78
3059 -78 -57 -104 -43 -184 -147 -81 -76 65 95 0 108 17 42 194 141 19 29 58 -29 -14 -18 -109 -102 -46 0 -35 -87 -18 -43
3088 -43 -90 -33 138 107 2 -17 171 31 -83 184 -1 -62 -6 -51 34 8 -120 -48 -105 -30 -110 67 -85 -60 153
3113A53j44J33j63R5J80k22J3Q3j21j08R0o0p5mR5J31j90N9k1K8J67j57R9M4o4
3138D1n5O0M9mj02moO4j88lP7j22J44o0L5P1j09J43O4r8M9J10j11J16j40Q2m3
3165F0r8R4j14K3Mj9r7J70n4oM7o8M0J61j12L2k7M1k1l0O6L7j2k76J60oQ2j97
3193a20lJ07n3j84K43n2o7J8J30J71j35j0J06J62k85k7j0N3l5j28J0J55j97%J50
3218ap2l0P5K3P7j14L2J16j01K1J41r2q7Q2j72K22p3j54L1lk2jk7JQ3p6P2J02
3246E3j23J69pJ16q5j30Q3K4q3J0J04k00J8rON9o9N6Q7j28o5K06m4oq7J19P4o6
3274H2j33J95N1k77kJ05m6j18l5J86j7q8Q9Jm3l7J58J69q7j79K2J75j00j6K7o6
3300A6%j27M3M6q1n7J80j25J38l8kJ02q3j6J00m5k5J32l3j63O3j13J1Q1j99J25
$$ plain form
3113 153 9 142 -21 74 254 32 45 128 7 -101 -11 -71 -146 -150 -55 76 -114 -55 -76 -48 119 -38 61 105 41
3138 41 -14 46 95 91 -11 -15 -21 43 -145 -148 -71 -193 -49 -109 -74 -3 -112 31 95 -3 46 156 45 161 21 103 60
3165 60 -38 56 -58 -35 -31 -50 -147 23 -31 -37 10 -58 -18 143 31 63 36 77 56 26 92 129 117 -159 1 -5 77 -120
3193 -120 -123 -16 -69 -253 -10 -62 -129 -111 19 190 55 45 151 313 28 1 -9 44 9 -119 -109 46 -151 -151 -1
3218 -1 -73 -103 -28 -5 72 -42 -10 106 5 26 167 75 -12 70 -102 120 47 -107 -76 -79 -101 -102 -129 -128 -45 -121 -49 53
3246 53 -70 99 92 208 123 -7 76 100 17 27 131 -69 -51 -60 -54 5 -64 -8 79 -49 -114 92 48 42 -45 74 148 82
3274 82 -51 144 195 -82 -84 21 -25 -143 -178 8 -9 -97 -8 -7 -50 -87 71 240 153 -26 -4 171 71 55 82 16
3300 16 16 -111 -68 -22 -103 -160 20 -105 33 -5 -7 95 12 -4 96 51 26 158 125 -38 25 -88 -77 4 -195 -70
3326g0L9n0oJ5J32j25j69K94O2j93J64m6j2ml5L7L5j00p7J19j07P9j25J10p8K
3352a09J23Q9k44N1J39%O6j42O1N7l4k30K82o0k94K58j28P5p7j11J37N3j18P8
3376g8N0j4l3K14n0O6r9M3j08l8J53r9j13p4J16MK9j78PJ61M3j08M2M3O4j45J8
3403h4J56j98J48NN4j13J0j5R4Jj49R0M6j85j6R3R0n5j05P0J56j28J25l5O2l9
3429G8j10Q0j03Pj0R0j92J89q4m5n0O3j05J28r4J91Pr1O3Q7%p2Q8j61K59j54l8
3456B1R4j11j46O7KJ44j86q7K83k4j16P0K9M0j6j67K10M5k71J02l2O1j1j24J07
3481a6K5n4n1Pj3J63j91Q3O1lK31j24k3K8J3j2M6k01k1J85j15p8Q7j52k1R0K8
3508b8j29J22Q8r%KR9k05Q6Q2r5O3l3m2R1L2k01L6k5k0k3nO3Q9q7R4jL9q0k3K0
$$ plain form
3326 -70 -31 -81 -87 -72 60 -65 -234 60 122 -71 93 47 35 31 -4 33 68 -32 -109 10 -97 -18 -143 -33 -111 -109
3352 -109 14 103 -141 -90 49 49 115 -27 34 91 57 -173 109 49 -245 13 -115 -40 -117 -228 -91 -38 -156 -78
3376 -78 -28 -42 -75 139 89 155 56 99 -9 -47 106 7 -106 -180 -64 -60 -31 -209 -202 -41 2 -106 -64 -21 43 -102 -84
3403 -84 72 -126 22 27 81 -32 -22 -37 57 58 -91 -1 45 -140 -156 -63 27 -28 -133 -63 93 -35 90 55 117 78
3429 78 -32 48 -55 -48 -58 32 -160 29 -55 -100 -150 -87 -192 -64 -158 33 40 -51 12 99 99 27 115 -46 213 59 21
3456 21 115 4 -142 -75 -73 71 -115 -202 81 57 -59 11 40 80 64 -103 107 152 -119 -17 -49 12 1 -123 -16
3481 -16 9 -45 -96 -89 -102 61 -130 -47 14 11 242 118 95 123 136 124 170 -31 -52 133 18 -60 27 -125 -146 -56 -28
3508 -28 -157 -35 53 44 44 46 145 -60 26 108 13 76 43 1 92 124 -77 -41 -66 -86 -109 -114 -51 38 -49 45 44 83 3 -20 0
3539@J23j41l8J58m1j40J09p9ok3O3M6n8o3Q5j6P1O6o9MK29k88K9o0N8j3r7O8
3567b3rL4k2j29N8O0P0j14J43n7j9L2OJ1n5R2J23j23j32K2R2q9Nk3O2l3l9J0Q
3596c9n3K4K46l22J95RO0j12mQ0K7o0L3j6j07J42M9k31l3Q5m1J13j4q9J39r6J5
3623@n9Q4l5R9n5P6j83Q2J04k05J56j23j12K16o3k2J49j91K15j99R0J09r5K0K6
3648H4k8q2M7Rl8R9j23L0J2j96J09M2L5k8mm8qJ98j16m3j0O2J38j52J3k8J04N4
3676A32j07j04J85j01r8J38j76J59j49R7J20j31M5J5l3O0J0o2P8Lj11N8N5m6K1
3701E8QN5p9n1rJ3j2l5r7J71kk7J67j41m5L5K0K7M4k05J35p1K2r3R1K2r0K8l0
3730i1K9N3l6N7j45L6O7J87j91J40M4j52L8k3q3J33j25j5J21r8K1J06m6O6j38
$$ plain form
3539 0 123 -18 -56 102 61 -79 30 -49 -55 -78 -15 31 -27 -90 -5 -21 50 116 47 51 280 -8 21 -39 19 6 -91 -23
3567 -23 -32 2 -20 -149 -91 -31 39 -75 68 11 -8 24 30 41 -14 78 201 78 -54 -32 60 -29 -24 -47 15 -18 -57 -47 -39
3596 -39 -92 -68 178 -144 51 60 120 8 4 84 111 51 84 68 -39 103 152 -79 -112 -27 -68 45 31 -58 81 -15 0
3623 0 -59 25 -10 89 34 110 -73 9 113 -92 64 -59 -171 45 -18 -40 109 -82 133 -66 24 133 38 58 84
3648 84 56 -26 21 30 -8 91 -32 -2 10 -186 -77 -35 0 -28 -32 -80 -88 110 -6 -49 -59 3 141 -11 2 -26 78 132
3676 132 25 -79 106 5 -93 45 -131 28 -121 -24 96 -35 10 25 -8 52 62 0 78 81 -30 28 83 37 58
3701 58 66 121 42 -9 -18 -5 -17 -52 -149 22 20 -7 160 19 -26 9 29 56 100 -105 30 -41 -19 -112 -21 1 -89 -61 -91
3730 -91 -62 -9 -45 12 -133 -97 -30 157 -34 106 150 -2 36 13 -70 63 -62 -77 44 -54 -33 73 27 93 -45
3755d5R1r6P3J34j01J7l7pn2R3K8j23N4n1l3J7K5n3J9m3J51J5j19lJ14l7P8j62
3783e3J11N6j20K0N5K3j13K0Ol3j2NQ1j22J8R5ok1l6K1J93j52j21J89m4p6N6P5
3811A15j18j15J9J70j71J4Q6J4j5J2j75L38j19n5J81j26p0J6j9M6K1j80J36P9
3835H4j95R1QR1j06r4P9L6j39J48J71k11J17r5R1m1l6R2Q0j66N1M0j00p9J10j62
3861a35K01k38K7J71o8o6J06J5M4j9k7LP5j61N0R5j26N0k4pJ01j44Q9Nk31K21
3887GL1m6n4L0J1J00p8J61m2o4j15O6j6Pj35J38j1j11Q4J71o5j51J25p1J26j52
3913e4M0P5n7L9q0J23rm7j38Q4j2j7J4N8m1M4p8L4R2j08k6J71k02J63K5k5j55
3940h7J39q0M8j18J25M5j37J17p1j52J48n6jJ51j64Q7Q3L8j71J62j19Q7j69M9
$$ plain form
3755 -45 46 -50 23 157 56 73 36 29 -23 70 98 -25 29 -22 -55 -38 -13 -66 -47 -90 61 76 -43 -46 68 31 109 -53
3783 -53 58 114 -6 14 69 92 -21 -1 5 -28 -40 -35 46 -76 -58 37 31 10 -26 -5 188 36 -85 104 60 -16 40 115
3811 115 -3 -118 -99 71 -100 -86 0 14 -1 11 -164 174 55 0 181 55 -15 1 -18 28 49 -131 5 84
3835 84 -111 -20 -12 79 -27 -121 -42 -6 -145 3 174 -37 80 -15 76 35 -1 91 171 5 56 96 -4 -83 27 -135
3861 -135 66 -172 -145 26 -42 -108 -2 13 57 38 11 14 89 -72 -22 73 -53 -3 -27 -34 67 -77 12 17 -214 7
3887 7 38 -8 -62 -32 -21 79 1 162 120 56 -59 7 -9 -2 -137 1 -10 -121 -37 134 69 -82 43 -28 98 -54
3913 -54 -14 61 4 43 -37 86 77 30 -108 -24 -36 -53 -39 19 -22 22 -56 -22 70 -38 -64 107 -95 68 93 68 -87
3940 -87 52 -28 20 -98 27 72 -65 52 -19 -171 -23 -79 -80 71 -93 -6 77 115 -56 106 -13 74 -95 -46
3964d6J64l3n1j38N6J27j35o1R6k8K1K8k4K8N3j07J25l9K5l4P8q0Q7q6r0N7L4
3991B7j50J39j00J5J06m0o6J81o2l8o8J9K26q7j22J21M9j11p4J20R3k63K5m4J52
4016D8m3j14N2K02j13j14K29j61o1O2p2P7P1j60M8L0m5J26r9Q0pj11M5J57j68
4041d1MM1n3J42m8j17J61j26J3Q9k5K0P9j68NJ16j28J28j68j1J55m9j1n4n1J20
4067B3k1K2qQj9J1J7J6k3R2r2j2M6m1m6JL8N4j33N9Q9r9N9j79O3K19j12l6L9N1
4097H6o8j02P5J2n8k6P3KQ5j6q0J6j59J56P8n2L0M9j21k7J84j41J8R7r4K1j23
4124h5J39J2q1m5J13k28K20lr7m0J48j03N7O4q6M3Rj8N8j07J16n6j05J70j35L5
4150eJ1j32L1J95j50J8j9R9l4m9K7P2j69J42J36k85J98jj34L8k1m6J77r3rO8j63
$$ plain form
3964 -46 118 85 34 -104 -48 79 -56 -117 -21 -49 -28 0 -24 4 57 -50 75 36 61 27 105 25 112 26 -64 -7 27
3991 27 -123 16 -84 -69 37 -3 -69 112 50 12 -56 -37 189 102 -20 101 150 39 -35 85 178 -85 -60 -104 48
4016 48 5 -109 -57 145 32 -82 147 -14 -75 -13 -85 -8 63 -97 -49 -19 -64 62 -37 43 36 -75 -30 127 -41
4041 -41 -37 4 -49 93 45 -72 89 -37 -24 65 40 60 139 -29 -24 92 -36 92 -76 -87 68 19 8 -46 -97 23
4067 23 2 24 16 24 5 16 33 49 26 118 26 14 60 19 -27 -26 12 66 -67 -8 81 -18 41 -138 -75 144 32 -4 35 86
4097 86 18 -84 -9 3 -55 -81 -8 -6 79 63 -17 -1 -160 -4 74 22 52 101 -20 -47 137 -4 14 111 17 38 -85
4124 -85 54 66 -15 -60 53 -175 45 42 -55 -95 53 -50 7 71 -15 28 37 19 77 -30 86 30 -75 95 -40 -5
4150 -5 6 -126 -95 100 -50 -32 -51 48 14 -35 -8 64 -105 37 173 -112 86 85 -49 -11 -32 -78 99 6 -3 65 -98
4177i8P2R1j34J4NJ15l2j12K5N4M0L9M2j49kl3P9r1j8m7J42K06k56n1R4J3j9J4
4205CMN1j36R9P6r3j8J0L3R7j13%m2M3JL6j03K3N0l3J75j93L6m3j7L1P1k2N0j12
4235c6pK0j20L2J15q7m8J36L1MQ6j40R0ln7oj6KJ1j14J38Pk9P4k6n8K0qk7J02
4265H6p4L7K7j11L9j9j00J56M0j04J2Rj0m9qK5P4j71K0Q0O6n9M1j54J26j6P1n2
4293a8j54J39J00j46K7RJ67j17o4L2O3j25N9P2m6l8R3j4j6j8q5J09M7Lqp9K8j8
4321B%J00l6n7J5j60j1J06K4J7k6N2j9p2J5J4P9l1M6r6%J53j27on2n4J01k6M8
4350aO4j11O0J7j21L9J61k02J43Q5k07O8k9o3J25M7r7m7L8L8r5P3P5o9n9J26j67
4377a09J04n6J16j6qj37K52k5j93Q5l5O1j2kn6L1k8j7N9%j09P5J17m7o0M4M1n9
$$ plain form
4177 -98 -26 65 -69 -55 -50 65 33 -79 -54 0 40 79 121 -28 -30 -63 16 -75 -93 -140 2 208 -48 -99 -5 8 -11 3
4205 3 7 58 -78 21 97 4 -14 -4 29 126 13 13 -29 14 15 51 -52 -29 21 -12 163 -30 6 -37 -54 -23 48 26 76 -36
4235 -36 -43 -23 -143 -111 4 -83 -131 5 36 40 126 -14 76 73 16 10 -6 -4 7 -107 31 38 9 83 57 -1 19 11 -16 86
4265 86 12 49 76 -35 4 -15 -115 41 81 -23 -11 -2 -12 -61 -69 -44 30 -141 -121 -41 25 -34 7 -147 -21 -37 34 -18
4293 -18 -172 -33 67 -79 -52 -43 124 7 -57 -25 38 -87 -28 44 -2 -40 53 39 23 5 -80 29 76 79 71 -8 20 2
4321 2 2 102 66 9 24 -136 -147 -41 -17 0 -26 26 7 -65 -50 -36 43 12 58 -38 -38 115 -12 -18 -70 -124 -23 -49 -1
4350 -1 63 -48 12 29 -92 -53 108 -94 49 134 -73 -5 -34 -97 28 75 -22 -69 -31 7 -88 -15 60 -9 -68 58 -109
4377 -109 -5 -61 55 39 31 -106 146 121 -72 13 -22 39 27 25 -31 0 -28 -45 14 14 -95 -20 97 50 -10 34 75 16
4405A6l9L3r4J26j8m1LM5o3R8j54M2J31k98J72J00j03P1j27J74k0o2OJ79j40r2
4431e5M2L9j6Oq0L4Q2jk6r9N0k8N7n5J63o2mj15R9n8L2j0J71j27q1L7j67K03P2
4460A03j25L7p6k7J67j81J07P3o5J0L5n6JK0Mk4m8l1N1Nm8N0NK5j05l6J64l6l6
4489c7J48k29K93k26L9J28j70J21j47O9J14k8j30OJ67k55Q5J5M7N5k33J19N2l6
4513c3j9L1P9j9j04J23pJ8k21J19JP6n8m3J08M0j16o0R8m4J43j72J55n2l1j3P1
4540G0j50L8Q7j28N2L9q1N1lO2n2J49j49q7P8R6r2R4o7M4Q5m4q4o2l0K6Q2o3p0
4569a09J00J5k9J62r6j73L6j1K9J82j46R3j9j42Q7N3l9R7q3k0J09j52n1J5MJ02
4595A4P8Km8j87Q9rN4Om7P0l4j2n8J44pk00J34mm7J63m1K5j06l3K2P2k04J83q
$$ plain form
4405 16 -23 10 -84 42 24 -17 -14 31 -32 66 -88 -46 85 -213 -41 59 -44 27 -100 74 54 -8 -2 177 37 -55
4431 -55 -13 26 10 16 -64 -30 52 51 25 -74 -24 -52 5 -50 113 51 47 -68 31 -27 5 -5 166 39 -42 -5 -172 31 103
4460 103 -22 15 -61 -88 79 -102 5 78 13 23 58 2 3 23 27 3 -45 -76 -25 -20 -68 -18 -13 12 -93 -129 35 -1 -37
4489 -37 111 -118 175 -51 -12 116 -54 67 -80 -11 103 75 -55 -49 118 -137 -52 -37 10 65 -168 -49 3 -33
4513 -33 -52 -21 58 39 -65 58 51 69 -152 -33 -32 44 -14 -57 51 91 -25 -85 13 -31 112 -60 95 43 12 -1 70
4540 70 -80 -42 45 -83 -31 8 -73 -22 -25 37 -15 134 -15 -102 -24 72 -20 74 7 51 136 92 8 -54 -84 -58 24 -39 -109
4569 -109 -9 6 -23 139 43 -130 -94 -105 -76 106 -40 53 34 -108 -21 32 -7 90 7 -13 96 -56 -107 -92 -88 14
4595 14 92 94 46 -141 -52 -61 -7 -1 -48 22 -12 -24 -82 62 55 -145 -11 -15 -62 101 60 85 -21 -54 -32 40 -164 19 11
4624A1K0J28j97o0J05O8n3K8o6J77j99o5J65r1r2L7J8Q5K5j37R3J14j20J01q5
4649A0p5M1M0q4Q0qlO9j07K7j11J5J12L2j06P1P9Q1k63K7L3O1J0k17J94N8N2j99
4677h1j09L12j36J18k31K2NK1k7J41J8q6K03j71n3L6l2P4L5o1O0J7o1K0j24J3
4703g7J87j55J18o6q3K3M3j6L2M4j42M0kk1Q2n2J21n9p2J12j28R3M6p6R9n8j53
4730a20J36j00P8N4q8l5J12n8N7q5K2l1M1J1L4P9k74R1J9M6l6J7L4k4j89J66P8
4757C5M3j66P3j6J30oj68O6j35P8J57r5N7k5Rp3q0J01l8L5q3J24l7m3P1m4J8O2
4785E0Jp5k9J08q4L1j60O0k9Q8J4O0Qp6NN3p1J4Q4J7q6M9Nl4L4k2K8J2j0K5p1
4816aP7ro9M6j00oJ94j28j68J16J72j16M2j07M3J40j46k2M1mOq7K7R9j45J39J0
$$ plain form
4624 11 31 159 -38 -98 7 75 22 50 -16 161 -38 -103 62 -29 -121 -84 -66 19 44 -93 0 114 -6 95 10
4649 10 -65 -24 16 -68 12 4 1 70 -37 -10 -121 -106 6 38 -68 3 82 163 -100 -73 -40 21 31 -186 8 66 118 -81
4677 -81 -190 122 -14 104 -127 -105 -100 -79 -106 35 53 -33 170 -1 -54 -18 -50 24 59 -2 58 75 14 34 -90 -77
4703 -77 110 -45 73 7 -76 -53 -10 -26 6 50 -92 -52 -54 -75 7 -45 76 17 -55 57 -71 22 68 -8 91 33 -120
4730 -120 16 -84 -6 48 -40 -75 37 -21 36 -49 -27 -58 -17 -6 28 107 -167 -76 -57 -11 -47 -30 4 -20 -209 -43 35
4757 35 78 -88 -15 -31 99 93 -75 -9 -144 -66 91 -4 53 28 37 -36 -116 -15 -53 -18 -101 23 -14 -57 14 -30 -12 50
4785 50 51 -24 -53 55 -29 2 -158 -98 -127 -39 -25 35 43 -33 -28 25 -46 -32 52 69 -17 32 37 3 37 15 43 55 45 70 -1
4816 -1 76 67 -2 44 -56 -62 132 4 -164 -48 124 8 50 -57 -14 126 -20 -42 -1 -5 1 -86 -59 40 -105 34 44
4843D4n4nL6p8K11j82N8o5Jj11J30R4K7j6j82n1KK76j8o5j90K00r6O1q4M6J08
4870I7j13j5J48j80M4N7o5l1J34k19J56J9j27Q0N0rq5K8J5J5p6J13J3m3L2n5k4
4897d1L0mJ38r3q3J09J5j34M0o7P0K8p2KJ27l0j31J49j59m0K22j05J40j59K3O
4923a9p6jJ95k0j22M2O5P0j16k02K05q3J14r0P2N4o5j00K54j71o8L2m2J94p6j48
4949a02J11J25j62j27J59k6M8j6K4K8n4k3Q4k9J4l7p6K00j26j5rn2j42J83J35
4974A15mj55L22k34M6q2K76Q8l81k1K3n9p0qL29m11J58l34N22m34M76l21N04k29
4998A16j74K19q9k95J83K95p00M17L82l84j36J22K37k27L0P0l46K43n6K73m07
5019b27K44q2q1L92j13k44J09J58k3j85J25l5J4J7p6J17Pq1o3J29k8j14J5R3o0
$$ plain form
4843 44 -10 -15 21 -57 154 -28 30 -35 -34 -145 -15 79 106 90 -92 -143 -141 135 117 52 -138 62 -34 27 -57 -11 97
4870 97 -16 -31 117 -63 -19 38 -27 -58 76 -143 13 32 -95 -15 35 26 -59 -31 -16 -1 -77 36 49 6 38 -17 -41
4897 -41 -11 -15 123 30 -53 56 71 -63 -23 -90 -20 8 -64 -62 65 35 -96 53 -106 -146 76 -29 111 -48 -25 -19
4923 -19 -95 -96 99 79 -43 -1 64 134 18 -184 21 -62 52 -38 34 88 23 -77 177 6 -62 -30 -72 122 46 -102
4949 -102 9 134 -28 -155 4 -22 26 10 34 62 8 -15 69 40 54 17 -59 141 15 0 -9 -61 -203 -20 115
4974 115 111 -44 278 44 90 8 284 372 -9 -30 -7 -66 -136 -144 185 -226 -68 -402 120 -314 162 -159 345 116
4998 116 -58 161 72 -223 -40 255 -445 -28 354 -30 -166 -44 193 -34 -4 66 -280 -37 -93 180 -227
5019 -227 17 -65 -146 246 133 -111 -2 156 133 -52 73 38 52 69 -7 110 117 36 -27 102 74 -40 -25 68 8
5044Hp7M1kN0m1m6N6J01m9q0L6k6m1J7P5j10lJ85k47J35P9n9n1O4k1qO0N9m5m1
5074A9pmj7L9r8J60p0p1j14J83J49k17K2%J56k04k8J77k6m5K5Jo3J7m1O8M4qq2
5103c5Q5r2R7j86L9J38o2M9jr3K7J5K4L9j2j01P8N6m3l1qJ4P0J3j23O5k9J24j56
5132c9j3J67n6j25J80m0n1Q7j61J9O0J8j6j4k3M3p8J3KR9J1q6o2M4m7K7P3J4o9
5161b3J05J0o6m6p6J29m8m3j3J45r7j08oJ26j2j18J41Q4j67J92q5P5j62KP9k0
5187bJo5k8J21j35Q7M4MQ0r5R0j23N6NLL4k1j06M8k6J41p5r1R9q5K7KO4o7O5l7
5218A5r6J17k2j41J35o4o3J42N4n5k2p8L8j6N9p0O1K9N0j54J02J5k4Qn5j7O1Q1
5246I0j29M9p2Q6L3k79L10L9j36L2j4o3J16q6j38J94j12L1N9RR4r3j67J54k1J0
$$ plain form
5044 8 -69 -28 -30 20 -21 -67 -11 90 41 -39 -3 -29 -70 -53 22 -88 -91 94 -153 -18 61 2 -49 15 -6 -14 46 105 60 19
5074 19 12 8 -9 30 -68 92 22 -49 -163 20 169 -48 -26 -26 130 -74 -102 75 49 4 29 30 -33 -16 -57 11 55 47 -35
5103 -35 50 -42 55 -131 -92 46 -16 33 32 -61 -34 -19 5 44 32 -69 9 65 22 -9 -17 -3 67 80 -43 22 -7 117 -39
5132 -39 -52 115 59 -66 114 74 23 110 -51 -32 28 46 30 16 -7 36 -42 -29 -27 72 83 -3 -65 -21 -68 -41 32 46 -23
5161 -23 82 92 26 -20 -96 33 -15 -58 -71 74 -23 -131 -137 -11 -23 -141 0 84 -83 109 24 99 -63 -61 18 -2
5187 -2 -1 -66 -94 27 -108 -21 23 27 107 12 102 -21 35 40 43 77 56 -50 -2 -28 113 38 -53 46 -39 -12 -10 54 -13 52 15
5218 15 -81 36 14 -127 8 -56 -119 23 77 22 0 -78 -40 -56 3 -67 -6 23 73 -81 21 36 12 20 -35 -52 9 90
5246 90 -39 10 -62 24 57 -222 88 127 -9 23 9 -54 62 -24 -162 32 -80 -49 10 19 113 20 -147 7 -14 -4
5272dJ34j28l1J32j16j7R1q8K5K7or4R6j35J32m5n7J66j49j3J98j74N3OO5n4o8
5299e4N6L9J0o1jq5R4o4P7j10K5O5J45j94m0J94j8o1m8R9n1r3J68m5j24R5l1r1
5327a04L1J8j3J57l3n4p2RJ09K5j67J66r8k2N2k0p1J37q6L4j3j53J99K6j32K3
5353e2K5J0L5K4l3j81P5OJ68q6M2Q5j25K7l8p7J43j49J63q0M1J9j52R0Q4j30J09
5380D3J02r3NJ34j30j06Lj4q2J72k4o1N9k9R4j55J9L1j68K23k0m2J29j96J03K1
5406A8KM4pQ7k06J44j61M4J03j55K8P6j02J16K2j63J22k4qK10j67N8l7j05J0R1
5432D0j62N3N9m3K1p6O5k3M3j0O9n2J54j25M0q2N9j44J95q8J65j23ll4r8P2o2
5459i0P6o8J17M3j87K18j13K7p3N2N2j33J32l%o0J17j58K21k22m0R5o4lL1J1n9
$$ plain form
5272 -4 130 2 -29 103 -13 -30 61 -27 -2 25 19 -75 21 -114 18 -27 -84 82 -67 -80 118 -56 -3 3 68 14 -54
5299 -54 2 41 51 -10 -11 -96 -2 -66 11 -99 -74 -9 136 -58 -98 96 78 17 -31 68 17 -76 92 47 -77 18 -13 -104
5327 -104 -73 -55 -68 89 56 2 -70 -61 48 73 -94 72 -26 -48 4 -16 -87 50 -36 -2 -15 -168 31 57 -75 -52
5353 -52 -27 -17 18 42 9 -172 -97 -91 77 -9 33 118 -7 20 -18 -95 48 -101 62 -18 23 42 -110 -20 64 -66 43
5380 43 145 52 57 191 61 -45 -42 -56 -138 34 10 -51 8 -21 73 -82 -63 -32 -200 23 3 -39 90 -106 -3 18
5406 18 20 64 57 144 -62 82 -79 -35 68 -87 -59 17 -85 31 53 -110 12 -12 -20 190 23 81 44 -61 -51 40
5432 40 -122 -69 -10 -53 -32 -108 -43 -66 -23 -33 36 -16 138 13 53 -29 30 -114 81 -7 158 35 32 -2 -100 -28 -90
5459 -90 -14 -82 35 78 -109 109 -4 23 -50 2 54 -79 53 50 50 -10 107 -51 170 -52 -92 3 -61 -64 -33 -22 -81
5486h1N93j010k9P43j9m3l5k06J61j55P3j31J64J1K75n96N16j53j81J84m6p1n9
5509i5j9k7K59k4j1M6j34o7OP9O2j5n5K0l4K2m3QJ67k70J72NJ4j61R0O7p7J5r7
5538i7J55J08j55L7K9j05M2j01J51%q0O2q3J03p8m0M1R8j46jO5q6J42k6o5N3M0
5565F3r6J07j57Q9o0n0Q7P9n3j06Q6K1j9J02j22P7mM2r3P2o7J5k3k4J08j88J35
5592B1l1j0PJ4j3J1k26R8J82r4Q8ol0p5J6L5J01r5j52J46J9k2O1r7Q6J6j64J64
5620E0p3m0O2O3j06J84j62l2N4j3M3J84k89Q8M6q2j4O3N7k30N0J46k5j65N4O2
5646b5rM8m4J49j13P2n7j6P1j04j8%%M8k1Rl9R4j27L5J97j98o9K99j60m8K2O2
5674E8m9N9J4j28J07j06J36j22J9MJ6Rl1M1q4l3N4K2K8J0m2Q1k8j29J12nJ1Q6
$$ plain form
5486 -81 512 -498 -527 216 197 154 119 -87 74 -81 -8 -139 25 36 311 -285 231 78 -103 81 35 -36 -95
5509 -95 -114 -141 118 94 83 129 -5 -72 -66 13 75 60 5 25 -9 13 -30 -22 145 -125 47 52 66 -95 -5 62 -15 0 -97
5538 -97 58 166 11 48 77 -28 14 -87 64 64 -16 46 -37 66 -12 -52 -11 87 -59 -60 5 -81 61 35 -30 23 63
5565 63 -33 74 -83 6 -54 -104 -17 62 9 -97 -11 10 -9 93 -29 48 44 86 -7 65 -2 13 -10 -34 74 -114 21
5592 21 -10 -20 -13 1 -12 -1 -227 -129 53 -41 47 41 11 -64 -48 -13 88 -7 -159 -13 6 -16 45 -52 34 50 -114 50
5620 50 -23 -63 -1 62 -44 140 -22 -54 0 -13 30 214 -75 13 59 -23 -37 26 83 -147 -97 49 24 -141 -87 -25
5646 -25 -34 14 -30 119 6 78 21 5 76 -28 -46 -46 -46 2 -19 -10 -49 45 -82 -47 150 -48 -117 182 22 -26 -4 58
5674 58 9 68 82 -46 61 -45 91 -31 -12 -8 8 17 -14 27 -57 -90 -36 -14 14 24 -18 63 35 -94 18 13 24 110
5702A10k14J87j93K03j13n4J78j45J08j20M6ML3j04J34r1j9P1m4j29K16j8l2L8
5726E2j37K2R4Q7p6K74k15J3q2n8K14j67m3KM9r0N1l2m8P5m1N8k7k4J8m3J04m8
5754a8n1J9R1j01Q3K2p4O0K7Pl0j9M9o5l5n0M0M6L3j61M8J33r6J03j60J25K5p8
5782b7j5J61o0o1K3rl4l7N4R8q0K4K4j96R5O9n0m2J32n4Q2k17J61j32K32j64j08
5809a31J32p4K03p7q1J24j57Q3%M5j18J27m7J9r1Q4N7n2l8qJ00m8K8o0l3q4J53
5836E6K3j05RJ30j06l8Q1n9rJ45k14J22p3n3J99r0n1R1m9k5k0LK2Q5p0L3p2Q8
5864E3j4q8J53q6K0n4K3p1J06o3l9O7j2N9m6o1P9k1r0J18q7N1k6N0o2J17j52J31
5892E5n5q7J22p5K8m4K3J17q4q0J21j01k0J0N7j1j2Q2o9M9l7j6j8O9r7J42p3K4
$$ plain form
5702 110 -104 83 -110 93 -20 -74 104 -41 67 -53 -7 -3 30 -74 60 -31 -50 21 -23 -152 64 46 14 52
5726 52 -85 -63 31 118 42 316 101 114 32 -26 188 21 -22 -20 29 -61 -10 -42 -90 -15 -56 2 -25 -49 -31 -74 30 -18
5754 -18 -69 -50 41 -60 23 45 -29 31 58 65 35 16 65 0 -35 -85 -45 1 34 -127 -79 54 -42 61 -99 26 51 -27
5782 -27 -42 119 59 -2 21 12 -22 -59 -5 93 13 37 61 -135 -40 29 -21 -63 69 15 97 -120 41 -91 141 -23 -131
5809 -131 1 -73 130 53 -28 96 -61 22 22 67 -51 76 29 48 -43 41 98 46 8 0 100 52 80 20 -13 -97 56
5836 56 79 -26 -17 113 7 -31 50 -9 -18 127 -87 35 -38 -91 108 18 -33 58 9 -16 -36 -33 -11 74 4 37 -35 53
5864 53 39 -49 104 18 38 -16 7 -64 42 -21 -60 7 -5 54 8 -53 26 5 -85 33 -54 -3 -29 21 -41 76 -76 55
5892 55 0 -87 35 -40 -12 -56 -33 84 0 -80 41 -60 -80 -70 -13 -24 -36 46 -23 26 -11 -27 -45 24 -73 69 -4 20
5920B0j7oJ3N9p7l9j8lj9J49jr4j7J02m6Qp4J8J28r7M0j3J87k85QJ48j32J44L7
5949A23j27R9j63Q9P1o8J5O1q6O5j62rK11j05K3n6P3j16J05j7M4p9l9N8J7j06
5975g9m8J01N0l9J55p4K4n9L5j45P0q3J17K6P7j91M0P4J14l12N7J05K4j38J39
6000D0n9J8j11L23j68L3j30M02m03J52l7J37M72j269O18l90K78N3m7r1J49L01
6022B71J26n78L96K22o33l0N08L06m22rol53N24m93K49J26o3j6L34m58L23j87
6044A37q51P19K21P18o20j009J140L02j396J167j035Q84Q2p89L57l38J54M45l56
6063f8M88l92k07K37q4K29j99N1n6p1J54j69J61j54Q5Q0n6J8q3l2j22J77M8q1
6087d6J15pJ9Q8j02n9k7%n3Q5P4n1q1J59q1Ql9Kl8J4R8K1M1j55m3rP2l2J10j23
$$ plain form
5920 20 3 -3 10 69 -8 -47 -65 -68 -87 62 61 -33 -50 52 6 14 -60 -42 86 -11 29 16 203 -82 -74 74 -58 86 123
5949 123 -4 95 -68 21 92 24 39 100 14 79 -83 -92 119 14 37 -19 54 -62 43 26 70 -9 -48 10 27 -79
5975 -79 -127 -26 24 -15 140 66 90 31 66 -79 -9 -92 25 51 128 -63 -23 51 165 -147 -90 15 39 -99 40
6000 40 -19 -1 -112 211 43 76 -54 348 -55 97 60 197 669 -600 18 -372 -94 -41 -88 -179 -30 271
6022 271 397 -181 215 437 -196 -226 282 588 166 157 151 -202 322 -171 78 204 141 125 459 1 324 137
6044 137 -714 5 226 944 324 -685 455 757 -639 528 -507 377 459 -330 27 -311 -157 288 -68
6063 -68 420 28 -179 58 -26 203 4 55 -1 -72 82 -87 74 -80 5 85 29 47 -36 -68 -190 -13 35 -46
6087 -46 69 62 81 169 67 8 -19 -19 -72 13 87 36 -45 114 33 41 2 4 -34 -20 78 99 140 -15 -58 -67 5 -27 83 -40
6117d0K0l9O6O0KKj43J31m2N0j7j9k21J62K2%N1j41J19J3m9M4MRr5J85j57M2p
6146A2L3p5Q2r5J20o7Kl0m1J58m5j59J35J7o6Q5o8N2M1On1m6j07J00qr5J16K6
6174C2ol8j3L7p6N2P5n6jQ2j07M2K1l3Jm0L0j19J25q5J65j77J46o9Q9r6j30J99
6202E0j06O2K5N6q8k7Q7n7L8J33j73M0N0j07J06L4p5o4P6j37K3j6J46JJ6qkj67
6230h4O2O2J64k53j06J28j02J09k50M21k63J41k12J54R4j69n0J68J43k8r1l04
6252b66O27n11L69m82M37n78O98l87N56k68k54L6M78l56j74K47m4j8j83K26k59
6273a06O84n18O3Q7kk01q7KO02j409R55Q1l57j9Mj17O00o09J6J42L41n59L37N29
6297D59o80J1m0N31j17m17L47k02M57l82q3K9qJ53L62p04K51l20NN61m08r1J95
$$ plain form
6117 -40 -20 -59 7 67 69 71 -72 59 17 67 50 31 -190 -28 -6 -6 45 -96 23 36 -13 31 35 44 -51 134 -23 19 12
6146 12 45 -30 52 -43 77 10 12 -18 -59 99 54 -105 30 47 -19 66 -2 50 91 97 46 0 -107 -7 -15 -110 6 32
6174 32 26 -12 -25 12 -64 -12 63 7 6 88 -19 23 44 11 12 -28 2 -117 8 -77 88 -89 57 -12 77 -19 -149 50
6202 50 -56 6 31 87 -1 -28 59 2 40 173 0 40 90 -17 89 123 48 -16 60 -77 -54 -70 76 77 93 85 83 -84
6230 -84 -22 40 204 -49 -155 -27 -129 -20 -270 151 -112 29 -183 -29 65 -104 -154 14 157 129 38 -266
6252 -266 361 -150 219 -263 174 -404 294 -93 463 195 -59 -23 455 99 -75 172 128 110 -73 153 -106
6273 -106 578 60 123 210 208 7 -80 -78 524 -885 70 151 -206 -225 -221 -338 262 -347 -331 -189 152 -407 -70 459
6297 459 -221 -210 -250 281 164 -253 94 -108 349 -33 -116 -87 -95 58 420 -284 -33 -353 -348 213 -195 -286 -91
6320i1j09M32k66l2k9K04l08L00k08K50N9P0k08rJ41o78P39J22p35N05N05q19
6342a65K95j41k71o8L56l86P18q49P20k95n48R59o04j1q0Q63l30m02L16j85J29
6363B1n40P36l85M1K9n8Q17m53l22K46k17K6L25m98L41J68l41L03m32J95M52l74
6385H0m4k55J22j57J28L9k9o9K69L9l96J27K99J24k57j35L2K14q4o4l5R9j23j24
6409b00J47Lq4L04j05Pj94J6J89r1J91k32R8N1j03qL3J65k37J10K8j75J30j1j3
6434A9o3RM5r5R2k3j05R8k29J46P8n5J15J0j8p7J40j40M7Ql7q4N0ON5NMJ48j73
6463b4j29K31j37J37j26Q3p7j8K11Mj60M0N6P5p5k19K72m80K54p5L41r2M16l53
6487A55o1Q4Q1J65l69l80L19k08P9L87j0K44n17L06J54o24M97l39J49j48L5o5
$$ plain form
6320 -91 -200 232 -34 -66 -95 109 -199 101 -107 143 202 272 64 55 196 -482 257 379 -356 149 654 -165
6342 -165 130 -11 -282 -350 6 -380 338 -511 209 -86 -634 325 -279 -290 -370 493 163 -239 77 -108 21
6363 21 -519 217 -168 -127 -98 -156 661 208 -114 132 -85 -59 266 -232 109 277 -64 239 -193 2 454 80
6385 80 36 -219 -97 -254 -126 -87 -116 -185 84 123 -273 -146 153 277 20 -115 -83 131 47 -17 -52 47 -76 -200
6409 -200 -53 -50 -134 170 65 72 -122 -106 83 -8 183 -49 49 100 -3 -11 22 187 -50 60 88 -87 43 32 19
6434 19 -44 -35 10 -85 7 -16 -121 -23 -252 -106 -28 -83 32 42 24 -53 87 -53 -6 2 -35 -119 -69 -63 -8 -3 1 149 -24
6463 -24 -153 78 -59 78 -48 35 -42 -60 151 155 -5 35 91 166 91 -128 144 -336 -82 -157 184 92 508 155
6487 155 94 178 259 424 55 -325 -6 -214 -135 252 242 486 -31 275 429 -195 302 -37 112 -36 -1 -66
6509f6J20n9M0j29J60j28L4K49k70J55m32K98j18n4L08n84M39j63K89j11nrK21
6532A85n0o4l47R5L51k18k0P8J46j21N2k62J53O74l18k96K1O31q79J93M20l32
6554I2m49K10J26n8R08j006O74m92J64J25R9Q5o21N48j60O51j191r7K47M16n91
6575c20L11j64k38O68l83L37J92p4Jl70O57m42n49O94m22n1N54o74M12j26N43
6596E56k60l52K74P6j43m9K6r1o4q0J66j43O5m4R8j9q4N0J86m54L03j24J4J04
6620A1l14K2J47K06J18m25L34l97l4jL29J307j019j2o90N99p1p19Q0J206j210
6641e33m24P86K96j35m33P54l30l03P69m04J21n43O89M0k85k0J17L13n96N45o73
6662b49j60L42N32o65L08J12n49K30K25r9J59J15j50J64K67l33l34K59k03J6K78
$$ plain form
6509 -66 54 -5 35 -94 66 -62 -28 221 -49 106 -326 -28 -146 -200 108 -476 -37 -200 89 -22 -27 -36 185
6532 185 135 71 -276 -181 170 -48 -68 10 156 35 87 -175 -22 652 334 38 59 690 -189 4 424 92
6554 92 -357 -147 -21 -79 829 -177 497 5 169 294 393 478 -143 405 245 896 -295 -392 -145 271 -320
6575 -320 -9 -173 -411 257 -126 211 403 329 330 -40 617 175 -374 320 -102 -153 401 -273 139 13 556
6596 556 296 -56 218 294 151 102 128 37 -27 -107 59 -84 -19 -63 35 16 -68 -18 168 -286 17 -107 -93 11
6620 11 -303 -281 -134 72 190 -235 99 -298 -332 -333 -4 1303 284 272 -418 181 110 -609 -529 677 -533
6641 -533 -957 -171 125 -10 -443 311 -19 -322 447 43 164 -379 310 350 65 45 162 475 -121 424 -249
6662 -249 -409 -67 465 -200 108 220 -329 -99 126 27 186 301 151 315 582 249 -85 174 -29 -13 265
6683B65m33L82J08l19m7LJ85k63K00j47J95j35K00k75J60k02J05j09J66P2M0Q7
6705B38o2l87j12K39k36m4Q13j014J188j429O16J48J17M68m33K71r54P21j53M58
6725D53r4m84o46J041q28O39k07P1j23O55J46n83K09r69P38n5O25p42n32M61K94
6746F9O56J38Q2j09m20q70L87j62j70N77k40O1J4O4K1q7J61j66J83l03J21j6j15
6769a24K5J58j07Q7q2L2QL2j53L7K7J0p3K64m03L62P0J82l62P5j63k89L03j80
6793b64N40m34L21l39M95p37R7N38n6o27J99P96q50k33O07M55o78LM5K37M4j60
6815aJ83j41O63L64j218K09L33m70j54N33k00j14Lk6l6P5M8j00rkN54j059q9J401
6839G47o74k38n9L33Q9k95N1oL5m27R12j37n31J88m8J64Kk29k6J42L0j85J10j9
$$ plain form
6683 265 -168 214 322 3 -44 -41 144 -119 81 -66 129 -6 194 -81 79 -123 -18 -127 39 111 151 238
6705 238 176 -211 -323 -84 -320 -364 449 -565 623 -806 -190 -42 75 543 110 381 -573 148 -5 453
6725 453 359 -125 -771 270 -558 81 -126 -55 -178 477 623 40 249 -720 18 -37 588 -154 -686 -225 69
6746 69 725 863 945 836 416 -454 -67 -229 -399 178 -62 -1 13 77 98 11 172 6 189 -114 7 -9 -124
6769 -124 -99 59 -48 39 -43 -11 -3 29 -124 -87 -60 -50 -123 141 -262 100 170 352 -10 65 -98 -387 -84 -264
6793 -264 276 -158 163 -176 319 -418 -321 217 161 -466 -267 529 -321 -554 53 508 -170 -167 -122 115 159 -1
6815 -1 182 41 704 1068 -150 59 392 -78 -232 301 101 -13 -10 -36 -72 3 51 -49 -58 -60 494 -565 -654 747
6839 747 73 -165 -224 109 198 -97 -46 -52 -17 -444 468 331 -200 -12 -60 104 106 -123 -149 -7 23 -162 -52 -71
6863g1P8J22k13M4J0P8op4Q6r8J62r0m0R3j17P3j32J91o0n7k20M39L4k30l06k59
6889e63J73p06J615m53m4J92j13l59J98j58M08l20L3Oj11L05Q3J0L1n15K09l1
6911a10k05N18j71M68j079O24r0k48K91m11M03k54J232m74m37j9k81L98j75K13
6931A93l84L15j8k89L78j94J3j15J73%K5p3j50K22j50P4j8q7O1l0J72m2j42J78
6955A12r4r2J6O9P6l8J7Lj17j2J25l4J1l1k0Kp3k2M7Q3k4m2OJ05p7L8k0r4J33
6984E3p4O4r3j4J24j7j27J81j14qO3o6J51l21N71m06k00O55J01q5k81J37j31M86
7008F49n19O4m35O9K99l0J28k97O9N8p1l4M2J29j02p0M6m1rK1Q5L5p9o5O4P7r1
7035hq5P5N1Q7k06O7m6p6P0M6L8k2LK8k9J6m2lJ8K6O6Rj56P8r1Q7M0P4j92J49
$$ plain form
6863 -71 7 129 -84 -40 -30 48 42 -32 54 -44 118 28 -12 81 -36 37 -95 96 36 -21 -241 198 232 2 -304 -563
6889 -563 -390 -1096 519 66 22 214 101 -258 -60 -218 190 -130 -97 -91 -202 103 186 196 227 -288 -79 -110
6911 -110 -315 203 32 500 -579 45 -45 -293 -2 -413 -10 -264 968 494 57 38 -243 155 -20 193
6931 193 -191 124 106 -183 195 1 14 -101 72 72 97 24 -126 96 -54 20 2 -85 -24 -54 118 76 -66 112
6955 112 18 -74 -58 11 87 49 66 69 -48 -60 65 31 42 11 -9 -7 -80 -102 -55 28 4 -38 -32 73 -4 34 14 -80 53
6984 53 -21 43 -50 -64 60 43 -84 97 -17 -25 38 -28 123 -198 373 -33 -233 422 523 438 157 294 163 649
7008 649 130 194 -241 -172 127 97 225 -72 -3 55 -16 -50 -8 121 19 -51 -5 -46 -55 -34 51 86 7 -58 6 83 -8
7035 -8 -93 -18 33 120 -86 -19 -65 -141 -71 -25 13 -9 -6 22 -7 9 -33 -36 -18 8 74 83 -73 5 -86 1 41 115 -77 72
7065G2j19O4n8j1j09K18N9m6j46J22j01P0M8n7P2n6n0R0l8p4M7q1J20j36J16K8
7091D4k8QJ1l0J19op2M0Q0j97qlJ02j63QJ41o0R4p7J02q1lm9J05m8j00Q6j04J38
7120D9o8J32q6j7k0J39L46n25M99n58j89J5N84K68k33k10l00L68j56m43K77j52
7142b80M22J77n4nj86M81j080R33m60K42j19P2k51l51M03M14n53K63k13j16L06
7163D5Q5o4j19N1k4o2J97j87P1Q7r0o5M7M5J5k3J3k5j39J99l9l9qn5Q2M5J7l5
7191B5Knn9jj8R2p8j7O4p5Mj04PL32J90j83j76O1Q8Q1k64J049l74n40j84J177
7217A094r53O9M6J368j809N90K10r45k07O33k0j23K64l69L69j29oj12J38j42o0
7238i4J32o5r3R7o5j5J09n8PR3p7Nr0N8L5P8J7K45k22j19J71m06q5L82l95M93
$$ plain form
7065 72 -47 17 -41 -52 -161 57 116 70 -76 46 -55 15 63 6 78 22 -28 62 24 -50 -3 -84 36 -100 16 44
7091 44 16 24 35 5 124 118 46 86 166 -31 -39 -42 60 -103 -95 46 -14 80 3 105 24 21 -28 77 29 -71 15 -89 49
7120 49 -19 113 27 10 -10 129 475 -50 449 -109 -298 -283 301 569 336 126 -174 194 38 -405 -128 -280
7142 -280 142 319 265 260 74 555 -525 408 -52 190 71 143 -108 -459 -56 358 -195 68 -145 -261 45
7163 45 130 66 -53 -2 -26 -88 109 -78 -7 80 -10 -75 -28 17 32 9 22 -3 -142 57 18 -21 -29 -84 -2 43 60 25
7191 25 27 22 -37 -38 -56 36 -42 -59 5 -70 -66 -170 -163 169 359 176 0 61 149 230 -34 1015 641 101 -83 1094
7217 1094 141 210 256 1624 -185 405 615 -330 -537 96 76 -47 217 -152 217 88 82 -30 108 -34 -94
7238 -94 38 -27 -120 -23 -88 -103 6 -52 -45 48 -29 -24 -114 -56 -21 57 74 319 97 -22 149 -257 -342 40 -355 138
7264A38l75K03k66K60L06L60J41k40l21N6o19K40l40K76M39M2l15q2K31j91n2
7285a09O2O5J0K86l89J26j80J31l2k3k7J24R6p5r9J04O2p9j63K59j52m06R17m90
7309A8l05J86r8r3K49K37j60r1j55J64k37O41k57l63L43o3J22k25J57j55O8j46
7331a63L65n74M42q8k50K51m24J04M21j61M36l59M43P9r08P25K62n27P8j67o9
7352h4l94P03j17j49r1J86K6j6o9r4J13K9j1m2l7N2p0j0N1N2k6P9m8j77K2J23
7378AK1nM9j15m3J72j50JP6J3j9r5N0P3j0Lo4J20k09K0j21j27R64k22p28O86l82
7405d1m6L61l56Q7R2o2m1L4M7m60M12k20O29j066Q94j4l66M24L96j132K46K7J8
7428a37K32p3l10l00P78m69J05n8M34j58jj22j11L36j06j89K15k21J41M9l3rJ1
$$ plain form
7264 138 -237 -34 -300 -40 266 626 767 527 206 262 -357 -117 -457 -181 258 300 -15 -97 134 -57 -109
7285 -109 -47 18 28 314 -75 51 -129 2 -30 -53 -80 44 140 65 -34 70 132 53 -110 149 -3 -409 508 18
7309 18 -287 -101 -199 -292 -43 194 34 -57 -212 -48 -285 356 99 -264 79 16 138 -87 70 -85 -17 -163
7331 -163 202 -372 70 -18 -268 -17 -441 -337 84 -77 359 0 443 522 -386 339 601 74 152 -15 -84
7352 -84 -478 225 108 -41 -132 54 80 64 -5 -99 14 43 32 -10 -47 5 -65 -75 -24 28 2 81 33 -144 -122 1
7378 1 22 17 66 -49 -92 80 -70 -69 7 20 1 -94 -44 29 19 22 -42 78 -131 -111 -232 -359 605 383 -345 341 -41
7405 -41 -87 274 -82 5 97 35 -6 28 75 -385 27 -193 436 -630 264 250 -116 308 704 -428 -182 -155 -137
7428 -137 95 22 -288 -588 190 -279 -174 -232 202 44 43 -79 -190 146 40 -149 66 -155 -14 35 2 -7 4
7451DQ4q8M5k09K71k89j03L15j14J52p6m6P1J8l3l4Q6o6N3j64J24j1m9J43r1q7
7477i4J8J12q0J5N7N4M5k41M3R9J0n2J9j69J40p1NJ14k9p4K30m6lp0n7P1q4qJ31
7506H5j04J55p9j23P0J37j08m4J28j32M6j82M6J89o4m7knl2J03N5p7J8m4J1j8
7532a8o9P1K1k5K6p2M3J8pjQ3q2J12p2k1K6q4Q9l7m7P1j2l4o3Pm9J93j15R5l1
7562A6Ml0O5L4q1J27j14j08R7o4qM1jR5j78J38j20J69J3j46k4J56p8J23j17k9
7588b0Q3k3r0j6J72j70J26J2K8k5j82J91j77K1Q5k6Pj51K43m9j00P8j92K35JM27
7614D88j98j74p19O25j9j36l55K30J57j72N40k80K86l68K76P38o02j018J035J16
7634D50p77L87rQ6n9K3j41P5j35k61K38J3J6M0pJ06n8n9N2M2o5K3k6J2J2jJ03
$$ plain form
7451 4 88 0 45 -164 107 -182 -285 30 -84 68 -8 -54 17 35 2 -32 54 -12 41 -123 1 -10 -59 84 -7 -94
7477 -94 -76 36 -44 -29 28 82 127 -114 -71 28 38 -14 5 -164 -24 -95 -90 24 -5 -79 151 105 102 32 -25 46 -38 -46 85
7506 85 -19 136 57 -66 4 141 33 -11 117 -15 31 -151 -105 84 20 -27 -29 -34 -66 37 92 15 33 -11 0 -18
7532 -18 -87 -16 5 -20 6 -66 -23 -5 -12 -13 70 -12 100 28 7 33 -51 38 1 -46 25 13 -21 -84 -77 -126 67 -48 47 16
7562 16 20 -10 55 89 8 135 21 -87 10 -54 -62 -21 -22 73 -105 33 -87 82 95 -51 -75 81 3 126 9 -20
7588 -20 63 40 -50 -66 106 -64 62 74 102 77 -105 86 -91 -70 15 -11 -4 -155 88 39 -61 17 -175 60 61 488
7614 488 290 116 -603 22 3 -133 -488 -258 -101 -273 267 -13 273 -95 181 919 317 -701 334 450
7634 450 -327 60 51 137 78 101 -40 35 -100 -361 -123 -110 -94 -54 -61 45 -13 -72 -20 22 -43 -20 -46 -34 -22 -23 80
7661H0k12K08k3N33p59k37P30p22K05N92o78L41o2j19P90q31J52O93n93k24L15
7682A79K4m5m87M65L5k11M93p52P1o2L09K80Q8r85J031o90L91k16q1l1J88j0j96
7705b12N1J69j94P4o3K61J98n65J78M7JJ44j35MLk3N3N7o9m8J40J3j21O7Rr7j13
7732a71J31O2k0or2O9j4R9o8J36k18k6M33l65P7J9k6J7Q9l45J10O0K5k6O1K3n5
7759b1o9J23n7N5p8j4l9M8kJ5J8P5j46J14r6J66j55J56j04j12J7j2J73r3O0K9
7785E1k8O1l6q7L5j52J01kM5o0Q6N2p2m7J04j25J33jr3k4O4j5o2m9Q2j9J10Q3
7813A35m5j61K8J2qJ08q9j0lJ5n0Q6r5K5N1J27o0j26M8O0n8pP1j44KJ17M5L1J1
7842A16l03O62l39J38K9l2r15R00q7n7L1j73R1j14J15j12J38j20K06r0j11P1j5
$$ plain form
7661 80 -132 76 53 586 -173 -410 320 -402 -197 395 -283 58 -4 -123 667 -164 -12 681 88 -136 179
7682 179 203 158 -329 136 171 -40 453 -299 -228 -290 19 299 387 -598 433 -257 134 -82 -163 -194 -6 -16 -212
7705 -212 -161 8 -186 -112 -175 86 284 -281 -103 -56 -55 89 -46 -42 -39 -62 -9 48 -21 -69 71 84 -37 30 39 -58 -171
7732 -171 -40 22 2 -4 -96 -27 -41 58 -10 126 -92 -118 315 -50 27 46 20 37 126 -219 -109 -49 -24 -50 11 34 -21
7759 -21 -90 33 -24 31 -47 -61 -100 -52 -54 -39 -21 54 -92 22 -74 92 -63 93 -11 -123 -106 -118 55 -38 22 51
7785 51 23 84 48 -39 -4 -156 -55 -57 -12 -72 14 66 -6 -53 51 -74 59 58 -35 -59 5 -10 -72 -121 -39 -58 52 135
7813 135 90 -71 -43 -31 -39 69 -20 -30 -33 -18 -68 18 -77 -52 -1 126 66 -60 -12 48 -10 -17 54 -90 -88 29 74 105 116
7842 116 -187 475 136 274 303 271 -644 256 169 112 143 -30 61 -53 62 -50 88 -32 174 84 -27 44 29
7865B9p1J26q1m3k9J13m4P0N7j2j81Q1O4m8l6O3m4m8R2o8k2l4J41j35R9p5j7l4
7893h7o0Q4M7J3p7J53p6M2j6m4Po0J42m4j32NJ14n5j9P3l8K9k0L7l0j1j0K7jk0
7923b7N4Rj25R5J7j6j03K03r0K2o1J54j66J58k20J65j45J86m32J58r5K02l03K59
7947a01J05J29l32N86l1l91k10P15l42l02O75p40J58K97l0k22K96m54K64l87J46
7968a71N13p29k49M00O52l49j46J94k17J97M5mj72N7l2%P8q0R2oq5m0O1J5Q3j43
7994c6O5rm5J0J88n7j02l4R2k6J1o1o6J4O0J4Q6p0K1l4R2r0L0j6p7R3k4k5n5K1
8024c0O8j21J23j71J90j55R7k8k32L28k23N9NJ63N5p0j46J07K5p5K2nK1O4o2o5
8050e6J03r7M0M7j62J31o9R8n9M3p5N6Qk4j18Q0Q5J09lj10K7j48Q1o8O9K1LJ64
$$ plain form
7865 29 -42 84 3 -40 -69 44 0 70 127 115 -66 15 79 31 -5 58 14 -34 58 -10 -32 -66 75 -60 39 -36 -53 -87
7893 -87 -147 -63 -16 -3 -80 73 -3 39 23 -21 -14 -74 68 24 -108 -103 11 -44 -63 10 -28 1 -19 18 -12 -23 -33 -6 -7 -27
7923 -27 27 36 -89 6 23 7 -96 107 17 39 -22 132 -34 124 -96 69 -76 110 -322 -164 -259 -57 -360 -101
7947 -101 4 133 -199 387 356 -35 -245 470 128 -174 501 -239 -81 216 186 -36 260 -194 70 -317 -171
7968 -171 342 -387 -636 -236 416 67 -79 115 -102 95 140 136 -36 21 -11 -11 67 -13 79 73 -12 -52 9 24 107 -36
7994 -36 29 20 -25 -15 173 116 14 -20 72 46 57 -4 -70 -56 4 18 104 34 55 21 113 23 53 37 -40 53 29 4 -51 -30
8024 -30 38 -83 40 -131 59 -96 1 -27 -259 69 -154 -95 -90 73 128 58 -88 19 44 -31 -9 -14 7 71 9 -56
8050 -56 47 -50 -10 37 -125 6 -63 35 -24 19 -56 0 8 -16 -134 -54 31 140 137 27 54 -94 -13 -81 -12 9 12 176
8078A76j62K6j42J87q7P4m5q9j4J21L6j26N3R0j38Q2l2p0O0L2p3J10p3pk2qn4
8105i5J05k3k0O9l0j51L10J8l71j3O20o45J06J98M44J48j160R68m24M33n89k24
8127c26m6O88n69L19j90K00%j23K4l4oO6R8m7mpq9P6QJ5m8J03q3ol7J38p2kl0
8156A6l4r6m6K12k1j08J01m5M1J01j82N1M5j29K17m87K39n18R78K80q87N26J05
8179C59n53Q14l68q5L25n99K08j44R8K11n00m09
$$ plain form
8078 176 14 40 -102 85 -2 72 27 -62 -76 45 81 -45 8 98 -40 42 10 -60 0 32 -41 69 -4 -11 -33 -41 -95
8105 -95 10 -13 -33 36 6 -145 165 183 -188 -201 419 -226 -120 78 522 670 -490 478 54 487 -102 -326
8127 -326 -372 316 -253 66 -124 76 76 -47 -23 -57 -63 3 101 54 50 43 -46 30 38 53 5 108 25 19 -18 120 48 46 16
8156 16 -18 -114 -160 52 31 -77 24 -21 20 121 -61 -10 35 -94 123 -364 -125 -643 335 615 -272 254 359
8179 359 -194 620 252 167 492 -107 101 -43 55 266 -234 -643
8191f43
$$ Imaginary data points
##PAGE= N=2
##DATA TABLE= (X++(I..I)), XYDATA
0@%%%%%%%%%%qJ6j6J6k4L2m0M8n6P2q8J04j20J44j73K00k35K72l12L60m11M69
32B50n33O04o84P68q64R71j083J208j346J498j661J840k038K250k485K742l020
49a583L328l668M041m452M911n425O003o660P412q281R300j0519J2007j3864J6264
64H814j9505K4136l1344M4190p3894K64912P1816o04966M8212M00684Q8191l31178
76a09932n5772K23659R9194j35099o0660k9934m5650P0407K06176n644k39945
87h3200q4361K12192Q2583j83467q5476J75051J11800r4112j01911P57j3839R721
99e4262J22192O3684j45544j04713J22029J01554j33026j18972J33277J61264
109A47483o7257j32547o167L0289J12M8135N2412o0902o9612P9539O2793j39634
$$ plain form
0 0 0 0 0 0 0 0 0 0 0 0 -8 8 -8 8 -16 16 -24 24 -32 40 -48 56 -64 80 -93 107 -128 144 -168 192 -219 250
32 250 -283 321 -363 405 -459 512 -571 637 -709 789 -872 968 -1070 1180 -1305 1437 -1583
49 -1583 1745 -1923 2118 -2334 2577 -2848 3155 -3505 3907 -4374 4926 -5593 6414 -7450 8814
64 8814 -10691 13445 -17899 26291 -47603 217309 289125 -315841 -267629 133055 221246 -109932
76 -109932 -165704 57955 157149 22050 -38610 -68544 -114194 -43787 162389 156745 -83200
87 -83200 -167561 44631 127214 -56253 -141729 33322 145122 51010 -50901 -50144 -63983 -54262
99 -54262 67930 131614 -13930 -118643 3386 104940 -28086 -147058 -13781 147483
109 147483 80226 -52321 -58488 -28199 -28087 20048 72460 11558 -58054 21485 84278 -55356
121e5356r9996J69522J54338j36181j53790J15366J14865j58668j15889K02650
131C6861J60168j83188j73584J48645J50938j54065j52795J56735J79205j02002
141F6918j60517L3373Q2804k7357k0862N9028L250o2918K2623N3267p6087q4525
153a11003R9685J38030o3600j42921L1605J05283m7292q7973O4525R6163m3591
164C8911p9374K5929L2659n6192j4743R0234L3594p5475l4388M5121J082n1092
176d3734J9927P2898q784n5266J2298J8323n0902j7122Q0085L9933p6703l5194
188d4241P8732O540j15562r860J46160M6814j35133o5972J14701N7490j16002
199c6333o0486J11431Q4382o5863q1334J2989L5159q57J0394J1679l1017p435
$$ plain form
121 -55356 -155352 14170 168508 32327 -121463 -6097 108768 -49900 -165789 36861
131 36861 197029 13841 -159743 -11098 139840 -14225 -167020 -10285 168920 66918
141 66918 -93599 -60226 22578 -4779 -25641 33387 36637 -26281 -3658 49609 -26478 -111003
153 -111003 -11318 126712 63112 -79809 -48204 57079 9787 -78186 -13661 82502 38911
164 38911 -40463 -14534 18125 -38067 -52810 37424 71018 -4457 -38845 6276 7358 -43734
176 -43734 -23807 49091 40307 -14959 -2661 15662 -35240 -52362 27723 67656 -9047 -44241
188 -44241 34491 41031 -74531 -84391 61769 108583 -26550 -92522 22179 79669 -36333
199 -36333 -96819 14612 98994 33131 -48203 -35214 -55 -912 9482 21161 -9856 -17291
211a7291N1944O05q9959k9564J08055P5305q3634q5054N2805O1360m5683m6727
223d7838M4974M7617k8124k6903J9983j4654m4639K9612P3473q753p2736r224
235c7212N5292J815n1772K380M8915J1600j8885j0401j6495k3210K1574N8722
247D2323k754o6592l522O5212j856p7422j2455Q2651L8402o1707m0819L4008J5968
260A1437k8047l22L3258N471k4314k58J2965k2550j9139L3948L1999j9527k6112
273a1191Q338P461k1618l080L4645P644k9812K04K4800j5413m0198J3634N8232
286C3646L839n2191r305L7190J390l4521k289L6579J4136k2494j3226O74q280
299a4852L819K2021L855j8797l152J8920m348l3746J001M2606J2293k8962j3138
$$ plain form
211 -17291 34653 35258 -54701 -84265 23790 99095 15461 -69593 -16788 44572 -1111 -47838
223 -47838 -2864 44753 16629 -10274 9709 -4945 -49584 -19972 53501 44748 -27988 -37212
235 -37212 18080 19895 -31877 -29497 19418 31018 12133 1732 -14763 -37973 -16399 42323
247 42323 39569 -27023 -30545 34667 32811 -44611 -57066 25585 63987 2280 -38539 -4531 11437
260 11437 -16610 -16932 16326 21797 -2517 -2775 10190 -12360 -31499 2449 34448 14921 -11191
273 -11191 -2853 4608 -17010 -20090 14555 22199 -7613 -7409 17391 1978 -38220 -24586 33646
286 33646 37485 -14706 -24011 13179 14569 -19952 -22241 14338 28474 5980 -7246 -6572 -14852
299 -14852 -11033 10988 14843 -3954 -7106 11814 7466 -26280 -25279 17327 29620 658 -12480
312a2480J5414K012j9638K591K7298J360j9676J465Q088j4086j4939J6901K6993
325B1303p294k3079L048R495r739o225J2558J2236l599o809K057p513j3940J1176
339f325K2230l188j7029J5J1755p465j9939Q519K5859j67j6699l214O129l046
353b565q120P346J4721k200p901J072l927q408K633J2853N949q969n666N664m254
368a772j0449M589J2372L923n110l776L05o545n022J2712J1656o968r053K973
382a65O245o421j2736N667J7057M286q872j2860n872R010J0856o07j0188k965
396g565J5376Q465k0434j9042J2646K7546N509k2967j5297J1836J2634m262j0841
409f396k882J1055J1434l724j5871j3398P361K3966O810j8555j4167Q788J7590
$$ plain form
312 -12480 2934 4946 -14692 -12101 15197 16557 -3119 -1654 6434 -7652 -22591 -5690 21303
325 21303 14009 -9070 -6022 3473 -6266 -12491 67 12303 8704 1895 3952 -3561 -17501 -6325
339 -6325 15905 12717 -4312 -4297 7458 -7 -19946 -11427 14432 14265 -2434 -5648 481 -2565
353 -2565 -10685 -3339 11382 9182 1281 2353 -1574 -9982 -7349 5504 11453 2484 -3182 2482 -1772
368 -1772 -12221 -7632 4740 8663 3553 -223 82 -6463 -11485 1227 12883 5915 -3138 -165
382 -165 6080 -341 -13077 -7410 9647 13933 5061 -7799 -13671 -4661 6195 5588 -4600 -7565
396 -7565 7811 16276 -4158 -23200 -10554 16992 22501 -466 -15763 -3927 8707 4445 -6396
409 -6396 -9278 1777 13211 9487 -6384 -19782 -12421 11545 18355 -200 -14367 -5579 12011
422A2011k981k0626k762K0375J4164r424k1606n699J4996J0577l406p098l077
435d556M147L629l276n031l311N170J3392K801j3296j2161L425J4891M632j0288
449A68l160N803k86m176o44K105l134m157J3190J3690j8490k8094Q861L7454R385
464B8515l7302k2530L2443L1545k1155l9082K950L9853J6354k6172k4545K839
476a6287J7085J4018l852j9480j1543J5957K9018n289m3916j4161M4681L8412
488D4643k6209n3261K451N3042J6718m1702k9809K4037L8431m124l6151j4240
500b6174J7422K0714N309j3663j8430r25J9565J7322j4927l1716O304M1778J0993
513C3572m0211l0210K9000M0734j7068l9672Q825L4515l640l2872j279L0919J406
$$ plain form
422 12011 9030 -11596 -14358 6017 20181 10757 -10849 -16548 -1552 9025 5619 -1479 -4556
435 -4556 -409 3220 -56 -5087 -8398 -3228 10164 12965 -331 -12492 -9067 5824 10456 168
449 168 -2992 2811 2525 -1651 -2295 -190 -3324 -7481 5709 19399 909 -27185 -18324 19130 28515
464 28515 -8787 -31317 1126 32671 11516 -27566 -24616 15237 31591 5419 -19126 -16287
476 -16287 798 14816 10964 -8516 -20059 -4102 24916 19627 -24289 -38450 6231 44643
488 44643 18434 -34827 -32376 20666 37384 -4318 -34127 -10090 28341 24217 -11934 -26174
500 -26174 -8752 11962 17271 3608 -14822 -15747 3818 21140 6213 -25503 -19199 22579 33572
513 33572 -6639 -36849 -7849 32885 15817 -23855 -15030 19485 15845 -17027 -18306 12613 14019
526A4019k8861L006K9492l095l4071l854L7311J3473l2905j6307K4280J5062j6327
539A223j3046J0332P795q605K797J2444j4119k3698J4326L5833l013m3223j1489
552c2443M4003K4704l6026l5842K0297M3966R42m0043j7810K2485K3926k059k0287
565d187j2275R125J7114O610j5120k4371L671L4608J6673l0040l7705J5290N0557
578B9950L143n1159k0060M4200L5777l1781m5734J6208M3317l583l2147k823K0955
591F263J189j6272M171J4102j0130j2246J5279J4981j6111k1153J3549K5443q906
604A0159k2478O335J6211o176j3379O413J2869q974j3174J2330J3254j3251j6836
617a6697Q422K1236L69j9792o367J2736R039k530r212n139O510R956J231j0875
$$ plain form
526 14019 -14842 -11836 17656 14561 -19510 -23364 13947 27420 -5485 -21792 2488 17550 1223
539 1223 -11823 -1491 6304 -2301 496 12940 -1179 -24877 -10551 25282 22269 -20954 -32443
552 -32443 11560 36264 238 -35604 -15307 28659 29601 -10442 -28252 -5767 18159 16100 -4187
565 -4187 -16462 -7337 9777 16387 1267 -23104 -19433 15175 31848 1808 -35897 -20607 29950
578 29950 33093 -18066 -38126 6074 41851 10070 -35664 -19456 23861 20278 -11869 -14692 6263
591 6263 7452 -8820 -4649 9453 -677 -12923 2356 17337 1226 -19927 -6378 19065 10159
604 10159 -12319 -5984 10227 4051 -9328 -2915 9954 980 -12194 136 13390 139 -16697
617 -16697 -8275 12961 13330 -6462 -12829 -93 8946 6416 -2796 -7935 -1425 8531 9762 -1113
631a113j2845N755J8216M030j5163j5108N520K2611N020k2802j6977J6740K9980
644B3864m015l7014r930L3923K1754k2607k8320J0425K8757j654k3386n795J1811
657b187R296n28o082o549l313Q100J2975n868j7628K741J8806L646j6805j0222
671a3618J2676J2246o194q228m20J741K519K055j528n538j959R347N719j1284
685b466q516Q458J0714k521j0360j51R020M67n736j283J843K809R25k840k641
700b278m89K708K405m034j753N533N27n487q87M877K974n261k591P532J974q420
716b670k252O611L913m953n366M662M402m894l724K161K865J193j828j906O5R33
732g88K957j33n162J354O742j31p015l348O401N719o054n522M522L572k470l844
$$ plain form
631 -1113 -13958 -8203 10013 14043 -1120 -16228 -10708 11903 16923 -5879 -22856 -6116 23864
644 23864 19849 -17165 -27095 6828 28582 5975 -22345 -11920 16837 15183 -8203 -13998 -2187
657 -2187 7109 6581 499 -6050 -9363 -1263 11712 5844 -11784 -9043 9763 13409 -3396 -13618
671 -13618 -942 11304 5110 -3118 -3538 -1797 722 2777 1249 -4289 -6248 3099 8818 -2466
685 -2466 -10982 -2524 8190 5669 -4691 -4842 4178 4645 -1091 -2374 -531 2278 3203 363 -2278
700 -2278 -2767 -59 2346 -1688 -3441 2092 2619 -2868 -3755 1122 4096 -1165 -3756 3776 5750 -2670
716 -2670 -4922 1689 5602 649 -4717 -55 4347 -547 -4271 -2110 755 1948 120 -1786 -1721 -788
732 -788 2169 2036 -3126 -1772 4970 4839 -2176 -5524 877 6596 542 -4980 -458 3114 644 -3200
748c200P8L773K83j595J525j081k173K048K137O9j815j029K894M55l125J53K35
765c68l4K170m01k667j790J084M182o38n472J601N347m78m161j507L832L208l406
782E02j444K482n81j359P1M10O01j341m11J963j497j454J512k18J65J209K41o84
800A67j987J077M209j635m396K012M144m38m929k566N319K801m605k077J757J930
816G83R9k555n83K012J085J280j218l758J896M287p90l612j189M060K616n254
832h41k995L495K065j057j830o09J340l25M19J598k671j332M538K059l339l981
848c466J836O019p43n698P4K920Q79r12k683o54J530J868J492l640l972M215M931
865C996k371m720P33N241R17n266j17L188q92o84J481j10k891j794M066L016n459
$$ plain form
748 -3200 -3122 651 934 -661 864 -217 -2390 -342 1795 1864 49 -980 1914 2369 -756 -603 -368
765 -368 -402 1768 1367 -1300 -3090 -2006 2176 1538 -3934 -2333 3014 2536 -1625 -3132 700 3908 502
782 502 -942 1540 959 -400 -329 81 682 -659 -1070 893 -604 -2058 -546 -764 -599 610 851 167
800 167 -1820 -743 3466 1831 -2565 -553 3591 3153 -1776 -4342 977 3778 -827 -2904 -1147 783
816 783 882 -1673 -2256 -244 841 2121 903 -2855 -959 3328 2538 -1074 -2263 1797 4413 -841
832 -841 -3836 -341 1724 667 -1163 -1772 -432 -757 -338 1260 -1411 -2743 1795 3854 515 -3466
848 -3466 -1630 4389 3646 -2052 -1978 942 1821 909 -1774 -2428 -898 970 2462 -1178 -5150 -935 3996
865 3996 1625 -3095 -2362 2879 3796 -1470 -1587 1601 709 25 1506 1396 -1495 -3289 777 3793 -1666
882a666l035M678K656k395k726J088K527r95M95K657l417l818M447M801k936o829
898d468P29Q116J79p325j676L274K755N09k280k522o97L502N431l695q219L547
914b840R263p15q700k593P467L343n939j163K755k410q65M418J246o428m169R013
930A683P242r993q371Q785Q602n153q221L731P555m456n331N574K329o478j891
945d393O852L329q315n484Q426N792o221m669K710L727Q9j768L34j223j356M795
961B625K781n717m313K943N185N57n319l319J666M099M492m380j0525K605J4523
976G903K485j5397q498J5028J3211j2607j3452Q595J1145m393q248L119L776o187
990c520N16J0886l695j5904K944J9487J350k2063n885K3233Q916j9861j0364J4912
$$ plain form
882 -1666 -4701 -23 2633 238 -2488 -1400 1127 132 627 3284 -133 -3951 496 5297 2361 -4468
898 -4468 -3739 4377 4556 -2769 -4445 -1171 1584 2093 -187 -2709 -3406 96 5527 1832 -6387 -2840
914 -2840 6423 5708 -2992 -5585 1882 5225 -714 -1877 878 -1532 -2397 2021 3267 -3161 -7330 1683
930 1683 8925 -1068 -9439 -654 7948 2795 -5426 -1695 5860 1404 -3927 1647 3976 -2502 -4393
945 -4393 2459 5788 -2527 -8011 415 6207 -14 -4683 -1973 1754 1843 75 409 -814 -2170 2625
961 2625 5406 -311 -4624 -1681 3504 4061 -1258 -4577 -2911 1188 5680 1300 -9225 -6620 7903
976 7903 10388 -5009 -13507 1521 14732 2125 -11327 -2732 8413 4020 -4228 -1109 2667 -3520
990 -3520 -3004 7882 4187 -11717 -8773 10714 12064 -9999 -15884 7349 16265 -3596 -13960 952
1004I52J0674j0085q730Q056M459q106l08Q450k824r534K157J1310p49j2860l20
1019g458J1752J541p691k528M465L253k146j678P83l94N91J500k254n92K348j526
1035c4l240K459N360k769r923L063J4068k601j5735P62J6233K954j5786m743J5013
1050E081L792j2537j267R971k009r786M414J2045p752j5951J0122J8545r374k0241
1064a4947O192K1477k374k0807J004J7720l50j2610P93Q226k297o194N233N824
1078F890r793o067J1586O235j1065p648R082R207p269q300N516N638k582j898
1092d68M73m68J6K661J108n418k083P506J546q798r47P893P25p864q78R302j71
1109D135j0304K373J0068l040r002L309R537l893j0101N552R670p670q645Q352
$$ plain form
1004 952 11626 1541 -7189 867 5326 -2780 -3088 5362 2538 -6996 -4839 6471 5722 -7138 -7458
1019 -7458 4294 5835 -1856 -4384 81 3334 1188 -490 293 -101 490 1990 -264 -856 1492 -34
1035 -34 -3274 -815 4545 1776 -8147 -5084 8984 6383 -9352 -8590 7643 10597 -5189 -9932 5081
1050 5081 8873 -3664 -4931 5040 3031 -6755 -2341 9704 1952 -13999 -3877 14668 5294 -14947
1064 -14947 -8755 12722 10348 -10459 -9455 8265 7915 -4695 -3902 4324 2027 -4167 1066 6890
1078 6890 -2903 -8970 2616 8851 -2214 -9862 -780 8427 1158 -7142 -1626 4012 1430 -468
1092 -468 5 -463 -447 2214 3322 -2096 -4179 3327 4873 -3925 -4872 3021 3746 -4118 -4996 4306 4135
1109 4135 -6169 -3796 6272 3232 -5770 -2461 7076 3183 -6918 -1366 8304 634 -8011 341
1123C41P975q962r048R306R716j0468q781J0523P367q992o236Q495N568q680l625
1138e501J0043J055j0486O53J0398j286j1036P26J1572j363j1496K022R656k264
1152B693p538K424O538k971n569N140M250o664k244P436J425p709j578Q081J285
1167D999r594q1R229j418q357J742P394j562p386K676P591m406n850N623M631
1182E231n713m053O175M322p552m122Q576K289q605j492P705J062p590p81Q362
1197C814q46q292L023P889l753p180L881Q010m105q483N047P866o127o185N309
1212a32M851n137m778N732L911p251k181P843R34p106p05P125J255p497j31P737
1228D470j392o649K435N221l000n214L147N751m824n724N646M761n555l798M755
$$ plain form
1123 341 8316 -646 -9694 -388 9328 -1140 -9921 602 7969 -1023 -7259 1236 6804 -1876 -5501
1138 -5501 4542 5597 -4889 -4236 6162 4876 -6160 -5434 6138 4775 -6721 -4699 4957 2693
1152 2693 -4845 -2421 4117 1146 -4423 717 4967 -1697 -3941 3495 4920 -2789 -4367 3714 4999
1167 4999 -4595 -4676 4553 3135 -5222 -3480 3914 2352 -5034 -2358 5233 827 -5023 600 5231
1182 5231 -482 -4535 1640 5962 -1590 -5712 2864 5153 -3452 -4944 2761 3823 -3767 -4548 3814
1197 3814 2968 -5324 -2301 5588 1835 -5345 -1464 6546 2441 -6042 -995 6871 744 -5441 -132
1212 -132 4719 -418 -5196 536 4447 -2804 -4985 2858 3792 -3314 -4019 3106 4361 -3136 -3267 4470
1228 4470 3078 -3571 -1136 4085 1085 -4129 -982 4769 -55 -5779 -133 4628 -927 -4725 30
1243C0L946m556l279N589J955n790K20N351r96n251R80N861j620p067K581O360
1259D314l583n418L339M902l152n038M116M971n074l568N848K589m984k517N070
1274A815K407n760j811O109j1n804P50M733q36n164J097N803j962n667L218M897
1290C814l048l926K852M186l132m189M363L032n032k132M587J738m674k309M961
1305A091J955n360j027M837K59l560R2L499L2l814J344L778k485l070K910K328
1321B809k674k843K649K944l631k600L920J330l432o59K972Q30k895m87L808n20
1337A521l519J938K774j944k708J609L197k279l856L011L099l616k369L034K062
1352A954k429k484L294K362m037j036M168Q28l477r73L273J559m093j242M030
$$ plain form
1243 30 3976 -580 -3859 1730 3685 -2105 -1885 3466 2470 -2781 -1801 4060 2440 -4627 -2046 4314
1259 4314 731 -4687 -1348 3554 402 -4636 -520 4451 -623 -4191 1657 4246 -738 -3255 1815
1274 1815 4222 -1538 -3349 2760 2749 -3055 -2305 2428 1592 -3572 -2475 3328 1366 -4301 -1083 3814
1290 3814 766 -3160 -308 3878 746 -3443 920 3952 -1080 -3212 1375 3113 -1561 -3870 1091
1305 1091 3046 -2314 -3341 1496 1755 -1805 -1713 1786 1818 -1996 -652 3126 641 -2429 481 2809
1321 2809 135 -2708 -59 2885 -746 -3346 574 1904 -1528 -2187 785 1615 -1280 -1767 2041 1521
1337 1521 -1998 -60 2714 770 -1938 -329 2868 589 -3267 -256 2843 -773 -3142 -108 1954
1352 1954 -475 -2959 335 2697 -1340 -2376 1792 2620 -857 -1830 1443 3002 -1091 -2333 1697
1367A697n9k959j16J955J18k041j13K453n93k225J698J414j052p69N63J262n52
1384F81j377J505J78j739P60J001r38j294K55J907m68k612J167K132j242r17Q29
1401a72Q39l43j050J434J070k291o25K524N05k279j536K073K126k607k147K224
1417b55J373j284j168N70J479n23j052J355L66j144K60P28L51o32j280Q62J162
1434A168j017r66j18O56Q51r68r69Q72P20%m42n07J274L25j175N17P42m96o41
1453a74j30J301J24k221j32K111R9j791j152J518J726j490j513J704R76q57o29
1470e30O28J302j068j220J792R03k186j093J425J965j475k994J326L038j159k534
1486a880J61K457Q79k647l69K608k3j522M1J282K82j808l99K394j86k820J83K047
$$ plain form
1367 1697 1638 -1321 -1437 518 636 -1405 -1518 935 342 -1883 -185 1229 177 -592 -29 1233 681
1384 681 -696 809 987 -752 8 1009 71 -1223 -968 939 471 -2141 -974 1158 -84 -1001 -172
1401 -172 667 324 -726 708 1778 -513 -1138 1386 1891 -388 -1924 149 2275 -332 -2479 -255
1417 -255 1118 -166 -1334 -764 715 192 -860 495 861 -283 -23 705 1056 424 -856 6 1168
1434 1168 151 -815 -933 -277 574 -394 -1363 -491 229 229 -213 -720 554 879 -296 221 963 467 -174
1453 -174 -304 997 1121 -1100 -1232 879 978 -813 -1965 -447 1279 -211 -1724 -20 956 99 -530
1470 -530 98 1400 332 -888 904 1807 -379 -1472 -47 1918 443 -2551 -1225 1813 654 -1880
1486 -1880 -1719 738 1617 -1030 -1399 1209 1186 -336 -295 987 1269 -539 -938 1456 1270 -1550 -1367 680
1504F80N11k115j286K205J751k345j081J636J290q26j545J022J901j339j270J120
1520C09Q36m28j742J74K124o85k188M75J580J39j425p91J999P49j847k49J754
1537G84M38j051j124J595J383k311j140J890J176j764j856J216K480j606k507
1552b397J688J928r44j540N42J965o00j831J289J595j384j092O73J676q35k405
1568a672R90K216j155j876N00J471J29j707k10J979k8j189L18O55M96p32o99J339
1586H25K49j277M9L72J28m65q98O54Q14q11n65L81M76M27j015j21J520r9r24J59
1606a21O31M21q37o54J147J96j293j52O66M79q18q96J011R28j332l04J216L32
1624F20o46p23J065J058j284p67J313L62q64o37M80Q35r10j014J122J98p60j08
$$ plain form
1504 680 1191 -924 -2210 -5 1746 -599 -1680 -44 1246 420 -1125 -103 1798 459 -811 309
1520 309 1145 717 -1025 -851 1273 588 -1600 -1125 455 594 -831 -1622 377 1126 -721 -970 784
1537 784 1222 171 -953 642 2025 -286 -1426 464 1640 -124 -1980 -764 1716 110 -2397
1552 -2397 -709 1219 275 -1265 -723 1242 642 -1189 100 1695 311 -781 -108 1568 733 -1672
1568 -1672 -682 1534 379 -1497 -997 474 603 -1104 -1314 665 637 -552 -234 421 917 185 -514 825
1586 825 1074 -203 -154 218 346 -119 -1017 -363 451 -360 -925 -544 -68 359 -656 -777 743 644 -280 -121
1606 -121 510 931 94 -560 587 783 -510 -662 4 483 -335 -1231 -220 708 -624 -928 288 620
1624 620 -26 -749 316 1374 90 -677 636 998 134 -503 -23 812 -98 -1112 10 208 -552 -660
1642f60M80L80l43n11R56N14r60K24L76m3R9n45K03L32p01J05J91n82K88J22n20
1663e95K88j0J68K18m64L69P97q69k2O50J11l55o06N09Q06j131p24R28L47p56
1683c41m53L64Q24q16p45J412L76j010j08R17N55q18p81J190O08j181m27N52J98
1702C16l18o90N34M66r31pN84j70r7L0K58M93n21j43Q11l65j18K34l53J96J54
1723C63m11K2l00k5O33n30n40N69J22l6j06qP30l08m36Q43J91p21j66N76K82n47
1745A97r81R35N51j216k50O95L75n17o45P18O74r35l7Q54k3j76k34L90N44q01
1765A18m17P70j58l55j44j41L36k28n03M55J76l46L95o5j2L01n8P8J62l04M58
1786E18j55l60K78Lm19oj52L11lo63L22M09l47p2J0L30L17n54K17P28l95l74L42
$$ plain form
1642 -660 -180 200 -143 -654 302 816 -144 80 456 413 512 -33 170 502 -199 -94 97 -485 -197 -75 -595
1663 -595 -307 -317 -149 69 -395 -26 771 -98 -120 530 641 286 -320 189 995 -136 -860 68 415 -341
1683 -341 -794 -430 394 -422 -1167 245 621 -389 -497 420 975 157 -624 566 1174 -7 -434 118 316
1702 316 -2 -692 -158 308 -623 -630 -46 -216 -313 -283 -25 468 -53 -196 615 250 132 366 13 209 363
1723 363 -48 -26 -326 -351 282 -248 -788 -219 -97 -133 -239 -247 483 175 -261 582 773 52 -114 462 744 197
1745 197 -784 151 702 -514 -764 -69 306 -211 -856 -138 536 -399 -436 418 395 219 -15 375 919 118
1765 118 -299 471 313 -42 -186 -327 9 -219 -722 -267 -91 -437 -42 -107 -119 182 124 202 364 60 518
1786 518 363 3 281 284 -135 -141 -293 18 15 -648 -326 83 -264 -336 -326 4 321 -233 -16 712 317 -57 285
1809B85J13J9m71l53P67k73p29L55J56n5j83l45O78K10n52K53M28j1K1l43K52
1830B22M04n03l6N1M3j4l95j25M15l22k45K07PK95P3n24M43L37l27M8J06K44K62
1853F66p29p3P40k58o44M4L02J2n78l04J049j18q22L41N25K28m63m63J164K04
1873H23j107J02Q06kn82n52P82M18j091l34R07j49m08k11M87N57p01j88N24L24
1893D05k27q1o5N08r4o68M04J46k36j48k69J07L65n54j38K63J84j3k59J57Q01
1914E88m03n64N63M58j81n66j04R78j98j165L88N61k49n21l22P32K98r92m8J015
1934B68o1m32o6M74N36r62QR38q5o77j62L12N16p71n23O99J10n43q7K51K91p0
1956c6m47M67M25l44k9K04Q9K53n59j42N96k30j72k67q8M88k83o76M87L54k96
$$ plain form
1809 285 398 417 -54 -407 360 87 -642 -287 -131 -186 -369 -714 -36 174 -378 -125 303 292 313 -30 222
1830 222 626 123 87 138 181 167 -228 -353 62 -260 -505 -298 -291 4 77 -447 -4 333 6 54 160 404 666
1853 666 -63 -136 604 346 -298 -254 48 60 -518 -822 227 109 -713 -372 153 381 -82 -545 619 823
1873 823 -284 -182 624 622 40 -512 270 688 -403 -737 170 21 -387 -598 -111 446 -255 -443 81 405
1893 405 178 97 32 540 446 -222 182 328 92 -56 -325 -218 147 -407 -545 -282 -98 -111 -370 -213 588
1914 588 185 -379 184 642 461 -105 -209 769 571 -594 -206 355 106 -415 -737 -5 293 -699 -747 268
1934 268 207 -225 -291 183 719 -243 -235 703 618 -59 -221 91 607 -164 -687 12 122 -421 -508 -257 34 -36
1956 -36 -483 -16 409 65 36 240 329 582 23 -119 477 247 75 -192 -280 208 -75 -751 -264 90 -206
1977b06j47Q3N44L5p48N11N71k82m35M2M65J04q89q5R14l57n89L9L41K87o22m76
1999i00J021K41p65J65M62L37n60l70R64J67q72r8M66M0l50n17M51L86p84M6L75
2020i5j6%j80J07M78k79o7M12j19J51p5l32L63J09n98J49q8n3K65n02q7N38k70
2043a89m44M87K66J71m75j12R24k0p58J32M93P3o26j96O13k2r28M2Q21j87n68
2064e03j82R60K4r36K52Q61j16o07K40N78rp09M1Q25n03n42L98rj25k95L0N41
2086B14m44k64N25J2k31K72J70Pk34N2N33l37n70N65J53n25r3K66J35m12n03P50
2108D1K00q57J19P68L7q14J68R18R1j038J51R94l66p70K42N19L9j082K08Q75m40
2129Cp15M29N36k01o22L36Q36n81m97P22K81m34k61L28M61n50l36N23k8q65M66
$$ plain form
1977 -206 -353 -270 274 309 -439 72 643 361 -74 -32 433 537 -352 -437 477 120 -469 -430 -89 198 -424 -900
1999 -900 121 362 -403 -238 224 561 1 -369 595 762 -110 -208 258 298 -52 -569 -118 268 -516 -470 -95
2020 -95 -111 -111 -291 -184 294 15 -52 360 241 392 317 -15 348 457 -141 8 -80 -133 132 -370 -457 81 -189
2043 -189 -633 -146 120 291 -184 -296 628 608 -150 -18 475 548 -78 -274 339 317 -611 -569 252 65 -503
2064 -503 -685 275 299 -637 -385 476 360 -247 -7 571 562 -147 -106 719 216 -326 72 63 -62 -357 -327 214
2086 214 -230 -494 31 43 -188 84 254 261 27 79 612 275 -295 270 423 -102 -195 71 206 -206 -709 41
2108 41 241 -616 -497 271 308 -506 -338 580 671 -367 -216 778 412 -358 -116 403 442 -640 -432 443 3
2129 3 -712 -283 253 52 -570 -234 602 21 -476 246 527 93 -168 160 621 71 -265 258 230 -635 -169
2150a69K17k25k98J00N88k64n28N81N21p92M8O31J55l89m07O68K30j039k9Q89
2170D88k71n97m2O14M1q97O1J061m21p46P23N77k54o35J76J046o92o85P19L37
2190F03m17n59L36L65n33n08O60L48r02J90N39K9k95j34O13J37p61L47O58o60
2210E6j69L56J85l16n22L22M03p88p6O86j07n28P3M89L69o81p9J160m48p63M85
2231A07M63j27o51qP49n02p90O46M86o18l87L52O54m10o10O79O13p83n1M33L75
2252F20m99l23O40K23q97R6O77m07m83O9K49O5p33M17N56m91k50O33R5k69k46
2273b58L76M94o63k41Q37j40p01K6M68k1p09P4N75j23q03M27N68l59j20J69O23
2294D99k81o69O97M70n95k65K97L05m08n75N35L22p76K0M52Nk81j92N08J82m28
$$ plain form
2150 -169 48 -177 -475 -375 213 -51 -579 2 523 -269 -221 410 565 176 -231 437 667 -372 -401 488
2170 488 217 -380 -422 192 233 -664 -603 458 37 -709 14 591 337 -298 -122 924 232 -453 266 603
2190 603 186 -373 -37 328 -205 -713 -53 295 -607 -417 122 151 -144 -278 335 472 -289 58 716 56
2210 56 -113 243 428 112 -410 -88 315 -473 -549 137 30 -498 -425 64 433 -248 -327 833 385 -378 107
2231 107 570 443 -208 -216 533 31 -759 -113 373 -245 -632 -280 374 -36 -646 33 646 -137 -188 245 620
2252 620 121 -202 438 661 -236 -140 537 130 -353 -284 -35 30 -703 -286 270 -221 -471 162 257 -12 -258
2273 -258 118 612 -51 -292 545 405 -296 -270 198 177 -532 -458 117 -6 -809 -382 186 -173 -293 -124 499
2294 499 218 -451 246 716 121 -144 153 458 50 -525 10 332 -444 -424 28 33 -248 -440 68 250 -178
2315a78R1N65k50l15K55J82j89k55O6M04l78m80N11j3m76Q8L04J46l87j02P37
2336C26L5o75L37N19k69l68J45M43k13m95Q2N49n35k66K43K61k71m91L48O79n67
2357a83k95O51J9j84k21K55N25o62m1O35l07l57O0J15j7k40j11M71k30l65M31
2378e1J29j54p7J30K57j00j65M21n0l40K71pj47k65L5L12j59n39K56N41o05p1
2400c78J20M85k59l77M44M33n06j93N55R3l36k13J46L66n38j99M86j12l65n0J89
2421b09J37j64k0L33J39n05L45K53m5j8k22L74j51l89K27p8k16J83l6j43kkJ43
2444f6L1k47J97K68l08J21J59k4kj70K01J70l70rJ48n8k06k06K61K63m22j75N59
2467A15k22l2J31O6L13l36j65N12k28j29P0J04nl02L6K46r9l38J13J99k49M5k7
$$ plain form
2315 -178 -87 478 228 -87 168 350 161 -94 -28 376 -2 -482 29 16 -460 -372 -68 78 -309 -411 326
2336 326 361 -314 23 542 273 -95 50 493 280 -215 -133 416 -119 -385 -142 119 -152 -643 -295 384 -183
2357 -183 -478 173 192 8 -213 42 567 -95 -136 499 192 -165 -105 10 -7 -247 -358 113 -117 -482 -51
2378 -51 78 -76 -153 -23 234 134 -31 390 340 0 271 264 117 -148 -113 199 40 -499 -243 298 -307 -378
2400 -378 -258 227 -32 -409 35 468 -38 -231 324 417 81 -132 14 380 -158 -357 129 17 -348 -398 -209
2421 -209 -72 -236 -256 77 216 -289 56 309 264 246 24 398 247 -142 85 7 -209 -26 -62 -205 -207 -209 -66
2444 -66 -35 -282 -85 183 -125 -4 155 131 129 -41 160 330 -40 -49 99 41 -165 -371 -110 153 -269 -444 115
2467 115 -107 -139 -8 58 371 35 -130 382 154 25 95 199 194 -108 -72 174 75 -263 -150 49 -200 -155 -182
2490a82J01L3n2J60J45j38J34M7o6j1j54j30K66j59n2Q8l01Q4J15j78J86m3l0
2513a37J79j86J02J75Qj24J51l3m0K9j61K81k53j40J21p4p4o5K6N1Q0j17J62J13
2537G4k75L35j41K12l3r6Q2k5j95J51P7l15J4P2j12J08k29J17R3j18Q7Q0j6J79
2561A26l8n4J80k0j47K18j42j1o5j18L3j3p4L5j84R9O1O6p7R6k0Q5Q7nJ38j22
2587A34j3M6q3N3p2m8j7j06j43J26j4j16J63M4L8L0j49K52P1j79K16R7j88N9p2
2612A29o8L5k12M4mj17K2J86k03R7n7o5J24J11j89L01j05P9J75k87K09m0q8jQ
2637H4j80K46k39j57J71j13K7O9J01M0o6j32K86J5j06J13r9R4M8j98J06L4k78
2660a34RO0l4O4j98J05K95l17m7J78N3J51j23l5K99r9j80K69j63r0P8k36J04k3
$$ plain form
2490 -182 -81 -48 -100 60 205 67 201 248 182 171 17 -113 153 -6 -58 30 -271 -187 -72 -250 -64 -107 -137
2513 -137 42 -144 -42 133 141 17 168 135 95 124 -37 244 -9 -149 -28 -102 -176 -241 -215 -164 -84 -201 -39 74
2537 74 -201 134 -7 205 172 76 158 133 -62 89 166 -149 -135 -63 -175 -67 -296 -179 -86 -204 -117 -37 -53 126
2561 126 88 34 214 194 47 265 123 112 47 -71 -38 -51 -125 -90 -274 -175 -114 -48 -125 -29 -49 36 123 118 256 134
2587 134 121 167 84 137 65 17 0 -106 -249 -123 -137 -253 -90 -46 -8 22 -127 125 196 17 233 330 142 201 129
2612 129 61 96 -116 -72 -76 -193 -171 15 -188 -91 -148 -213 -89 22 -167 134 29 108 283 -4 205 165 77 76 84
2637 84 -96 150 -89 -246 -75 -188 -161 -92 9 49 -17 -149 137 152 46 159 60 154 202 4 110 144 -134
2660 -134 -125 -65 -99 -35 -233 -128 167 -150 -197 -19 34 185 62 27 326 227 47 316 153 63 141 -95 9 -14
2684a4k17K12p7p6J28n6q5J80nN4pJ3J27N1k53J79J8k38J07ko0r2j17O8K19k42
2710a85p1K44q1L6m1Q5L12k76j4K15j28O3n1K2J22k31j47K00j25J7o5r9J51n5
2734a02j94L49j9q3m7K22O1Q8j45M1K0j53M3J2j82Q2n6o0R9k11J19kQJ7N7j24
2760a60K30J2nM2Kq4K84k24j87J77Nj95K7m8l2M4j67L07j19j09K5J65K2Mn5K84
2786B45j7k63LQ3J34j17j29L1M5j40p6J55p8jp7j3L02k26O7K20j2Pk7j11R8L7
2812A40q7J48j86q2Q6l4n4jo6J05j09LJ65n5MO7J3m7K6j9O8O5j66O3M2j71O0O4
2840D2r7j4j44K8K59l34K79KR6j36R8n3J81j77l4J82l5r8P3j47O7j98k7J26j06
2865a67n4J60J8o6nJ9J89k8m6J76k9j22P8q7N4j7m6J9j15p6j1N7qj2L3J4J38j31
$$ plain form
2684 -14 -231 -19 -96 -172 -44 -100 -185 -5 -10 44 37 50 177 228 -25 154 172 -66 41 39 -21 -113 -230 -162 57 -185
2710 -185 -256 -12 -93 -57 -98 -13 299 23 9 224 96 159 108 130 252 21 -126 74 -51 -34 -99 -198 -47 -102
2734 -102 -296 53 34 -49 -96 126 187 275 130 171 191 38 81 93 -89 -7 -63 -123 -24 -235 -116 -118 -110 -93 -36 -160
2760 -160 70 82 77 119 121 37 321 97 -90 87 92 -103 -76 -124 -156 -112 -279 28 -91 -200 -175 -10 12 16 -39 245
2786 245 228 -35 -32 51 185 68 -61 -30 15 -125 -201 -46 -124 -125 -202 -215 87 -139 -72 148 136 143 116 5 103 140
2812 140 53 201 15 -67 19 -15 -69 -70 -136 -31 -140 -137 28 -27 -23 44 57 10 36 17 85 150 -16 47 89 -82 -22 42
2840 42 -55 -69 -213 -185 74 -260 19 21 117 -19 79 26 207 30 -4 178 143 45 118 -29 38 -160 -187 -61 -167
2865 -167 -221 -61 -43 -109 -114 -95 94 66 20 196 167 45 123 36 90 73 27 46 -69 -145 -156 -99 -107 -119 -86 -72 66 -65
2893f5J39M5Np7J91j50Q8j06P1P1j38j59J19p1j64K39j39R7j30j72K17R0pQQ1
2918H3J29j20m2J85q3q2rO3l9j42M4j2L7j66M1N3m8Q6mO1J3K8o4K12M0k47N4J1
2946H2L7l4j23M6j34lO8j32j0K18k14Q2L6J08q4N8J7J37q6k2J22p3N7j53p1J11
2972D0Q0l07Q9lj4J6k8J55j9j33R8J01J8l7P2jK3j08l5J32l0k12J80j21o8Q1l2
2999f3n0M5r5J20o3j05J64oJ47ln6O6Jj44J23m6j25J31o8k9J7p7J1M0J7Qn0Q7
3027cL2j26K27K3q7J01m0r7J00j55l8k8m9N4L4M9j17RP3J1j1l8J38j06R5J4k9
3054C6O1J38j04j3Nk03Q0j9o0qQ1j26Q2o8M9m5J2K17q9j0J62j53M9J9n0N1Q6j10
3082G0o5l1k7m5J08j72J35l8k0J11j52J38Q1j01N1J90k65L2l5J62Nl7j25R5j13
$$ plain form
2893 -65 74 119 124 47 238 88 176 70 141 212 74 -85 34 -37 -201 38 -101 -4 -134 -306 -89 1 -6 2 83
2918 83 212 92 50 235 152 70 61 124 85 -57 -13 -25 12 -154 -113 -60 -108 -22 -26 35 48 76 12 224 264 17 71 82
2946 82 119 85 -38 8 -126 -129 -61 -193 -203 15 -199 -117 -81 27 -57 1 18 155 69 47 169 96 153 0 -71 40
2972 40 120 -187 -98 -101 -115 -99 -127 28 9 -124 -26 75 93 56 128 127 150 42 7 139 109 -103 77 -44 -112 -31 -63
2999 -63 -113 -68 -163 -43 -106 -211 -47 -53 94 91 35 101 102 -42 81 35 -90 41 -27 -56 -39 -116 -105 -65 -48 -40 -90 -3
3027 -3 29 -97 130 153 66 167 127 30 130 -25 -63 -91 -140 -86 -52 -3 -120 -111 -38 -27 -38 -76 62 -44 51 65 36
3054 36 97 235 131 118 123 -80 0 -19 -79 -87 -6 -132 -50 -118 -69 -114 -102 115 26 16 178 25 74 93 43 94 180 70
3082 70 5 -26 -53 -98 10 -162 -27 -65 -85 26 -126 12 93 -8 43 233 -32 0 -35 127 132 95 -30 65 -48
3107d8j1N6j31Q5N5o1prM9J3O7n9PJ21Rq3l4J18o1k57K25j42m4R6LJ8j5p6R2N2
3137B8j33Q3M8KK7L4P3L2j78k2J21j70Q7Q0j70J34j19o9J60k10O9J52L1J3j02
3162AJ2J28l6n8J15K2q0j3l8j48N8r9J57j22q8N0J39n2q4M8J71k3n5J06mo0M2
3189H9L6k1m0n1L7M3j60N8mj37J5Q5m9J58r4m8J07l7j9K19p6o4M2R0n7j57q7J45
3217B3P6k10M4L8o1j82L8J91J00k23J67R3j23K08k81K47o1k9n9P3K4j29p2m3J16
3242c5Pk7L7j52J57M1j02Q6M6J7J42j00j21J77j14p2J43r8r9O2j93K12J1k12J47
3267d0Q1r8o9N4J35r7j13K51P4l12J47J06q9m8N5L9q0r9J04r1j8o1K22J21k33
3292e9r7k2J85L9r2J05L6o8L1K6J0L1k59K15n5j36P6n1M8m2n8OJ35j88K78o9J2
$$ plain form
3107 -48 -59 -3 -134 -49 6 -55 -62 -71 -22 -9 58 -1 6 127 136 53 19 137 76 -181 44 -98 -142 -46 -43 -25 -40 -116 -24 28
3137 28 -105 -22 26 28 55 89 162 194 16 -6 115 -55 32 112 -58 76 -43 -112 48 -162 -93 59 90 103 1
3162 1 13 141 105 47 162 184 104 91 53 -95 -37 -136 21 -101 -189 -139 0 -52 -136 -88 83 60 5 111 107 47 89
3189 89 125 104 64 13 50 93 -67 -9 -13 -150 -135 -50 -99 59 -35 -83 24 -13 -32 187 111 47 89 179 122 -35 -122 23
3217 23 99 -111 -67 -29 -90 -272 -234 -43 57 -166 1 94 -29 179 -102 145 84 55 -4 69 93 -36 -108 -151 -35
3242 -35 -28 -55 -18 -170 -13 28 -74 12 58 75 217 117 -4 173 59 -13 130 32 -67 -5 -198 14 25 -187 -40
3267 -40 41 -57 -126 -72 63 -34 -147 104 178 -134 13 119 30 -18 37 76 -4 -103 1 -90 -108 -169 53 174 -59
3292 -59 -156 -178 7 46 -46 59 95 27 58 84 94 125 -134 81 26 -110 -34 -85 -37 -79 -137 -131 4 -184 94 25 37
3319C7J12j54J22q3L7J2M5j41M2M7Jj53J13p9j37nJ33J50n1k26J15J49Lk03k9
3344a43K29lj05R8j01lj5j9J33l3l14K57L1n0n2l4J94p0m7P0J31j66O8L5j5l6
3370D0K0j53K70k01j5qK6j17L4J2R2p4J9J30o7k7P9m5o8J27L6qj1J1Nj00j32R1
3398c4j29N7m6J4K97j80p5J47l6l7q8K03R6j75m8N1O1j54J28j56J03k5p6N4P3
3423B5j11J8P6o2L2%M5P1o7J7O7q4J21m6k15J38J66k03k4p5J41km5k38K36l4L6
3450a7Q6j6M5o0Q5J12j79l8j06N1J56l14N8J25m2j42J42KJ52j07l8J84j1j55k1
3475d8J72K6r5q5N2J24j45J0O7r9j81J39Q8mj42P2K2o1r5P6J66J3L1j94J87j78
3501h2R4J07j10k8O6j39M3R9o5j8N2j15M6J52j85M6J7J26j23k9J23M6j42R7p5
$$ plain form
3319 37 149 -5 117 34 71 83 128 -13 29 76 77 -76 37 -42 -179 -184 -51 99 48 -178 -63 86 89 -114 -143
3344 -143 86 83 -22 76 -25 -28 -43 -62 71 38 -276 -19 12 -38 -90 -124 70 0 -47 23 154 -12 56 91 76 40
3370 40 60 -93 177 -24 -39 -47 -21 -138 -104 -92 0 -74 -55 75 8 -19 60 15 -53 74 110 102 91 102 107 7 -125 -34
3398 -34 -163 -106 -152 -138 159 -21 -96 51 15 -22 -110 93 189 14 -34 17 78 -76 52 -104 -1 -26 -102 -48 25
3423 25 -86 -68 8 -54 -22 -22 23 94 27 44 111 27 148 102 -113 25 191 -12 -36 -111 30 28 -17 -255 -19 -53 -17
3450 -17 69 53 98 38 123 235 56 18 -88 -37 119 -195 -137 -12 -54 -196 -54 -52 100 -7 -45 139 128 -27 -48
3475 -48 124 150 55 -30 22 146 1 11 78 -21 -202 -63 25 21 -121 -49 -27 -88 -183 -107 59 72 103 -91 96 -82
3501 -82 12 119 9 -19 47 -92 -49 50 -15 -33 19 -96 -50 102 -83 -37 -20 106 -17 -46 77 123 -19 78 3
3526Ck1J61k03O6K7j61J1R0L1r2Q3R7j03N9o4O5p8o9K43j11L0l3j03J14M3j63
3552g8R2n0Jj5r4J74j33L1K5J36n4m0l9J68j71J11j0rm6j5P3p4j0O4o5k6K7O4
3580C7J2j34O1K1p1L8R5RN0j07k7Q2j78R2n8m5J09p7k1P5M5j96J80K6k0M5p8R3
3608E8l4k18M32k29j2J5J2M5k1L6k51L11j96K7j6m5J20p9L0L4Rm0J22n7j15J8
3634d4o4J51J18j46n6K02j90L2j54M0K11k23k7Q0L2Jj1NJ48o8L8l1J2RO0l00K08
3661C3O9j34J25o8j29O1o8J26q4K2KR3k1o8R9j0N0j91J9M9M2j02J48o2N1o8j05
3688a21O9P3q3M2j39K11q1j7n0J27L1J15j50O1N8r4p5J10j50J4qQ4j05OlJ40j67
3715a02j9K24n6l8o5L8J24j13%J4K10k21o1l2O2J24j11kN4n5n2O2r6N6J10j86
$$ plain form
3526 3 -18 143 -60 6 33 -128 -117 -27 4 -88 -5 92 -11 48 -16 49 -29 -98 145 34 64 31 -72 42 85 -78
3552 -78 14 -36 -35 -50 -144 30 -103 -72 -47 89 35 -5 -44 124 -47 64 54 45 -1 -16 57 -17 -27 37 -28 -54 -27 37
3580 37 49 -85 -24 -3 -74 -36 59 68 118 11 -16 66 -112 -20 -78 -123 -14 -91 -112 -37 8 -188 -8 18 -2 43 -35 58
3608 58 24 -194 238 9 -3 12 24 69 48 84 -167 144 -52 -25 -41 -86 34 -45 -15 19 28 -12 110 53 -62 -44
3634 -44 -108 43 161 15 -41 161 -29 3 -151 -111 100 -123 -150 -70 -38 -37 -48 -43 105 37 75 44 56 65 125 -175 33
3661 33 102 -32 93 25 -104 -43 -111 15 -69 -47 -45 48 27 -41 58 48 98 -93 -74 -25 17 -85 63 1 52 -16 -121
3688 -121 -52 21 -62 -20 -159 52 -29 -46 -96 31 62 177 27 88 146 52 -23 87 -63 -49 -57 27 -78 -72 -75 65 -102
3715 -102 -121 103 47 9 -56 -18 106 -7 -7 7 217 -4 -65 -97 -35 89 -22 -24 30 -25 -77 -15 -111 -55 55 -131
3741a31J87J0n1lJ00n6m5L2m2J00l0j4q6k1N7m2kL9K7r9J50j08R0j42k5J68j6
3768D7ln6N4L9m2m6J01j37M4JQL%r2L6R8N4j06J5N1L5p2K6M3j67Q6P9L6o8o7j01
3799a01l2L5J13k0ko1K9M4r9qK13Pn8k9j7J22l8j15q3J01Mm4J1PK9Krr8J05l8
3829c0J26k7j68J85r6O7l0n1J55j31p2N0K7j91K30K0j45J02m2nj5qK1J01j40J58
3855I1l5nn5P2q8O3r4P3m0n1M5j00J14R3j8q9M2LkK8R9j53J06q2j8L5LN8q8j24
3885a17M3J01j20pJ83j52K4q8J36R2p0r8N4P4r2j8O3Q5n2k06K29k2k3q2J1P0q
3912A0j77O1J89j60O5j8J04k4o5M5J45j42j38K30j30n7J48j00o5O9M9j38M7%R9
3937D7r7J5o1R9O3kJ5M8j52k3R2k2Q4j53m4J49l6k13O6R8k9k0L3J43O4j65k8O8
$$ plain form
3741 -131 56 66 15 12 112 56 11 43 1 101 71 57 -29 -50 7 -35 -37 2 29 -70 80 -28 62 -80 -105 63 47
3768 47 44 -12 42 81 39 -7 94 -43 1 2 10 13 13 -79 -43 55 109 3 18 69 104 32 58 101 -66 20 99 135 67 0 -101
3799 -101 -133 -98 15 -5 -7 -68 -39 5 -94 -102 111 118 60 31 14 136 98 -17 -100 1 5 -39 -28 -21 8 10 1 -97 8 -30
3829 -30 96 69 -99 86 -10 57 27 -24 131 0 -72 -22 5 -186 44 64 -81 21 -21 -26 -41 -49 -28 73 -67 91
3855 91 56 51 -4 68 -20 43 -51 22 -18 -69 -24 -124 -10 83 65 -24 18 21 19 47 146 -7 99 17 -1 34 37 95 7 -117
3885 -117 -74 27 -93 -100 83 -69 -45 -133 3 95 25 -73 -19 55 -37 -55 8 93 41 -165 64 42 19 -63 -52 18 10
3912 10 -167 -106 83 -77 -12 -30 74 50 -15 30 175 33 -105 125 -5 -62 86 -14 -79 -10 39 -99 -52 -52 47
3937 47 -50 -35 -96 3 66 64 79 127 -25 -48 44 22 106 -47 -91 58 22 -191 -125 -27 -56 -76 -43 100 164 -1 -29 39
3965C9j04J3M0j0m8p8J52N6l8r4J02j4N1j32n4J11K6m3Ml9J04m1Mk4O0r1K5O6
3993D3r5J64k39P1J06m2o2J74j89O9m7j08K00Q3p8p3o0K00n4j33OR7j6l2j19K56
4019A22q7j82J45Pm5j00J97j17J39n9J8L8q9o0J33j7K5l0j26J70m0p9k8M2l0M3
4045a0j8r6J25j34J80j36J47m8n7M5RQ2r7N8j25J10k21J70k1p3J65j47N0pL2j13
4071a30J38n9j6J17p9J17l5oN2nnj90Q6P2l6j5O0p8Om7L8m3j32J83J3j56J72p0
4099d8J59j32K3J29j20K2j50O7JK7j10JJ93j54O9P3k6m4l3J6J9rP6M7j16N9k4
4126A5k1oM5q3M8L0n9N6L4l7J0j08J65l8p1Pj23J24jk1O0j9J0m4l2j0O4Qq3P0
4156a0L6l2j3J5Q3m0p2K3R5j04j20J71L0k4j48J15j0j19J55o4r4J81j77j6K20
$$ plain form
3965 39 -65 -52 -12 -22 -70 -148 4 60 22 -72 30 16 67 -65 -119 -8 18 -25 -21 -60 44 3 7 -17 43 -48 -23 43
3993 43 -52 112 -127 -56 50 8 -54 120 -69 0 -47 -155 45 128 50 -23 -83 117 63 -70 -64 33 17 -15 -134 122
4019 122 35 -147 -2 5 -40 -140 57 -60 79 20 38 76 -13 -73 60 43 68 38 -88 82 42 -37 -65 -23 -53 -10
4045 -10 -28 -124 1 -133 47 -89 58 10 -47 -2 7 89 -8 50 -75 35 -186 -16 -37 -110 55 -92 -42 -49 -17 -130
4071 -130 8 -51 -67 50 -29 88 53 47 99 94 89 -101 -15 57 21 6 66 -12 -6 -53 -15 -58 -190 -7 6 -150 22 -48
4099 -48 111 -21 2 131 11 33 -117 -50 -49 -22 -132 -131 62 -92 -23 50 24 -20 -53 -37 -18 -27 49 96 -20 39 15
4126 15 -6 -12 33 -50 -2 28 -31 25 59 22 32 -76 89 51 -20 -13 -136 -12 -13 -34 26 7 17 -27 -59 -69 -5 3 -80 -10
4156 -10 26 -6 -19 -4 79 39 -33 -10 85 -19 -139 32 62 38 -110 5 -5 -124 31 -33 -127 54 -123 -139 81
4181H1r8p1P3N7L4j28P2Q4k00J15k3j9N3m7L8j09M0l6Q2K0K4Oj6o3J39j40M5j4
4209aMj7N2LL8q1K7j7O2M3j04p9nJ02p9j1P6j47J50J2j08J12r2J45k5p2Pk8j1
4238d4n4O2pO5o0J6j4M5j3p3J7R0m9M2Q8j16O3J3p6L4Po4J5Lj9n3P4p5o8R1O5
4269Ej12O7M6J9q0J05j10P6K5r2k1J30j41J04M2j05L9N4k60L25j72R1j24J49l3
4294B7Mj08J60m1j31J42m1QK9k4k5J10n9j51K7J56j38OlP9K0q1J21m3j02J49j98
4321a07J81p6j22J89n8K0kL3j92J74q1j22J32PJ37j26L6j0n7r9J44p3J04J5j44
4346i7K56j40n4R9p0o8Q3%j88J13l5J36o3L6r7J06r7M4P3j42J27p1J14o3M4l7
4372ILN0q0J01j81J02o9P7K9n5K2l0l7N8Q1O7L1k41J46p9J6j8m8lR1mJ0j01P1
$$ plain form
4181 81 -17 -88 -15 42 76 -52 20 104 -96 19 -4 -23 30 -17 21 -88 -48 -84 -2 18 42 48 32 -31 108 -32 13 -1
4209 -1 3 -14 38 41 79 -2 25 8 70 113 9 -70 -75 27 -52 -63 13 -134 16 28 -80 32 -60 85 60 -12 -5 -33 -44
4238 -44 -98 -36 -43 22 -38 -22 -36 9 -4 -77 -60 30 -19 23 111 -5 58 71 -5 29 36 -28 -13 -10 -29 -82 -8 -83 -151 -60 5
4269 5 -107 -40 6 25 -55 50 -60 16 41 -51 -72 58 -83 21 63 -42 -3 51 -209 116 -56 35 -89 60 27
4294 27 31 -77 83 42 -89 53 12 20 49 25 0 110 51 -100 -73 83 -55 -49 -52 27 47 -34 87 44 -58 91 -107
4321 -107 74 -2 -124 65 7 27 25 58 -134 40 -41 -163 -31 -24 113 -13 23 13 -44 -143 1 -72 32 47 -97
4346 -97 159 19 -35 64 -6 -74 9 9 -179 -66 -101 35 -28 8 -89 17 -80 -36 37 -105 22 -49 65 2 46 9
4372 9 12 62 -18 83 -98 4 -65 12 41 -14 8 -22 -59 -1 80 147 178 -63 83 4 20 2 -46 -49 42 38 48 -53 18
4401A8j43J87j08j12J59j3K4Po9J94j07j22J06n0r5O6Mk9M3O1o7J14j27R5j07
4426g1K1J51r4M1ml2n1J82p7m0PL8q4O1n9P0j06m3J42j8K3K5j20P6k1j00J60r6
4454a9L3J04j18o6J95j93J11p9N5P1mj36J4N4o4J9q3J88j04J5J00k2j19K4L6M6
4480E8j5N4q6Rj54K59j98L7j16P4R6o9l9L8P9p1N9RL8Jj33J24j55J56m5m3k1M8
4508fK6j14J23j09Q4nl6K7o7K1J46p7k1J3M7j14J16l0j07K44j69j11K00j59P0
4533hRp2J11o7K8KM2m0mp8K41O0l28K02j04Q6M0k3r8J33j60o4K40k53J13j56M7
4560a01J71r2q1J83j26M7q3K48j80l9K2k3K2L1j0m7rP9o9n1J47j33Q4P4j14L2
4586a8L0p5Q4o6O1R0j13J3%mO1j82J70m4j6O1Rp3K6o1K3KJ20r9k9L7o9J13j04
$$ plain form
4401 18 -125 62 -46 -158 1 -12 12 19 -50 144 37 -85 21 -29 -124 -58 -54 -83 -40 21 -46 68 -59 36 -71
4426 -71 -50 101 7 48 44 12 -39 143 66 26 33 71 -13 48 -11 59 -47 -90 52 34 57 82 -38 38 17 -83 77 -19
4454 -19 14 118 0 -66 129 -64 47 -32 23 94 90 -46 -32 22 -42 -23 -106 82 -22 -7 93 71 -48 -24 12 58
4480 58 43 97 11 20 -134 125 -73 -36 -152 -78 18 -51 -90 -52 27 -44 15 24 62 63 -70 54 -101 55 10 -33 -54 -6
4508 -6 20 -94 29 -80 4 -1 -37 -10 -77 -56 90 13 -8 5 52 -62 54 24 -83 161 -8 -119 81 -78 -8
4533 -8 1 -71 40 -27 1 3 45 5 1 -77 164 224 -104 98 -6 80 120 97 -1 132 -28 -92 148 -105 8 -148 -101
4560 -101 70 -22 -103 80 -46 1 -82 166 -14 -53 -31 -54 -32 -1 -11 -58 -67 12 -57 -108 39 -94 -10 64 -50 -18
4586 -18 12 -63 21 -45 16 106 -7 6 6 2 63 -119 51 7 -9 52 61 -12 14 -47 -24 -22 98 -1 -30 7 -62 51 -53
4615e3M2n4m8R5N2j19KK22j35P6j08QR2j8j49J26m9N2o7l6K05r5j20J38k6l4Q3
4642H2j65J2J62j93J13P5o8j9P4o1M7j62P2m9J0K56j75j15J31Mj74K02ql3k7j03
4668a12K03L2k34O4L0m1Q8j04J28q5jpN8j9om4k5J79r4o6P8o5k5J14r8M3O9j17
4696e7RJ68j84J40m8%j20J29L8l7l8K0J6km3j07J13l6J15o9N1p9J22r7q4O9R7
4723H6j50J09L0Ok3j41j8K46k59N5Q3Nm7o3O5q3J66l3l0K5J9o3N6kN3j54L5Mj17
4752a40J71n0q8L3N8n7N4N9r1P0j9jJ0%Pj3J31r5J3K2m7J9R1j13j19J19j3o3J4
4781c8m4Q6l7j30K36M3j23K8q5J47j00O0M8j35N0l1M3J7j0K3q5K2j10J87K6j01
4807a3P7n8P9k6j62O7J85j25j23J51M8k59J37m8J17p1j8J81j40l8Q3o6M8m1Lo
$$ plain form
4615 -53 -11 -65 -113 -18 34 -85 -83 139 4 80 -28 -20 72 54 -95 31 -18 34 -33 -69 136 41 -79 59 33 -1 82
4642 82 -83 -71 91 -102 11 86 18 -1 73 12 59 -103 -31 -80 -70 186 11 -104 27 31 -143 59 51 18 -9 -112
4668 -112 91 123 -111 -47 -17 -58 30 -74 54 -31 -32 -39 19 0 -6 -50 -75 104 10 -56 22 -43 -68 46 -52 -9 60 -57
4696 -57 -48 120 -64 76 28 28 -92 37 75 38 0 20 36 34 -9 -116 -3 -39 76 7 58 -21 101 4 -80 -11 86
4723 86 -64 45 75 81 58 -83 -101 145 -114 -59 24 29 -18 -81 -16 -99 67 34 4 29 48 -15 41 39 92 -62 -27 -23 -140
4752 -140 31 -19 -107 -74 -16 -73 -19 40 -51 19 0 -1 9 9 16 3 134 39 52 74 27 46 137 24 -95 24 11 -52 -38
4781 -38 -82 4 -33 -163 73 116 -7 21 -64 83 -17 43 91 -44 6 -25 18 35 25 48 -37 -15 -125 62 88 -13
4807 -13 64 6 85 59 -103 -36 149 24 -99 52 100 -159 -22 -70 47 -24 -42 139 -1 -39 44 -22 26 -15 -12 -18
4833a8N8oj3o0o8J86m9o9%j2N6R9j67J39L5k62Q1mJ03J26r8J1m4J8j46n2K31q7
4861a2r3N3k6L7M9j7Lj9R1j39J31j54J1J31l1p6R7K2j8kj67pK23j01Q3p4n1N6
4889@K9j78N5M0P0j0oR8j75j1Q8Njl5J1K0P5j67QO6l4J33j98M4L9J4k0L6O4o7
4919gL2j32J95o9j71K43q4N5L6j05L5o6m0J3L1PP2L5N7p0j42L2O7RJ2K4j2j50
4947i3%N2K3j2k1N2%Rj5J6n6o6J32l5l6j3Q9k5N0J56k16p5o4L7J05M5j54J60p1
4976b6j58K55k69L53L9l36j8J58j96j1n4L04K14m72P34n17J44Q7r5J54n56L64
4998I8J25Qn78L92K66l52J47k57N59o08M81k11M19n12J32O11l90m25J91j30L16
5019B82l13k1R2j69K16j43Q8K4n4kK8M5p2K2Q2n4jKp6Oj0J1J5L3o5J2K9Qq8K3
$$ plain form
4833 -18 40 34 21 -39 -107 79 30 -39 -39 -51 5 104 -63 76 111 -151 -70 -74 29 155 57 68 24 42 -104 -156 75 -12
4861 -12 -105 -52 -78 -41 8 -9 -6 -25 66 -73 58 -96 -85 46 15 -61 36 58 40 38 -129 -136 87 -14 69 -5 -56 0
4889 0 29 -149 -94 -54 16 6 0 98 -77 -88 0 5 4 -31 -20 0 75 -92 -84 -18 -52 81 -117 -73 -34 -20 -40 -4 60 -7
4919 -7 25 -107 88 19 -152 91 7 62 98 -7 28 -38 -78 -65 -34 -27 45 80 137 67 -75 -43 24 33 45 69 57 -93
4947 -93 -93 -41 -18 -30 -51 1 1 10 -5 11 -45 -111 21 -14 -50 -63 26 1 51 207 -9 -84 -148 -111 -6 39 -115 45 -26
4976 -26 -184 71 -198 155 194 -142 -160 -2 -198 -209 -263 41 255 -217 517 0 144 231 136 290 -266 98
4998 98 223 231 -347 45 311 -41 106 -151 408 -200 281 70 489 -23 109 720 330 -95 96 -34 282
5019 282 -31 -52 40 -129 87 -56 32 56 2 0 28 73 1 23 105 51 50 52 -24 -18 -28 -17 -2 31 -34 -22 7 15 -73 -50
5049e0J11j22l6P7J15j44J40l5k8l4j5J5Mm6O2p9N1o5P3p3J26L0Nj47Q3o0R9n4
5077Ck8K5L1O4n7ql8J1k1N0q7l4m0J83Q8q6j14N5N4m4ll3J18m8j64J53J2K2p1
5106gj7o1K25k72J32J5K5n7lJ26q0j15M0R6j24rqL3J95k38P3J61j93J7j0L6QN6
5134D4j60R6qm7O9j8N7j8J02n1J21j12j44R5R0o6k8M1j33J44j69M9J00n0M4j30
5160h2J62n9Q8j05jN7p5j28J31J41j26l4M1j2k8l7J35q2j44J69oN1m0R7k18J50
5186D5K1p1J09q7Q7j18N9l3K8l8o9KL9L6j8J8J9K9r4M2jK5qQk7L3j81J70Ro0j7
5217d3k5J67l1j15N5J4l3K1P7n5J14j00p3J39j66J41k6j16L8O1n5j1K6l1L1J13
5243A17k08J15n0J07j00m3N3J00p7l6l3J09k6k5n2J01m4j2o2O1Q6l05K20r1J51
$$ plain form
5049 -50 61 -61 -97 -20 95 -49 91 56 28 -6 -21 -6 -2 -48 14 -65 -14 -79 -6 -79 47 77 82 -65 18 -42 57 3
5077 3 -25 0 31 95 38 30 -8 3 -18 32 -55 -89 -129 54 142 56 -58 -3 51 7 4 -29 89 41 -123 30 42 64 -7
5106 -7 -24 -85 140 -132 0 15 40 -17 -20 106 26 -89 -49 47 -77 -86 -94 -61 134 -104 -31 130 -63 -46 -56 -20 -12 44
5134 44 -116 -20 -28 -75 -6 -24 33 15 117 66 187 75 -69 26 116 50 22 63 -70 74 -95 -46 54 4 48 -82
5160 -82 80 21 109 4 3 60 -15 -143 -12 129 3 -31 10 -2 -30 -67 68 -14 -158 11 5 56 16 113 -105 45
5186 45 66 -5 104 17 104 -14 45 12 40 2 -67 -65 -26 10 -8 10 29 58 -36 6 5 30 22 30 3 36 -145 25 34 -26 -43
5217 -43 -68 99 68 -47 8 22 -11 10 87 32 146 46 -27 112 -54 87 61 -55 -17 44 -11 -22 4 -27 4 117
5243 117 -91 24 -26 81 -19 -62 -9 91 14 -22 -55 54 28 3 -49 52 8 -4 -66 -5 81 -224 -4 -95 56
5268E6J7J7j07J61j54N8n0O9j04Q3j42J24j38Q4Q7p3N3J5j06N4q4J2R3K2j04J34
5294G7j16J2l9N1j29K13N5j75j1N6m0J20l1k3r8K9O1J16j70J27j03J0M0j20O2
5319b6J60q8J3q7j23K12p5n2j4K3J99j23O5j18r1J77o4n0j42J89k6L3J27m1J0
5344H8Qj15q0J35kK3r2M9O4j05J27q9PJJ38k41J13q3l2J16o1kM2Rj31MN6O0o1
5373e4M5R3j01l5R9or0J35n6K6l6o0P9k8p7J21j3j5K6j43J83Nj07L3pK2m5l5P1
5402C0k3n3L7k3R9n5Q2o5N8r4o0J48n2pp3N4k6N8j34lJ63r2R4n0Jn8N4J42O5j99
5432A8K0Jr0J43j01J22q3N3j38J19n2o5Q7o2O6p9j9M4K7j31K64n2j81L3O0k1n4
5459g1K4J39j09J3J2n9n0j6k2J47j13k0J59k3J7m2M3KQ9m62K72J16j00K7L6L3
$$ plain form
5268 56 73 90 -17 144 -10 48 -2 67 -37 46 -96 28 -110 -26 61 -12 41 56 -50 4 -80 -68 25 47 -57 77
5294 77 -39 -27 -66 -15 -144 69 124 -51 -62 -6 -46 74 43 20 -78 -49 12 128 -42 85 -18 -8 32 -88 -26
5319 -26 134 46 59 -28 -151 61 -14 -66 -80 -57 142 19 84 -34 -125 52 -12 -62 -204 -15 -41 -8 119 78 88
5344 88 96 -19 -99 36 34 57 -35 14 78 -27 100 11 18 19 157 -84 29 -54 -86 30 -31 -33 9 18 -113 -109 -53 7 -54
5373 -54 -9 84 -17 -52 47 41 -49 86 30 56 20 -40 39 11 -66 55 42 27 53 -90 93 98 -9 24 17 39 -6 -41 30
5402 30 7 -46 -9 -32 67 12 94 29 87 -7 -67 81 29 22 -51 3 -23 35 -99 -102 61 -31 63 13 14 -44 10 152 217 18
5432 18 38 39 -51 92 -9 113 30 83 -55 64 12 -53 34 -28 38 -41 -60 -16 11 -120 144 92 -89 -56 4 -17 -71
5459 -71 -47 92 -17 -4 8 -51 -101 -117 -139 8 -105 -125 34 11 28 -14 29 31 120 -342 -70 46 -54 -27 9 42
5485D2J83Lj12O4l57K09n8p8J54lM6j19R3p8R1o4r8K23p4N1j21q5m8J05NOj18
5512a38R9J89j38n7N1M4JM6j82J67r2J12j08N0j4K1j23J29J5k27J88Q0j48R3o3
5537eP8o8J3j24J90m7r2K1qJ2J61k15K5q8N7J29%j1m8o4P7n3l2K30k14J8L4j3
5565c7K5MR8J2k7l1L4o5op0J70k11P2r4J56K0j81N7J48p4M4L3j46J46k07J20N7
5592D7J3j65J57m8j6J1j32J33k1k4J05k7n7N3j27J85j21N2L6Kl5R5j41L2J8j07
5618h2J31j44K66j05P5j39P5j64N2J04o4P0p1R5q8m4k2O3o5m0OK02k75K23r6L3
5644dP8j05M2o0J18j60J63n5p4MO4M1k5J73j92jJ4j5j7L1r4p2J11Q5j31R9M9p
5672F0j29J9M8lj9R6L7r8L5j08J18j3kj7l3on4l1R9L0q8Q4p1J06Mj16Q6M1j87
$$ plain form
5485 42 225 228 116 180 -177 32 -26 -104 50 47 93 -26 67 -11 80 16 -82 141 67 118 -3 -88 -136 -31 -26 -20 -138
5512 -138 -39 150 12 -45 6 50 51 97 -85 82 -10 102 -6 44 30 51 -72 57 72 -155 33 113 -35 58 -5
5537 -5 73 5 18 -106 84 37 -55 -34 -42 -30 131 -84 -59 -147 -90 39 39 28 -20 -84 -7 -60 -92 138 -76 -58 -24 -37
5565 -37 -12 -8 90 102 75 44 78 13 7 -63 107 -104 -32 -126 30 50 -131 -74 74 0 44 77 -69 77 -130 -10 47
5592 47 60 -105 52 4 -12 -1 -133 0 -21 -45 60 33 -24 29 -98 87 -34 18 54 56 21 116 -25 7 25 -82
5618 -82 49 -95 171 66 141 2 77 -87 -35 69 5 75 4 99 11 -33 -55 8 -57 -97 -91 111 -164 59 -37 -4
5644 -4 74 -31 11 -49 69 -91 72 17 -57 -53 11 52 27 200 8 7 21 6 -11 20 -74 -146 -35 50 -81 18 67 60
5672 60 -69 -50 -2 -5 -24 72 109 11 46 -62 56 43 41 24 -9 -15 -69 -100 -1 29 -59 25 -46 60 64 -52 34 75 -112
5701a12K7N7J7K3q5J33K0r6P4q0j1P0l9j03M0J02l8j4k3J0R3j31P0J32j91k0K35
5728A60k09J9MK31k43q6J39p9J78j79J40j0j23K6R3J6p1N2n3O8N1o9p7QRq0M5
5755d0Q0k8rRp3J73k01N5P0m1l5K3kN5M8q4N4r6M6o7M8M9o3L5P5q0J04j22Qq0
5785h9J34J1p8J47q1K2N6n1j30J86k52J73l6k0J0n1M9L1p8L9NK4j48K22j23M7
5811A9m4jP8j35M1L7M8N3j01rP7p2L1K4J1n7M8j52J61k8J51j31j60k6P8J24n2
5838A3K8j05p3J75n9RK0j19K29j16R0p0j35J43o7J73j40Q7r5K07p4nj04p3M0P0
5864D9J8l2R5r6k6n8k8J27n1j50K55j15J6P8m5J9q2J34k07R7J3Q1n9j37J92j90
5890a02O3M7k9l9J06j91L03j68O6O2J4j10m2j21O6J44j36L3J16j11P7j5k9P8n9
$$ plain form
5701 -112 -85 -28 -11 12 -73 60 80 -16 58 -22 -33 37 -2 -105 -65 37 -1 -15 -38 -28 65 -66 4 136 -55 -75 160
5728 160 -49 -30 -26 205 -38 -124 15 -64 114 -65 75 65 -58 -32 61 77 6 58 5 73 124 55 -22 -14 -5 -85 -40
5755 -40 40 12 3 12 -61 112 -89 -34 36 -5 -40 -17 -19 36 84 0 54 -42 4 -63 -15 34 -29 6 81 1 105 -17 -9 -89
5785 -89 45 56 -22 125 44 66 122 71 -59 127 -125 48 12 -8 2 -49 0 31 -47 -8 -3 21 -127 95 -28 19
5811 19 -25 -26 52 -83 -42 -5 43 96 -5 -14 63 -9 22 46 57 0 48 -104 57 29 180 49 -111 -137 -59 65 13
5838 13 41 -64 -137 38 -21 -12 8 -111 118 2 92 22 -113 30 -37 136 -4 83 -12 195 121 116 12 -61 -21 49
5864 49 67 35 130 34 8 -50 -78 49 -2 -152 103 -12 4 82 37 56 -26 108 -99 -2 11 92 33 -104 88 -102
5890 -102 -39 8 -21 -60 46 -145 158 -10 56 118 132 22 -20 -141 -75 69 -67 -34 82 -29 48 33 4 82 23
5915B3M0p1J2j1M2O1n1k7mJ40j91K7M4j0l5LK9N2m9j15kJ86j50J18j28N1L0r1
5943g7J27j1j38L4O5k7O6j39R9M0l6r4R2p8rJ20J0j0r7R5l5l0M7P6o4q0J20j54
5971h8K09k05J70j12O9j13RO9M2o3qJ9Jn0J01j12rK5J61j25K5O3p0Q4j08k9J07
5998F2j2O6j91K32k40K46k6N6k40J48l76J47J50J04k26J33L72l71J61k23N79k73
6020B78k31j77l2J36p2l56N30K34l81l26J97L81Pl34J06K38n13Q34n52J3l52l9
6042d11N17J46n62P4J03N45K33k83k18l86K59M34r01M60p4O0J70n0j98j95Q9K8
6064a60N4K37j00J11r3l7j39N99m21k8k7N0j6p7N8K9L3P9j63K7j04L3p1K56j42
6089a2j33K43j40L2N1J60k29K4Ll4J46J31k70J08p0n8L6P7o8R8k58J49j4Q8Nj01
$$ plain form
5915 23 63 -8 4 -7 35 96 45 18 14 154 -37 -10 34 24 -11 -8 21 73 24 -91 -93 93 -57 61 -67 -16 14 -77
5943 -77 50 39 -99 -65 0 -27 39 -100 -1 39 3 -91 1 -77 -86 34 44 34 -63 32 -3 -33 14 90 26 -54 66 -88
5971 -88 121 -84 86 -26 43 -70 -61 8 50 -13 -21 -2 -1 -51 50 -62 -71 -46 115 -10 15 78 8 92 -16 -45 62
5998 62 50 116 -75 157 -83 163 137 193 -47 101 -275 -128 22 126 -100 33 405 34 195 -28 551 278
6020 278 47 -130 -162 -26 -98 -454 76 310 -71 -397 -200 181 188 -146 -40 198 -315 519 -33 -20 -372 -411
6042 -411 106 252 -310 -236 -133 412 645 362 144 -242 17 451 -450 10 -64 -4 166 116 -82 -277 -188 -160
6064 -160 -106 131 31 142 49 12 -127 472 51 23 -4 46 30 -47 11 40 73 152 -11 16 -88 -55 -126 130 -12
6089 -12 -145 98 -42 -10 41 201 -28 -4 -1 -35 111 242 -28 80 10 -48 -12 65 -3 95 -163 -14 -28 60 65 -36
$$ [...]
8191d03
##END NTUPLES=NMR FID
##END=
