##TITLE=1H_DE-80H_X3
 200.13MHz, d2o
 8 sc
 
 19ns.26.2.2025
##JCAMPDX= 6.0         $$ Bruker NMR JCAMP-DX V2.0
##DATA TYPE= NMR FID
##DATA CLASS= NTUPLES
##ORIGIN= UXNMR, Bruker Analytische Messtechnik GmbH
##OWNER= pz
$$ XWIN-NMR		Version 3.5
$$ Wed Jan 28 14:54:13 2026 Russian Standard Time (UT+4h)  Yarkov@DPX200
##.OBSERVE FREQUENCY= 200.1313
##.OBSERVE NUCLEUS= ^1H
##.DELAY= (6, 6)
##.ACQUISITION MODE= SIMULTANEOUS
##.ACQUISITION SCHEME= undefined
##.AVERAGES= 8
##.DIGITISER RES= 18
##SPECTROMETER/DATA SYSTEM= spect
##.PULSE SEQUENCE= zg30
##.SOLVENT NAME= D2O
##.SHIFT REFERENCE= (INTERNAL, D2O, 0, 14.3821)
##AUDIT TRAIL= $$ (NUMBER, WHEN, WHO, WHERE, WHAT)
$$ ##TITLE= Audit trail, XWIN-NMR		Version 3.5
$$ ##JCAMPDX= 5.01
$$ ##ORIGIN= Bruker BioSpin GmbH
$$ ##OWNER= Yarkov
$$ C:/Bruker/XWIN-NMR/data/yarkov2/nmr/H-C/1/audita.txt
$$ ##AUDIT TRAIL=  $$ (NUMBER, WHEN, WHO, WHERE, WHAT)
(   1,<2026-01-28 14:53:28.98 +0400>,<Yarkov>,<DPX200>,
      <created by zg, POWCHK disabled, PULCHK disabled
       configuration hash MD5:
       00 E9 B6 7A A2 85 ED C7 34 08 36 98 17 FE 4E 26
       data hash MD5: 16K
       B2 98 6E F8 8E 41 DE DF B8 0A 97 6E 8E 79 45 34>)
$$ ##END=
$$ 
$$ hash MD5
$$ 59 0A 30 95 1F F5 56 72 D9 AB 4C 6D 87 FC 83 21
##$RELAX= 
##$RELAX= 
##$RELAX= 
##$RELAX= 
##$RELAX= 
##$RELAX= 
$$ Bruker specific parameters
$$ --------------------------
##$DU= <C:/Bruker/XWIN-NMR>
##$EXPNO= 1
##$NAME= <H-C>
##$PROCNO= 1
##$TYPE= <nmr>
##$USER= <yarkov2>
##$AMP= (0..31)
100 100 100 100 100 100 100 100 100 100 100 100 100 100 100 100 100 100 
100 100 100 100 100 100 100 100 100 100 100 100 100 100 
##$AQSEQ= 0
##$AQ_mod= 1
##$AUNM= <au_zg>
##$AUTOPOS= <>
##$BF1= 200.13
##$BF2= 200.13
##$BF3= 200.13
##$BF4= 200.13
##$BF5= 200.13
##$BF6= 200.13
##$BF7= 200.13
##$BF8= 200.13
##$BYTORDA= 1
##$CFDGTYP= 0
##$CFRGTYP= 5
##$CHEMSTR= <none>
##$CNST= (0..31)
1 1 145 1 1 1 1 1 1 1 1 1 1 1 1 1 1 1 1 1 1 1 1 1 1 1 1 1 1 1 1 1 
##$CPDPRG= <>
##$CPDPRG1= <>
##$CPDPRG2= <>
##$CPDPRG3= <>
##$CPDPRG4= <mlev>
##$CPDPRG5= <mlev>
##$CPDPRG6= <mlev>
##$CPDPRG7= <mlev>
##$CPDPRG8= <mlev>
##$CPDPRGB= <>
##$CPDPRGT= <>
##$D= (0..31)
0 0.7 0 0 0 0 0 0 0 0 0 0.03 0 0 0 0 0 0 0 0 0 0 0 0 0 0 0 0 0 0 0 0 
##$DATE= 1769597608
##$DBL= (0..7)
120 120 120 120 120 120 120 120 
##$DBP= (0..7)
150 150 150 150 150 150 150 150 
##$DBP07= 0
##$DBPNAM0= <>
##$DBPNAM1= <>
##$DBPNAM2= <>
##$DBPNAM3= <>
##$DBPNAM4= <>
##$DBPNAM5= <>
##$DBPNAM6= <>
##$DBPNAM7= <>
##$DBPOAL= (0..7)
0.5 0.5 0.5 0.5 0.5 0.5 0.5 0.5 
##$DBPOFFS= (0..7)
0 0 0 0 0 0 0 0 
##$DE= 6
##$DECBNUC= <off>
##$DECIM= 32
##$DECNUC= <off>
##$DECSTAT= 4
##$DIGMOD= 1
##$DIGTYP= 9
##$DL= (0..7)
0 120 120 120 120 120 120 120 
##$DP= (0..7)
150 150 150 150 150 150 150 150 
##$DP07= 0
##$DPNAME0= <>
##$DPNAME1= <>
##$DPNAME2= <>
##$DPNAME3= <>
##$DPNAME4= <>
##$DPNAME5= <>
##$DPNAME6= <>
##$DPNAME7= <>
##$DPOAL= (0..7)
0.5 0.5 0.5 0.5 0.5 0.5 0.5 0.5 
##$DPOFFS= (0..7)
0 0 0 0 0 0 0 0 
##$DQDMODE= 0
##$DR= 18
##$DS= 0
$$ [...]
##$SUBNAM2= <"">
##$SUBNAM3= <"">
##$SUBNAM4= <"">
##$SUBNAM5= <"">
##$SUBNAM6= <"">
##$SUBNAM7= <"">
##$SUBNAM8= <"">
##$SUBNAM9= <"">
##$SW= 18.0517328524113
##$SWIBOX= (0..15)
0 0 2 0 0 0 0 0 0 0 0 0 0 0 0 0 
##$SW_h= 3612.71676300578
##$TD= 16384
##$TD0= 1
##$TE= 0
##$TE2= 300
##$TE3= 300
##$TEG= 300
##$TL= (0..7)
0 120 120 120 120 120 120 120 
##$TP= (0..7)
150 150 150 150 150 150 150 150 
##$TP07= 0
##$TPNAME0= <>
##$TPNAME1= <>
##$TPNAME2= <>
##$TPNAME3= <>
##$TPNAME4= <>
##$TPNAME5= <>
##$TPNAME6= <>
##$TPNAME7= <>
##$TPOAL= (0..7)
0.5 0.5 0.5 0.5 0.5 0.5 0.5 0.5 
##$TPOFFS= (0..7)
0 0 0 0 0 0 0 0 
##$TUNHIN= 0
##$TUNHOUT= 0
##$TUNXOUT= 0
##$USERA1= <user>
##$USERA2= <user>
##$USERA3= <user>
##$USERA4= <user>
##$USERA5= <user>
##$V9= 5
##$VALIST= <valist>
##$VCLIST= <CCCCCCCCCCCCCCC>
##$VD= 0
##$VDLIST= <DDDDDDDDDDDDDDD>
##$VPLIST= <PPPPPPPPPPPPPPP>
##$VTLIST= <TTTTTTTTTTTTTTT>
##$WBST= 1024
##$WBSW= 4
##$XGAIN= (0..3)
0 0 0 0 
##$XL= 0
##$YL= 0
##$YMAX_a= 286375
##$YMIN_a= -329075
##$ZGOPTNS= <>
##$ZL1= 120
##$ZL2= 120
##$ZL3= 120
##$ZL4= 120
##$ABSF1= 10
##$ABSF2= 0
##$ABSG= 5
##$ABSL= 3
##$ALPHA= 0
##$AQORDER= 0
##$ASSFAC= 0
##$ASSFACI= 0
##$ASSFACX= 0
##$ASSWID= 0
##$AUNMP= <proc_1d>
##$AZFE= 0.1
##$AZFW= 0.1
##$BCFW= 1
##$BC_mod= 2
##$BYTORDP= 1
##$COROFFS= 0
##$CY= 83.5205535888672
##$DATMOD= 1
##$DC= 2
##$DFILT= <>
##$DTYPP= 0
##$F1P= 10.8118882576601
##$F2P= -7.23987719738617
##$FCOR= 0.5
##$FTSIZE= 0
##$FT_mod= 4
##$GAMMA= 1
##$GB= 0.15
##$INTBC= 1
##$INTSCL= 1
##$ISEN= 128
##$LB= 0.25
##$LEV0= 0
##$LPBIN= 0
##$MAXI= 10000
##$MC2= 0
##$MEAN= 0
##$ME_mod= 0
##$MI= 1.114404
##$NCOEF= 0
##$NC_proc= 0
##$NLEV= 6
##$NOISF1= 3.799351
##$NOISF2= 2.8
##$NSP= 1
##$NTH_PI= 0
##$NZP= 0
##$OFFSET= 14.38212
##$PC= 1
##$PHC0= -5219.697
##$PHC1= 7.62193
##$PH_mod= 1
##$PKNL= yes
##$PPARMOD= 0
##$PSCAL= 0
##$PSIGN= 0
##$REVERSE= no
##$SF= 200.129724274929
##$SI= 16384
##$SIGF1= 3
##$SIGF2= 2
##$SINO= 400
##$SIOLD= 16384
##$SREGLST= <1H.CDCl3>
##$SSB= 0
##$STSI= 0
##$STSR= 0
##$SW_p= 3205.1282051282
##$SYMM= 0
##$S_DEV= 0
##$TDeff= 0
##$TDoff= 0
##$TI= <>
##$TILT= no
##$TM1= 0
##$TM2= 0
##$TOPLEV= 0
##$USERP1= <user>
##$USERP2= <user>
##$USERP3= <user>
##$USERP4= <user>
##$USERP5= <user>
##$WDW= 1
##$XDIM= 8192
##$YMAX_p= 0
##$YMIN_p= 0
$$ End of Bruker specific parameters
$$ ---------------------------------
##NTUPLES= NMR FID
##VAR_NAME=  TIME,          FID/REAL,        FID/IMAG
##SYMBOL=    X,             R,               I
##VAR_TYPE=  INDEPENDENT,   DEPENDENT,       DEPENDENT
##VAR_FORM=  AFFN,          ASDF,            ASDF
##VAR_DIM=   8192,          8192,            8192
##UNITS=     SECONDS,       ARBITRARY UNITS, ARBITRARY UNITS
##FACTOR=    0.0002768,     1,               1
##FIRST=     0,             0,               0
##LAST=      2.2672688,     0,               0
##MIN=       0,             -329075,         0
##MAX=       2.2672688,     286375,          0
$$ Real data points
##PAGE= N=1
##DATA TABLE= (X++(R..R)), XYDATA
0@%%%%%%%%%qJ6j6J6k4L2m0N6o5P3r6J20j44J69j98K37k76L21l73M30m95N69o49
32c45P38q37R46j067J199j344J505j681J870k079K310k560K834l133L457l812
48a999M203m628N094n610O179o812P519q310R202j0219J1391j2755J4369j6315
62h691J8712k1750K5739l1244L9392n2876Q0647k28821J96642J51661j62905J8040
74B4546k35142L74899k73546K00500M9213l65112K13282p289K71326l12799j95335
85b55457M16975k00029J58363j82701K7117M8256j61220M27134l11468j16279
95a49309J07178Q4571J89654m43702K14955J6139p4079J95774k02181J12580k37875
106a86295K15914K19635l86366R7438n6720K38645q8280j77193K33006k63862
$$ y = [0, 0, 0, 0, 0, 0, 0, 0, 0, 0, -8, 8, -8, 8, -16, 16, -24, 32, -33, 40, -56, 64, -80, 89, -109, 128, -148, 173, -200, 230, -265, 304, -345, 393, -444, 502, -565, 634, -710, 795, -886, 984, -1095, 1215, -1345, 1489, -1644, 1813, -1999, 2204, -2424, 2670, -2940, 3239, -3573, 3946, -4364, 4838, -5381, 6010, -6745, 7624, -8691, 10021, -11729, 14010, -17234, 22158, -30718, 49929, -178892, 17750, 169411, 6506, 24546, -210596, 164303, -109243, 91257, 140470, -224642, -11360, -18649, 252677, -60122, -255457, 161518, -38511, 119852, -62849, -35732, 12524, -148696, 278438, -33030, -149309, -42131, 42440, 232094, -211608, 3347, 19486, -54593, 141181, -61000, 51580, -186295, 29619, 249254, -137112, -39674, -96394, 142251, 53971, -123222, 109784, -154078]
116a54078J96831M2501o1043m5598k01845M26525j42244j31548M7735n9330K19067
127A36973k08915J48141p3965j77550K82427o9218N1063k40628P4453K52688k31439
138e5970J05587j23255N5520M6807n2925J84219l04461P6851J37225j3550j545
149E4503k28886K34107l9555k8783Q9030j71623R7451o6118J65307k8858k40834
160a64259J80205j0328Q7518j15854n5185J32598j31059J67376o1324q4301J6599
171c8014n592K04688k03350k7840P3787j4344J00560j38817O7570o4385O36J64214
183A19113j32971m272o7811J19196O6308j60934P1362o4563P2255K8930n1097
194d484K8070j31544J39287L8893p1631k1218n6280J45755m9061j5024N96p5169
$$ y = [-154078, 42753, 85254, 24211, -21387, -223232, 203293, 61049, -70499, -22764, -82094, 136973, -71942, 76199, 2234, -175316, 107111, 37893, 88956, -151672, -77219, 175469, -55970, 49617, -73638, -18118, 28689, -24236, 159983, -144478, -67627, 69598, 56048, 54503, -174383, 59724, 20169, -8614, 80416, -91207, 6244, -59874, 105433, 76575, -164259, 15946, 5618, 93136, -22718, -77903, 54695, -76364, 91012, 29688, -54613, -38014, -43606, 161082, -42268, -70108, 3679, -10665, 89895, -48922, 18648, -45737, -45101, 119113, -13858, -18130, -85941, 33255, 99563, -61371, 9991, -54572, 17683, 46613, -4484, 23586, -107958, 31329, 70222, -1409, -22627, -78907, 66848, 17787, 2763, 3359, -71810]
206g1810J02822j3355L0240p8668n1482J35888k8287K599p1672N038P2801l3773
218C41M9844q5882j1322O0078J5009K4990j15589L2405N1174J133J2773q1052
230d6098K9525R684L6585J5050r1050J9980K0261N3288k1330p2047L2098M222
242i832M9625j7263n2093O846O629O4831k7689n0634J201K1372N2885l4676l0668
255a9466r037J9512N1125k6917l0692j9389K9513M6399k6716l0831j7330L1840
267a989L6109j6925l1023k1192L3785L2920j2761l3675j9557L3106L0623r655
279A9766l4097j7675K9036L2465q799l6751j3202K5285L1191o674l4925j3847
291b8227K2353L3495o731l4412j5477K3711L3279j1026k8023j6099K0042L3997
$$ y = [-71810, 31012, 17657, 47897, -30771, -82253, 53635, 25348, 27947, -43725, -38687, 34114, 341, 50185, -35697, -47019, 13059, 28068, 53058, -62531, -30126, 21048, 22181, 34954, -46098, -16573, -6889, 29696, 44746, -46304, -26324, -6063, 47225, 25895, -46152, -14054, -9832, 39793, 22530, -29563, -22717, -16088, 48743, 21054, -29580, -28379, -7007, 45878, 11202, -19466, -28503, -8991, 42134, 15217, -15475, -34864, -5351, 41048, 14332, -16499, -33829, -1989, 34120, 17195, -13828, -35020, -1235, 31685, 18924, -14751, -34308, -1202, 29421, 19766, -14331, -32006, -2970, 29495, 20696, -16055, -29257, -3972, 27219, 20545, -14380, -28227, -5874, 27621, 20890, -13522, -28999, -5288, 27991, 16965, -11058, -27157, -7115, 26882]
303B6882r277k6124j9888K1279L4196r862k6448j9025K3591K7771o043k2896k3014
316b8858K4129K6253l036k4318k4121K6328K4117k852k3802k0742K2572K2339
328A8009J941k6300j9779K0785K2423L897k8827j6937K0246K0502M160k6276j7178
341b3334J6760K2603L432k5064j7562J5528K4897Q58k3453j5931J3815K2827K392
354A7768k1189j8983J5031K1706M081k1086k1307J9849J7085L774j8117k1329
366b2717J8243J3749J0331k1047k2168J9616J3158J2917k8590j3405J8588M695
378C370J9820k9025j0876J0519R479K5901l9900n249J0306J2726J7002l8815J0321
391d421p946J6371K2761l8262P052j7194L7339R384m4773J9727j8310L4844n267
$$ y = [26882, 17605, -8519, -28407, -7128, 27068, 17206, -9242, -28267, -4676, 23095, 17052, -5844, -28858, -4729, 21524, 18488, -5830, -29951, -3623, 20494, 17642, -6160, -26902, -4330, 18009, 19950, -6350, -26129, -5344, 17079, 20976, -7851, -24788, -4542, 15960, 20120, -6156, -23334, -6574, 16029, 19461, -5603, -23165, -7637, 17260, 18118, -5335, -21266, -7451, 15376, 17768, -3421, -22404, -7373, 14333, 18414, -2672, -23979, -4130, 12955, 16729, -1388, -22717, -4474, 9275, 19606, -1441, -23609, -3993, 9165, 22082, -6508, -19913, -1325, 3370, 23190, -5835, -16711, -6192, 3287, 29188, -10712, -15961, -5655, 7071, 24073, -14742, -4421, -12367, 4004, 26765, -11497, -4445, -21639, 15700, 25084, -19689, 38, -18272, 16572, 11305]
404A1305j9212J3983l8480N3931p006j7565m529k1158O6084m1710J997L455k5208
417b4113M8583l3255L1202l7471j6610O7330l9604J8047m3875K7271L0395n3118
429b5218N6427n3360J4077J4950p534L9898r3196N9597J3685k2968J8762n3299
441c8179P0088n1983K1148L6099p7676N0234k9863O0458l6401n7667R5193o0926
453a9475L8909k7769J154K9733p7380J11026n7495k4236K6088j4345P5888j17763
465e5665O2944J5294n7391O9318n9805O2801p8156K1047R3211j18190N2443l4277
477b6426N7462j5603p3301J23608j06674L7619J8996j4340K8036j14868J46356
488F0865m4051n4364N5308m5568Q1249j08878P5614K2745j15426J06471m3507
$$ y = [11305, -7907, 6076, -32404, 21527, 14521, -3044, -7573, -28731, 37353, -4357, -2360, 1095, -24113, 24470, -8785, 22417, -15054, -31664, 35666, -3938, 14109, -29766, -2495, 27900, -25218, 31209, -22151, -8074, 6876, -658, 39240, -53956, 5641, 19326, -3642, 15120, -38179, 31909, -20074, 1074, 37173, -40503, 9731, -20132, 40326, 3925, -53742, 41451, -19475, 19434, -8335, -7181, 22552, -54828, 56198, -1297, -25533, 555, -13790, 62098, -55665, 7279, 22573, -34818, 34500, -25305, 37496, -40660, -19613, 73598, -44592, 7851, -26426, 31036, 15433, -57868, 65740, -40934, -3315, 15681, 1341, 29377, -85491, 60865, 16814, -37550, 17758, -27810, 53439, -55439, 20175, 42920, -72506, 33965, -9542]
499i542N3613q3511j317J28444j43127P0389k0678J2273L631p0133J53612j36511
511d2857R631O4080l2087M0870j27961J45820m1259p4376J09440p7534N9304r4302
523f1231Q5506M6748j67202J29213l6792L5094n4452j8559J34904j73433R5290
534A5086J4692m0355J3990p1771J74552j40901j4371R8463p0642N6627j02855
545f7485J25934m5601r8281J59324q7936L0447p0793O6690O7716j79352J41016
556D1679l7341p541k741k3244J22105j83441R1555N4202p8185L0887p0272J52219
568H9882j20182j9928J24506j15302N7125n9646J00259l8617j19697J81473q9342
579i469J1682l0967L0282O6379j68281J55400l5895n4431L8407k5431J11799j72787
$$ y = [-9542, 44071, -39440, -40757, 87687, -55440, 14949, -5729, 6544, 10175, -59958, 93654, -42857, -33226, 30854, -1233, 39637, -88324, 57496, 16237, -58139, 51301, -26233, 33071, -61231, 24275, 71023, -96179, 33034, -3758, 31336, -23116, -41675, 93229, -80204, 15086, 29778, -10577, 3413, -68358, 106194, -34707, -49078, 49385, -21257, 35370, -67485, 58449, 12848, -85433, 73891, -14045, 16402, -54391, 12299, 80015, -99337, 41679, 4338, -3203, -5944, -29188, 92917, -90524, 1031, 55233, -22952, 7935, -62337, 89882, -30300, -50228, 74278, -41024, 16101, -43545, 56714, 18097, -101600, 79873, -9469, 2213, -28754, 1528, 67907, -100374, 55026, 19131, -35300, 3107, -22324, 89475, -83312]
591h3312P5262P2028j06094O1479n9947J04612r5386j8507J40976j37110M6711
602G12k5578O4467j4265j17158J66902q9105j679K0120p427N1669j39141J40350
614D9867j6888q1708O0738l2312Q5384j24298N2573O8826j21205Q0134l4030N3287
626D0368o5897k4710J37751j28159L5488N15J9020P272r0613J39374q6951j5883
638c2425N6522k8370M1341j09859J07925j992q3013P5880m4085N2665p2775L6369
650a817N9045j18600P7970j6817K1961l1681l2884J08572j01341L2693J7211k0499
662f187J9418n9090J00834o3676k6859O2099l4825L3663o7266O1274K886o6486
674d4215P5975m0094J8161l1564J8580M9228r1570N5657n819j142p10k7598O6376
$$ y = [-83312, -8050, 63978, -42116, 19363, -40584, 64028, -31358, -49865, 91111, -45999, 712, -24866, 39601, 25336, -91822, 75080, -14025, -15704, 4416, -3011, 48658, -90483, 49867, 32979, -48729, 12009, -20303, 65081, -59217, -6644, 62182, -59023, 21111, -12919, 40368, -25529, -50239, 87512, -40647, -5159, -4644, 14376, 21648, -68965, 70409, -16542, -32425, 24097, -4273, 37068, -72791, 35134, 33142, -49871, 26009, -18076, 34589, -38186, -1817, 57228, -61372, 16598, -219, 21742, -9939, -42823, 65749, -35592, -2899, 14312, -6187, 13231, -45859, 54975, -8701, -35560, 26539, -8286, 25377, -41889, 19385, 22271, -44215, 31760, -8334, 9827, -21737, -3157, 46071, -45499, 10158, 4339, 3197, 2487, -25111, 41265]
687D1265p1441K6295K7238l4932J9384l7716O3616l4487k5075M9188l7246K6873
699A2962k9077K6950J696m7221N9972k7711M795j1034M22L6662n4028L5073n559
712C902j2920J5852j7335L3243m0950J1867K3541k5287J5311k2338K6981j1013
724H54j2968K9820k9367J3049m239P917L378k7647K9377j0221M25O75p373J5313
738H993j9864J8244k987j3285J1697o742J4275j5017m39J0750j0213J0202q183
751b569L118k247j747J2197j2330K416p85K614M489r110M967l253K151L805m307
766e91m48j974N019L58k435j521n40L411O74r96l494J080K127K232k973k595L227
783E61k303N244k877l440K613j535P026o601j024K812j865N711o775L516l161
$$ y = [41265, -30176, -3881, 23357, -11575, 7809, -29907, 33709, -778, -25853, 23335, -13911, 12962, -16115, 10835, 12531, -34690, 25282, -2429, 2366, -8668, -8246, 28416, -25612, 9461, 3902, -9018, 6834, -10501, 22742, -18208, -6341, 17200, -8087, 7224, -15114, 11867, 854, -12114, 17706, -11661, 1388, -2851, 5066, 8444, -19203, 10174, -47, 378, 1053, -6320, 8993, -10871, 7373, 4386, -8899, 2798, -3944, 10331, -4686, -5125, 5625, -4588, 5614, -2569, 549, -1698, -3445, 8752, -3578, -1162, -1947, 667, 5156, -3954, 1013, -2240, -89, 3716, -591, -1039, -3013, 2006, 2364, -71, -1592, -2132, 1279, 1953, 957, -2537, -1457, 670, 2902, -71, -2666, 561, -1742, 3502, 625, -2815, -202, -1737, 5289, -1312, -2336, 476, -1389, 4322, -2453, 1063, -2098]
798b098o8Q492r521M266m405L738N016j0265P824o542M096K578n345N599j0072
813f707J0184j186m287M505r066J2112o611N38L529r948J2034o602L697k155n635
828e598J1380q896O591n551j209P887q685R893r480J462N917o884Q771j0441M795
843d8J609l464P172j0561O791k128P76M119j0045Q557m805L004K301p877O884
858B285m905N146p24n300M948l836N478l222j473K522l676O369l660j020R92j770
874a846N041l302j193R08l18K423j189j272j48O09J605l87j940K16j88K733n11
891A241l423K792k005L619j410l372M917n670N409o83l390L008m966R314o364
906i83j217M285n494Q426r474O979j336q083J4481j0866N959n866R77J1332j8167
$$ y = [-2098, -2166, 6326, -3195, 1071, -3334, 404, 5420, -4845, 2979, -3563, 533, 3111, -2234, 3365, -6707, 3477, 2291, -1996, 2509, -6557, 5555, -1056, -518, 3011, -6937, 5097, -1505, 2192, 37, -5598, 5782, -3114, 3477, -2074, -3283, 4604, -4081, 5812, -3668, -2206, 3711, -3173, 5598, -4843, -48, 1561, -1903, 5269, -5292, 1499, -629, 147, 4266, -5779, 2778, -2027, 977, 3278, -4599, 2285, -2620, 2526, 1802, -3498, 1450, -2386, 3092, -130, -1603, 919, -2757, 3612, -48, -1068, -76, -1846, 3195, -107, -1300, -392, -710, 1713, 524, -748, -896, -287, 1318, 931, -1009, -793, -981, 1752, 1241, -2182, 610, -1395, 2224, 814, -2558, 2359, -3311, 2098, 1415, -1975, 1033, -3933, 5381, -983, -2200, 2085, -3409, 5017, -4457, 2522, 1186, -6897, 7584, -3282, 2677, -3189, -2212, 9120, -9047]
921i047J3957o608Q50L631r086J8123k2308J0844O332j1922J1320j7729K2591
934A0948j2571p000K0909k1502J5132j3147J2929J465k5776L3101j8900O408m152
947b156l550K2912l7291K9807m993j3145J3707j6124L1463l5666J0201K0884k8706
960a2657K1569k1800K7796j7072j6360M4301l9175J6282r406J1375R290m4160
972c0017N2735k5606l416R941j0354K9732n4368M3710K064l3699K8923k2847L8987
985B5785m4918R965L9659n5563L4050j7445K4437j8431k6611O8678n7302J5136
997b560K996J771J4898n6716P2278l2818k0350L3424k0327L2507o1825M8845J2798
1010B4921n7351M7633k4827L1551m2057P331N6515p9322M1895n195R348r989l5487
$$ y = [-9047, 4910, -1698, -848, 2783, -6303, 11820, -10488, 356, 6688, -5234, 6086, -11643, 10948, -1623, -8623, 12286, -9216, 5916, -7231, 5698, 7163, -18613, 14488, -4412, 1996, -2156, -5706, 17206, -20085, 9722, 4729, -8416, 5291, -10833, 20630, -15036, -4835, 16049, -12657, 8912, -12888, 14908, -2164, -18524, 25777, -13398, 2884, -6522, 4853, 14143, -30017, 22718, -2888, -6304, 3637, -6717, 23015, -31353, 12357, 14421, -19278, 9645, -13202, 25785, -19133, -9168, 30491, -25072, 8978, -8467, 15970, -2461, -29072, 39606, -17696, -2560, 436, 2207, 17105, -39611, 32667, -151, -20501, 12923, -7404, 25103, -36722, 12123, 24921, -32430, 15203, -9624, 21927, -20130, -12799, 43716, -35606, 6289, 1094, 10442, 453, -35034]
1023c5034Q3186o8471Q051K6545j7367J8391n7570Q0350l3679l9019N8532l2053
1035h138K9004n6413M7510K0461p9565O9288k3972J4029l0342L947O6535r6989
1047d4645M9356P678j2344K270l6982Q8192p7766L437N0478l9723K2107n0454
1059c8396P5369k9463n1701P8531m2979J9840l8388L7906K4819r0881Q1328j9958
1071F027p002r303m339O5960r7151M7760K3096l8276J6628l0288P5656p2060l583
1084b6875O7845n7728K3620l3667N7517k2316n7355R1892n1165O263j2622K2696
1096H105K5106q9587Q4560j7014k5061J3249j1700N6802q9024M6184L1447n7745
1108b4678L0911k4901N7303n7581q515P2588o7223K5041j6354L4124j2732n3942
$$ y = [-35034, 48152, -20319, -12268, 14277, -3090, 15301, -42269, 38081, 4402, -34617, 23915, -8138, 20866, -35547, 11963, 32424, -47141, 22147, -1825, 12204, -18138, -14191, 52344, -44645, 4711, 12389, 45, 2315, -34667, 53525, -24241, -20804, 29674, -10049, 12058, -38396, 36973, 7510, -44191, 34340, -8639, 11201, -27187, 10719, 35538, -55343, 25985, 6027, -975, -10278, -14617, 51343, -45808, 1952, 25048, -13228, 3400, -26888, 48768, -23292, -26875, 40970, -16758, 6862, -26805, 30712, 8396, -48959, 42933, -8232, -1969, -14591, 8105, 33211, -56376, 28184, 11170, -13891, -642, -12342, 44460, -44564, 1620, 33067, -24678, 6233, -18668, 38635, -18946, -27461, 45127, -22096, 2945, -13409, 20715, 7983, -45959]
1120d5959Q9656n1214l163R365L464K5022p4605P2041j0469l7920L1554j5540
1132g768L8580o5662L4890L4380o4117L7228j5839L1293l5597j1158O6641o6355
1144b3484K1430K835Q937l377m2723P3954m4296q567K4235j1417K1029n3719N5853
1157B0690p289m0588M0674j9306K4200m1315K1556L0377n7369L7377j1039J2280
1169A0248j6639j1450N2077n4985J7855J0109o990O282l1139N1060l0995j0598
1181a5165K8972j8680J4596l0388L3637k153l3992L6932j7160J0414j7319Q127
1193b179K2613m2488K8966l443l420j460r330L2238l5165J0808J2006j3842R644
1206D948j8063K8074j7655r176K4639j8109R844j3531J4550J679k1837K4752j2694
$$ y = [-45959, 43697, -7517, -10680, -1315, 2149, 27171, -47434, 24607, 14138, -23782, 7772, -7768, 30812, -34850, 40, 34420, -29697, 7531, -8308, 22985, -12612, -23770, 42871, -23484, -2054, 781, 9718, 6341, -36382, 37572, -6724, -15291, 8944, -2473, 18556, -35163, 20690, 13401, -27187, 13487, -5819, 18381, -22934, -1378, 28999, -28370, 9007, -2032, 10248, -6391, -17841, 34236, -20749, -2894, 7215, 225, 6507, -24632, 26428, -4567, -15165, 13807, -4873, 9723, -20665, 12972, 10819, -23173, 13759, -3401, 7013, -10306, -2179, 20434, -22054, 6912, 3469, 49, -1411, -10741, 21497, -13668, -2860, 9146, -4696, 4948, -13115, 14959, -2696, -11872, 12767, -5342, 4502, -9029, 5521, 7200, -14637, 10115, -2579]
1219b579L885m207P70J3655k4810J8063j601o177N013q047J5945j6437M617Q353
1233F443j1220P447p221J0476o805n084J3078j0683M907l150K437K483r217J0802
1247D693n081j066K024j392M141p401N413j56l106L420k973L403l256P61K841
1262B265l953J987m95M46j73n48R24q60O83K3k51l93N15k07O0j41P2M04j589L003
1282A772k258m85K291k520K730l228K120P28l551M621l340K053j809L37L663o815
1298c691N913k919K98J898m613P209p040L151K066m882N223n998O279l417j872
1313b395O112p394O762n125K454K166p578R732p303L110L06l694P387r017P283
1328B806k908j908N323p456Q522p428K719L415p482Q870q003N151o48m193P833
$$ y = [-2579, 1306, -2901, -2131, 11524, -13286, 4777, 3176, -3001, 2012, -6035, 9910, -6527, -1910, 6443, -4777, 2670, -4551, 5925, -880, -5964, 7114, -3569, 1338, -1812, 625, 3108, -6109, 4693, -388, -1454, 570, -822, 3319, -4082, 1331, 1175, -1931, 1489, -1484, 1919, -1337, -576, 2265, -1688, 299, -196, 250, 77, -471, 453, -407, 276, 299, 48, -345, 170, -37, 23, -118, -46, 358, -1231, 1772, -486, -971, 1320, -1200, 1530, -1698, 422, 1150, -2401, 2220, -1120, 933, -876, -539, 3124, -3691, 2222, -697, -399, 1499, -3114, 4095, -2945, 206, 2272, -2610, 2613, -3385, 2894, -523, -2395, 3717, -3677, 3085, -2040, 414, 2580, -4998, 4734, -2569, 541, 847, -2847, 4540, -4477, 2806, -102, -2010, 3313, -4143, 4379, -3049, -330, 3085, -4397, 4473, -3530, 1621, 973, -3220, 4613]
1343D613r021P066l449m86M606p885Q891o972K986K129o658Q531p848N253j197
1358E59l489P006q003O674l514j04L283o282Q052o826K658J737m664O496o894
1373c311N312j427l103N677n617M269l271J386K201n192N612l955J995j10k179
1388a713M507n427L370j3j780K048k489L164k268K01J356j734J456j606J743p75
1404D0j060J890j018K50j90Q6J07K7n54N98m3q67J573j526J270p17n00J812k181
1423a003J962k282J971K63l179M603l886K581j317q78M545p318N834j692j008
1438h04J872m147P902q332L513K644n437N699p506R398n621l854J0729r851O485
1453B690n939M902K324j2210J4824q623K192r14j622J0864j8483J3902j033o776
$$ y = [4613, -4408, 2658, -791, -1277, 3329, -4556, 4335, -2637, 349, 2478, -4180, 4351, -3497, 1756, 559, -2930, 4076, -3927, 2747, -767, -871, 2412, -3870, 4182, -2644, 14, 1751, -2913, 3583, -3311, 2001, 574, -2529, 3148, -2469, 1800, -1471, -85, 2116, -3076, 2536, -1419, 576, 466, -1713, 2794, -2633, 737, 724, -1056, 992, -1497, 1667, -601, -400, 956, -778, 678, -928, 815, 40, -1020, 870, -148, 102, -88, -2, 105, 132, -422, 176, 133, -734, 839, -687, 583, -134, -634, 1178, -1003, 959, -1323, 648, 911, -2268, 2335, -1551, 1030, -287, -1165, 3380, -3938, 1896, 204, -804, 1068, -3079, 4823, -3509, 4, 2648, -2789, 2910, -4596, 4802, -819, -4673, 6056, -3795, 2690, -3249, 1653, 3977, -8233, 6591, -2032, 160, -754, -2376, 8488, -9995, 3907, 2874, -3902]
1467c902O914q944J5563j6230L647J1683j5267J0112r373J3197p581r970K2532
1480A2381j8331P296m164M454N787k2847K6761j1399m423O333n324J5580k7259
1493a5155J9814L371j7985J4834j1069J8906k2251L808K2543k9189J5946p830
1505d257J2016p708j5754L5709k8276N864L285M22P792l0404L7574j4602j2908
1518a1247J7582j0557J7748l2042K3537R467l2001K4530j0947J5421k1605J622
1530h492L2203m1201J9534j016L959m029k0168M4604l4474K45J6921r287R534
1543H333l0699M0637j3724k3572L1359j5857J3887k8772K3522J4066m4454L5322
1555A0048r710N964j4810o98L7333n0380K2665P422p823R89k0159M7574l9056
$$ y = [-3902, 3012, -5932, 9631, -6599, -2952, 8731, -6536, 3576, -5797, 7400, -181, -10151, 12381, -5950, 1346, -2818, 1636, 7423, -15424, 11337, -62, -4485, 1848, -3476, 12104, -15155, 4659, 8030, -9955, 4879, -6190, 12716, -9535, -5727, 16816, -12373, 3573, -4257, 7759, 51, -15703, 20006, -8270, -2406, 879, 1301, 9093, -21311, 16263, 1661, -11247, 6335, -4222, 13526, -18516, 5021, 14488, -17513, 7017, -3930, 11491, -10114, -8492, 23711, -17490, 2044, 1028, 4987, 958, -19210, 25394, -9080, -8835, 8086, -1201, 8333, -22366, 18271, 4547, -19025, 12334, -3523, 10364, -18408, 5114, 19180, -25274, 10048, 338, 6302, -8508, -9206, 28127, -22253, 412, 7834, 11, 1000, -19159, 28415, -10641]
1568a0641k436K8706k0276J1426k7475L9071j2233l1196M2659k0350Q099j9850
1580a4496J8777J6715n0275M0996p193n354m225l874L7074n1520K1632J6950k1928
1593f721Q186j6296L9915l4896o655L8377k9782J0488j6322K9106q732l4199M9222
1606B1691k3817J17n263R990J6345m8400M1902m344j6246P289o056L0911m6398
1619b2279K0258K0803l1121J5119j2877L0006k7839q820M1069l4308R933o897
1631f953J7395m298l1549M7074k3527m627N948J029J4988m0604L6042p94k3494
1644a3370J6918p787K0583l2969J4003K1966l4261J7717o309J5057j6588r361
1656a4401L7125l3097P579L803L114P94k4419L7470j8964q641J4391n848J1130
$$ y = [-10641, -13077, 15629, -4647, 6779, -20696, 18375, 6142, -25054, 17605, -2745, 5354, -14496, 4281, 20996, -29279, 11717, 4524, -830, -5055, -8929, 28145, -23375, -1743, 15207, -6721, 1465, -14831, 25084, -9812, -16467, 21910, -7872, 2616, -13706, 15400, 6668, -27531, 21691, -2126, -2009, -7272, 2718, 19063, -29337, 12565, 8221, -8025, -736, -6792, 24119, -22279, -2021, 18782, -12339, 2780, -10097, 19909, -7930, -16750, 24319, -9989, -56, -6953, 10442, 6144, -25405, 21669, -1858, -6485, -537, 492, 15480, -25124, 10918, 10124, -13370, 3548, -4239, 16344, -16625, -2622, 19344, -14917, 2800, -3509, 11548, -5040, -14401, 22724, -10373, -2794, 1009, 4123, 4917, -19502, 17968, -996, -9637, 4754, -1094, 10036]
1669A0036k7960K6467P09k3591K0559q932J1957j9823P845J8952l0210J6927k963
1682b7N034p313q147K7825k6390O207O945m345M114j6800K5534j3053q725J6158
1696G017r170P131j4732J4680J883j8543J7970p201L938p428K170J3319k1442
1709a0408J2504M62l191R19o208J5889j5255K416P962p330M466q424J2541o169
1723A74o603J2378q179M091n387N005K843j1349J0966m109J38q58o68O881j0647
1738e324O655N50l571K810l887O820o205M25N000n260K952k425L124j353k892
1753b581N283l780J149k41m6J763l777L431p72j498J876j361J160j038J83R97
1769G48j453R58j74k82N63p79P55m52j67J077j705J330J04j472J814j478J151
$$ y = [10036, -17924, 8543, 9252, -14339, 6220, -2712, 9245, -10578, -2733, 16219, -13991, 2936, -27, 5007, -2306, -10453, 17372, -9018, -2811, 4134, -211, 3903, -12897, 12637, -416, -9141, 7017, -2153, 4978, -9754, 4926, 6809, -11734, 6236, -965, 2973, -4455, -2285, 11034, -10408, 2096, 2558, -633, 286, -5922, 9967, -5288, -2872, 5090, -2240, 2226, -6198, 6343, 174, -6429, 5949, -2230, 1861, -3526, 1479, 4322, -7027, 3939, -170, -32, -890, -1558, 5323, -5324, 1331, 1881, -1690, 1120, -2767, 4053, -2152, -1727, 3273, -1987, 965, -1460, 1664, 311, -2581, 2702, -1078, 71, -170, -216, 1547, -2230, 1201, 429, -1069, 807, -554, 606, -432, -249, 748, -705, 253, 79, -203, 360, -419, 336, -116, -283, 794, -911, 419, 523, -949, 865, -613, 538]
1786E38o38q13K563k942J528m3l71Q41k410L707k773J61J975k648K984l566K856
1803I49J25l470M546l451K318j613r7L188n553M929k355K65J230l509N977n969
1819b490K717J301l641M458n064M962k584j560M845n575M843l893K017J580n491
1834c575P068n642K768P6k863N624o903N409j943j542L921n482O148n059J937
1849e8K085n190O481n972L943o30l121N862o600N293k563o84L584n482O038m975
1865a989K286J329m586O105n739L991j219k195N296o404N010k358j49K332m487
1880b777N796m971K089J104l145M357n147M594j790k061M380m459L609k805J277
1895E1J567m151M554l071J617o44j067L547m759L343o89r89J617k410L357k858
$$ y = [538, -100, -913, 1650, -1292, 236, 193, -178, 663, -1747, 1960, -813, -652, 1323, -1325, 1659, -1907, 949, 1074, -2396, 2150, -1301, 1017, -596, -693, 2495, -3058, 1871, -484, -219, 1011, -2498, 3479, -2490, 227, 1528, -2113, 2345, -2719, 2243, -341, -1901, 2944, -2631, 2212, -1681, 336, 1916, -3575, 3493, -2149, 619, 695, -2168, 3456, -3447, 1962, 19, -1523, 2398, -3084, 3064, -1995, -58, 2027, -3163, 3318, -2654, 1289, 659, -2462, 3400, -3200, 2093, -470, -1154, 2430, -3052, 2986, -1989, 297, 1626, -2960, 3145, -2594, 1397, 178, -2017, 3279, -3125, 1885, -473, -622, 1710, -2777, 3019, -1952, 137, 1241, -1904, 2453, -2694, 1900, 110, -1951, 2429, -2030, 1579, -1226, 51, 1618, -2533, 2021, -1050, 567, -77, -1144, 2403, -2356, 987, 298, -691, 926, -1484, 1873, -985]
1911i85O28J360j760J473j912K386j403p10K123j962J309j205R80J46j446J590
1927F12q34M75p56Q21l9r14J307j236J087q66K65N20j078J386j507J320p20J9
1945a38O38j567K623k848J519N28j817K187k632L199k286m46K849l208K563k867
1961a703L153q37l374N731m513K371j828P89L064p122O854k573o87J024k147O173
1977D375q671N059J646m797M029m763P733o745q48Q232q425M566l794N137j392
1992A342p594J2396q048J514l62P23M939j3084J2827l016n128N023l859Q783j3326
2007f870P201N701j1587P629m909Q835r435j520J4554j5384O435k019M513j467
2021A677j1291J9692j2398p37M216j057N512j6890J8194l623j0345J0272n209
$$ y = [-985, -357, 1003, -757, 716, -1196, 1190, -213, -923, 1200, -762, 547, -658, 322, 468, -978, 612, -222, 253, -503, 318, 279, -635, 672, -564, 523, -343, -78, 442, -636, 750, -757, 563, -157, -138, 500, -1067, 1556, -1292, 227, 755, -1062, 1125, -1507, 1692, -594, -1040, 1809, -1399, 1164, -1703, 1450, 613, -2761, 2970, -1543, 828, -1000, -211, 2853, -4269, 2585, 12, -675, 349, -1798, 4375, -4296, 763, 2409, -2388, 1641, -3122, 4611, -2134, -2982, 5250, -3175, 1391, -2403, 2734, 1342, -6252, 6144, -1904, -390, -752, -29, 4910, -8174, 4653, 1637, -3491, 1532, -2327, 6456, -6870, 331, 6032, -5555, 2074, -2835, 6000, -3435, -4955, 9599, -5785, 650, -1369, 3144, 1677, -9614, 10078, -2320, -3057, 1159, 102, 5614, -11276, 6918, 3295, -7050, 3222, -1987]
2034a987R359j6399R329R550j9371J2143l816O678r341k771K0126k1410O812K727
2048A629N44n04j3224K4573j5424m547J2101n909N734j6820J9586k240j7300J7739
2062E938o720N851j3827R100J2125k5918J6888j647Q07n981l615K2866k5908P310
2076b731Q534n965J282j2146K5355j7129o862J8355j0345N087j4444J9101j682
2089F410k1403K3377q109J780r165P372J3002k8682J9119R09n571j304l907K1964
2103A5792k6511O670J3907j3479M362r050K0896j4781r436K3742j4805L079p207
2116f821J3399l82k2214K6223q989l529q89L116J1997k7076J8925L345j2202M633
2130d64l677J7081k2827N741J5784j7532O366n711J5186j1884r418K4461j6652
$$ y = [-1987, 7372, -9027, 302, 9852, -9519, 2624, -1192, 5486, -3855, -6626, 13500, -7910, -1098, 1629, 2173, 1669, -11555, 13018, -2406, -6953, 5148, -761, 4973, -11847, 7739, 5499, -11801, 5938, -782, 5069, -8758, 342, 12467, -13451, 3437, 1790, 2597, -3384, -6999, 15867, -10041, -2731, 5803, -162, 1120, -11026, 14329, -2800, -9662, 8693, -1652, 3435, -11009, 8092, 6410, -14993, 8384, 275, 2055, -7110, 262, 13264, -15418, 3701, 4610, -961, -2265, -6172, 15792, -10719, -4049, 9858, -3621, 741, -8309, 12587, -2194, -11630, 12112, -2693, 386, -6821, 6578, 6196, -16018, 10205, 1216, -2313, -3202, -86, 11911, -15165, 3760, 7105, -5097, -464, -4141, 12940, -9887, -4146, 11638, -5894, 472, -5239, 9947, -1937, -11355, 13106, -3546]
2143c546J975j523P683M98j9443K4385q533o249M513L3R260k1955J6522L958j5174
2158g596R097l612J0598j5812L502J5334j8738P371j355O578o458q093K1094j5699
2172c789O93M293K76K229j4424J8741o137q360R117l105N782j3951J1110M205
2186F680j4492J0222l160N205q849J210J2587j5941O595R13J004k255n963J4819
2200H575j1616J36N532k760K450q965J2162m210o897R225m428L121o655N511L503
2215D684j0696Q342j956O24k618l85P822j0383M555K031k747J353l956P854n865
2230a341j199N531m073K047l585M792j061m772O347l272J106j744J155K779o074
2245c364M619n61j296P17j172L393m122J616J514k293J522j692K521j701r35K842
$$ y = [-3546, -1571, -3094, 4589, 5087, -14356, 10029, 1496, -4753, -240, -207, 9053, -12902, 3620, 7578, -7596, 1501, -2111, 8487, -7325, -3823, 11511, -7227, 144, -1211, 5367, -1091, -9184, 11910, -3789, -3096, 1197, 1473, 3702, -10722, 8019, 1882, -6478, 2639, -466, 5316, -8635, 2475, 6680, -7812, 2410, -750, 4455, -4394, -3184, 9403, -6538, 57, 970, 1974, -281, -6244, 8575, -3041, -2905, 2627, -133, 2317, -6648, 5514, 1304, -5593, 3632, -796, 2325, -4330, 1181, 4684, -6012, 2330, 374, 998, -1620, -2005, 5817, -4566, -11, 2020, -727, 626, -3330, 4524, -1341, -2540, 2991, -1082, 965, -2620, 2172, 1111, -3661, 2686, -586, 520, -1224, -69, 2710, -3364, 1255, 694, -602, 115, -1057, 2336, -1786, -170, 1344, -949, 573, -1119, 1402, -299, -1234, 1608]
2261A608k427J019l45J99N61j709J846p67l63P17p00Q73r55M71M25j163J294q26
2279b42j6Q57j229J070o16N6P25j482J556p25l20P62q42J249j674J094N47j857
2297a087J908j386J110o24r30K684k920J440J09o42J096k257L034j982l03J800
2313A050j988K160k726K236J73k821L584k630J668j064l89K744m137L286j308
2328a62p9R80k448M075l965J730R96k627L184l580L354j437j550L605l830L127
2344A373k346R49J349l722M593l478J642K01k149L942m701L480j011j340K989
2359A771l832L941k919Q06J653l456M174l797K380j99k174L940m447L502j447
2374a04r25K813l777L811k969J153J215l199L943l510K426p61j499L651m377L270
$$ y = [1608, -819, 200, -145, 54, 615, -1094, 752, -15, -378, 339, -361, 512, -443, 28, 453, -710, 584, -242, -258, 599, -630, 440, -176, -120, 605, -877, 679, -46, -366, 396, -446, 803, -871, 223, 770, -1087, 821, -565, 545, -79, -1009, 1675, -1245, 195, 304, -338, 758, -1499, 1535, -447, -750, 1050, -938, 1222, -1504, 732, 905, -1916, 1668, -962, 706, -358, -747, 1997, -2140, 1146, -162, -241, 739, -1709, 2366, -1599, 131, 1127, -1500, 1684, -1896, 1458, 21, -1529, 2076, -1754, 1373, -973, -24, 1325, -2397, 2196, -1282, 360, 561, -1588, 2354, -2347, 1133, 122, -1218, 1771, -2061, 1880, -1039, -233, 1420, -2036, 2138, -1659, 721, 522, -1652, 2288, -2159, 1343, -104, -1029, 1784, -1993, 1818, -1151, 2, 1217, -1982, 1961, -1549, 877, 116, -1383, 2268, -2109, 1161]
2390A161j319m09J797l188L961l125R55J094k129K753l367L092j136j574L094
2405A660l014K463j965Q02J401l202L196j900Q78l74p59K571l427K340m28o65
2421d23J092j909K782k311L26J349j589J243j497J829r58p80J807j543J086j173
2437f69R41L08j708J905j001L41l19J48O70j395J272p06L78k62k53J136j553J211
2455D44n34J8L57p84J119j217J037o11o6Q80j423J533j370R87j01j220K061j850
2473g40J109p36M42O90k247K735j701M95j08m92K207l683K856k92j316J297j591
2490a075L149l678J263K030k991K051k176L451k498j634N010m327J797j251J724
2505H45N19m945O438l117n57Q15l42L158o865N751m0l924L204k275M649o231K029
$$ y = [1161, -158, -567, 1230, -1958, 2003, -1122, -167, 927, -1202, 1551, -1816, 1276, 140, -1434, 1660, -1354, 1109, -856, -54, 1347, -1855, 1341, -559, 319, -55, -814, 1757, -1670, 670, 242, -423, 669, -1240, 1542, -769, -443, 906, -683, 560, -937, 892, -66, -846, 961, -582, 504, -669, 272, 580, -1128, 777, -224, 117, -202, -54, 616, -779, 493, -213, 165, -97, -350, 786, -767, 444, -90, -72, 285, -499, 620, -597, 440, -171, -237, 643, -780, 753, -617, 370, 269, -951, 1110, -740, 369, -367, 75, 765, -1482, 1253, -448, 47, -61, -553, 1654, -2029, 827, 535, -781, 516, -1075, 2074, -1604, -341, 1689, -1302, 749, -1427, 2024, -474, -2108, 2902, -1425, 372, -879, 845, 1364, -3581, 2857, -260, -817, -2, -344, 2814, -4051, 1700, 1660, -2264, 940, -1335, 3314, -2917, -888]
2522h88M798o901L700j792L669l494k520Q537p493J984J33J478L57o996J0235
2537D807m941k350L431j082L355q818Q137M00p039N454k097M501p962L265O876
2552E937j0756N425p25K695l883l106J1613j0423J519L059l73L21p627J2590o226
2567D0m566P311l032K987q748Q945J349j0978R330k403K082o248K907Q379j4004
2582f649P291J113o75k295l295J2970j2569J224O619l822Q40o696J2730o678o295
2597f187J0631m617J703p118Q979J201j2833J1842k523l33m168K662Q368j5133
2611g526Q105K775l932n48k440J1733j2723J170Q948p114J786m656J0453n835
2625A96p298J3246o751K76k955N903J689j2845J2881k591l406J49Q36P417j4139
$$ y = [-888, 3910, -2991, 709, -1083, 2586, -908, -3428, 5109, -2384, -400, -267, 1211, 1568, -5428, 4807, -134, -2484, 947, -135, 3220, -5598, 2539, 2939, -4100, 1354, -743, 3758, -4204, -939, 5937, -4819, 606, -119, 2576, -1307, -4413, 7200, -3223, -1704, 1355, 982, 1303, -6324, 6266, 40, -4526, 2785, -247, 2740, -6008, 2937, 4286, -6692, 2638, 235, 2317, -3931, -1024, 7355, -6649, 642, 1755, 1080, -1215, -4510, 8460, -4109, -2885, 3734, -88, 752, -5944, 6786, 108, -6187, 4444, -173, 1530, -5588, 3391, 4592, -8241, 3601, 1078, 745, -3423, -761, 7607, -7526, 579, 3354, -578, -1126, -3566, 8167, -4556, -3386, 5562, -1552, 234, -4422, 6031, 196, -7102, 6144, -607, -331, -3286, 2617, 4306, -8539, 4342, 1751, -1655, -1506, -670, 6747, -7392]
2640g392P919M256p611K467j961Q877j0556M18J0073r007K097k104P202m621o737
2655f680J3204p395o64J70L265J455j0852J1704k272m837K698L9M984j0918O846
2670G47L890q489M304j479N239p224Q7R067r326K567L18K724k340n206J0794o756
2686a083j077K894j70J779p841Q796j376n664N092j580K894o489M048L851p931
2701c857M559p13K053l755n21P125p681K164J434n4m71l621P225m614j344L472
2717A401j397J129m226N269r82m100M468j798J272k831J838K531n346L474k63
2732D39j75p43p41L870m410J354J512j523Q58k044L464k052j370L065j990Q38
2748C52j276J506L20k605K730j035J3k47q0J594k579J602K10r94P89q36J325j130
$$ y = [-7392, 527, 4783, -2828, -361, -2322, 6555, -4001, -3583, 6490, -2517, -420, -2524, 4678, 57, -6680, 6524, -871, -1535, -1365, 1900, 3355, -7497, 4207, 1935, -2902, -204, -165, 4819, -6099, 747, 4637, -3852, 452, -1027, 4212, -3012, -2925, 6142, -3184, -617, -299, 2425, 85, -5121, 5673, -1083, -2160, 734, 564, 2343, -5498, 3298, 1922, -3742, 1350, -230, 2664, -3825, 223, 4074, -3857, 702, -11, 2042, -1713, -2234, 4891, -2790, -626, 808, 754, 283, -3338, 3887, -727, -2071, 1401, 4, 1133, -3093, 2176, 1194, -2906, 1562, -236, 1036, -1795, 43, 2574, -2772, 702, 439, 264, -479, -1220, 2650, -1760, -406, 1106, -417, 441, -1603, 1861, -191, -1561, 1504, -486, 352, -924, 582, 902, -1703, 1027, -8, 5, -242, -322, 1272, -1307, 295, 505, -489, 300, -536, 789, -341]
2766c41j5J040j095O13m42M38r3o19J005p38K59J63m99O42m89K43J48n81P62n73
2786a72J9N70o60L27l53M34o8o37J159r10K99M5j60P06j438J324k15q78J021p56
2806c43Q76j063M34Q87j661J303o93N24k38r11K150k085P65M50p56J022j821K136
2824I76j052o92J571j404J360j637J214M69k153K404j612R37m26o10K134k834
2840a355J973m78m70Q84j639K515k260O56R40j699K012k278J998o60j282K565
2856A422k502J796j131J73J240k536K728j829P44L19j466K507k813J975m03j108
2872h84K111k537K381j507R3J349k295K548k100J095K03j507K451k734K074o55
2888H6q87J992k423K264j614L91J139k231K394j894J194k66j072K371k736J862
$$ y = [-341, -356, 684, -411, 202, -240, 198, 105, -514, 491, -247, 12, 175, -324, 318, -171, 72, 220, -361, 401, -172, -153, 417, -243, 84, -269, 165, 97, -540, 619, -291, 8, 53, -107, 599, -839, 485, 270, -608, 413, -343, 533, -530, -96, 791, -870, 433, -260, 264, 26, -885, 1265, -820, -55, 395, -361, 661, -1160, 976, -76, -768, 803, -601, 759, -878, 336, 805, -1348, 1056, -556, 381, -45, -655, 1479, -1355, 618, 140, -330, 554, -1085, 1430, -830, -174, 766, -933, 1079, -1199, 799, 139, -1143, 1422, -1080, 716, -415, -242, 998, -1538, 1190, -639, 105, 424, -1042, 1465, -1348, 627, 224, -884, 1227, -1310, 1071, -436, -343, 1006, -1289, 1259, -841, 254, 457, -1050, 1401, -1333, 741, 86, -801, 1191, -1232, 1032, -582, -191, 948, -1283, 1111, -783, 411, 145, -927, 1444, -1292, 570]
2904E70n55m73J269k124K573j798J83J022j429J656j966J742m22j284K077j818
2920g77J457j186L64J216k403K147r74K48J7p89J890k280J289J9m90O70j362K027
2938A083j611O4J239j353J061j116J199l15j018J469r24M11o02N78M23j540J500
2955E48o06K7q0r4Q63j304P91K9l40K52l13J038j198M04K68n25N84p88R84p23
2975a83rN62n68N60o68O09m06j38P63r92Q74p59L71J38n37Q86j050Q78l24j97
2995a90M06n92J037j243P02L43r72Q57r01J199r34j79J487j535P99o75R61m63
3013A07j162K225j582L91k11L48P26k491K652p08q86Q26n19J550k769J851P42
3030A090k178J376r04K005k348Q1K880l275J396m36J182q18j997M203k932Q2O43
$$ y = [570, 15, -458, 811, -1313, 1260, -538, -355, 667, -762, 894, -1072, 670, 248, -1036, 1041, -777, 680, -506, -142, 1074, -1329, 818, -156, 92, 109, -680, 1210, -1070, 219, 238, -252, 418, -944, 1083, -528, -464, 775, -578, 483, -633, 566, 251, -767, 702, -222, 189, -413, 165, 588, -952, 548, -58, -31, -111, -205, 658, -646, 145, 174, -166, 86, -227, 811, -387, 17, 285, -240, 344, -444, 540, -183, -192, 370, -198, 362, -306, 303, -103, -241, 522, -470, 404, -355, 16, 154, -383, 503, -547, 331, 7, -190, 216, -376, 661, -582, 120, 463, -509, 348, -553, 646, -288, -467, 1020, -515, 284, -391, 570, 107, -1055, 1170, -412, -21, -232, 116, 842, -1649, 1003, 295, -591, 235, -284, 1266, -1503, 348, 1090, -1088, 288, -616, 1389, -959, -878, 2002, -1273, 123, -313, 869, 51, -1946, 2257, -675, -593, 50]
3047E0K84O25l511M377j331j912J944n85J666l931K811J460l909K281l88J687
3063A618l214P30L706m715J648L67J029j499k005N592m152l66K033l95L49l717
3079b991N418j743l066L535j099J256l960L393J821n731L949l40M75k398M26M757
3095C702o346K229J611p46q32j954O106m983p96L893j747K66l200N399j712m263
3111c373N269j557J48k842L447J571o432M803k8q34j604O97M450o753K528K484
3127A974k228l31j148N306m909q29M717k849K26j944M386j604m379O065k184n95
3143c26j104K198J604o161N097J85k328R4K44L732o200K432L212l967R58p33L820
3160B757l945j227N485l735K3k99K808j356l787N865k341j319N58J193J096n025
$$ y = [50, 334, 959, -2552, 1825, 494, -1418, 526, -59, 1607, -2324, 487, 1947, -1962, 319, -69, 1618, -1596, -866, 2840, -1875, -227, 140, 1169, -330, -2335, 3257, -895, -1261, 772, 377, 726, -2991, 2427, 684, -2382, 1153, 54, 1310, -2650, 743, 2564, -3167, 782, 442, 917, -1481, -1055, 3702, -2644, -415, 1196, 450, -382, -2336, 3770, -1213, -2009, 1884, 137, 403, -2797, 2602, 890, -3373, 1896, 339, 487, -2355, 1092, 2663, -3769, 1034, 1006, 172, -1432, -735, 3715, -3038, -510, 1974, -254, -585, -1733, 3573, -1336, -2165, 2552, -297, -71, -2015, 2371, 767, -3612, 2453, 269, -326, -1430, 768, 2372, -3789, 1308, 1493, -835, -741, -497, 3235, -2965, -533, 2679, -1288, -330, -1063, 2757, -1188, -2415, 3070, -665, -642, -941, 1867, 511, -3276, 2589, 248, -1071, -513, 680, 1776, -3249]
3176c249M535K11l002J279K44K072m404K017K632l765J254j61K086k675q28M440
3192B686l637K95O52R03n22k764M458j940j475J695n0O81l238L088N09l080K117
3209C78l50J045k429R31K464l534J415L17M33j118p82L216k711J67J028k25Nj656
3227a406K722j175j252J763n53K26j326J570J44j866J510k62K60q91K59J331j921
3244h67Q11N11m91j6m76J328j112j38R50o11K23o17R76k64q28J134o07J26j42
3263a10O7O29j089O89%m29L82l68N62m35qM53o47M98l21OL26m85N19l68J06J32
3285A09m39N51k51m7J22j96M42o21L50K30n29M30l61M95l45l10R47q92K94KN7
3306C8J95q01J094n23k40L87k80N73j060Q28J78r91R22n69N38n85qR62j417R43
$$ y = [-3249, 1286, 1497, -1505, -226, 18, 2090, -2314, -297, 2335, -1430, -176, -337, 1749, -926, -1754, 2686, -951, -656, -4, 899, 377, -2387, 2071, 131, -1344, 351, 301, 982, -2256, 832, 1341, -1739, 378, 28, 1073, -1356, -425, 2039, -1495, -80, 237, 670, -448, -1230, 1986, -725, -558, 470, 245, 250, -1406, 1316, 141, -1111, 652, 99, 325, -1001, 569, 713, -1153, 357, 95, 355, -536, -277, 1054, -867, -56, 455, -36, -52, -528, 800, -312, -450, 500, -111, 112, -505, 471, 207, -621, 513, -94, 32, -110, -43, 586, -503, 186, 186, -243, 139, -229, 333, -102, -110, 343, -304, 194, -127, -121, 205, -280, 239, -129, -23, 109, -330, 221, -30, -77, 45, -151, 291, -330, 20, 250, -279, 151, -210, 285, -60, -370, 577, -315, -21, -19, 38, 233, -568, 526, 3, -237, 150, -130, 443, -617, 211, 389, -602, 320, -249, 289, -296, -304, 658, -759, 184]
3326A84k13J30r2o23J467j295L11M51n92P12j198J325m50p62J233r83Q17q99N38
3345F1N43j464J440q32M26j66n27J505j784J043j8n21P93j281J600j184Q4Q20
3363E38j069J116j197R65j40r52J581j489J025n33j41J008j619J529q91K06M42
3380C79j050J477j517J004r8p56J356j555J308p14k19J034j444J465j019L48L55
3397C54r83J385j494J124k03p27J286j437J253q19K0R41j520J387q45L75Rp14
3415f08J482j565Q87j36l40Q07j370J583r61j48R19j032J005j114Q95K8j042J346
3433F36j040P37o42K21Q94j616J251o26J86J43o21J284j416N83L25n39N13q86
3451f13J296q88k06J002r65O66p51P44j0r90J266p14K53l01J65N81j261J079k99
$$ y = [184, -29, 101, 9, -614, 853, -442, -131, 320, -272, 440, -758, 567, 117, -645, 588, -395, 422, -477, 61, 604, -860, 580, -252, 174, 8, -519, 986, -798, 245, 227, -294, 499, -782, 818, -366, -282, 538, -531, 585, -612, 353, 213, -739, 842, -647, 378, -155, -296, 712, -907, 622, -269, -63, 379, -671, 806, -711, 293, 195, -561, 795, -760, 548, -166, -385, 649, -795, 670, -349, -1, 354, -629, 756, -738, 386, 183, -544, 742, -695, 558, -261, -241, 700, -820, 567, -278, 97, 106, -608, 874, -691, 196, 60, -280, 527, -843, 740, -221, -369, 550, -482, 523, -591, 304, 332, -710, 636, -404, 333, -309, -88, 806, -810, 441, -185, 1, 144, -477, 807, -609, -26, 299, -240, 273, -613, 683, -205, -411, 591, -374, 292, -459, 285, 275, -715, 551, -163, 90, -211, -46, 535, -726, 353, 54]
3470E4j52J48l62R49j138M46L76n44M27n27Q19p13k1O59o83M43n31N54r3o28R39
3491D22p08L80k41J37K70p16Q40n24J88j29n5N57q62N97j07k41M35n18N32n29
3511b72L53Ll43N44m80K84j14m0K97n93O95m43j3K37k36M23o16N01l6l89M32k89
3533i5M11p11M15L64q20N96k95M47n15q4Q71r74M21j54L35k44n35J283j021J32
3553a73L32r1J94j113J457l64q17P60j39L27j114J062K62j325Q97r0L97r52K66
3572b24J251j771N97L84R3n28m40J762j478j80Q82p8k73r29J874p68j106J332
3590D00j92q8r81J307L10j820J312Q0j06r20N75J326k230R10O49l97m49l49K067
3609A404j961j81J519o88j84p69K013j033j424K067o13j95q76J470L10k389K004
$$ y = [54, -98, 50, -312, 637, -501, -55, 321, -223, 204, -323, 496, -217, -238, 421, -262, 181, -350, 204, 111, -517, 422, -286, 94, -147, -10, 260, -456, 384, -140, 48, -81, -136, 421, -441, 156, 49, -192, 243, -275, 257, -272, 81, 84, -259, 285, -195, 89, -25, -65, 232, -361, 334, -109, -122, 115, -121, 302, -314, 187, 151, -238, 194, -95, 316, -395, 20, 384, -436, 160, -135, 312, -203, -287, 584, -390, 31, -123, 212, -32, -567, 716, -305, -173, 159, 68, 262, -851, 606, 242, -575, 185, 46, 373, -741, 321, 583, -742, 155, 65, 462, -490, -224, 1027, -744, -147, 237, 330, -198, -638, 1124, -354, -534, 348, 270, -3, -932, 942, 174, -932, 400, 208, 120, -861, 446, 756, -1064, 248, 328, 222, -698, -123, 1203, -1027, -117, 532, 135, -314, -663, 1404, -557, -738, 781, 93, -91, -860, 1153, 120, -1304, 763, 150, -45, -921, 549, 859, -1530, 474]
3626D74N4o33n24O66J213k480J076J024r89l51R1J700k003q5J796j040l60j65
3644e36J566r89j224K117o90n16k15J046P8k028J947K1j053Q0N45Q91k216J092
3662h4J070j463K02J53J148j720l7J921j489q2J30J037p09j236K291j012o97M42
3680a35N93l1j607J738N5j263N03L61M13j563R33R79j555L87L28L92r60o8J440
3699I40j197j60N52K49m49o98J516p08o52P85R3j66r02J229K8j122P21P7P0p18
3719e12M80P42j278N05K73l9l60j88J129r66j12O36l18Q3m94Q67l76m95P00k61
3739A6N2l83M25K32q08O11k8j83J9r3M44m92M1L33l26J63k37L84k03k36N07l26
3761h8J55r2J5K22m75M30j69o0J77k75L46k93J09R0k58L19l28K81k7k32L39m00
$$ y = [474, 528, -105, -629, 37, 1250, -1230, -154, 870, -119, -470, -379, 1321, -682, -767, 1029, -11, -371, -536, 1030, 41, -1183, 934, 244, -272, -487, 559, 637, -1391, 556, 577, -476, -396, 149, 1040, -1176, -84, 986, -477, -275, -122, 1026, -694, -731, 1190, -299, -381, -251, 786, 77, -1159, 1132, 120, -577, -135, 458, 427, -1180, 558, 613, -650, -147, 214, 627, -936, -3, 976, -579, -192, 136, 528, -432, -500, 940, -257, -417, 135, 384, -65, -763, 753, 45, -607, 178, 271, 105, -797, 432, 460, -662, 59, 136, 206, -512, -32, 710, -568, -63, 210, 171, -189, -377, 752, -214, -326, 310, -8, 75, -419, 448, 72, -423, 277, 16, 68, -315, 110, 342, -466, 145, 117, -66, -47, -140, 304, -188, -147, 186, -140, 23, -214, 170, -33, -269, 238, -88, 67, -25, -10, 212, -263, 167, -2, -62, 115, -160, 186, -107, 2, 92, -166, 153, -175, 106, 79, -153, 186, -214]
3783b14M07k39j47M40m63K92k13J12J24m46O47l58K1M4j33L70o46N34Q5m47L42
3804A12k96M57m44JN20n79K76j15J77n0m83Q81o30L4L19k32K87p65Q15j55m40
3825c10M80l55M20o51M05M12q74O80l17L03k53k28Q44r14M75j3j58K35n84R13
3845E10p04N2L56l60M57p71P45j35n59Q20o31L36k24J8N66r95Q35l57P2J36m55
3866b88O71q40M69J32l76N11o49P25m62j15O34p48N80m98L27J34p12R20p32M08
3886I1q9k09P25j006P93l81r9M72o32O62n97K91K22n90P27o87N24j91k61O16p75
3907c94P12l69j24M32o18P33o74L80J08n52P21o61N29k92j42O63r14P00l28P0
3927b0K07n66Q36p70K71J58l14M64o76P70l77l08O69n67N15n27K80K50p27O72
$$ y = [-214, 193, -46, -193, 247, -216, 76, -137, -25, 99, -347, 300, -58, -37, 7, -126, 244, -402, 132, 217, -230, 112, -184, 273, -171, -170, 350, -229, 47, -68, 109, 59, -424, 457, -173, -139, 180, -52, 235, -530, 285, 130, -310, 170, -185, 235, -416, -11, 401, -473, 207, -110, 193, -60, -288, 556, -358, 117, 104, -54, 181, -403, 510, -194, -142, 214, -146, 311, -460, 285, 150, -409, 411, -220, 116, -108, -90, 476, -519, 316, -41, 31, 167, -288, 383, -457, 12, 144, -232, 279, -370, 355, -107, -222, 412, -336, 244, -254, 73, 207, -505, 415, -317, 91, 2, -207, 518, -488, 305, -76, -175, 297, -335, 327, -270, 21, 243, -347, 380, -307, 217, 26, -235, 381, -394, 318, -51, -175, 257, -361, 372, -302, 78, 186, -366, 355, -306, 223, -69, -211, 452, -462, 238, -90, -20, 187, -379, 457, -313, -42, 116, -198, 266, -410, 360, -17, -325, 344, -223, 292, -235, 45, 295, -432, 240]
3947B40l41K11j96p9O34r68O43m6j75J69m39Q56p95J26M29m51L28n07P07l54l83
3968c91P79n82L43l90L41K02q45Q71l51rlj03O19r55O12L5l48K98m03P40p20R0
3990a70N61o50L98l61M55j64m62Q03n96K55j96K34R5o81P89l69n7J31j03M28p59
4011d19N60L1l88L25k97N26n73J53M00n93M43l64L96k16k47O69n58K80j83Q2J50
4032A77n19O53l69lK23l02M18o04M51j1l73N10m77M02k79qL79n80N25l72J84O4
4054H9l23N54o08M16p8k17L96m94M95l51Q3K48m59M84l86K60r4j87M95o21M46
4075A48j13q5J78m00N88m82P7K98l81L11l85M62j90l37O32m99K46j77J20K66p15
4096d38O80k29j02J10j64M94o75M11Q0l80L44l36N67n60k5O57o56L13k10L12j29
$$ y = [240, -101, 110, -86, -165, 469, -499, 144, 98, -77, 92, -347, 509, -286, -160, 269, -182, 146, -361, 346, -8, -391, 388, -194, 149, -241, 100, 302, -543, 328, -23, -32, -35, -138, 481, -474, 138, 173, -175, 123, -280, 460, -260, -170, 391, -259, 139, -222, 233, 69, -393, 410, -186, 69, -127, 107, 202, -479, 310, -59, -116, 15, -88, 340, -419, 141, 172, -216, 109, -188, 338, -235, -82, 318, -275, 168, -196, 200, -16, -263, 406, -152, 128, -55, 27, 177, -342, 311, -58, -61, 162, -140, 278, -326, 125, 114, -259, 251, -226, 176, -103, -111, 268, -312, 213, -159, 25, 89, -234, 320, -288, 128, 50, -167, 229, -265, 230, -121, -38, 210, -249, 235, -151, 109, 15, -172, 323, -298, 148, 35, -50, 128, -272, 316, -166, -89, 209, -172, 139, -246, 216, 26, -311, 321, -178, 68, -109, 11, 277, -438, 242, 13, -89, 21, -143, 351, -324, 87, 167, -213, 131, -205, 362, -198, -223, 434, -222, 91, -119, 193, 64]
4117F4m46P79m97O6l8J45J79p06P38j66k88K05o4M00p75M99K03n48L70k33L94
4138B81n59K5O78o71K08OJ75r2m47Q42n17j15K52n0J83o00O50p5m84N20l04K87
4160A93m64K48M29p57M81j91K30k30k26P43p17J98J69j11J02m54P42m35j92M30
4180A88k70K39m84N24k4n41N84k60J54k88J55L70p22N12j14Mok19O28p07K25K40
4202A88l10K75m11N27k67k57N21m38L27l18J70K32n99N99l28Q2N7k44N06n84L50
4223G8jj81K68m07N37m09qL38m61M55l72K33M0l31M82m39K83j17q8L14m35M18
4245A97k66J8J65l77N15l40J60K5k33L83m84L80j23k33M11m32M10k93O5L43m97
4266b06L06k64K55r4k38N61m98K29m6j10K88m40M16p5j64J57k40M73n38K38K16
$$ y = [64, -382, 397, -100, -34, -72, 73, 252, -454, 284, 118, -170, 35, -29, 371, -404, 95, 298, -250, 120, -113, 281, -278, -253, 425, -246, -38, -32, 143, 51, -396, 446, -71, -186, 66, 16, 199, -401, 249, 174, -310, 210, -94, 193, -271, -23, 406, -351, 130, -61, 169, -61, -287, 456, -261, -63, 106, -5, 97, -357, 385, -50, -242, 188, -82, 157, -327, 197, 173, -368, 216, -44, 110, -178, -23, 347, -375, 137, 23, 27, 21, -198, 430, -277, -52, 188, -122, 153, -258, 269, 2, -255, 266, -172, 155, -163, 7, 239, -360, 239, -89, -7, 50, -194, 312, -272, 78, 77, -104, 164, -243, 294, -115, -123, 215, -246, 209, -163, 70, 110, -221, 261, -178, 105, -12, -100, 214, -221, 197, -69, -51, 114, -263, 252, -88, 72, 97, -136, 247, -237, 143, 20, -213, 198, -234, 176, -117, -52, 291, -206, 100, -164, 91, -3, -241, 320, -178, 51, 5, -105, 183, -257, 159, 84, -80, 77, -163, 310, -228, 10, 226]
4287B26m42L58k94L75k72j46N05m87K37j41J63L8m68O61l77k9J29r8K68n42M78
4308A42j6l43L00j81L16m49J77L51n52L38j32J86j43k33O09n30J17J09m0R7m35
4329c12O01k86j86L20k08K57m52L74R6n07M54j96J58k44K4M19n74L17l9Qk5k26
4351b27N53m89P7K22k14J91l53M55j92k05L90k14J08k77K11P9l83M57k24N0r2
4372g7k0L67m33J91N9j27J08k53L55l36P1K94k98K07k89K86n6k74L88l04J95r4
4394d0k4K21m02M37k57L5J36j87K78l67K28L4k20K86k97L02j69j9J98l88M13l09
4416a11J49M1k82L31k95K33j7j91L33l49K70k11K7K52m08L51j99O8J7j99M16m69
4438b43K82Jj13J84l41M55k93n9K97k90K40k84K66j6l19M48l07K17j91K9K51n37
$$ y = [226, -216, 142, -152, 223, -49, -195, 310, -177, 60, -81, 82, 120, -348, 313, -64, -93, 36, -62, 206, -336, 142, 126, -217, 83, -98, 218, -231, -54, 297, -255, 83, -49, 137, -6, -239, 370, -160, -43, 66, 26, 123, -312, 289, 3, -183, 137, -71, 186, -266, 108, 204, -303, 151, -45, 113, -131, -107, 312, -262, 55, 16, 24, -1, -227, 326, -163, -86, 136, -78, 113, -240, 215, 23, -182, 208, -6, 102, -175, 36, 115, -268, 189, -35, 15, -77, -97, 270, -163, 28, 87, -40, 68, -185, 170, -166, -95, 199, -99, 108, -181, 105, 49, -225, 163, -141, 54, -40, -64, 157, -245, 192, -65, -30, 106, -81, 197, -170, 58, 92, -128, 158, -139, 163, -6, -25, 173, -215, 198, -111, 38, 79, -203, 128, -167, 66, 49, -142, 191, -158, 112, -99, -72, 180, -228, 123, -76, -8, 9, -190, 226, -243, 39, 40, -73, 111, -230, 225, -68, -127, 170, -120, 120, -164, 102, 86, -233, 215, -92, 125, -66, -37, 214, -323]
4460c23M34j09j05J34k19M36m64J89J71k46J82k88M59l35r8M30l88K07k31K87
4480A23j9m20N66l08P7r2M8K96o24N20q1j82J56j93M67n84K22K68m01K59k68M40
4502B70l46j66N96n40K50j74K17L0n45P46m15KQ5q4L47o81O08j00l12L20k65M69
4524C12n96K43L73o22M24k66L48l00k24P29o95K95n3P2J17n63Q31m90o4K45k73
4545a57M73p04N83m2m81N39l95M40m83R3N54q62O48l92L21j61m10Q87p39K57J15
4566H4j47K38o25Q78n76o8M92n08N58p10N61M8o45P45n22L88l58Q9N18r03P23
4587B60k86J3J12n01R55q87L29J78k89M10p32Q22m20k92P25p84N53m93M43J40
4607B56q11R88o68L31j74j65P16j014P51j43k24L86o21R18q68K67M46p42P15o92
$$ y = [-323, 111, 2, -103, 31, -188, 248, -216, -27, 144, -102, 80, -208, 251, -84, -182, 248, -140, 67, -164, 123, 104, -316, 250, -58, 19, -73, -25, 271, -353, 167, 86, -96, 60, -133, 334, -250, -28, 240, -161, 98, -170, 270, -76, -242, 354, -186, 64, -110, 107, 137, -408, 338, -77, -75, 10, -74, 273, -408, 200, 100, -212, 108, -157, 312, -284, -41, 332, -290, 134, -132, 216, -84, -308, 421, -274, 21, -32, 40, 157, -406, 425, -65, -129, 116, -157, 316, -388, 195, 153, -328, 211, -184, 256, -227, -134, 420, -442, 206, -186, 135, -26, -436, 451, -288, -31, 84, -63, 175, -450, 428, -148, -216, 276, -232, 326, -384, 177, 225, -420, 325, -197, 191, -167, -78, 440, -463, 260, -26, -13, 99, -402, 553, -334, -5, 173, -116, 294, -438, 384, -36, -328, 397, -387, 166, -327, 116, 256, -555, 433, -235, 96, -78, -243, 473, -541, 210, 67, -157, 229, -392, 526, -342, -75, 371, -371, 344, -348]
4627c48O30k00n16R31q64N79l76J39L91r64J036n86J08J44m17Q32j028O83nm73
4647c04O48p50Q40o92L9O51q57P82n92M44r1o13J110r78N17j97r2O01j096J037
4667D07m67j90N10n24Q16r78N90J38p45P96o93O85m85j61Q73j058P35l98J92J75
4687B18p59J107q63K61J71l58O36r94R25k52l84O78p25P27p49L24M47r09Q08m83
4707a74L85k46k87R02j040O45k09o4L07p07R59o79J5M39n14O14q01P04q2o06Q17
4728C78o39N01m64J45N19r88Q47l74R9K9l96R04r57M30J44l42M08o50Q45n31j76
4749b68O36o13M97n39M52O5o92Q38n20K33j74k5N21q85O84j52j57J57l31P03p63
4770c33K11L89n07L52l37N18k84l52O62n11K75j97J66J68o69P80l83j5J01j47
$$ y = [-348, 282, 82, -434, 497, -367, 212, -164, -25, 366, -598, 438, -148, -40, 104, -313, 519, -509, 174, 169, -304, 344, -406, 434, -258, -219, 432, -425, 357, -235, 209, 118, -495, 615, -363, 154, -43, -135, 466, -630, 407, -60, -250, 260, -264, 552, -426, 164, 302, -443, 353, -340, 345, -140, -301, 572, -486, 249, -149, 43, 218, -541, 566, -297, -36, 135, -223, 413, -581, 344, 92, -292, 386, -339, 388, -361, -37, 410, -499, 309, -174, 211, -35, -322, 580, -460, 185, -24, -88, 219, -488, 471, -208, -193, 246, -268, 346, -455, 249, 167, -439, 378, -261, 240, -224, -79, 440, -548, 299, -75, 24, 53, -343, 561, -396, 34, 178, -164, 244, -406, 439, -92, -268, 368, -245, 252, -287, 165, 230, -462, 376, -144, 89, -85, -110, 411, -474, 210, 58, -99, 58, -273, 430, -333, -122, 267, -240, 112, -225, 293, 9, -343, 319, -192, 83, -114, 52, 220, -449, 331, -52, -67, 34, -113]
4790a13M48p24M84L6l47L47k80M31m65M6M21m89L22j98K66j66l33O50m94J32J5
4811a1NJ66n07N71k02j95K65j79K99m71L03J59m40L43j74K10k43j5M16m80K23
4832D3l0M3j5k45M53l39J4J76j24J49l38L66o1k67K95j42J03j49N5J87m16L48
4854A06n9o3J8j49L24k67j1J93j18Q7k21K91j10j02J18p9J46j84J13Q3k32K31
4876A15q5K7j49O1J92l21K13k9p0J01j30K09k31O4J28j92J86j22J64j09j49J54
4898B7o4M0l6J2M9k22L16j87L2R8j44J92j52N5O3j53J47j30J07q4n3J70j78J34
4922C9o9M4Q3j72J22r3R2p7l2J55j07O7p9J0M9j17J58j27M4L9r6J61k08J15K8
4947B9l0M8j76K27j45J7J39j59J21j39J24j8j65K53j75R2q2O8P8j94J55j68J63
$$ y = [-113, 335, -389, 95, 131, -216, 131, -149, 282, -183, -137, 284, -205, 117, -81, 185, 19, -314, 336, -158, -26, -11, -6, 160, -347, 224, 22, -173, 92, -87, 212, -259, 44, 203, -237, 106, -68, 142, -101, -116, 300, -180, 43, 13, 56, 41, -204, 249, -90, -76, 100, -24, 125, -213, 153, 92, -175, 120, -22, 81, -68, -13, 174, -242, 106, 47, -16, 2, -147, 177, -90, -101, 92, -26, 61, -160, 131, 21, -81, 37, -42, 104, -80, 33, 116, -116, 115, 30, 57, -92, -31, 161, -160, 53, 24, -46, 55, -75, 134, -97, -33, 95, -97, 89, -33, 131, 22, -127, 27, -37, 3, -33, -21, 28, -194, 122, -65, -33, 65, -79, 113, -39, 16, 79, -74, 73, -57, 50, -34, -87, 83, -95, 39, -30, 14, 97, -75, 47, -46, 46, -31, -63, 92, -15, 52, -27, -17, 32, -85, 73, -54, -10, 29, -67, 94, -114, 1, 29, -1, 47, -129, 98, -47, -30, 109, -50, 71, -68, 56, 38, -127, 126, -49, 43, -39, 29, 107, -87, 68, -100, 63]
4970F3m3j04K82l17R8J04j89J60j47K46k12j4K02k32J37j23J78r4j43K52k59J32
4992b3mJ58k2m00M59j17j07J19j87L02l85K47Q0k36J88j75L11l93J10L26l88K19
5014H2j75K01j64j35M22l46J62j04J39O8m75N25j56q1J16k56M00m69L32N6l65
5035b23L35k45L64m02N3M49n85L78j93K35j23l35P25o22J68P1o1K20n97P09l18
5056Ck08L46k67L93o36M96J61o54N55l13L42l86j2O23q31N02j50J06lm65Q93p31
5078b36J46K54k78L61o95P98l06l52O17m77M54o28M40K69q44P71m04K70k53j33
5098b26P93j041N88l1j10J29n11R03p68P7N17m67L50o73Q03k60n50Q89o27M23
5118B08m86L07M01j042R49l87P0l2k76R07j146O16J43m19L84o17R81p85o5P60
$$ y = [63, 20, -84, 198, -119, -21, 83, -106, 54, -93, 153, -59, -73, 129, -103, 34, -89, 89, -5, -148, 104, -155, -23, -27, 131, 109, -291, 168, 51, -56, 63, -124, 178, -207, 40, 120, -116, 72, -103, 208, -185, -75, 251, -137, 82, -93, 108, -56, -191, 231, -115, 47, -57, 82, 150, -325, 200, 44, -37, 79, -177, 223, -246, 86, 142, -223, 112, -133, 231, -171, -118, 331, -254, 124, -69, 166, 43, -292, 433, -189, -21, 50, -11, 209, -388, 321, 3, -205, 141, -126, 267, -369, 127, 288, -366, 189, -124, 218, -168, -180, 443, -388, 114, -36, 70, 67, -398, 495, -236, -90, 164, -114, 247, -448, 350, 44, -308, 309, -168, 286, -342, 98, 367, -477, 294, -110, 160, -93, -226, 567, -474, 114, 83, -27, 102, -409, 494, -274, -197, 320, -147, 203, -470, 333, 73, -477, 412, -215, 208, -278, 29, 430, -612, 337, -50, 20, -12, -288, 619, -527, 89, 232, -187, 197, -420, 561, -224, -289, 471]
5138D71p63N30n99O40r3p91J145o95K72k76J96M45j149J021l50j30J97l69Q74
5157E76j106N73L23p02N62o01Q46o36j81R48r82N59m62M58J3q28J248p48J11M1
5177A2j01N87j183J026j85m20N09n20Q37j037M25N63r64O42m34N54m25k90J059
5196F55j042M48j40J31J70q28J166p36k4M08l34N18r17Q97j08p53P84n11N77o91
5216c30K39O48j073P39k97K42j77l99J036j017L79J01j64L11p74J002n50k36O26
5235C06m38M29p59P05L0q11P91m49L80l23L9O06j007O55j18j5N0l98Q42q21K18
5256h8L47l94L23n45P22l52l47P00n01K99m25L90J45q02Q52l34J9j48k4N58q25
5277d30N22L7k48K11k85N77n86N7M31m80K52k09L53j77m16P21m37J24j17J70K48
$$ y = [471, -292, 238, -361, 279, 186, -605, 540, -155, 117, -159, 37, 482, -667, 354, 4, -126, 71, -298, 576, -530, 43, 366, -336, 226, -375, 471, -165, -346, 602, -380, 179, -283, 175, 188, -640, 608, -140, -29, 12, -89, 498, -685, 341, 156, -264, 245, -275, 562, -475, -50, 513, -451, 191, -243, 311, -114, -404, 655, -387, 61, -79, 52, 222, -606, 560, -176, -200, 208, -126, 392, -525, 372, 264, -489, 295, -216, 361, -330, -91, 557, -516, 223, -74, 168, -9, -408, 628, -389, -10, 91, -73, 238, -536, 466, -84, -320, 306, -132, 297, -462, 243, 273, -538, 253, -196, 184, -139, -100, 506, -501, 154, 36, 21, 71, -327, 515, -306, -88, 259, -135, 188, -357, 365, 13, -334, 366, -135, 164, -261, 129, 274, -528, 324, -10, 9, -139, -163, 395, -430, 92, 129, -119, 92, -193, 384, -202, -145, 286, -194, 58, -151, 202, 25, -391, 330, -107, 17, -100, 70, 318]
5298C18p03O07k84o3J58j14L89n64K78J93m01K97k36L32l15j8M04m73K33r8J38
5319G8l6l03N03l24l2J44p8J40l36L57l4k51K59j43J81k60J19K07l59K38p4P3
5341F9p9r9L17l10Q8O4n3N5j96K93j39j24K29j54R7j64J34O0k42K21p8J9m2j5
5365d9J69k47J32K5p7N5j07J91j32l3J82j69N8n7R6Lj39J95j04N3qmN0k62K01
5390B2qk7P6j16J61j63R3Q3j86P4m6M6J5j09J67j54P0ok2P8j46J79p6j12K20j99
5416h6J45m4jO4j28J12j11R2k1q1J39j36R8l1n8Q0r0J30r4J1K3l0J04j64J54j1
5442F6j92K33j36J15q9q5J16n3J12j14J0O6q0P2r2R1l1p1J49j72J28q6Q9J2j09
5467e1J22r3K0Km5J12j48J43k1q7J07j23J44j74R2M2p5J10j15Q9j01L5O1j45J17
$$ y = [318, -385, 222, -62, -125, 33, -81, 308, -256, 22, 215, -186, 111, -125, 207, -108, -126, 278, -195, 38, -60, 78, 42, -261, 242, -82, -114, 30, -48, 92, -244, 113, 79, -172, 87, -56, 125, -135, -16, 191, -168, 70, -4, 69, -10, -109, 208, -102, -14, 50, -3, 52, -144, 149, 10, -114, 115, -39, 58, -106, 28, 88, -154, 67, -11, 8, -34, -49, 120, -127, 5, 30, -47, 8, -99, 92, -40, -73, 109, -60, -2, -59, 37, 40, -99, 96, -8, 45, 37, 33, 83, -179, 22, 14, -13, 63, -53, 108, -55, 38, 121, -65, 9, -37, 9, 24, -85, 82, -72, -2, -8, -30, 48, -98, 81, 5, -107, 113, -86, 59, 15, 14, 78, -50, 62, -49, 43, 22, -59, 80, -56, 42, 11, -47, 33, -57, 73, -21, -10, 13, -17, 87, -77, 77, 66, -126, 107, -29, 86, -3, -88, 28, -25, 87, -27, -17, 49, -31, 41, -51, 40, 9, -62, 87, -85, 43, -43, 46, 58, -51, 71, -22, -2, 0, -45, 67, -81, 62, 41, -46, 61, -62, 82, -92, 0, 42, -33, 77, -38, 51, -50, -15, 46, -99, 18]
5492A8o4P8m6q4J99j76Q7n6O3N2j60K31j61kl8M8Q0j82J62M2j77J08n6J45j60
5517d9K5J47k11J39j15J62j30r0K43k73J77m4N7Jk17L54k08PO8j9P7l13K94n3
5541B9j50J64j38K93l64J18K03k48J28n0R4j56j5L47m04J72k5O9J5k93M81l21
5563e1k1J66j48K18l82L53l4k49K51j47J51k72J25L01n28L49j69K03j59j47N53
5584C63n10J08M9RJ20m48N98k71j66L07k91K95m36M37L4m99M89k65K46l79J74
5605c6L67o71M90j58l%k51P24p48K54J77k57K26m31O88m61j42M98m11L45m80M58
5627A78J7o34P95m58K28k83J03M79q92O45j09j12M5k16O71p76K11M28m59K84l76
5648b31O12m23k95P51n69K41l41M34J4o94Q19l24j5k3n2N15r43P04q5k87K78l35
$$ y = [18, -46, 32, -14, -98, 101, -75, 12, -44, 19, 71, -89, 142, -19, -21, -59, -11, 69, -113, 49, 91, -86, 22, -34, 111, -49, -24, 123, -88, 51, -64, 98, -32, -122, 121, -152, 25, -19, 38, 39, -178, 176, -32, -25, 43, 24, 101, -212, 82, 29, -121, 43, -95, 198, -166, -48, 155, -93, 35, -15, 79, -77, -92, 255, -149, 23, -2, 67, 82, -211, 270, -51, -72, 94, -54, 164, -218, 135, 101, -148, 103, -44, 107, -165, -40, 261, -267, 82, -87, 116, -43, -190, 363, -147, -39, 10, 19, 139, -309, 289, 18, -148, 159, -132, 163, -273, 164, 198, -301, 188, -77, 169, -210, -36, 331, -340, 150, -8, -11, -11, -262, 462, -286, -32, 145, -112, 114, -317, 371, -90, -232, 266, -145, 200, -280, 178, 195, -439, 356, -102, 126, -157, -54, 425, -467, 178, 69, -43, 2, -214, 457, -319, -108, 320, -139, 145, -231, 381, -42, -337, 414, -155, 86, -255, 179, 193, -501, 318, -6, -21, -44, -96, 419, -524, 180, 95, -192, 86, -249]
5670b49P85q99K25N26o49L71l20N26l14l98Q67p00K89j52J87J75q12R31l67j59
5690a37K14j84M82r09O30J23n16N08l80N34p09J17O75q63N00k41L29j52m37R16
5710E00p33J77M9k4K38n84P98m05l31M77k62L75p11N47K55p97O39k89L21m19k1
5731b00O64p94M03o0K3L0m54Q80o72J5K98k15L07n96O65k19m19N44l36L45n06
5752b97L55J75p12O79k43Q8j39q9O01p38L45Q3j19P6l06O23n67j1L64k69K00l78
5774b79N45j60m53N82l42J77j99J27K46o03M72m9j36J37j23L42n67K74J52l38
5794a95K39k18L91l03r7M13l31J46j50J93J7l53M65k45OK5k0J97m05L26mk22J97
5817G2j37K44l26J18K02k63J09o7J25r4j13L03k61L1L8rQ4k43L25j46j10J77r1
$$ y = [-249, 536, -363, -138, 388, -261, 110, -210, 316, 2, -396, 471, -229, 60, -92, 95, 270, -542, 389, 22, -137, 77, -107, 375, -534, 96, 219, -297, 211, -169, 365, -344, -227, 448, -415, 85, -156, 173, 21, -416, 500, -233, -56, -7, -31, 207, -377, 421, 16, -315, 162, -100, 275, -436, 111, 366, -431, 208, -81, 240, -179, -200, 464, -330, 73, 13, 36, 66, -388, 492, -180, -165, 133, -82, 225, -371, 294, 75, -344, 200, -136, 209, -297, 58, 233, -479, 200, -43, 45, -94, -183, 418, -320, 25, 108, -11, 65, -241, 382, -185, -196, 168, -101, 99, -279, 266, 106, -347, 235, -107, 70, -129, -2, 244, -359, 113, 64, -72, 65, -58, 284, -283, -9, 143, -195, 44, -174, 217, -86, -183, 230, -101, 45, -105, 88, 105, -248, 217, -28, -22, 3, -17, 180, -225, 101, 97, -125, 72, -65, 179, -147, -29, 173, -90, 19, -48, 77, -17, -130, 173, -88, -57, -19, -28, 56, -187, 138, -8, -118, 59, -32]
5840c2J62k64J82L3k47J86k0N2o6l7J63j96J27pj03O7j14J72j64N3J24j62J07
5863A6j12J26J1j80J95j18N7l3m3J62k05O0J17j23R9j13J20r8L6J02j20R2p6O7
5887C9oj02J55j24N7Mm6R2j62J58n0l4N7o8O3p4O7M4j14J00j10P4k3o3J63j75
5913g8J04k0n2R7j47J48r1JP5j18J46j22N6K2j05J60j49J12l2m7J13j38J28o4
5937aj2P4j19J48j40P0J2j00J61j53Q9l3m5J16j47J47r7PO4j32J58j33P2op1J22
5963E1j24J00n3nR4j49J39q4J8L6r2J62j42P4pm6R8j45J41p8qQ5r8R2j08P9pr6
5991g3J35j04P3n2nQ1j44J09n1K9Np8J60j51O5lj7O1j30J59r0j3N4n1Q9j28J16
6018D6j3q7J00o6Q6j00N9N1j36J12p1Q0p5k4J34j61J09l9J8Jj06J93j70K3L9k7
$$ y = [-32, 130, -134, 48, 81, -166, 20, 0, 52, -14, -51, 112, -84, 43, 36, -67, 0, -114, 58, -106, -53, 71, -91, 16, -96, 30, 41, -139, 56, -62, -5, -38, -81, 81, -124, -64, 53, -70, 29, -84, 36, -62, -26, 76, -44, 48, -28, 39, 33, -69, 86, -38, 19, 23, -23, 69, -93, 65, 15, -19, 38, -30, 33, -41, 26, 70, -44, 56, -54, 20, -3, -66, 97, -78, 26, 6, -46, 51, -96, 52, -39, -38, 37, -81, 65, -57, -1, 21, -84, 76, -73, 39, 7, -40, 73, -65, 63, -1, -13, 61, -58, 90, -50, 20, 32, -68, 93, -60, 29, -4, -49, 67, -80, 67, -30, -23, 41, -91, 67, -66, 6, 0, -71, 51, -73, 27, -26, -31, 63, -86, 53, -31, -13, 23, -69, 93, -49, 25, 18, -28, 70, -75, 66, -12, -20, 65, -33, 59, -49, 30, 23, -73, 62, -42, 31, -21, -26, 55, -89, 20, -31, -2, 3, -75, 85, -66, -1, -4, -21, 40, -90, 69, -21, -34, 20, -31, 58, -70, 46, 33, -54, 46, -20, 66, -34, 25, 76, -60, 52, -19, 61, -14, -38, 96, -65, 44, 5, 23, 24, -82, 111, -59, -36, 3, -24]
6044b4P3j70K02p8q0J11o5J01j63J31M5j80J60r3J27j47J9J59k49J56m9O1l6r9
6068h8K58k60R8J6k8M8k10L14j67p3J59j21J71k62J95L8k74K76j49J72k15K0K85
6091B03l67K14o6M1k8j58L99l53O5J09p5Q9k86M01k19j37K65j31J30k91K86Q6
6113A77m10L68j85J12j84NL54m86K37QKok04M91m33NK92j73R7k76M05j21k95L95
6137A75k39J63k42K43Q3m72M36j67M5k08Q2M94o58L23J17k49R9k57N59m58rL88
6159B48l63K08l27M78k22l45O44m25J28j52J52J91n51N00r4j77J01r4M36o37K41
6180f0J89j96O0j97N19m65OM79m70J89k22L76j57m19P27m29N2j4P2J67n95N90
6202B02r8k18J08j01M17o10L15K44m89K68j88L46k83j23N62n80K25o8J39O5m14
$$ y = [-24, 49, -121, 81, 3, -77, 34, -31, 70, -93, 38, 83, -97, 63, -30, 97, -50, -31, 128, -121, 35, -14, 47, 11, -88, 170, -90, 8, 24, -4, 44, -166, 148, -19, -92, 67, -54, 117, -145, 50, 88, -186, 90, -59, 113, -102, -82, 203, -164, 50, -16, 25, -3, -161, 238, -115, -50, 59, -16, 73, -213, 188, -31, -168, 97, -34, 96, -195, 91, 177, -233, 135, -50, 62, -122, -117, 237, -249, -12, -4, -2, -8, -212, 279, -154, -149, 143, -30, 67, -209, 196, 75, -220, 175, -64, 99, -143, 100, 183, -289, 147, -20, 25, -183, -101, 393, -265, 58, 175, -74, 25, -232, 327, -131, -140, 248, -115, 93, -234, 244, 22, -323, 321, -104, 24, -128, 24, 215, -336, 164, 70, -107, -6, -100, 336, -301, -60, 129, -67, -7, -204, 315, -150, -144, 335, -135, 54, -168, 208, 51, -368, 359, -70, -18, -32, 40, 207, -388, 202, 104, -114, -6, -107, 310, -300, 15, 259, -230, 38, -150, 196, -87, -210, 352, -228, -3, -71, 68, 133, -281]
6223b81O11m03M8k2J2J60m69N45j37l35L89j77K84m28J45K52m15L19p2J63l09
6244a20j22N96n06J52L3j5j7k92N68l26r4K29j98J70l46M53m0m35M39k08J79k63
6266a63P8L63n55L46k0k5p3j07M43m72J65J53j71J07k56M15k51j34L04j69J03
6287H1k63L06k4l61L91j79L7j23J08K39m54K94J14j71k5k9K82l73M3K79k16lr6
6310a43K78j27j52K89j79L0k5mJ61k81K91j34m6J03r4K11k85P6Q0j66J24m5J49
6333A11k06Q1J89k84J08k9Q3l9j41K36j45qQ5n4O4j42J49j2j41J33m0Qq3P6J69
6358A68k44R4k8J5K0o1J31j25PR1l4kq6J18p4m7J36j08L9n6J03p5j47J72j5LK0
6385A5K2N6j68Q1L1l3Lk7P3m0qN8j24Q4k1NK8j23J86n3n1R0o4K6j04Q6K1n1R4
$$ y = [-281, 330, -73, -25, -47, -35, 125, -344, 201, 64, -271, 118, -59, 225, -203, -58, 194, -221, 98, 26, 189, -120, -242, 354, -152, 0, 33, 18, 1, -291, 277, -49, -143, 86, -112, 58, -288, 165, 125, -310, 129, -79, 100, -163, -85, 278, -277, 69, 49, 24, -49, -156, 287, -185, -20, 133, -38, 69, -187, 228, -23, -157, 147, -22, 81, -182, 124, 100, -261, 130, -49, -12, -135, -27, 212, -242, 52, 166, -5, -30, -59, 223, -150, -107, 172, -44, -47, -143, 135, 8, -144, 145, -34, -4, -29, -33, 128, -153, 138, 4, -42, 61, -33, 178, -107, -31, 49, -117, 7, -38, 111, -95, -14, 175, -109, -1, -30, 53, 14, -127, 109, -36, -44, 41, -13, 51, -91, 58, 46, -95, 38, -2, 6, -77, -1, 168, -76, 18, -10, 5, 25, -36, 95, -30, -23, 68, 34, 32, -54, 64, -10, -57, 79, -29, 10, -46, 57, -18, -165, 7, -8, -5, 15, 37, 93, -75, 6, 37, 4, 7, -20, 53, 13, 5, 63, -61, 23, 2, 7, 35, -88, 98, 45, -6, 84, 20, 46, -58, 28, 49, -2, 92]
6414I2j52J10o9J6M9j18O8l4m4J58k75K20j12J16J0j44J95j25J23j02k8R3q9J33
6438I1j17J3N8r0J35r3L5qn7J26j36R3m2k4R2j34Q5q9L2N8q1J06q7K5Mo1K11j68
6466b3P2J8q6J8j6L3l2k0N6j01J32r1P5Jr1J09j06R8l8j2M6r1J04q4M0L3p1P7
6494E0j00J01m4m0R4j07P2n7L6K7j22J59j49O6J9l0O9j41J12l5jM0o6J04j06L2
6520a7N2p1M0r0J22n9K7J0k4J9j5L1j2m0J00q2L2k9PO0r7M8jk1Qm6R1j05O3O1
6550F2q7K0l5Q6n1m8P8n1M4q3J03j2o1J02j14R9r1P2N6j44Q8k5O3q2k4J20j28
6577d3N5K0k2Pr9J83q4m2O2m4L1q1J07m1p7J20p2O8j22Q4P2k21K30p0N5j47N2
6604a9J09k20K37j59Q7m7j04K64j57pJ03q5O9j81K20p6j48J96j00Q2j65J31Q9
$$ y = [92, -60, 50, -19, -3, 46, -72, -4, -38, -82, 76, -199, 21, -91, 25, 35, -109, 86, -39, 84, -18, -46, 47, -42, 91, -26, -13, 45, -45, 90, -3, 32, 24, -33, 93, -43, 50, 8, -16, 76, -58, 27, -62, -30, 28, -53, 53, -34, -9, -5, -66, 145, -23, 49, 67, -19, -1, -17, 16, -16, -36, 20, -81, 51, -40, 35, 36, -55, 54, -52, 46, 8, -4, 42, -49, 55, -29, 11, 44, -27, 50, -50, 51, 7, -33, 61, -46, 26, -31, 5, 32, -90, 69, -80, -14, 5, -25, 44, -97, 15, -20, -21, 19, -47, 57, -49, -17, 35, -36, 4, -86, 36, -23, 4, 14, -10, 9, -6, 25, 13, -27, 73, -9, 23, -6, 1, 61, -36, 12, 11, -10, -2, -48, 43, -62, 1, 62, -25, -5, -40, 46, -5, -53, 25, -26, 18, -65, 38, 26, -35, 67, -47, 52, -39, 33, 89, -55, 33, 8, 71, -11, -35, 85, -43, 12, 32, 10, 17, -82, 101, 17, -25, 37, -7, 24, -57, 50, 9, -68, 52, -20, 48, -74, 10, 82, -139, 91, 21, 76, -71, -19, 90, -130, 107, -52, 35, -12, -116, 148, -9, -16, 87, 2, 71, -110, 110, 34, -114, 82, -18, 64, -101, 30, 119]
6627A19k67K16n9J7m7m2K53l48J36N9m9J9j47K90k23j5J65j00R1k39K60n3j55
6650a19K37j50L4j27J36J61l32K64j9n4o0l1K49l57K19N3j35K2j05L02k71j9K59
6673A57j98O4j30K37r8k43L71j84Jj8P3J17l56K65m3p6P4m8K23l69J91J55k39
6696g4Q7p2K54k74r1L94k83J00n4J67j68j14L35k43k6Q1K1J31l49K88q9j40J31
6719A2k4J71l22J08J98k73J42p9J80j65r2L63l12N6%O4Q3k92L69j82r5J16J7Q7
6743A30k94L08k8k42K10n4J16k85R0J89k80J57k5Q9r9j07K43k25PJ07o2J21k75
6766b09L26j66r6K01r2J49k80K56M9k53K05p9K3j27Q2J44k55J61J3o7L4n8J73
6789A34j59mJ00p4K2j01J73j46n5J98j75M7pP7J5j67J74n1k6pNJ17k10J21M7q1
$$ y = [119, -148, 68, 9, 26, -21, -63, 190, -158, -22, 37, -12, 7, -140, 150, -73, -88, 77, -23, 68, -171, 89, 36, -119, 118, -32, 2, -125, 11, 172, -160, 104, 85, 31, -29, -60, 189, -168, 51, 104, -31, -9, -114, 188, -83, -102, 157, -41, 23, -107, 130, 32, -211, 160, -24, -23, -41, 32, 149, -207, 58, 15, -61, 13, -35, 188, -181, 10, 165, -74, 13, -59, 195, -79, -170, 224, -59, 41, -13, 154, -14, -128, 207, -36, -62, 19, 40, 171, -178, 110, 21, -119, 12, -12, 159, -163, -55, 143, -130, 12, -67, 113, -52, -144, 219, -93, -37, -37, 27, 110, -182, 187, 5, -90, 26, 43, 130, -164, 144, 116, -126, 84, 30, 146, -139, -49, 140, -140, 17, -8, 81, -18, -125, 118, -107, -100, 7, -55, 66, -209, 117, -49, -145, 56, -36, 113, -167, 89, 138, -115, 90, 11, 34, -93, -11, 133, -122, 39, 52, -15, 19, -39, 134, -25, -29, 71, -3, 19, -82, 91, -55, -110, 88, -87, -40, -47, 30, 45, -122, 52, 1, -25, -32, -27, 90, -120, 1, 48, -33]
6815c3J8l9J22j21pJ44j29M6k7Q3rj12J72o9m7K2MM3j40J30mj70J23j4k1o2R2
6842eN4j00N8j9N1o3j6R0q8K2K8j5J7n7R5o2K0J9n6K2n6O1L0o0P1l2%j4K0Q3j16
6873a8N5N8p8pm5M4n7K6P0p6M0j8J1Qm7R9r2K3K8q7N6l6O8p5K8M4q8M3m2P8L0
6904D3k4l4Nj8J4J9J7rOJ5o3P1m5M9m3nO1r3N2OK0r8O7O3j73J47n2K5K2j56Q9
6935b2J7m9Q0p6P1l7KN0q5R3l6KJ2n4P8p1O6k7j0L6r3J02n0%M9q1P6o5M2Pn1Q6
6967F2r5O0k3L5K2j18R5o1LM0p0Q9p6M6Pn9R1q2N5k2k4P7r7R1n1nM4o3R1q9M9
6998B2J6n2O8q4P3m3j2M9p8O8n6K8J7o8Q5m0M6kj05R4m7L8L7m3J4o0L3n1Q1K0
7028D8j14P0J2ol2KM8o1P3p3mN2PO8q2Ml5jN4k8j9N2m1JJ4N3j16K6M4l2Q1j08
$$ y = [-33, -15, -54, 68, -53, -60, 84, -45, 1, -26, 57, 48, -64, 108, 39, -8, 14, 18, 61, -79, 51, 47, -123, 0, -14, -35, -97, -5, 49, -51, 7, -12, 39, -24, -40, 50, -38, -16, 12, -3, 14, -43, 52, -10, 10, 29, -27, -5, -61, 0, 30, -30, 41, 9, 9, -5, 15, 98, -18, 37, 95, 17, 10, -35, 9, -48, -22, 48, -28, 12, -6, 5, 13, -34, 65, -27, -4, 24, -63, -7, -43, 25, -50, -22, 22, -66, -23, -65, 13, 43, 19, -15, -10, -28, -14, 5, 22, 13, 19, 34, -29, 42, -3, 46, 3, -2, 59, -34, 18, 24, 44, -54, 13, 76, -97, 50, -2, 23, 45, -111, -22, -5, -54, 26, -50, 21, -16, -14, 36, -49, 44, 8, 10, 22, -32, 46, -25, 41, 14, 4, 40, -53, 49, -1, -1, 48, -33, 43, -22, 20, 27, -24, 62, -33, 27, 4, 39, 61, -57, 38, -23, -20, 20, -50, 39, -37, 9, 16, -43, 48, -34, 21, -1, -25, 52, -45, 46, -5, -10, 34, -29, 62, -27, 22, 38, -14, 54, -30, 43, 0, -12, 37, -41, 27, -29, -1, 16, -52, 33, -7, 39, 37, -68, 26, -21, 17, 54, 11, 25, -35, -2, -53, 28, 48, -66, 4, 16, 10, -22, -20, 28, -33, 40, -33, -37, 15, 22, 90, 8, 12, -23, -24, 30, 2, -17, 35, -6, -5, 9, 62, -54, -28, 16, -16, 65, -43]
7060d3N9k6K3m2K3Pj3m8N2q2J36r8N0N3n8J7m2P8l7kJJK9o3M0Qk1Pj6M8o3J8M9
7093D5n0Qk1L7j6m0O0l3J1m1L6K0o2O9j8rj6qJ4j1OQ6r0O5L0l2j06O9nn6O8n4
7125d4J96j66j3O4l3J2m0O7j5q9R2l3Ql3L0M7j13N4M1n3Qm9R9j16J10J2p5K5m3
7154e0J04p5k4J03n1qk4O2J0j18J32l9j4l5N3N2j45R3K4n3%j0J02j39K4Q4p2L
7182a1k0P2o9j2J12p4N8q5K1Kj11K02p4j7rR7%j44P7M0j01L4lJ15j57P4R7j00
7210A4m0K4O2o1l7J33r5k7L0J4M2j77J92j57pJ37j02O7j62K20k9p1J5PM3j37M4
7237e8N2m4O3J5k2l4JJ15j47M1O0m7kr8J80q8m4Q3rL2j03O9m8J0J3K5K9q4K3Q2
7267F5j10J6M4ok8m1J14p5k6O4qj6m5R2k0p5Q3rol9M7K7r0N5K0k5j0L8K7m5j5
$$ y = [-43, 16, -10, 13, -29, -6, 1, -12, -60, -8, -90, 46, -52, -2, 51, -7, 10, -32, 46, 9, 7, 8, 9, 38, -25, 15, 23, 2, 9, -7, 41, -22, -4, 45, -5, 3, -18, 19, 3, -37, 23, -10, 1, -40, -4, 16, -46, 23, 5, -4, -20, -28, -14, -25, -19, 67, -23, 42, 72, 40, -66, 3, -2, -58, 10, -44, 152, -14, -27, 37, 4, 16, -24, 43, 28, -61, 31, -2, 6, -27, 3, 50, -63, -9, 32, -21, -13, -62, 37, -79, 31, 43, -32, -7, -50, 54, -21, -45, 58, 7, -1, -25, 37, 47, -71, 61, 22, 8, -27, 26, 78, -67, 26, 50, -3, -3, -13, 89, -50, -26, 58, -14, -11, -31, 41, -28, -40, 72, -2, 56, -29, -8, -6, -117, 85, 11, -6, -15, 82, 82, -62, 15, 55, -46, -12, -15, 100, -57, 17, 114, 14, -26, -2, 60, -1, -38, 95, 0, -27, 3, 17, 59, -118, 74, -83, -90, 47, -55, 12, -150, 70, 41, -30, -15, -8, 35, -102, -58, -6, -50, 13, 28, 6, -28, -27, 88, -59, -18, 42, -5, -7, -105, 75, -13, -57, 26, 17, 49, -54, 15, -33, -23, -10, 15, 44, -40, -17, 65, -45, -29, 15, 9, -19, -60, 54, -21, -47, 17, 9, -7, -52, 40, 20, -55, 28, 19, 13, -26, 21, 48, -42, 13, 33, 8, -2, 36, 63, 18, 3]
7298CL8l3k7J5N7o6j2O0l8kj8M8j1n9N5Qm6KK6K0o7M1J6l8J2J0J8l3QP8r8K0N9
7331D6k6m9j4J21j09oO6J7l4k0L3Kn2L7rJ2k7K8On1J7J1kolK4l4J7Nj7J2j5K7
7364Gj8l3J44j16M6j6pQl9L9j2j1K2pK1l8K6Jj0J3j5J3kn2J03n5Pj2p2J31j51
7395h5J39o9QQl0L6l2L3k1k1M4l6K8rKJ8m7N6l0J4K2l6L5n2L8J1m2N7o2O5n5j9
7427c2O9l5P2j6M7j57R5Lp2K5j3qM5o1M0k0mK7k6N5j02J02k2m9M1Nnn6L7M6k0
7458A1J01q9j4L3p1P3p4L5J4l1M9m4K9mn3O9o1M0pJ2k4l8N1l8rL7o6N7J9n7M6
7489dj5J0qLj1J1M5o9P3l9J9k3l3J11r6N5Mj5P4j23P4m6j0N3o9O4m1J4lj7M9n9
7521b2P6n4j2K5r1N0mN3o2qP3p8P3k5j4K3l3M3k6K8M6r5N7k4K3rLL3n9K9J8q0
$$ y = [3, 41, 8, -19, -4, 53, -13, -25, 35, -3, -5, -23, 25, 14, -45, 10, 18, -28, -26, 0, 20, -47, -6, 10, -28, -16, -6, 12, -21, -13, 65, -33, -13, 46, 20, -29, -43, 78, -31, -37, 29, 46, 12, -8, 25, 27, -25, 12, 3, 15, -12, 16, 22, -29, -12, -1, -3, -9, -12, 12, -22, -5, 0, -17, -5, -20, 7, -11, -44, 100, -16, 30, 14, 7, 15, -24, 15, 3, -8, 14, 7, 28, -10, 16, 17, 7, 20, 5, 18, 16, -36, 67, 12, 19, 7, -65, 66, -85, 54, -15, -7, 1, -29, 7, -25, 8, -13, -34, 10, -26, 2, -7, -5, 13, -34, 22, -8, 6, 28, -8, 27, -25, 13, 24, -18, 39, -23, 42, -13, -32, 37, 2, 74, 58, 105, -52, 43, 46, -26, -1, -14, -22, 23, -38, 2, -18, -22, 5, -21, 34, -68, 34, 12, -37, 4, 9, 4, -52, -15, 31, 11, 112, 23, 9, 42, -29, 44, -30, 5, 19, -12, 37, -7, 22, 18, -35, 34, -27, 13, 6, 18, -6, -44, 7, -31, -40, -3, -69, -12, 7, -50, -4, -19, -9, -17, -14, -25, -14, 31, -38, 35, -4, 15, -8, -41, 70, -26, 29, 33, 18, 92, -31, 43, -3, -13, 40, -29, 35, -6, 8, 5, -12, 37, -22, 54, 0, -12, 13, -78, -28, -32, 21, -41, -49, 24, -54, 19, -6, -20, 3, -30, 13, -13, 15, 61, -34, 23, -1, 22, 13, 16, 49, -10, 19, 37, -43]
7553d3N2l1J4kk4O1n6N0m7K2K9n6M3k0M4l0n6M9q9P4PqJ5j4M7n4K6Kj5L6m0N5
7585D1l8%nL0Lo5L2M1R2j52PO3j7l1L7n2K9j0lJ1k6L8m2J3JJrK9L0j12P4qqJ1
7619Ep%K1m0M1m6M2J3n0O7p7L8j8P2r5rJ25r5k5J21m3kj6j0J9l7L2l4O3jk1k0
7651A3k3k8L4mll1Q9m4j4Lm3J4k3Nj4Q2L0j4L0q9P0J04j09m1M9j6m3J6M0n1J5
7682DJ2Qk8qN1m1nJ0Lj1j5L6k6j9L0ppj3K4Ll9L2J0nk5J8K1m4L0P6q3J4k6J9N
7717Dm8M5j1L1m4M4J0p0N4J1l2J0mK1n0L2j2Ml6M8lk5PK7k7oMK5l0j3N2k3pJ4
7751BJ5J6r2M3K7j8J5J8Km1K4J9l4QKK2l4PK5k7JJ2Pk7j4L2k6oPJ1jk8M0k3k1
7786c7K5PQj8K2Nl2K0qNpOK7l1J3LMqj8L2j4j3K9j4jj6K2j3j0K6k1Qj0jK5qp6
$$ y = [-43, 9, -22, -8, -10, -34, 27, -29, 21, -26, -4, 25, -31, 12, -8, 36, 6, -50, -1, -90, -16, -9, -17, -2, -16, 31, -23, 3, 5, -10, 26, -14, 41, 3, 3, -2, 28, 31, -34, -2, 39, 131, -21, -14, 49, 32, 1, 38, -14, 15, 5, 2, 13, -13, 25, -17, -4, -3, -2, -11, 18, 48, -64, 10, 2, -6, 5, -2, -2, 19, -21, 20, -26, 16, 29, -21, 46, -31, 7, -11, 61, -34, -43, 82, -13, -38, 83, 40, 38, 22, 12, 31, -6, 26, -8, 55, 54, 33, 13, -10, -38, -4, -8, -11, -42, 47, 3, -11, -8, -51, -37, -60, -55, -69, 13, 43, 29, 59, -30, 40, 144, 35, -6, 43, 27, -16, 0, 40, -11, 4, 16, 24, -4, -12, 39, -2, -7, 3, 6, -5, -20, 16, -10, -29, 1, -6, -13, -26, -2, 1, -38, -6, 4, -1, -26, -8, 13, -31, -1, 75, -8, 6, -20, -1, 4, -44, 1, -10, 21, -23, 21, 31, -39, 15, 26, -6, 4, 0, 21, -29, 3, -9, -5, -41, 7, 4, -21, -14, 13, -14, -20, -16, 9, -21, -34, 18, -5, -12, 2, 17, 33, -59, -16, 11, -7, 8, 26, 28, -13, 11, 30, -4, 4, 6, 28, -6, 1, 26, -1, 0, 12, 19, -8, -22, 10, -16, -22, -15, -4, -5, -33, 7, -16, -37, -12, -5, 3, -15, 7, 12, -20, 0, -8, -3, -10, -4, 23, -8, 5, 8, 12, 4, -14, 18, 4, -9, 20, 6, 5, -11, 11, -2, -12, 14, -7, 1, -9, -10, 15, 7, -69]
7823f9j2K9L1l7Q6j8l7O1p1P2j39J25l7k4P3n4L6k1J1MqK1k9K0J6l2J7j2K6n4
7853b6L2l3O0k2l6qK8k0N7j2rj1l9M7j3K3j9J3j5k5L0k2K9Kj9J0j7J9rpM8p6M4
7886DK0j5J0k9M3l8J7%JJ2l5K1j4rK6j9M3p1P9q2J7J6j4K5l6J8J4k2QllJ7k4L6
7920A3l3J5PjOpjK0m4N9p2L6J1L3qnK0k3KJ8l9QOp8L3j1O8n4Q4l9l1k7jJ5L1K6
7956C7j7l7jJ6K0l3p5J28Lj16P9l7J16r5P7j1o4O2q3R4o9J12mq8J7j7JPqomNk2
7989a3JM0m4K6Pn2O8p6P0l9K9k5k6L5k7m1M0M0o1M9K3q1J01j8l2L0l9M7l2J1M
8020A5j7K4k6NOj8K8l5L8k7J2rk2M5l6mJ9pJ7l0K4ok9L5k4J6jLK0l5K4lj1J5k
8055DK4l1K9lj4K0m5M5k9lL2k9Nj7K2Ol8M5k3Lj9J3J3l6K8Pl0N1qo7k2Q7Pl4K5
$$ y = [-69, -81, -52, -21, -58, 28, 10, -27, 34, -37, 35, -104, 21, -16, -40, 33, -21, 15, -6, 5, 9, 1, 22, -7, 13, 29, -3, 14, 2, 28, -26, 6, -27, 33, 11, -25, -33, -5, -25, 32, 20, 11, 0, -39, 8, -5, 18, -1, 12, -3, -28, 2, -20, 9, 11, -8, 2, -15, 4, -5, -12, 36, -40, 4, 24, 9, 19, -10, 33, -5, 12, 12, 13, 25, -10, 11, -3, -12, 14, -5, 38, -33, 46, -36, -19, -3, -17, 8, -28, -10, 4, -18, -10, -13, -16, 1, -23, 13, -20, -5, 2, 1, 7, 0, -1, 19, -25, 34, -38, -2, 9, 42, 34, 29, 49, 26, 28, 46, 7, 15, 21, -57, -24, -35, 33, -21, 63, 24, -7, -34, -35, -20, 11, 37, 20, -17, -18, -2, 18, -15, -90, 38, 41, -75, 4, -33, 83, -12, 65, 54, -10, 52, -31, 63, -6, 106, 102, 14, 31, 14, 15, 22, 14, 8, 4, 9, -13, -12, 28, -16, 10, 17, -35, 33, -43, 27, -12, 17, -8, -34, 1, -26, -67, -27, 13, -48, 1, 24, -57, 44, 26, -6, 24, -15, 32, 0, 11, 15, -2, 22, -4, 1, 7, -11, 17, -18, 20, -7, 5, -4, -26, 19, -17, -21, -2, -9, 8, -22, 2, -4, -33, 2, -22, -6, -7, -4, 16, -19, 5, 2, -9, 6, 4, 28, -3, 26, 23, 9, 29, -16, 29, 0, -3, 29, 0, 5, -12, 10, 16, -22, 23, 0, 3, -16, -3, 10, -26, 2, 9, -21, 30, 22, -45, -67, 20, 27, -7, 18]
8090A8k8L1j8j8L9k7J4nK0%l1M2k6jJ4j5L2o0L6J3l6J6k3K6k9LM2m8MON5q7p8
8123a19J81q7K6j6k2N7m9M6j1k1N3qL1r5K8M7n4L4j4J8pj2L7n9K3KoOl2N6l7k
8155fK2l0K8m3M4k1j8K0L1L0j15Q6l8j3K3j2J7mk4O6n2L0j9M8n5m6J02n3l8P1
8185C1m2M3n0M5lm7
$$ y = [18, -10, 21, 3, -15, 24, -3, 11, 6, 26, 26, -5, 37, 11, 10, 24, 9, 41, -19, 17, 30, -6, 10, -13, 13, -16, -13, 29, -19, -15, -9, 46, -41, -119, 62, -25, 1, -15, -37, 20, -29, 17, 6, -15, 38, 30, 61, -34, -6, 41, -13, 21, 7, 25, 18, 6, 43, -16, 7, 9, 3, 9, -23, 33, -4, -6, 16, -14, 14, -29, 15, -6, -24, -4, 27, 57, -58, 28, -10, -23, 0, -12, 5, 1, -23, 43, -9, 21, 2, 50, -5, -51, 51, -2, -40, 31, -11, 32, -18, 27, 24, -23]
8191b3
$$ Imaginary data points
##PAGE= N=2
##DATA TABLE= (X++(I..I)), XYDATA
0@%%%%%%%%%%%%%%%%%%%%%%%%%%%kOqQj3K1k4L0m0M7n7O8p8R2j08J23j41J62j85
46i9K10k38K66k94L25l55L87m21M58m92N22n51N69n71N49m88L62j25l08J119k718
67a893O245j6042P6277K21788l54824N9304j50381K40867M78j73301K88080m26468
79b29870J91828J41816Q39o8034l65654M96772q2195j11966N4756j74054K47689
90A01927k04935K58916q1282l42022L23971j5178J39574l18155q233L12661k55600
101h8356K06292j52116j6932J9489l0622L44942m14077J711J60614K4596P8248
112A33789l24101K53721r1632k2596K18557k32363N7367j49645K75499N4381l59170
123a86193J93438n8016J55308r0678p6620J45030k60086K69759N559j20358m0774
$$ y = [0, 0, 0, 0, 0, 0, 0, 0, 0, 0, 0, 0, 0, 0, 0, 0, 0, 0, 0, 0, 0, 0, 0, 0, 0, 0, 0, 0, -2, 4, -4, 4, -9, 12, -12, 18, -22, 25, -32, 36, -42, 50, -58, 65, -76, 86, -99, 111, -127, 139, -155, 170, -185, 202, -219, 239, -253, 269, -282, 287, -284, 265, -223, 139, 14, -294, 825, -1893, 4352, -11690, 64587, 286375, -68449, -9145, -159526, 81341, 81819, -91482, 196598, -229870, -38042, 103774, 104613, 36579, -329075, 167697, 85502, -26464, 28292, -145762, 101927, -103008, 155908, 74626, -267396, 56575, 41397, 180971, -137184, -145417, 167244, -88356, 117936, -34180, -51112, -31623, -62245, 282697, -131380, -129669, 30945, 55541, 133789, -190312, 63409, -28223, -50819, 167738, -64625, -7258, -156903, 118596, 172977, -186193, 7245, -50771, 104537, 13859, -62761, 82269, -177817, 91942, 97501, -22857, -63631]
134f3631o8875L44694k28349m2717O6758q1493J72373j37842J26744j49243p9316
145a40897K89839j25637Q89j57531J26650J34373j98230J39010j38783L8557O2821
156C1061q394Q3312k78532J60163R9232o3526o807j39906J89727p7968K7880N8484
168G4726j82017J03386j2710J27854j01601j52189J95223m9664O0998q6054k8707
179e0755P5162q4157J69558j07168p5622N0464K5617J18997j90031K9434M5878
190G377j9611Q8798j10519L5947n9981N4799J13036j47742Q420k2282R8732J3742
202F0716j10284N9990o5425P7434K7136n2052o988p4514J39913l781o9609p284
214b4748k5505J04296m1678k373k3689m8448J01326j1010j268p3592l922J04937
$$ y = [-63631, -132506, 212188, -16161, -58878, 7880, -73613, 98760, -39082, 87662, -61581, -140897, 148942, 23305, 24194, -133337, -6687, 127686, -70544, 68466, -70317, -31760, 31061, 22667, 105979, -172553, -12390, 86842, 23316, 16509, -123397, 66330, -11638, 16242, 74726, -107291, -3905, -16615, 111239, 9638, -142551, 52672, 3008, 64006, -22048, -50755, 24407, -59750, 109808, 2640, -72982, -22518, 3099, 122096, -67935, -38501, 7377, -12234, 76564, -33955, 1992, -57989, -3190, 109846, -37896, -29476, -51758, 46974, 60716, -49568, 10422, -55003, 22431, 49567, -2485, -9473, -83987, 55926, 52145, -17464, -24748, -50253, 54043, 12365, 9992, -13697, -62145, 39181, 28171, 26903, -46689, -50611, 54326]
226E4326l8299L52n5960R759N7819j3015K1504q2882J0999N9699P162o017q2113
239e6666L9897L5246O232q87o7661K5755K2627L2210j3418p0082K6281K8092L2850
252D0476k9457m8758K1303J7765L8790k7905m4104Q573K5056M1001l3928l9173
264c0361O442K9262L2785k9608l2873l008L2928L0974k7449l2464n144L5377K7441
277C4302k4005l2488n417L3709K6336k0065l6286k550L2842K3049j6053l5651
289b2277l032K9680K4936j4806l6745l291K9017K6867j8562l2880j110K3033K8678
302B9508j6832l1602m268K2449L1206j8520l0803m537K4598K7330j8313k4480
314a4264j0061K4217K7963j7323k3552j3173K7071K6692j7810k2247j1938K5702
$$ y = [54326, 16027, 16379, -39581, -29822, 27997, 14982, 36486, -46396, -35397, 24302, 31464, 25447, -56666, -16769, 18477, 24709, 23822, -43839, -18084, 4543, 36753, 23335, -46747, -20466, 7626, 40476, 11019, -37739, -16436, 1329, 40119, 12214, -31890, -23317, 1739, 42740, 8812, -30361, -23919, 5343, 38128, 8520, -24353, -27361, 5567, 36541, 9092, -23372, -28516, 6861, 34302, 10297, -22191, -27608, 6101, 32437, 12372, -23914, -26464, 6378, 29427, 13374, -22277, -25309, 4371, 29307, 14501, -22244, -25535, 3482, 30349, 11787, -21093, -22203, 830, 29508, 12676, -18926, -23194, -745, 30461, 11941, -18862, -23399, 1199, 28529, 10216, -14264, -24325, -108, 27855, 10532, -13020, -26193, 878, 27570, 9760, -12487, -24425, 1277]
326A277K2825j2246k3484j3811K6678K1257r086k5604j2935K7813J8311q042k4018
339a1065j2660K4088J9910o577k4926j1456K1784K2115p547k5455q905J9421K0784
352A9511o542k2602j1669J9100K2120p186k0561j5129K2244K0854j0558j5418
364e836j6495K1309J8252o036j4658k1497K5375J6186l697j8871j9305L0920M561
377A0208L022j6369k1282K8421L033J3427k7194j9827L3563J44J2305l2377l601
390a6527K1756o290K7352l8452l313J2927P375K6645n6211J5102J0467L643J8460
403B2934m3778K4419j9224K2336K3659n1915J9087j7678M5566r173m4680M1278
415A2831l3937L9712j0866j4502J3081m5675P5477k6832k1567O214j4445O3096
$$ y = [1277, 24102, 11856, -11628, -25439, 1239, 22496, 13410, -12194, -25129, 2684, 20995, 12953, -11065, -23725, 363, 20273, 13696, -11230, -22686, -902, 21213, 13666, -11789, -20694, -1273, 19511, 12969, -9633, -21302, -2202, 19918, 12732, -7829, -22958, -714, 20140, 9582, -5836, -22331, -1022, 17230, 11194, -3464, -24961, 414, 16600, 12903, -5968, -25273, 5647, 10208, 13230, -3139, -24421, 4000, 7033, 20460, -6734, -26561, 7002, 7146, 19451, -12926, -16527, 5229, -1061, 26291, -12161, -15474, -2547, 4828, 31473, -24738, -9636, 831, 4474, 22934, -20844, 3575, -15649, 6687, 30346, -21569, -2482, -20160, 25406, 16233, -28447, 12831, -21106, 18606, 7740, -6762, 6319, -39356, 36121, 9289, -12278, -6064, -20509, 42587]
427D2587o3316K6075p10l4772N8953l8043L4461n4460N773P3373o9111L0261l6628
440b5557L3342J0443m7968P4731p9521K6193K2140r433K4507r3871R5781j6440
452A4347l1388L6983n2208O4613o6679N2498J8352r5290P9172l0823N0692n9222
464a8953k2066J00017j00740O3707k3057l629J2680n8182J29256j05403m628M9200
476A8202k4908N1166j09821J01976k7497n6676R7993p1651M6697p8092O4099N7245
488F8733j41999R6772l5460L5127k8381l1104J10639j44312P9697K1502l8450
499g236J4081p5903J55170j03974k2206Q1206p0212O3175q6829J02300l3825r9995
511h4248J48088p2779L0348o9241M5112P8950j62330J28283l9938j2802Q616k7906
$$ y = [42587, -20729, 5346, 4636, -30136, 28817, -9226, 25235, -29225, -23452, 49921, -19190, 11071, -25557, 7785, 18228, -29740, 44991, -34530, -8337, 13803, 4370, 28877, -64994, 30787, 14347, -17041, 19942, -32266, 32347, -34332, 18166, 36518, -58772, 20400, -10423, 40269, -18953, -41019, 58998, -41742, 21965, -1092, -4721, 7959, -50223, 79033, -26370, -30998, 18202, -6706, 44460, -65361, 36615, 9118, -47558, 50435, -21216, 25481, -52611, 11488, 68733, -73266, 23506, -11954, 23173, -5208, -36312, 74327, -69985, 9712, 31214, -7236, 6845, -69058, 86112, -17862, -40068, 41138, -29074, 34101, -52728, 49572, 15747, -84248, 63840, -8939, 21409, -47832, -2720, 76230, -86100, 42183, 2245, -10557, -1941, -29847]
523b9847J25191j79138P4207O2090p2433L7927q3254J44044j04105k3906J27909
534G8685j21011N5439n8767R9383k2373j35874J76214q1808J5649k5733J3761
545f435P4229j69384J54383k4628o5309L7803l1238J26440j70437N8319Q0856
556F4599j11385P0736o2259J02340r4202l2337J62931j41158L9311k8834O6337
567C6079P6j35123J79772r6048q607L2833j1021O1867j66625J54322j846r8924
579e3245O8298m4338J02446j36944N4259Q7581j50907R2920l4362O6145p5493
590b3640m6616J72565j45748L8306K223J4090J6184j12243J71104r7983l5079
601d6837P2329k9755N6223j39668J21964J0297j08021R7805n2676N7937q8951
$$ y = [-29847, 95344, -83794, -9587, 52503, -19930, 17997, -65257, 78787, -25318, -49224, 78685, -42326, 13113, -45654, 53729, 31356, -104518, 71696, -10112, 5537, -20196, -6435, 67794, -101590, 52793, 28165, -37144, 659, -30579, 95861, -74576, -16257, 64599, -46786, 23950, -38309, 64031, -30171, -62508, 100423, -40735, -1424, -30258, 36079, 36155, -98968, 80804, -15244, -23851, 8982, -2039, 59828, -106797, 47525, 45679, -53245, 15053, -29285, 73161, -63783, -9524, 78057, -72850, 20070, -14292, 51853, -23640, -70256, 102309, -43439, -5133, -2910, 11180, 27364, -84879, 86225, -11758, -46837, 25492, -4263, 51960, -87708, 34256, 44553, -63468, 34337, -18339, 39598, -49353]
612d9353M1563R0114j57226Q6666j1151K7504l5848n0051J43499j32350L5955
623a0678L7105l1615K0786q4604J43667p6052n2037Q8437m7545M7477r1257Q3811
635B7495Q226j06504J13922m8165K2284n1406K1230Q6300j37648P7278m408q195
647D09L322m1647J05797j12165K7850N4239n0346K6741o4526R9442m6207m6580
659d3671Q4889o1102L4139m1665M6822R871r1226R6337l2712K386j6896k059O2944
672D8057r5039O1562J773l4000K3252k6740O8329p5840R793N1914m9021K8739
684A2779l7820M9401k4575l1330P1341n6161J7025j2475K0914J5175o6392O5006
696B2888k3490l949Q877j4805L5719n7462M3565O001l5120K3860k1179M1295l7741
$$ y = [-49353, -7790, 82324, -74902, 11764, 613, 28117, -7731, -57782, 85717, -46633, -10678, 26427, -5188, 15598, -69006, 74661, -1391, -53428, 35009, -12536, 34941, -56316, 27495, 35721, -70783, 43139, -5026, 17258, -34148, -12918, 73382, -64266, 13012, 8604, 409, 3731, -37916, 67881, -44284, -16434, 37805, -12541, 14200, -50326, 49116, 2909, -43671, 41218, -19884, 14255, -27410, 19412, 29283, -61943, 34394, 1682, 4068, -12828, -14887, 48057, -46982, 14580, 16353, -17647, 5605, -21135, 47194, -28646, -18853, 33061, -15960, 12779, -25041, 24360, -215, -31545, 39796, -16365, 660, -11815, 9099, 24274, -42118, 22888, -602, -4551, 4326, -10479, 25240, -32222, 11343, 17344, -17776, 6084, -15095, 26200, -11541]
709a1541l66L3300l9431K7750j5661J5196j0283k0020M6810l3272O283k484K375
722a344J5660l3070L2537j6017p170J7986j2168J4649k7230J8171R391k0001J3898
735E292j3067J4465r301J7J3849k3685J5004j674K722j983j2671J9386j0407L033
749I80O22n994P174p129J1394p755n021Q036l205O301q770J350L397k907N839
764D312n473q26O24K770J811m830J4J21L193K76k125k190R33L318nj750l719M323
782G77l77Q10Q44o419M981o58K939j995o028P402k961L451l305k040M217n006
798c368R269p190j733M231l564Q933j0725L150K444m412Q745r214M705l713J551
813h91P497j1770P325n733M968K879r693R939r743P036J657o799O505r595J1008
$$ y = [-11541, -11907, 21393, -18038, 9712, -5949, 9247, -1036, -21056, 25754, -7518, -1235, -3719, -1344, 14316, -18754, 13783, -2234, -9404, 8582, -3586, 11063, -16167, 2004, 11395, -8606, 5292, -7775, 6690, -2611, -2594, 11255, -12430, 2574, 900, 3622, 1639, -11032, 8354, -2053, 980, 1602, -4392, 2782, -4347, 7047, -708, -5729, 2307, -898, 5403, -3367, -2017, 1380, -1527, 4312, -1161, -1987, -1363, 1407, 3218, -1612, -1598, -1477, 1716, 1992, -133, -2323, -1390, 1928, 1923, 173, -3546, 777, 400, 1210, 2054, -4365, 616, -42, 2897, 902, -5126, 2276, -685, 2766, -539, -2579, 1638, -3368, 5901, -1289, -3022, 1209, -2355, 6578, -4147, -997, 1447, -2965, 5780, -3434, 1271, -2442, -891, 6606, -5164, 2161, -3572, 1396, 4275, -5418, 4521, -5222, 1814, 3471, -3328, 3177, -6418, 4590]
828D590l605l106M562q373J1592p289K357P60p850J2614q691M291k424l913J0015
843E530q612O535n718k64O493o674P125q817L795L390n347P205r062M719R74k112
859h40M628q400N491o97M00J486n754N389l062L011J62n150M250k041L080r37
875A016l785L111m61J522p07k083P71P95R95m63k077M93R85J007M96m110K473
892b2O10l16J822n627M950j857l49M459p292M712k701L604P12q416R203n701M354
909B145k018l295Q648j2788J2373l404n542O670q516J4880j4135K481Q323j2172
923f350J2541j2088J1797o933p744K1966k0604J0277o898M516Q861k4480K6892
936A1753j4779j82P220r319J8531l0417K3240K145j8660J7793j7707K4972k3354
$$ y = [4590, 985, -2121, 2441, -5932, 5660, -1629, 728, 1488, -6362, 6252, -2439, 1852, -572, -4485, 5530, -3082, 3453, -2265, -2529, 3964, -2710, 4415, -4402, -607, 2783, -2564, 4641, -4421, 298, 1272, -840, 3788, -4612, 879, 182, 582, 2068, -3686, 1703, -1359, 1652, 1814, -3336, 914, -1127, 1953, 1016, -2769, 342, -119, 1403, 696, -1387, -616, 179, 1174, 711, -1366, -873, 112, 1119, 1615, -2495, -22, 588, 272, 2094, -3533, 1417, -440, -789, 3670, -3622, 1090, -1611, 1993, 2705, -5711, 3492, -2209, 2145, 127, -3168, 5480, -7308, 5065, 1661, -3881, 2789, -5727, 9153, -4982, -2501, 5822, -6350, 6191, -5897, 5900, -1033, -8777, 13189, -7415, 2862, -4036, 480, 9341, -15139, 11753, -3026, -3208, 4012, -5307, 13224, -17193, 6047, 8192, -10468, 7325, -10382, 14590, -8764]
949h764K682K4151l4331K3058j2124J3587o850k0889M3006l3888J0262P51k539
962a888J5081l8426M5777k0324j4179K3863j7683K6891m2523K8875J2159m0124
974b2501L5365k1707K3630k7151J493M3344n8855L2357o797P219k141l2505O4071
987C5822n1575P245K0597j7292J9625m7892O1651k3168l1895M6247k9088K8445
999A8722m5331L3255K0778o5961N7412k1475J2348k1357m171N9460p8227L7592
1011C045O825j1735P299l6100P4582o1934j477M5552l6084K3032m6705O2452j8545
1024A0207n0154P0657l9291J8519l2519K9310K8058q5792P3842j7394o370n947
1036f874j0269O6172r1149M3031K3764l8744J9556l3459P4752o6430q460O7946
$$ y = [-8764, -6082, 18069, -16262, 6796, -5328, 8259, 1409, -19480, 23526, -10362, -100, 651, -1888, 13193, -25233, 20544, 220, -13959, 9904, -7779, 19112, -23411, 5464, 17623, -22501, 12864, -8843, 14787, -12364, -10871, 32473, -26382, 5975, -822, 6397, 4256, -28249, 35822, -15753, -8508, 12089, -5203, 14422, -33470, 28181, 5013, -26882, 19365, -9723, 18722, -26609, 6646, 27424, -38537, 18875, -2600, 9748, -11609, -15780, 43680, -34547, 3045, 9870, -1865, 5434, -30666, 43916, -18018, -19495, 26057, -10027, 13005, -33700, 28752, 10207, -39947, 30710, -8581, 9938, -22581, 6729, 34787, -51005, 22837, 5443, -927, -6874, -17143, 49029, -42120, 911, 24675, -14069, 5487, -27972, 46780, -19650, -28110, 39836]
1048C9836n6942K6271l6304N5051j6403o1780R2728n0333O405j2412J8299L2477
1060C6893r3080Q1585j2543k7435J5398j5477O0938r0032M1734L8318o1730L2057
1072F626k7038N9802n5506j6322Q1380p1432K3678j4144L4015r935o3491R9508
1084D7141n2726p876J2625J887L1411q6704Q0744p386m8269L8279j8612M6534
1096C7048p6816L6583M5657p7138M3201j9230L8535m1294j8211Q5038q0620K3319
1108c928M319J1071m61n8507R2699n0171j5945L2104j4167K7507o9542O8707k398
1121B1288n7283N1684k2002L0069n2141K3279M5854p7759M5431p851J2242k1105
1133h294j7686P3402p3022J7574J9773j0914P989m4249P2634m0714k1889M5775
$$ y = [39836, -17106, 9165, -27139, 27912, 11509, -50271, 42457, -7876, -1471, -13883, 4416, 36893, -56187, 25398, 12855, -14580, 818, -14659, 46279, -43753, -2019, 36299, -25431, 6626, -20412, 39390, -16116, -32438, 48942, -22490, 1188, -12956, 21059, 11124, -52367, 47141, -5585, -13461, -836, 1051, 32462, -54242, 26502, 19116, -29153, 9126, -9486, 37048, -39768, -3185, 42472, -34666, 8535, -10695, 27840, -13454, -31665, 53373, -27247, -3928, 391, 11462, 11001, -47506, 45193, -4978, -20923, 11181, -2986, 24521, -45021, 23686, 21288, -35995, 15689, -6313, 23756, -28385, -5106, 40748, -37011, 8420, 569, 12811, -8294, -25980, 47422, -25600, -8026, 11747, 833, 8822, -35427, 37207, -3507, -25396, 20379]
1145B0379k5479J8826m4583M8531J389n4703N4555k2398J4274k7568J2402L8532
1157C4157o9094M3633k077n545l270j7437N5792n7158J3556K3589k2694J3704
1169G156l0283M9522k8990k0205M4640k9300J4699k3918K6284N447m3795M6220
1181A7477j8581J532o730K604K7131m9053L2040K426j5034Q507j4039L3477l5427
1194a3670O759K3392k5884J3350j4495K4600j4556j5783L3512k4017Q817p678
1206e653Q989O156k8506L1922j2728m004M352m212J6796k7509J8089K607j3344
1219g045J0970r967J6734j7779K862J5376j8929J0811p030Q575l608r631J8459
1232I798j4098M053L22J90L990j2986J4945o041l477N673m851P073r375O079K214
$$ y = [20379, -5100, 13726, -30857, 17674, 19063, -35640, 18915, -3483, 10791, -16777, -4375, 34157, -34937, 8696, 6619, 1074, -2196, -19633, 36159, -20999, -7443, 16146, -6548, 7156, -23127, 26395, -2595, -22800, 21840, -7460, 7239, -16679, 9605, 15052, -28743, 17477, -1104, 428, -6302, -3698, 23433, -25620, 6420, 8846, -6188, 2319, -11720, 21757, -13670, -6911, 16481, -9403, 3947, -10548, 14052, -504, -16287, 17225, -6792, 2025, -5653, 3336, 9492, -19014, 12908, 180, -3824, 528, -3684, 13112, -14397, 3692, 6299, -7045, 3925, -6042, 10692, -7087, -4225, 11151, -7778, 3033, -3997, 4578, 970, -8661, 9798, -4300, -247, 75, 265, 4255, -8731, 6214, 173, -3304, 2369, -2482, 4591, -4784, 1295, 3509]
1247C509p957O582l247L324l984J47N327o613M084j441M38M62k718M710l788L14
1263h51J740j269R21j220J121n14M3M04n64n0K45K22n18M72m95Q14j198J304K07
1282H14k859L602k175P88n3j467L776m666L312l84j927K464l231N040n199J540
1298f25K998n086N406n220M225j088l845P504p289M169j748m5L596p450Q266n335
1314a567J224K262n063P473q686O131j10n244P342p462O970m428m48N473q417
1329d550Q194n952K927R57n882R636r208N510q74l594P207q974P990m563m43N036
1345C417p490Q179p108L826J037n643Q506q915O127j519k933O446q310P720m472
1360a132Q5L937o530P046o251M153j07m721P556p140N079k208j390M988p246O513
$$ y = [3509, -4448, 2134, -1113, 2211, -1773, -1626, 3701, -2912, 1172, -269, 169, 631, -2087, 2623, -1165, -851, 889, -380, 541, -679, 442, -72, -29, 375, -189, -239, 6, 228, -290, 182, -313, 501, -697, 607, 814, -2045, 1557, -618, 170, 117, -1350, 2426, -2240, 1072, 688, -1239, 1225, -2006, 3034, -2165, -625, 2373, -2713, 2693, -2527, 1698, 610, -3235, 4269, -3020, 1149, -599, -644, 2952, -4498, 3768, -1567, -343, 1919, -3144, 4329, -4357, 1774, 1664, -3580, 3762, -3700, 3270, -1158, -1606, 3867, -4550, 3644, -2308, 619, 1576, -4306, 5330, -3878, 1632, 758, -2836, 4371, -4603, 3387, -1176, -1619, 3417, -4073, 4106, -3002, 824, 1861, -3782, 4724, -4191, 1936, 417, -2516, 3930, -4380, 3340, -1132, -1047, 2890, -3640, 3406, -2845, 1308, 1201, -3520, 4036, -3104, 1975, -233, -1623, 3365, -3881, 2632]
1376B632l305j80K201l598N420n711L195M63k980L990m436M234k583q18M011m390
1392a855K792j557R92M55k444L024k135Q62k35o6J038k213K116m63p12N18k84
1409a67L42k07j48QO86j181J195m30m44J100j870K240j593L16L55j069K873m242
1427b236L410o90j812L099m174N243m674O85M298o025M859m235M515j842m296
1442c875Q914q334M646k467J014M022j1121J2799o223j287L749m855R381j3499
1456g136R292J629r118Q920p836J1066j1191P95J2862j6671J0549o030O128j606
1470A653j1389K1217j6251L560K290j750P388j9603K2102q010q270J2016r233
1483d280J3604k0517J3374P916k2218J7836r267J0842j2712j422K3347k8962J4835
$$ y = [2632, -673, -853, 1348, -2250, 3170, -2541, 654, 1117, -1863, 2127, -2309, 1925, -658, -1476, 2535, -1855, 937, -620, 372, 827, -1617, 1407, -728, 134, -101, -167, 871, -1342, 774, 311, -401, 117, -167, 175, -32, -180, -172, 514, -667, 528, 98, -346, 754, -1116, 1124, -469, -153, 202, -867, 2006, -2236, 1174, 484, -1328, 1771, -2403, 2840, -1834, -1149, 3149, -2876, 1983, -2252, 2263, 421, -3875, 5039, -3295, 1351, -1116, -102, 3920, -7201, 5598, -625, -1912, 1837, -3018, 6363, -7136, 2156, 3785, -5333, 3587, -4249, 6817, -4374, -3579, 9283, -7388, 3161, -2869, 3259, 1653, -9736, 11481, -4770, -1210, 1080, -670, 6718, -12885, 9217, 1207, -7063, 4953, -4280, 9324, -11193, 2181, 10097, -12121, 5715, -3552, 7290, -5422, -6844, 16503, -12459, 2376]
1496B376k038K374m74j6988L3400k5636J063J2251q934J0614k5117L0308r382
1509C817j8299K4511j4286J3430k3097J6547J3147l5801K8639r546O067j0232
1521e103m242L2572m0687J7395O530p349L504j9506L9757l0309m267K5331j8608
1534d982J1798k4281L1580p021k9723L8335j8447P237j5931J3455J7682m5852
1546b6150L6432o023n486k211o149L6150m7862J9235J6583k1587R937j8142L9103
1559B3830l2044q459L7949k9191J1631j7927K8615o349l5902M9080k3650J318
1571a099o154Q365J9760n0615M1383k477j7416Q086q068L3625m7317J8100K4272
1584B0445l3364J5901j3838L1427k7401j2774M6325l6855R025n413J6783k321
$$ y = [2376, 338, 2712, 2238, -14750, 18650, -6986, -5923, 6328, -2606, 8008, -17109, 13199, 3817, -14482, 10029, -4257, 9173, -13924, 2623, 15770, -20031, 8608, -938, 5129, -5103, -9345, 23227, -17460, -65, 6465, -884, 2620, -16886, 22871, -7438, -11705, 13626, -4982, 6816, -17465, 14115, 7094, -22629, 15706, -2741, 4496, -11435, 2020, 19702, -26150, 10282, 4259, -1227, -3438, -9587, 26563, -21299, -2064, 14519, -7068, 2869, -15273, 23830, -8214, -16673, 21276, -7915, 3716, -14211, 14404, 8055, -27847, 21233, -2417, -1099, -7253, 1112, 20872, -29743, 11640, 9163, -8253, -167, -8235, 25390, -21927, -3827, 20445, -12919, 2982, -10856, 20571, -6830, -19604, 26721, -10134, -1109, -6522, 10261, 7940]
1596G940l6383N1889k4068p772Q355L42J7671m6649M0314J194k8844K0149r306
1609e168K4702l8751J4872K8204m1435K0377p638J9381k0299j3084M7034m0392
1621a2197Q622L995N098J757l3146M8486k2620j2788J8355o720J4780l7234L3819
1634A0207L250l2557K6441j0336J5514k6590R154K8191m2155K1304j045M995r190
1647b817j2440L9724l5653N023J3016o568M817k4058L7123j7289j5815K5346j2718
1660b309R503k2312K1971N266l1018K7400q823N365j3024L966K2855l5759J9371
1673B452J907m179m46j0778K9421k7261K874J5033j1888O548j5706K4351j1624
1686G04j3390K3420j3921O575j1400J1685N483k4205K2749o902j108k178n00J5108
$$ y = [7940, -28443, 23446, -622, -8394, -39, 303, 17974, -28675, 11639, 12833, -16011, 4138, -5168, 19534, -19217, -4345, 23859, -17576, 2801, -4837, 14544, -5755, -18839, 28195, -12197, -3575, 420, 5518, 7275, -25871, 22615, -5, -12793, 5562, -1158, 13622, -23612, 10207, 13457, -19100, 7341, -2995, 12519, -14071, -4917, 23274, -18881, 2423, 1378, 6373, -2817, -15257, 24467, -11186, -6163, 6853, 285, 5102, -18956, 18167, 878, -14937, 10409, -2309, 7194, -15118, 6853, 12119, -18899, 8501, -322, 5043, -7981, -4015, 18840, -16919, 2452, 4359, 180, -266, -11044, 18377, -8884, -6010, 9023, -2865, 3683, -12023, 12328, 704, -12686, 10734, -3187, 3388, -8012, 3673, 9156, -15049, 7700, 798, -310, -2488, -2988, 12120]
1700A2120k3909J3555L647q844M697p343J6679j6035L39J3796j3110O211o541
1713d738J0282m273r961J6750j0284K336k274L066M514j4425J4022l916l393L072
1727G78l064Q414j2110O426L578p528N043m085O894o550m89P698q267M344k444
1742a362K839l64n348Q316n165L12J259q86K337n045M955j256k299K889k096K439
1758A525k851J081K008l493K386o41j52L44r67J702j303J13P57r22P25m89R4L91
1776C08q48J168r22j50J556k096J338q1p06J128j909K372j432o63K143k042J672
1793H36j859J615L66l032L943k874J416m90r04L513n163L785o26j583K285l185
1809a957M500m244J283K362m122M176m152L815j356k937O006n873L754j728j62
$$ y = [12120, -11789, 1766, 5413, -3431, 1266, -6077, 10602, -5433, -5094, 8702, -4408, 1803, -4738, 5544, 1271, -8690, 8060, -2224, 112, -2162, 904, 5418, -9007, 5015, 1099, -2294, 778, -2286, 6128, -5982, 444, 4022, -3506, 1537, -2548, 4346, -2204, -2693, 5005, -3262, 1082, -1362, 1477, 1113, -4235, 4081, -1084, -772, 487, -399, 1938, -3107, 1848, 592, -1707, 1182, -914, 1525, -1326, -245, 1763, -1730, 656, 15, -137, 207, -760, 942, -361, -248, 509, -413, 312, -177, -83, 308, -540, 628, -294, -444, 1112, -984, 354, 273, -433, 695, -1214, 1158, -274, -937, 1206, -836, 836, -1023, 592, 958, -2074, 1869, -1005, 411, -79, -983, 2530, -2633, 1152, 526, -1057, 1228, -1957, 2543, -1701, -418, 1944, -2178, 1998, -2154, 1661, 305, -2632, 3374, -2499, 1255, -473, -635]
1824f35L000n872O408l988O97J660l553N602o525M562l42l532N470n876N361l380
1840i43l77M325o320N923m281K083Q99m252O601o577M268q99k464N222o688O026
1856B546l353l25L687n726O070m812K391O66l797N974o376M674j378k048M592
1871B785n991N926l776R5L258m905N055m513L054j50l287N377n189L691j966l14
1887h50L359n696N406k810J04J531k840M317m664K732L16k265K777l248L793k826
1903h64r2K963l721K829k022J482l3k248L388k517J077n29K91R57k595K863j464
1920b35l6N22p37J484k018J357l2n50L12l08R74j520J230m90j29N32j024J445
1938G77j392R66m28k02R37j489J654j700J536n88j246K907l072K051j085L99J074
$$ y = [-635, 2365, -3507, 2901, -1087, -390, 1270, -2283, 3319, -3206, 1356, 1014, -2518, 2952, -2924, 2437, -943, -1320, 3005, -3315, 2608, -1673, 410, 1309, -2943, 3658, -2919, 1349, 450, -2014, 3208, -3480, 2546, -807, -1132, 2555, -3171, 2899, -1913, 478, 1144, -2653, 3321, -3055, 1619, 241, -1807, 2785, -3206, 2720, -1056, -961, 2297, -2608, 2447, -2066, 988, 838, -2449, 2928, -2261, 1430, -536, -850, 2509, -3187, 2219, -591, -487, 1044, -1796, 2521, -2143, 589, 905, -1360, 1417, -1831, 1962, -864, -956, 2007, -1714, 1115, -907, 575, 542, -1706, 1682, -835, 242, -287, 4, 961, -1634, 1229, -235, -271, 251, -486, 998, -1020, 337, 305, -245, 67, -241, 733, -787, 443, -47, -176, 356, -668, 777, -615, 351, -77, -279, 658, -831, 823, -877, 659, 71, -1175, 1732, -1340, 711, -374, 25, 1099]
1955A099l306M247k872O95L02q11K860n378N043j360k158L037l284M979n828K553
1971a82L141n901M564l345M387l689j831P817q220M124j707J835R03p608J1201
1986E489o732n60L061k276M954j0284R731j035o897P147m640O700r551M237P334
2001F678j3172Q783l325L969m293l800J4291j4465M799J815o00J429j0509J7397
2015H997j0675l126Q786n486O053j3307J3908o74j3343J3628o112N676j0632N774
2029e33J0508k0343J3283k161J454m035m784J9547k0650N296P232n608K774j1493
$$ y = [1099, -2207, 2040, -832, -137, 165, -646, 2214, -3164, 1879, 519, -1639, 1398, -1886, 3093, -2735, -182, 2959, -2942, 1622, -1723, 2664, -1025, -2856, 4961, -3259, 865, -842, 993, 1896, -5712, 5489, -1243, -1803, 1258, -1018, 3936, -6348, 3383, 2348, -4549, 2598, -2042, 4658, -4893, -656, 6678, -6494, 2289, -1036, 2933, -1360, -5160, 9131, -5334, -535, 1280, 680, 2109, -8400, 8997, -1678, -4804, 3982, -1504, 4549, -8758, 5150, 4476, -8867, 4761, -1351, 4325, -6307, -533, 9975, -10368, 2915, 754, 2208, -1827, -6611, 12936, -7714, -2418, 4814, -794, 1980, -9513]
$$ [...]
8191A2
##END NTUPLES=NMR FID
##END=
