##TITLE=1H_DE-80H_X3
 200.13MHz, d2o
 8 sc
 
 19ns.26.2.2025
##JCAMPDX= 6.0         $$ Bruker NMR JCAMP-DX V2.0
##DATA TYPE= NMR FID
##DATA CLASS= NTUPLES
##ORIGIN= UXNMR, Bruker Analytische Messtechnik GmbH
##OWNER= pz
$$ XWIN-NMR		Version 3.5
$$ Fri Dec 19 10:34:53 2025 Russian Standard Time (UT+4h)  Yarkov@DPX200
##.OBSERVE FREQUENCY= 200.1313
##.OBSERVE NUCLEUS= ^1H
##.DELAY= (6, 6)
##.ACQUISITION MODE= SIMULTANEOUS
##.ACQUISITION SCHEME= undefined
##.AVERAGES= 8
##.DIGITISER RES= 18
##SPECTROMETER/DATA SYSTEM= spect
##.PULSE SEQUENCE= zg30
##.SOLVENT NAME= DMSO
##.SHIFT REFERENCE= (INTERNAL, DMSO, 0, 14.3821)
##AUDIT TRAIL= $$ (NUMBER, WHEN, WHO, WHERE, WHAT)
$$ ##TITLE= Audit trail, XWIN-NMR		Version 3.5
$$ ##JCAMPDX= 5.01
$$ ##ORIGIN= Bruker BioSpin GmbH
$$ ##OWNER= Yarkov
$$ C:/Bruker/XWIN-NMR/data/yarkov2/nmr/H-C/1/audita.txt
$$ ##AUDIT TRAIL=  $$ (NUMBER, WHEN, WHO, WHERE, WHAT)
(   1,<2025-12-19 10:34:12.90 +0400>,<Yarkov>,<DPX200>,
      <created by zg, POWCHK disabled, PULCHK disabled
       configuration hash MD5:
       00 E9 B6 7A A2 85 ED C7 34 08 36 98 17 FE 4E 26
       data hash MD5: 16K
       46 83 BF BD ED 3B B7 67 B6 75 BD 80 D5 CF 80 D3>)
$$ ##END=
$$ 
$$ hash MD5
$$ 6E C6 2D A6 9A 64 8D 2C 21 96 6B 57 AF 13 C3 6E
##$RELAX= 
##$RELAX= 
##$RELAX= 
##$RELAX= 
##$RELAX= 
##$RELAX= 
$$ Bruker specific parameters
$$ --------------------------
##$DU= <C:/Bruker/XWIN-NMR>
##$EXPNO= 1
##$NAME= <H-C>
##$PROCNO= 1
##$TYPE= <nmr>
##$USER= <yarkov2>
##$AMP= (0..31)
100 100 100 100 100 100 100 100 100 100 100 100 100 100 100 100 100 100 
100 100 100 100 100 100 100 100 100 100 100 100 100 100 
##$AQSEQ= 0
##$AQ_mod= 1
##$AUNM= <au_zg>
##$AUTOPOS= <>
##$BF1= 200.13
##$BF2= 200.13
##$BF3= 200.13
##$BF4= 200.13
##$BF5= 200.13
##$BF6= 200.13
##$BF7= 200.13
##$BF8= 200.13
##$BYTORDA= 1
##$CFDGTYP= 0
##$CFRGTYP= 5
##$CHEMSTR= <none>
##$CNST= (0..31)
1 1 145 1 1 1 1 1 1 1 1 1 1 1 1 1 1 1 1 1 1 1 1 1 1 1 1 1 1 1 1 1 
##$CPDPRG= <>
##$CPDPRG1= <>
##$CPDPRG2= <>
##$CPDPRG3= <>
##$CPDPRG4= <mlev>
##$CPDPRG5= <mlev>
##$CPDPRG6= <mlev>
##$CPDPRG7= <mlev>
##$CPDPRG8= <mlev>
##$CPDPRGB= <>
##$CPDPRGT= <>
##$D= (0..31)
0 0.7 0 0 0 0 0 0 0 0 0 0.03 0 0 0 0 0 0 0 0 0 0 0 0 0 0 0 0 0 0 0 0 
##$DATE= 1766126052
##$DBL= (0..7)
120 120 120 120 120 120 120 120 
##$DBP= (0..7)
150 150 150 150 150 150 150 150 
##$DBP07= 0
##$DBPNAM0= <>
##$DBPNAM1= <>
##$DBPNAM2= <>
##$DBPNAM3= <>
##$DBPNAM4= <>
##$DBPNAM5= <>
##$DBPNAM6= <>
##$DBPNAM7= <>
##$DBPOAL= (0..7)
0.5 0.5 0.5 0.5 0.5 0.5 0.5 0.5 
##$DBPOFFS= (0..7)
0 0 0 0 0 0 0 0 
##$DE= 6
##$DECBNUC= <off>
##$DECIM= 32
##$DECNUC= <off>
##$DECSTAT= 4
##$DIGMOD= 1
##$DIGTYP= 9
##$DL= (0..7)
0 120 120 120 120 120 120 120 
##$DP= (0..7)
150 150 150 150 150 150 150 150 
##$DP07= 0
##$DPNAME0= <>
##$DPNAME1= <>
##$DPNAME2= <>
##$DPNAME3= <>
##$DPNAME4= <>
##$DPNAME5= <>
##$DPNAME6= <>
##$DPNAME7= <>
##$DPOAL= (0..7)
0.5 0.5 0.5 0.5 0.5 0.5 0.5 0.5 
##$DPOFFS= (0..7)
0 0 0 0 0 0 0 0 
##$DQDMODE= 0
##$DR= 18
##$DS= 0
$$ [...]
##$SUBNAM2= <"">
##$SUBNAM3= <"">
##$SUBNAM4= <"">
##$SUBNAM5= <"">
##$SUBNAM6= <"">
##$SUBNAM7= <"">
##$SUBNAM8= <"">
##$SUBNAM9= <"">
##$SW= 18.0517328524113
##$SWIBOX= (0..15)
0 0 2 0 0 0 0 0 0 0 0 0 0 0 0 0 
##$SW_h= 3612.71676300578
##$TD= 16384
##$TD0= 1
##$TE= 0
##$TE2= 300
##$TE3= 300
##$TEG= 300
##$TL= (0..7)
0 120 120 120 120 120 120 120 
##$TP= (0..7)
150 150 150 150 150 150 150 150 
##$TP07= 0
##$TPNAME0= <>
##$TPNAME1= <>
##$TPNAME2= <>
##$TPNAME3= <>
##$TPNAME4= <>
##$TPNAME5= <>
##$TPNAME6= <>
##$TPNAME7= <>
##$TPOAL= (0..7)
0.5 0.5 0.5 0.5 0.5 0.5 0.5 0.5 
##$TPOFFS= (0..7)
0 0 0 0 0 0 0 0 
##$TUNHIN= 0
##$TUNHOUT= 0
##$TUNXOUT= 0
##$USERA1= <user>
##$USERA2= <user>
##$USERA3= <user>
##$USERA4= <user>
##$USERA5= <user>
##$V9= 5
##$VALIST= <valist>
##$VCLIST= <CCCCCCCCCCCCCCC>
##$VD= 0
##$VDLIST= <DDDDDDDDDDDDDDD>
##$VPLIST= <PPPPPPPPPPPPPPP>
##$VTLIST= <TTTTTTTTTTTTTTT>
##$WBST= 1024
##$WBSW= 4
##$XGAIN= (0..3)
0 0 0 0 
##$XL= 0
##$YL= 0
##$YMAX_a= 65937
##$YMIN_a= -67923
##$ZGOPTNS= <>
##$ZL1= 120
##$ZL2= 120
##$ZL3= 120
##$ZL4= 120
##$ABSF1= 10
##$ABSF2= 0
##$ABSG= 5
##$ABSL= 3
##$ALPHA= 0
##$AQORDER= 0
##$ASSFAC= 0
##$ASSFACI= 0
##$ASSFACX= 0
##$ASSWID= 0
##$AUNMP= <proc_1d>
##$AZFE= 0.1
##$AZFW= 0.1
##$BCFW= 1
##$BC_mod= 2
##$BYTORDP= 1
##$COROFFS= 0
##$CY= 83.5205535888672
##$DATMOD= 1
##$DC= 2
##$DFILT= <>
##$DTYPP= 0
##$F1P= 10.8118882576601
##$F2P= -7.23987719738617
##$FCOR= 0.5
##$FTSIZE= 0
##$FT_mod= 4
##$GAMMA= 1
##$GB= 0.15
##$INTBC= 1
##$INTSCL= 1
##$ISEN= 128
##$LB= 0.25
##$LEV0= 0
##$LPBIN= 0
##$MAXI= 10000
##$MC2= 0
##$MEAN= 0
##$ME_mod= 0
##$MI= 1.114404
##$NCOEF= 0
##$NC_proc= 0
##$NLEV= 6
##$NOISF1= 3.799351
##$NOISF2= 2.8
##$NSP= 1
##$NTH_PI= 0
##$NZP= 0
##$OFFSET= 14.38212
##$PC= 1
##$PHC0= -5306.755
##$PHC1= 10.82193
##$PH_mod= 1
##$PKNL= yes
##$PPARMOD= 0
##$PSCAL= 0
##$PSIGN= 0
##$REVERSE= no
##$SF= 200.129724274929
##$SI= 16384
##$SIGF1= 3
##$SIGF2= 2
##$SINO= 400
##$SIOLD= 16384
##$SREGLST= <1H.CDCl3>
##$SSB= 0
##$STSI= 0
##$STSR= 0
##$SW_p= 3205.1282051282
##$SYMM= 0
##$S_DEV= 0
##$TDeff= 0
##$TDoff= 0
##$TI= <>
##$TILT= no
##$TM1= 0
##$TM2= 0
##$TOPLEV= 0
##$USERP1= <user>
##$USERP2= <user>
##$USERP3= <user>
##$USERP4= <user>
##$USERP5= <user>
##$WDW= 1
##$XDIM= 8192
##$YMAX_p= 0
##$YMIN_p= 0
$$ End of Bruker specific parameters
$$ ---------------------------------
##NTUPLES= NMR FID
##VAR_NAME=  TIME,          FID/REAL,        FID/IMAG
##SYMBOL=    X,             R,               I
##VAR_TYPE=  INDEPENDENT,   DEPENDENT,       DEPENDENT
##VAR_FORM=  AFFN,          ASDF,            ASDF
##VAR_DIM=   8192,          8192,            8192
##UNITS=     SECONDS,       ARBITRARY UNITS, ARBITRARY UNITS
##FACTOR=    0.0002768,     1,               1
##FIRST=     0,             0,               0
##LAST=      2.2672688,     0,               0
##MIN=       0,             -67923,          0
##MAX=       2.2672688,     65937,           0
$$ Real data points
##PAGE= N=1
##DATA TABLE= (X++(R..R)), XYDATA
$$ [...]
$$ plain form
1611 -585 464 -6 -1107 952 1220 -2128 -467 1995 -450 -755 720 -41 -595 92 1259 53 -1580
1628 -1580 601 1433 -1218 -108 1085 -1151 -435 1285 83 -915 -468 891 476 -1062 424 598
1644 598 -1476 493 1448 -1024 -747 723 67 -268 -201 433 12 -945 901 732 -1581 59 1163 -782
1662 -782 -87 743 -300 -446 -23 764 197 -1259 556 813 -1005 447 577 -1081 53 722 -145 -419
1680 -419 -265 640 205 -776 662 488 -1148 416 683 -770 6 341 -219 -41 -183 436 -113 -896 807
1699 807 367 -1015 359 462 -575 402 331 -318 63 -24 477 -37 -796 590 386 -781 529 221 -590
1718 -590 304 154 -163 13 -329 231 -27 -631 608 196 -783 389 231 -432 321 -76 -232 269 -212
1737 -212 301 1 -655 537 167 -704 332 67 -363 429 -54 -201 251 -166 327 54 -485 568 -52
$$ packed form
1611e85J049m70j101K059K68l348J661K462k445l05J475p61n54O87J167j206j633
1628a580K181Q32k651J110J193k236P16J720j202r98M47J359m15j538J486J74
1644E98k074J969R55k472K77J470o56l35O7O34m21r57J846j69k313J640J104j945
1662g82O95Q30j043j46M23P87n67j456J815K57j818J452J30j658J134O69q67k74
1680d19J54R05m35r81J438j74j636J564K67j453P76L35n60J78j42O19n49p83J703
1699H07m40j382J374J03j037R77p1o49L81q7N01n14p59J386k04j167J310l08q11
1718e90Q94j50l17J76l42N60k58o04J239m12r79J172j58o63P53l97j56N01m81
1737b12N13l00o56J192l70q71J036k65m30P92m83j47M52m17M93k73n39J053o20
$$ plain form
1756 -52 -552 431 82 -270 258 -275 34 259 -227 220 -37 -322 548 -35 -574 538 -103 -225 366 -358
1776 -358 153 451 -397 225 41 -245 496 -166 -369 439 -92 -187 217 -296 69 171 -407 290 75 -258
1796 -258 478 -240 -364 582 -181 -276 162 -379 240 55 -440 298 -3 -349 390 -193 -295 516 -106 -222
1816 -222 309 -68 258 138 -394 391 -20 -373 505 -230 -192 477 -320 -145 257 -182 320 78 -344 499
1836 499 -54 -239 451 -304 -11 401 -284 -158 296 10 34 51 -170 521 -89 -153 329 -410 -9 459 -472
1857 -472 -149 275 -154 106 -75 -125 461 -308 -153 391 -422 -145 424 -387 13 299 -66 118 -172 3
1877 3 484 -440 -66 481 -440 130 229 -624 31 447 -86 8 -323 143 304 -580 -80 436 -480 84 507
1898 507 -485 -16 232 -142 -82 -52 304 195 -548 245 515 -615 10 373 -406 14 252 -177 -136 -7 309
$$ packed form
1756e2n00R83l49l52N28n33L09K25m86M47k57k85Q70n83n39J112o41j22N91p24
1776c58N11K98q48O22j84k86P41o62k03Q08n31r5M04n13L65J02n78O97k15l33
1796b58P36p18j24R46p63r5M38n41O19j85m95P38l01l46P39n83j02Q11o22j16
1816b22N31l77L26j20n32P85m11l53Q78p35L8O69p97J75M02m39N02k42m22Q43
1836D99n53j85O90p55K93M12o85J26M54k86K4J7k21O91o10o4M82p39M01M68r31
1857d72L23M24m29K60j81n0N86p69J55N44q13K77N69q11M00K86l65J84k90J75
1877CM81r24L74N47r21N70R9q53O55M16n33R4l31M66J61q84N00N16r16N64M23
1898E07r92M69K48l74O0L0L56j09p43P93K70j130O25L63p79M20K38m29M1J29L16
$$ plain form
1919 309 285 -571 194 634 -529 129 422 -446 -11 454 -185 -186 -104 288 94 -626 336 436 -810 161 502
1940 502 -339 -45 204 -218 39 161 340 -210 -716 658 510 -794 105 534 -392 164 387 -234 -230 -31
1960 -31 503 -1 -674 417 281 -799 476 550 -746 -69 322 103 -128 -151 264 -98 -379 792 117
1979 117 -1056 196 660 -462 25 196 -162 -150 177 441 -256 -701 726 265 -832 449 347 -735
1997 -735 99 548 -52 -388 -208 415 -86 -380 628 -187 -705 755 498 -637 -86 326 126 -82 -60
2016 -60 196 -441 -304 799 -41 -919 554 366 -465 0 323 -229 -383 183 564 -370 -484 540 -69
2035 -69 -475 619 143 -851 106 610 26 -347 -111 357 -157 -146 575 -327 -693 755 386 -680 17 313
2055 313 -45 -135 55 289 -409 -359 816 -93 -635 395 5 -490 299 261 -294 -420 206 526 -431 -356 501
$$ packed form
1919C09k4q56P65M40j163O58K93q68M35M65o39jQ2L92j94p20R62J00j246R71L41
1940E02q41K94K49m22K57J22J79n50n06J374j48j304Q99M29r26N56K23o21MJ99
1960c1N34n04o73J091j36j080J275P4j296O77L91k19k31k3M15l62k81J171o75
1979A17j173J252M64j122M87J71l58J2L27K64o97m45J427m61j097J281j02j082
1997g35Q34M49o00l36J80O23n01k94J008q15n18J460k57j135N51M12k00k08K2
2016f0K56o37J37J103q40q78J473j88q31M65L23n52j54N66L81r34j14J024o09
2035f9m06J094m76r94R57N04n84l73K36M68n14J1P21r02l66J448l69j066O97K96
2055C13l58r0J90K34o98N0J175r09n42J030l90m95P89l8n55j26O26L20r57P5Q57
$$ plain form
2076 501 -185 -287 601 -75 -622 250 379 -68 -168 19 320 -271 -132 602 -373 -387 619 77 -372 180
2096 180 69 -165 -112 314 369 -564 -274 677 -233 -186 450 -131 -321 357 114 -259 -283 202 362 -427 -242
2117 -242 440 -360 -409 602 -150 -356 198 188 -34 -107 139 250 -378 2 574 -414 -277 415 -42 -175 271
2138 271 -111 -10 -30 343 273 -386 -168 486 -231 -229 352 -201 -89 155 7 11 -143 34 139 -315 70 441
2160 441 -387 -272 374 -201 -183 38 -109 -7 -10 57 225 -422 33 330 -439 -46 374 12 -125 206 -82
2181 -82 -30 22 59 248 -393 -2 348 -268 -87 331 -157 -75 138 -36 67 -185 67 145 -192 -48 262 -358
2203 -358 13 312 -207 7 54 -65 268 -153 12 45 -233 157 341 -263 46 160 -105 40 56 -153 81
2224 81 -92 92 235 -357 -18 119 -330 -75 187 -196 -21 67 -44 250 -251 -53 130 -249 98 192 -265
$$ packed form
2076E01o86j02Q88o76n47Q72J29m47j00J87L01n91J39P34r75j4J006n42m49N52
2096A80j11k34N3M26N5r33K90R51r10M7O36n81j90O78k43l73k4M85J60p89J85
2117b42O82q00m9J011p52k06N54j0k22p3K46J11o28L80N72r88J37O92m57j33M46
2138B71l82J01k0L73p0o59K18O54p17KN81n53J12K44j48Mj54J77J05m54L85L71
2160D41q28J15O46n75J8K21j47J02lO7J68o47M55K97p69L93M20l62j37L31k88
2181h2N2N2L7J89o41L91L50o16J81M18m88Q2K13j74J03k52K52P8l37J44L10o20
2203c58L71K99n19K14M7j19L33m21J65L3k78L90J84o04L09J14k65J45J6k09K34
2224H1j73J84J43n92L39J37m49K55K62l83J75Q8j11K94n01J98J83l79L47R4m57
$$ plain form
2245 -265 -12 232 -109 52 102 -114 109 -142 39 159 -224 19 166 -68 95 199 -72 98 67 -42 113
2266 113 -163 -42 186 -174 110 97 -208 44 24 -294 248 -41 -40 106 -116 34 154 -217 1 111 -281
2287 -281 118 -34 -87 59 4 -142 80 -236 96 77 -93 115 148 -123 146 -34 -122 96 42 12 93 -115 71
2310 71 204 -186 126 58 -141 118 48 -202 185 -41 -44 -29 -80 0 135 -237 146 32 -301 208 15 15 82 -5
2334 -5 -94 53 -214 41 125 -110 298 38 -151 145 35 -86 209 -66 -2 103 -102 93 -6 -95 156 66 -259
2357 -259 184 -85 -86 114 -36 -24 -12 -126 139 59 -138 260 -120 -182 203 -17 -33 36 -126 -62 -66 -68 56 66 -151
2382 -151 158 -22 -140 226 68 -123 164 62 -39 71 -166 190 -80 -217 190 -30 -228 157 -70 -93
2402 -93 181 38 27 -36 -97 94 -102 -69 272 -106 -275 228 20 -132 149 -17 36 4 -78 249 -118 -99 201
$$ packed form
2245b65K53K44l41J61N0k16K23k51J81J20l83K43J47k34J63J04k71J70l1j09J55
2266A13k76J21K28l60K84j3l05K52k0l18N42k89JJ46k22J50J20l71K18J10l92
2287b81L99j52n3J46n5j46K22l16L32j9j70K08L3k71K69j80q8K18n4l0Q1k08J86
2310G1J33l90L12o8j99K59p0k50L87k26lJ5n1Q0J35l72L83j14l33N09j93%O7q7
2334eq9J47k67K55Q4k35M08k60j89K96j10j21K95k75O4J05k05J95r9q9K51r0l25
2357b59M43k69jK00j50J2J2j14K65q0j97L98l80o2L85k20j6O9j62O4mkJ24J0k17
2382a51L09j80j18L66j58j91K87j02j01J10k37L56k70j37M07k20j98L85k27k3
2402i3K74j43j1o3o1J91j96L3L41l78j69N03k08j52K81j66N3l2q2L27l67J9L00
$$ plain form
2425 201 -68 -170 126 4 -57 112 45 -1 -8 -104 175 67 -195 288 -188 -237 185 -32 -198 -12 18 36 -142
2448 -142 -83 172 -192 -202 314 -51 -269 323 26 -83 77 27 8 -92 82 174 -163 3 312 -17 -101 320
2470 320 -81 -169 115 172 131 -185 24 209 -192 -126 224 -245 -98 373 -95 -257 -14 -5 -14 -118 173 156 -233
2493 -233 25 303 -179 -141 297 73 -142 65 124 -131 -186 134 183 -388 17 337 -157 -41 266 -140 -94 207
2515 207 159 11 -46 74 192 -288 7 217 -219 -183 324 -51 -212 -22 19 -69 -131 76 93 -239 93 169 -191
2538 -191 -216 243 -205 -88 164 3 -180 -196 211 216 -242 28 171 -232 -4 327 -163 -166 73 176 87 -219
2560 -219 122 116 -116 160 208 -332 -13 262 -94 -71 154 22 -81 -114 277 100 -380 42 351 -332 -92 194
2582 194 -137 -8 82 10 -86 -136 138 113 -320 98 205 -264 19 254 -103 -105 81 105 -22 -55 91 22 -270
$$ packed form
2425B01k69j02K96j22o1J69o7m6pr6K79j08k62M83m76m9M22k17j66J86L0J8j78
2448a42N9K55l64j0N16l65k18N92k97j09J60n0j9j00J74R2l37J66L09l29q4M21
2470C20m01q8K84N7m1l16K09J85m01O6L50m69J47M71m68j62K43Rrj04K91j7l89
2493b33K58K78m82L8M38k24k15K07N9k55n5L20M9n71M05L20m94J16L07m06M6L01
2515B07m8j48n7J20J18m80K95K10m36L6N07l75j61J90M1q8o2K07J7l32L32P6l60
2538a91k5M59m48J17K52j61j83j6M07Nm58K70J43m03K28L31m90lK39J03q9l06
2560b19L41ok32K76M8n40L19K75l56K3K25j32j03l3L91j77m80M22L09o83K40K86
2582A94l31J29R0p2r6n0K74k5m33M18J07m69K83K35l57kJ86K4j27l3J46o9k92
$$ plain form
2605 -270 144 286 -324 -17 136 -167 -13 -48 64 -124 -16 231 8 -523 240 326 -245 41 120 -160 -75
2626 -75 26 -42 6 -273 204 125 -97 131 123 -266 107 237 -153 -59 104 118 15 26 209 50 -271 162 228
2649 228 -224 -14 97 -149 44 82 -89 -22 -80 173 75 -223 199 78 -273 -17 175 -267 -103 68 80 -118
2671 -118 -231 27 7 -172 84 20 -167 186 62 -146 -11 -86 86 47 -101 204 77 -283 74 60 -156 72
2693 72 -20 -79 54 6 75 38 -78 158 66 -211 129 -24 -251 122 20 -83 41 -10 -45 9 -114 214 35
2716 35 -148 233 -70 -216 63 4 -161 78 -17 164 28 -143 281 -36 -50 101 95 -250 54 25 -86 182
2738 182 -26 61 38 -46 238 80 -167 152 46 -41 104 -78 11 120 -44 95 16 -126 120 -21 -191 174
2760 174 79 -60 296 -88 -63 191 -177 145 85 -75 174 -12 -95 91 18 -18 216 -121 -3 103 -162 25
$$ packed form
2605b70M14J42o10L07J53l03J54l5J12j88J08K47k23n31P63Q6n71K86P9k80Q5
2626g5J01o8M8k79M77p9k22K28ql89L73J30l90R4J63J4j03J1J83j59l21M33O6
2649B28m52K10J11k46J93L8j71O7n8K53r8k98M22j21l51K56J92m42J64J71J2j98
2671a18j13K58k0j79K56o4j87L53j24k08J35p5J72l9j48L05j27l60L57j4k16K28
2693G2r2n9J33m8O9l7j16K36r2k77L40j53k27L73j02j03J24n1l5N4j23L28j79
2716C5j83L81l03j46K79n9j65K39r5J81j36j71M24l17j4J51ol45L04k9j11K68
2738A82k08Q7k3q4K84j58k47L19j06q7J45j82Q9J09j64J39p9j42K46j41j70L65
2760A74r5j39L56l84K5K54l68L22o0j60K49j86q3J86p3l6K34l37J18J06k65J87
$$ plain form
2782 25 34 26 167 32 -136 121 31 -76 172 16 -74 104 -146 85 26 -182 271 -107 -38 22 -85 -66 182 -171
2806 -171 -54 69 -61 86 46 -147 125 -65 -184 15 50 -104 115 -59 -114 106 -99 190 -64 -51 189
2827 189 -118 -104 112 -33 -117 50 -93 -18 -11 -100 143 -78 -34 148 -58 -88 102 -240 -76 97 -155 -78 -21
2850 -21 -52 60 -107 -187 218 -118 78 304 -254 -15 133 -176 63 143 -43 156 -33 67 141 -75 -82 117
2872 117 -80 -20 168 -171 73 -64 -66 195 -206 -50 111 -285 -81 55 -224 48 266 -56 75 72 -84 32
2894 32 -48 -16 100 -190 101 260 -150 52 176 -108 -53 102 -107 114 -103 33 196 -168 62 249 -187
2915 -187 13 234 -114 -19 127 130 52 -191 84 131 -246 95 191 -184 71 174 -225 -11 26 -39 102 -11 56
2938 56 259 -226 85 199 -371 74 111 -145 6 9 58 -42 -169 132 90 -180 147 127 -362 92 189 -275 23
$$ packed form
2782B5RqJ41j35j68K57r0j07K48j56r0J78k50K31n9k08M53l78O9O0j07J9K48l53
2806a71J17J23j30J47m0j93K72j90j19J99L5j54K19j74n5K20k05K89k54J3K40
2827A89l07J4K16j45q4J67j43P5Pq9K43k21M4J82k06l0J90l42J64J73k52P7N7
2850b1l1J12j67q0M05l36J96K26n58K39J48l09K39Q0j86J99j89J00P4k16pJ99
2872A17j97O0J88l39K44j37kK61m01J56J61l96K04J36k79K72K18l22J31lj56J16
2894C2q0L2J16k90K91J59m10K02J24k84N5J55k09K21k17J36J63l64K30J87m36
2915a87K00K21l48R5J46Lp8k43K75M7l77L41R6l75K55J03l99K14L7o5J41j13O7
2938E6K03m85L11J14n70M45L7k56J51LM9j00j27L01m2k70L27k0m89M54R7m64K98
$$ plain form
2961 23 133 -17 -82 -159 34 83 -246 212 68 -281 185 155 -139 -5 29 -3 -121 -73 259 -7 -288 161 176
2984 176 -262 119 72 -143 -76 69 71 -106 -188 190 66 -267 257 67 -403 236 225 -120 20 53 106 -20 -95
3007 -95 272 -82 -328 282 178 -378 151 202 -198 53 2 -12 -218 -135 217 85 -289 387 7 -256 270 156
3029 156 -271 125 143 286 -171 -89 268 -34 -228 382 -1 -321 387 106 -275 68 153 127 -53 -4 358 -105
3051 -105 -233 344 3 -261 210 61 -189 -1 -80 46 -225 -70 389 -88 -171 245 -118 -172 270 -7 -176
3072 -176 59 38 156 -59 -75 281 -182 -194 396 -46 -198 281 -51 -221 -21 74 3 -79 -30 229 -212 -188 273
3095 273 -104 -237 343 -41 -210 167 21 3 -234 -102 301 -164 -170 244 -203 -156 314 -8 -122 52 -36 147
3117 147 -23 108 230 -209 -103 339 -95 -162 299 -99 20 73 24 125 -64 -24 145 -182 -47 286 -228
$$ packed form
2961B3J10j50o5p7J93M9l29M58j44l49M66l0k94J34L4l2j18M8L32k66k81M49J5
2984A76m38L81m7k15O7J45Kj77q2L78j24l33N24j90m70O39j1l45J40L3N3j26p5
3007i5L67l54k46O10j04n56N29N1m00K51n1j4k06Q3L52j32l74O76l80k63N26j14
3029A56m27L96J8J43m57Q2L57l02j94O10l83l20P08k81l81L43Q5k6j80M9L62m63
3051a05j28N77l41k64M71j49k50J88p9J26k71J55M59m77q3M16l63n4M42k77j69
3072a76K35k1J18k15j6L56m63j2N90m42j52M79l32j70K00R5p1q2M9K59m41K4M61
3095B73l77j33N80l84j69L77j46j8k37J32M03m65oM14m47M7M70l22j14J74q8J83
3117A47j70J31J22m39J06M42m34o7M61l98J19N3m9J01j89M0J69l27J35L33n14
$$ plain form
3138 -228 -209 251 -204 34 109 -47 116 -95 6 190 -282 -8 297 -213 -69 162 -63 -56 165 -89 127
3159 127 -80 0 241 -231 -44 279 -174 -16 180 -245 35 24 0 121 -146 43 161 -176 -24 129 -208
3180 -208 -31 57 -85 -57 -48 -32 73 -175 54 149 -271 -89 272 -230 100 116 -87 109 25 27 81 -143 -14 265
3204 265 -281 9 277 -203 74 -4 -134 247 -33 -50 231 -137 -2 93 -74 147 227 -311 28 -44 -162 32
3226 32 -60 -65 76 -205 -13 171 -271 73 49 -189 52 69 -113 91 -59 116 120 -250 179 257 -216 -7 118
3249 118 -183 213 67 -216 28 -13 -62 50 -143 172 128 -214 155 31 -225 35 -138 -152 49 -143 -66 74
3271 74 -220 70 118 -112 169 -6 -200 183 -24 -200 160 -71 30 84 -130 189 154 -249 222 98 -133
3292 -133 162 -17 -65 136 -184 -53 76 -292 115 46 -200 244 -27 -180 106 10 -7 230 -235 -35 23 -252
$$ packed form
3138b28J9M60m55K38P5j56J63k11J01J84m72K74L05n10J44K31k25PK21k54K16
3159A27k07Q0K41m72J87L23m53J58J96m25K80j1k4J21k67J89J18l37J52J53l37
3180b08J77Q8j42K8RJ6J05k48K29R5m20J82L61n02L30J6k03J96q4KN4k24J29K79
3204B65n46K90K68m80K77p8j30L81k80j7K81l68J35R5j67K21Q0n38L39p2j18J94
3226C2r2nJ41k81J92J84m42L44k4k38K41J7j82K04j50J75Ml70M29P8m73K09J25
3249A18l01L96j46k83K44m1m9J12j93L15m4l42L69j24k56K60j73j4K01j92P7J40
3271G4k94K90M8k30K81j75j94L83k07j76L60k31J01N4k14L19l5m03M71j24k31
3292a33K95j79m8K01l20J31J29l68M07o9k46M44k71j53K86r6j7K37m65K00N8k75
$$ plain form
3314 -252 199 60 -202 257 -18 -35 268 0 -60 200 41 185 66 -174 109 -39 -234 103 -80 -151 126
3335 126 -171 -111 210 -127 186 27 -180 248 -107 -178 128 -117 -122 196 -46 -111 222 -201 176 -136 -223 203
3357 203 -31 -60 227 -106 -27 282 -92 -73 90 -33 132 60 -123 194 -142 -169 250 -160 -68 305 -144 62
3379 62 123 -146 74 -102 -120 329 -201 -91 225 -239 15 225 -148 -27 -54 -129 75 -105 6 272 -213 -92
3401 -92 204 -201 25 240 -98 -45 80 37 96 -147 50 197 -254 -71 371 -221 -39 181 -164 135 59 8
3423 8 73 -102 110 215 -157 -171 264 -290 26 159 -204 26 -7 19 102 -157 -57 160 -308 85 380 -350
3445 -350 -91 186 -86 2 -2 87 142 -64 107 201 -203 222 219 -264 90 193 -195 48 79 -16 146 -258 25
3468 25 77 -386 101 198 -360 109 240 -223 -43 1 -46 156 -247 176 68 -283 166 230 -336 16 198 -196
$$ packed form
3314b52M51j39k62M59k75j7L03k68o0K60j59J44j19k40K83j48j95L37j83p1K77
3335A26k97O0L21l37L13j59k07M28l55p1L06k45nL18k42o5L33m23L77l12q7M26
3357B03k34k9K87l33P9L09l74J9J63j23J65p2j83L17l36k7M19m10R2L73m49K06
3379F2O1k69K20j76j8M49n30J10L16m64K54K10l73J21k7p5K04j80J11K66m85J21
3401i2K96m05K26K15l38N3J25m3N9k43J97J47m51J83M42n92J82K20l45K99p6n1
3423HO5j75K12J05l72j4M35n54L16J33l63K30l3K6Q3k59J00K17m68L93K95p30
3445c50K59K77k72Q8mQ9N5k06J71R4m04M25lm83L54J03l88K43L1r5J62m04K83
3468B5N2m63M87R7n58M69J31m63J80M4m7K02m03M23j08l51M49O4n66L52J82l94
$$ plain form
3490 -196 59 -33 22 58 -37 178 59 -302 178 162 -251 7 174 -242 -54 154 77 -4 -249 202 124 -298 201
3513 201 183 -317 216 189 -183 44 -25 67 -2 -164 217 -92 -281 218 67 -324 103 96 -83 189 -36 67
3535 67 -42 -104 254 -39 -290 238 105 -228 137 171 -174 104 -4 79 -48 -145 205 -51 -289 254 5 -378
3557 -378 232 131 -103 14 56 40 -133 -164 226 47 -328 315 135 -186 213 53 -70 109 -8 53 -26 -216
3579 -216 292 59 -182 265 -68 -255 166 168 -184 83 -2 55 -77 -161 189 -33 -291 380 -18 -290 306 23
3601 23 -145 87 -93 -1 -77 0 189 -50 -254 317 -65 -145 144 -114 -109 93 19 78 -41 -147 337 -68 -186
3624 -186 354 -73 -132 271 -46 7 84 -38 61 -138 -88 319 -185 -137 223 -43 -19 241 -76 -82 110 46 122 -93
3648 -93 -72 328 -188 -267 257 -217 -104 126 -173 -44 36 -70 64 -36 -87 344 -39 -21 254 -170 69 115
$$ packed form
3490a96K55r2N5L6r5K15j19l61M80j6m13K58J67m16J88K08p7q1k45M51p8m22M99
3513B01j8n00N33k7l72K27o9R2o9j62L81l09j89M99j51l91M27pj79K72k25J03
3535F7j09o2L58k93k51N28j33l33L65L4l45K78j08Q3j27r7L50k56k38N43k49l83
3557c78O10j01k34J17M2j6j73l1L90j79l75O43j80l21L99j60j23J79j17O1p9j90
3579b16N08k33k41M47l33j87M21Kl52K67q5N7j32q4L50k22k58O71l98k72N96k83
3601B3j68K32j80R2p6P7J89k39k04N71l82q0K89k58NK02p4N9j19j06M84m05j18
3624a86N40m27n9M03l17N3P7j22R9j99N0M07n04M8L60k66K4K60l17oJ92o4P6k15
3648i3K1M00n16p9N24m74J13K30k99J29Q0j06J34j00n1M31l83J8K75m24K39M6
$$ plain form
3670 115 -140 96 25 -52 86 -20 -53 156 -129 -84 235 -301 -25 184 -152 97 68 -68 117 -60 34 291
3692 291 -139 -71 96 -384 50 100 -173 133 37 -101 135 -156 69 217 -266 47 207 -201 -39 219 -16
3713 -16 74 3 31 226 -135 29 94 -249 -20 200 -79 29 6 -224 52 -132 -105 202 -58 22 106 -90 67
3736 67 170 -287 -48 77 -168 68 8 -35 126 -79 34 287 -228 37 180 -208 99 51 -93 100 56 3
3758 3 207 -122 27 120 -169 46 -18 -142 49 55 -137 52 -58 -37 198 -197 59 -14 -90 56 188 -173 107
3781 107 51 -76 116 -139 -26 74 -225 -38 128 -151 49 116 -141 231 -32 -132 125 -61 -44 144 -162
3802 -162 115 89 -263 94 40 -93 240 -41 -128 116 -69 -28 91 -202 71 64 -357 127 111 -233 184 -77
3824 -77 -176 27 -42 126 102 -153 90 137 -176 91 92 -131 94 29 63 111 -44 104 1 -196 49 3 -266 159
$$ packed form
3670A15k55K36p1p7J38j06l3K09k85M5L19n36K76K09l36K49k9j36J85j77R4K57
3692B91m30O8J67m80M34N0k73L06r6j38K36k91K25J48m83L13J60m08J62K58k35
3713a6R0p1K8J95l61J64O5l43K29K20k79J08k3k30K76j84K7L07k60Q0Q4j96J57
3736F7J03m57K39J25k45K36o0m3J61k05J13K53n15K65J43l88L07m8j44J93m4n3
3758CK04l29J49R3k89K15o4j24J91Oj92J89j10K1K35l95K56p3p6J46J32l61K80
3781A07n6j27J92k55J13J00k99J87J66k79K00O7k57L72k63j00K57j86J7J88l06
3802a62K77k6l52L57n4j33L33k81q7K44j85M1J19k93K73pm21M84j6l44M17k61
3824g7r9K03o9J68k4k55K43M7l13K67Jk23K25o5L4M8j55J48j03j97K45m6k69M25
$$ plain form
3848 159 -2 -108 213 -62 6 86 -98 -56 -50 -97 186 -28 -248 208 -84 -102 83 -70 34 152 -49 36 46
3871 46 -209 278 -38 -76 36 -114 2 206 -49 80 152 -70 115 18 -63 109 -98 -230 278 -117 -35 249
3893 249 -111 125 128 -21 163 -89 -119 216 -159 -172 240 -69 -78 149 -58 -33 86 -54 16 -137 -141 276 -126
3916 -126 -27 268 -151 -218 139 -90 -20 -41 -117 211 -20 -144 262 -234 -67 249 -156 2 262 -175 -11 150
3938 150 159 104 -101 -9 264 -233 -32 285 -227 -89 215 -112 -48 63 62 75 -189 -5 171 -263 -56 237 -188
3961 -188 -24 311 -46 25 35 -29 41 -170 126 289 -195 -45 358 -220 -60 213 -13 9 16 131 36 -169 -37
3984 -37 167 -251 61 172 -301 31 233 -18 43 -66 -136 72 -216 100 221 -325 228 70 -216 -22 229
4005 229 -84 -25 42 117 72 -232 139 100 -260 29 231 -111 124 137 -193 43 21 89 52 -196 67 236 -165
$$ packed form
3848A59j61j06L21k75O8Q0j84M2Om7K83k14k20M56k92j8J85j53J04J18k01Q5J0
3871D6k55M87l16l8J12j50J16K04k55J29P2k22J85r7q1J72k07j32N08l95Q2K84
3893B49l60K36Lj49J84k52l0L35l75j3M12l09rK27k07K5J19j40P0j53mM17m02
3916a26R9K95m19o7L57k29P0k1p6L28k31j24M06m96J67L16m05J58K60m37J64J61
3938A50Rn5k05R2K73m97K01L17n12J38L04l27O4J11jJ3k64J84J76m34K07K93m25
3961a88J64L35l57P1J0o4P0k11K96J63m84J50M03n78J60K73k26K2PJ15r5k05J32
3984c7K04m18L12J11m73L32K02k51O1j09p0K08k88L16J21n46N53j58k86J94K51
4005B29l13N9O7P5m5l04L71l9l60K89K02l42K35J3l30K36k2O8l7k48K63J69m01
$$ plain form
4028 -165 133 141 -118 131 167 -163 -27 -62 58 48 -182 135 94 -309 189 180 -223 86 -14 -93 62 70 56 129
4052 129 -187 237 274 -389 160 30 -170 130 -5 -154 61 -106 86 -18 -181 82 -75 -230 110 28 -166
4073 -166 179 -89 1 59 -22 96 -47 -262 107 -21 -206 177 85 -190 130 -50 26 60 -49 133 2 -143
4095 -143 337 -172 -213 159 53 -111 216 51 -161 78 17 110 1 -213 281 -37 -351 344 45 -254 110
4116 110 -41 -47 -3 -88 54 -64 -159 213 -160 -183 261 -7 -67 233 -33 39 3 -66 179 -62 -111 276 -99 -201
4140 -201 321 -108 -190 183 -74 -6 19 -132 236 -61 -127 325 -133 -182 247 17 -78 307 -35 -41 -74 -74 120 -5
4164 -5 -214 219 -216 -155 270 -209 -34 113 -98 96 0 -141 117 -17 -196 258 0 -69 298 -99 -70 176
4186 176 -57 19 36 -75 74 -19 -76 103 -171 -19 189 -140 -2 96 -54 -4 77 -66 139 -111 -129 232 -134
$$ packed form
4028a65K98Qk59K49L6l30J36l5J20j0k30L17m1m03M98rm03L09j00p9J55Qj4P3
4052A29l16M24L7o63N49j30k00L00j35j49K15j67J92j04j63K63j57j55L40q2j94
4073a66L45k68R0N8q1J18j43k15L69j28j85L83r2k75L20j80P6L4j09J82j31j45
4095a43M80n09m1L72j06j64L27j65k12K39o1R3j09k14M94l18l14O95k99k99L64
4116A10j51oM4q5J42j18r5L72l73k3M44k68o0L00k66P2l6o9K45k41m9L87l75j02
4140b01N22m29q2L73k57O8K5j51L68k97o6M52m58m9M29k30r5L85l42ol3%J94j25
4164ek09M33m35O1M25m79J75J47k11J94r6j41K58j34j79M54k58o9L67l97K9K46
4186A76k33P6J7j11J49r3n7J79k74J52K08l29J38R8j50N0Q1j43K05k50j8L61l66
$$ plain form
4209 -134 -36 182 -216 55 143 -10 77 16 -87 42 -19 -39 147 -156 50 133 -160 108 208 -75 227 -23
4231 -23 -61 48 -66 73 217 -150 104 277 -83 -2 114 -131 182 2 -21 87 -225 -18 156 -228 -33
4252 -33 53 -202 16 130 -127 63 43 -51 163 -154 -36 151 -260 29 124 -224 148 120 -135 166 18 -62
4274 -62 157 -142 75 123 -192 75 124 -109 60 166 -123 88 -38 43 97 -198 102 150 -167 135 128 -150 163
4297 163 -4 -216 207 -72 -125 170 -158 104 161 -185 158 116 -156 141 -117 -179 161 -53 -13 161 -157 139
4319 139 142 -229 53 -18 -136 184 -29 -25 255 -15 8 110 -127 93 63 -161 114 82 -169 57 -140 -95 129
4342 129 -148 0 172 -215 194 82 -131 119 -48 -127 122 3 28 84 -87 10 88 -136 183 -62 -187 131
4364 131 -18 -34 201 -56 63 27 -106 25 13 -57 156 46 -238 161 -17 -146 97 -139 -4 69 5 140
$$ packed form
4209a34R8K18l98K71Q8j53Q7o1j03J29o1k0J86l03K06Q3k93K68J00k83L02k50
4231b3l8J09j14J39J44l67K54J73l60Q1J16k45L13j80k3J08l12K07J74l84J95
4252c3Q6k55K18J14k57J90k0r4K14l17J18J87m11K89R5l48L72k8k55L01j48q0
4274f2K19k99K17M8l15K67M9k33J69J06k89K11j26Q1N4k95L00M8l17L02pk78L13
4297A63j67k12M23k79n3K95l28K62N7l46L43m2k72K97k58o2L40k14M0J74l18K96
4319A39Ll71K82p1j18L20k13MK80k70K3J02k37K20l0k24K75l2k51K26j97M5K24
4342A29k77J48J72l87M09j12k13K50j67p9K49j19K5N6j71R7P8k24L19k45j25L18
4364A31j49j6K35k57J19l6j33J31j2p0K13j10k84L99j78j29K43k36J35P3o4J35
$$ plain form
4386 140 69 -153 185 20 -77 224 -35 -84 113 -56 -18 121 -126 69 8 -139 64 7 -70 170 -135 -140 139
4409 139 41 53 63 -62 117 -65 -133 255 -32 -165 242 -25 -172 117 -133 -124 54 -45 196 -126 -214 124 -197
4432 -197 -62 199 -85 -34 197 -93 -19 124 -68 117 -118 -63 351 -67 -25 291 -123 -139 176 23 91 37
4454 37 -63 144 -57 -169 155 -207 -142 139 -180 -51 143 -134 33 7 4 186 -116 -108 93 -128 -16 184
4476 184 -162 48 185 -152 82 7 -27 49 -91 -23 142 -136 -61 256 -58 46 154 -123 76 51 48 145 -142
4499 -142 72 211 -129 20 312 -169 -41 147 -20 45 25 -74 177 -130 43 108 -248 150 192 -122 49 161
4521 161 -183 55 25 41 132 -149 169 248 -328 14 84 -230 69 161 2 41 75 14 91 -146 143 158 -265 -72
4545 -72 153 -196 -33 58 -102 -21 8 18 60 -161 108 68 -283 145 213 -126 109 155 -52 181 -12 -104 23
$$ packed form
4386A40p1k22L38j65r7L01k59m9J97j69L8J39k47J95o1j47K03n7p7K40l05nK79
4409A39r8J2J0j25J79j82o8L88k87j33M07k67j47K89k50RJ78r9K41l22q8L38l21
4432a97J35K61k84N1K31k90P4J43j92J85k35N5M14m18M2L16m14j6L15j53O8n4
4454C7j00K07k01j12L24l62O5K81l19J29J94k77J67k6lJ82l02QK01k21J12K00
4476A84l46K10J37l37K34p5l4P6j40O8J65k78P5L17l14J04J08k77J99k5lR7k87
4499a42K14J39l40J49K92m81J28J88j67O5k0r9K51l07J73O5l56L98M2l14J71J12
4521A61l44K38l0J6R1k81L18P9n76L42P0l14K99R2j59L9L4o1P7k37K89J5m23J93
4545g2K25l49J63R1j60Q1K9J0M2k21K69m0l51M28O8l39K35M6k07K33j93r2J27
$$ plain form
4568 23 -129 93 -15 -195 85 61 -271 131 -21 -83 125 -148 27 101 -204 158 114 -222 171 48 -176 119
4590 119 48 -111 -60 -183 68 8 -156 189 70 -169 130 0 -57 111 -47 -4 86 27 83 126 -71 111 74
4613 74 -169 126 -12 -172 90 -35 7 10 -87 76 51 -150 109 -41 -167 282 -21 -184 -49 93 -94 99
4635 99 -132 -3 72 -87 238 25 -114 201 -25 34 166 -102 -13 170 -108 74 73 -164 96 10 -111 220
4657 220 -70 -15 148 -118 -47 30 -54 88 49 -49 219 -76 -84 73 -62 -111 144 -43 -47 84 -142 2 -39 -152
4681 -152 53 -2 -124 185 -84 -57 49 -22 72 11 -66 14 82 -79 152 -61 -109 140 -66 52 67 -148 92
4704 92 -54 -174 52 47 -46 154 -36 -14 63 31 35 102 -101 -2 -7 -136 139 -45 -71 242 -64 -39 103 -162 27
4729 27 103 -197 73 -33 -56 176 -17 -55 165 -117 -8 126 -102 -5 48 -34 68 27 -78 152 -94 -101 198
$$ packed form
4568B3j52K22j08j80K80k4l32M02j52o2K08k73J75P4l05L62m4l36L93j23k24K95
4590A19p1j59N1j23K51o0j64L45j19k39K99j30n7J68j58M3R0n9N6M3j97J82l7
4613G4k43K95j38j60K62j25M2Lr7J63k5k01K59j50j26M49l03j63J35J42j87J93
4635I9k31J29P5j59L25k13j39L15k26N9J32k68Q9J83k78J82jk37K60q6j21L31
4657B20k90N5J63k66P1P7q4J42l9r8K68k95qJ57j35m9K55j87mJ31k26J44m1j13
4681a52K05n5j22L09k69K7J06p1R4o1p7Q0O8j61K31k13m8K49k06J18J5k15K40
4704I2j46j20K26nr3K00j90K2P7l2MO7k03R9nj29K75j84k6L13l06K5J42k65J89
4729B7P6l00K70j06k3K32j93l8K20k82J09J34k28R7N3q2J02m1j05K30k46pK99
$$ plain form
4752 198 -30 -116 168 -166 -6 -13 -78 24 59 -35 42 -54 -53 -43 -222 55 34 -93 6 -43 -115 -4 -111 49 212
4777 212 -131 36 132 -92 93 125 -157 79 38 -102 117 -83 -22 28 -100 16 21 -91 -25 139 -107 171 160
4800 160 -1 186 -101 -103 129 -147 5 101 -223 66 19 -110 141 18 -96 41 -116 26 115 -104 23 139
4822 139 -100 23 49 -81 -39 152 -211 131 -48 -148 209 -152 83 70 -201 -25 32 -64 119 -111 -48 101
4844 101 -62 -10 148 -29 111 86 -196 54 -81 -130 1 -65 -203 15 6 -6 28 -172 25 10 -168 114 77
4867 77 -26 73 -88 -49 97 102 50 26 -109 106 16 -59 159 -69 -178 -26 -114 -130 30 -189 -58 -29 -157 121
4891 121 23 -123 154 -105 -165 121 -66 55 144 13 135 86 -162 232 -75 -34 196 4 -78 99 -55 -73
4913 -73 43 -17 25 -34 -48 86 -88 -79 91 47 -39 138 27 -54 4 -117 86 18 -134 188 22 -106 131 -32
$$ packed form
4752A98k28q6K84l34J60po5J02L5r4P7r6JJ0j79K77k1j27R9m9p2J11j07J60J63
4777B12l43J67R6k24J85L2k82K36m1j40K19k00O1N0j28J16Nj12O6J64k46K78j1
4800A60j61J87k87kK32k76J52R6l24K89m7j29K51j23j14J37j57J42Q9k19J27J16
4822A39k39J23K6j30M2J91l63L42j79j00L57l61K35j3k71J76N7r6J83k30O3J49
4844A01j63N2J58j77J40k5k82K50j35m9J31o6j38K18rj2L4k00J97j5j78K82l7
4867G7j03R9j61L9J46Nn2k4j35K15r0p5K18k28j09J52q8j6J60k19J31K9j28K78
4891A21r8j46K77k59o0K86j87J21Q9j31J22m9k48L94l07M1K30j92q2J77j54j8
4913g3J16o0M2n9j4J34j74RJ70m4q6J77j11q1N8j21K03o8j52L22j66j28K37j63
$$ plain form
4937 -32 -72 122 -94 -87 69 -132 129 68 -157 216 -25 -159 142 -61 -101 82 -1 70 -26 -149 92 -37 -123
4960 -123 189 -88 -78 201 -66 -57 200 -83 0 68 -78 173 -28 -92 161 -32 -108 147 -115 43 66 -120 29
4983 29 -1 -124 105 -13 4 146 -126 -61 114 -64 -56 132 -14 125 -34 -126 100 -68 -81 65 -150 -28 164
5006 164 -39 -35 94 -45 -57 -34 -53 9 -54 -166 193 -98 5 126 -136 49 173 -71 60 -21 51 40 -62
5029 -62 -45 126 -75 -27 167 -73 41 217 -76 75 66 41 131 -152 50 130 -141 -108 -6 -109 102 -14 -37
5052 -37 28 -15 -61 -19 -96 -67 67 -190 -58 128 -191 1 -23 -112 85 -9 71 82 64 6 161 -100 64 -40 -105
5077 -105 91 153 -27 91 -64 10 126 -105 -13 101 -157 45 85 -17 22 127 69 39 -137 15 34 -128 110
5100 110 91 -129 113 -20 -117 24 20 -68 29 -14 -33 -23 -6 106 265 -148 111 124 -86 42 -26 15 -36 11 3 56
$$ packed form
4937c2m0J94k16PJ56k01K61o1k25L73k41j34L01k03m0J83q3P1r6j23K41j29q6
4960a23L12k77J0K79k67RK57k83Q3O8j46K51k01o4K53j93p6K55k62J58K3j86J49
4983B9l0j23K29j18J7J42k72O5J75j78QJ88j46J39j59r2K26j68j3J46k15J22J92
5006A64k03MJ29j39j2K3j9O2o3j12L59k91J03J21k62J85J24k44J31q1P2j1j02
5029f2J7J71k01M8J94k40J14J76k93J51rk5R0k83K02Q0k71L3J02j03K11j16k3
5052c7O5m3m6M2p7K9J34k57J32J86l19J92k4q9J97r4Q0J1j8n8J55k61J64j04o5
5077a05J96O2j80J18j55P4J16k31R2J14k58K02M0j02L9J05n8l0j76J52J9j62K38
5100A10j9k20K42j33r7J41mq8R7m3j9J0J7J12J59m13K59J3k10J28o8M1n1M7qN3
$$ plain form
5126 56 -37 154 78 -166 152 41 -83 160 -14 -16 124 -65 12 70 -149 33 27 -136 174 156 -111 102 -108
5149 -108 -41 -1 -126 -5 -50 -198 128 -30 -146 180 -122 -44 157 -7 51 171 -155 16 51 -124 172 101
5171 101 -89 122 9 14 11 -125 16 100 -81 77 -10 -107 117 110 -73 37 21 36 68 -46 -29 32 -52 54 -111
5196 -111 3 37 -89 -25 182 16 -56 166 24 -3 98 -142 44 49 -50 83 -66 -51 59 67 -17 65 -129 1
5220 1 86 -105 149 -6 -130 130 22 -3 113 -11 58 178 -136 19 -8 6 63 -76 -171 -26 -53 -160 137
5243 137 -69 -1 39 -77 56 2 4 149 -55 -97 133 -11 47 23 -6 -33 58 32 68 -35 -173 35 -76 -36 123
5268 123 -105 -82 49 -105 -12 27 -27 -41 -23 -44 71 -130 -40 107 -146 30 131 -77 52 88 -96 106 79
5291 79 56 64 -47 -1 167 -56 45 29 -131 -10 108 -48 110 -22 -15 172 -18 66 183 -181 -41 87 -75
$$ packed form
5126E6r3J91p6k44L18j11j24K43j74kJ40j89P7N8k19J82oj63L10j8k67K13k10
5149a08O7M0j25J21m5j48L26j58j16L26l02P8K01j64N8J20l26J71L5j75K96p1
5171A01j90K11j13Nlj36J41Q4j81J58q7r7K24pj83J10j6J5L2j14J7O1q4J06j65
5196a11J14L4j26O4K07j66p2K22j42k7J01k40J86Nr9J33j49J5J10Qq4Q2j94J30
5220AQ5j91K54j55j24K60j08k5J16j24O9J20l14J55k7J4N7j39r5J45k7j07K97
5243A37k06O8M0j16J33n4KJ45k04m2K30j44N8k4k9k7R1k6L6j03j38K08j11M0J59
5268A23k28K3J31j54R3L9n4j4J8k1J15k01R0J47k53J76J01k08J29L6j84K02k7
5291G9k3Qj11M6J68k23J01j6j60J21J18j56J58j32PJ87j90Q4J17l64J40J28j62
$$ plain form
5314 -75 132 -10 -196 110 -5 -8 85 -148 -32 148 -130 14 -41 -30 55 3 -70 -34 -110 -112 45 -64 -3 224 -53
5339 -53 -55 53 -113 63 44 70 77 -49 30 139 -82 -119 74 -42 114 55 -179 52 -68 -173 -61 -104 -73 78
5363 78 28 -6 82 -126 134 55 -15 97 9 -65 44 50 -21 73 -56 146 9 -290 25 -3 8 94 48 9 40 -151
5389 -151 -23 101 -157 58 15 -148 88 108 -30 118 -177 -79 103 -58 -27 111 -69 76 -31 16 -7 -1 -33
5412 -33 122 23 -74 151 -130 144 -44 -184 17 -4 -57 170 72 -119 70 -37 47 234 -27 24 150 -85 243
5435 243 39 -30 71 4 -81 -43 79 -10 45 -79 -8 41 2 138 29 -159 33 58 -123 7 -138 53 64 -180
5459 -180 59 -70 -88 180 -66 -80 169 0 -50 110 -48 25 86 -115 -10 117 -89 81 -36 -78 156 -86
5481 -86 -74 32 -14 -9 70 -23 100 -83 -108 56 -82 -132 171 -91 -28 161 -122 -28 37 -99 44 11 -18 57 71
$$ packed form
5314g5K07j42j86L06j15lR3k33J16J80k78J44n5J1Q5n2p3L6p6kJ57j09O1K27k77
5339e3kJ08j66J76j9K6Pj26P9J09k21l7J93j16J56n9k34K31j20j05J12m3L1J51
5363G8n0l4Q8k08K60p9p0J12q8p4J09Op1R4j29K02j37k99L15k8J1Q6m6l9L1j91
5389a51J28J24k58K15m3j63K36K0j38J48k95R8J82j61L1J38j80J45j07M7k3Ol2
5412c3J55r9r7K25k81K74j88j40K01k1n3K27r8j91J89j07Q4J87k61N1J26k35L28
5435B43k04o9J01o7q5L8J22q9N5j24P1M9l9J36j09j88J92K5j81J30j45J91J1k44
5459a80K39j29j8K68k46j4K49j69n0J60j58P3O1k01J05J27k06J70j17m2K34k42
5481h6J2J06m6NP9r3J23j83k5J64j38n0L03k62O3J89k83R4O5j36J43l3k9P5J4
$$ plain form
5506 71 -19 71 -21 -101 65 -69 -12 63 -85 134 35 -34 137 -89 5 162 -12 -25 180 -29 21 21 52 49 -122 -3
5532 -3 29 -83 -14 126 -195 4 43 -72 62 -55 -18 68 -12 -20 136 -32 -9 47 -8 87 -50 -23 43 12 -71 75
5558 75 -77 -51 105 40 51 82 -48 10 36 -100 29 3 -33 145 -70 -45 56 -182 -20 38 -114 8 110 2
5582 2 124 10 88 134 -129 -23 180 -147 105 206 -64 35 53 -116 79 27 -81 82 -27 1 31 -71 -35
5605 -35 129 -216 134 12 -90 142 -65 57 -21 -56 23 -19 -137 -19 60 -106 36 -4 -34 -8 11 109 163 -139
5629 -139 40 128 -127 73 54 -121 54 43 -134 103 -81 -37 48 -29 92 77 -129 41 57 -2 86 2 -37 123
5653 123 -99 -41 55 -96 59 33 -79 5 -62 -46 73 -85 -2 -4 -139 55 -1 -108 87 61 -110 142 24 -196
5677 -196 -22 -3 7 106 34 93 68 -133 97 44 -92 55 -6 17 91 36 -5 117 -105 -101 28 -52 23 38 -180 26
$$ packed form
5506G1r0R0r2q0J66j34N7P5j48K19r9o9J71k26R4J57j74j3K05k09N0%L1lj71J19
5532cL2j12O9J40l21J99L9j15J34j17L7Q6q0qJ56j68K3N6n5R5j37K7O6l1q3J46
5558G5j52K6J56o5J1L1j30N8K6j36J29k6l6J78k15K5J01k38J62N8j52J22J02j08
5582BJ22j14P8M6k63J06K03l27K52J01k70R9J8j69J95n2j08J63j09K8L0j02L6
5605c5J64l45L50j22j02K32k07J22p8l5P9m2j18J18P9j66J42m0l0K6J9R8N4l02
5629a39J79Q8k55K00j9j75J75j1j77K37j84M4Q5p7J21j5k06J70J6n9Q8q4l9J60
5653A23k22N8R6j51J55k6j12Q4o7J6J19j58Q3kj35J94n6j07J95k6j71K52j18k20
5677a96J74J9J0R9p2N9k5k01K30n3j36J47o1K3P4n5m1J22k22MJ29q0P5J5k18K06
$$ plain form
5703 26 -16 -172 5 -86 -58 39 -143 76 88 -95 142 78 -126 127 39 32 128 -59 22 81 -28 131 90 -55 36
5728 36 33 -34 173 -52 65 58 -9 -4 9 -145 4 7 -124 21 13 -105 88 -46 -29 64 -110 79 61 -83 15 -24
5754 -24 48 138 -117 -43 42 -91 37 -75 -96 49 64 -125 66 -80 -107 122 75 -49 127 -57 -59 90 -111 91
5778 91 12 -158 59 35 -50 104 -51 -98 95 -144 -65 -29 -33 0 -30 -40 80 -16 -62 52 -135 -186 46 -80 31
5803 31 19 -21 1 -54 -57 88 -43 9 170 -45 8 128 -104 83 89 -166 84 81 62 153 -55 -148 167 -232 32
5828 32 57 -159 81 45 -66 -72 64 46 37 -38 -19 57 -31 -44 169 -90 -16 32 -76 84 56 -134 64 -100 -78 52
5854 52 -139 12 -49 -45 -44 -72 -18 -27 -79 30 199 -35 61 70 -149 44 85 -125 -37 40 -5 34 -42 -69 22 -4 -51 5
5882 5 -55 -68 0 -66 3 20 -101 -54 -112 -17 141 -34 -34 10 -181 123 4 -81 178 38 -73 3 -91 -8 168 -126
$$ packed form
5703B6m2j56J77r1K8R7j82K19J2j83K37o4k04K53q8pR6j87Q1N9j09J59m1j45R1
5728C6lo7K07k25J17po7NJ3j54J49Lj31J45qj18J93j34J7R3j74J89j8j44R8l9
5754b4P2R0k55P4Q5j33J28j12k1J45J5j89J91j46k7K29m7j24J76j84kJ49k01K02
5778I1p9j70K17k4q5J54j55m7J93k39P9L6mL3l0j0J20r6m6J14j87n1K32j26J11
5803C1j2m0K2n5lJ45j31N2J61k15N3J20k32J87Ok55K50lj9R1k08r3L15l99K64
5828C2K5k16K40l6j11oJ36j8rp5J9P6q8j3K13k59P4M8j08J60k8j90J98j64K2J30
5854E2j91J51o1MJk8N4rn2J09J69k34R6Rk19J93M1k10Q8P7m5L9p6k7R1k6m7N6
5882Eo0j3O8o6O9J7j21M7n8R5J58j75%M4j91L04j19q5K59j40j11P6r4Q3J76k94
$$ plain form
5908 -126 115 -6 -53 -22 13 -76 143 -8 -101 146 -54 -14 120 -26 36 21 -43 135 19 -10 45 12 -137 -26
5932 -26 93 39 104 111 4 4 -175 49 -29 0 157 0 66 75 -25 47 -101 -61 -25 -3 -136 133 70 -106 61 32
5958 32 -84 128 -10 19 40 -3 2 -32 6 119 4 -163 48 -53 19 -47 -43 61 -55 -95 32 25 -11 77 -88 -14
5984 -14 126 -79 32 22 -43 85 57 15 17 4 -89 131 58 -167 -43 -27 -15 -13 33 -95 36 -206 6 -46 -132 27
6010 27 -102 -14 112 -49 43 114 -41 105 -29 -90 34 35 53 127 -58 -48 118 -23 48 67 -29 224 -6 -62 83
6035 83 -15 17 144 -19 -61 -32 -73 18 64 14 135 -156 21 193 54 -80 59 45 -44 124 -47 95 144 -93
6059 -93 -65 75 -17 48 -5 -81 -50 16 -115 74 13 113 72 -23 133 45 14 133 8 -44 -27 6 28 -17 -149 5
6085 5 20 -39 33 -95 -30 116 -56 -58 166 -102 -72 -12 21 58 -47 -74 -21 -23 -11 51 -63 -37 143 -135 8 17 -61
$$ packed form
5908a26K41j21m7L1L5q9K19j51r3K47k00M0J34j46O2j5o4J78j16k9N5l3j49J11
5932b6J19n4O5Pj07%j79K24p8K9J57j57O6Rj00P2j48M0L6K2j33K69o3j76J67k9
5958C2j16K12j38K9K1m3Nl4L8J13j15j67K11j01P2o6MJ04j16m0J27pl6Q8j65P4
5984a4J40k05J11j0o5J28k8m2Kj3r3K20p3k25J24J6J2KM6j28J31k42K12n2q6J59
6010B7j29Q8J26j61R2P1j55J46j34o1J24JJ8P4j85J0J66j41P1J9r6K53k30n6J45
6035H3r8L2J27j63m2K9m1R1M6n0J21k91J77J72j39j34J39j4q9J68j71J42M9k37
6059i3K8J40r2O5n3p6L1O6j31J89o1J00m1r5J56q8l1J19j25n2J7L3K2m5j32J54
6085EJ5n9P2j28O5J46j72kK24k68L0O0L3L7j05k7N3kJ2O2j14K6J80k78J43Rp8
$$ plain form
6112 -61 1 94 -3 93 29 -65 79 -105 164 89 -24 46 86 41 110 -41 -41 -78 -57 -115 112 -91 -23 76 -207 40
6138 40 -17 -74 -11 6 -29 79 -214 -66 124 -57 10 -106 -11 74 -8 -23 -11 -38 14 47 10 -109 -30 -91 -22 -66 -128
6165 -128 87 61 -45 -32 -85 -36 53 -121 77 22 5 -56 141 -26 80 33 -53 -23 -106 50 -16 -187 90 24 -43
6190 -43 62 66 -10 -7 87 -2 87 -24 53 163 -137 142 100 -40 28 50 -149 16 -18 14 16 -63 -6 -38 -5 12 109 -172
6218 -172 188 44 1 5 -140 -23 75 45 45 -28 -83 39 -27 -192 33 69 -69 214 -37 -86 15 -38 80 -29
6242 -29 -3 82 58 -4 62 -24 28 49 -44 89 80 -62 50 -28 -107 65 -22 -40 45 -61 -51 123 21 -29 136 -89
6268 -89 115 -7 -27 23 75 -113 30 78 -5 69 -37 -16 48 -87 7 21 -65 102 -123 -107 51 -83 69 -40
6292 -40 -59 -42 47 -152 5 26 -143 25 -27 30 54 -110 48 84 -143 131 146 -183 67 -40 57 23 -16 36 56
$$ packed form
6112f1O2R3r7R6o4r4J44j84K69p5j13P0M0m5O9j51%l7K1n8K27k03O8R9k83K47
6138D0n7n7O3J7l5J08k93J48J90j81O7j16R5Q5q2j5J2k7N2L3l7j19P9o1O9m4o2
6165a28K15k6j06J3n3M9Q9j74J98n5j7o1J97j67J06m7q6L0q3J56o6j71K77o6o7
6190d3J05Mp6LR4q9Q9j11P7J10l00K79m2j40O8K2j99J65l4L2Kp9N7l2L3J7R7k81
6218a72L60j44m3Mj45J17R8l0%p3n5J22o6j65K25L6j38K83k51m9J01n3J18j09
6242b9K6Q5k4o2O6q6N2K1r3J33rj42J12p8p9J72q7j8Q5j06J0J74j02n0J65k25
6268h9K04j22k0N0N2j88J43M8q3P4j06K1O4j35R4J4q6J67k25J6J58j34J52j09
6292d0j9J7Q9j99J57K1j69J68n2N7K4j64J58L6k27K74J5l29K50j07R7l4l9N2K0
$$ plain form
6317 56 -67 74 192 -117 142 99 -5 48 -129 120 135 36 57 161 72 101 1 -31 53 4 69 -46 -76 -23 -44
6342 -44 -179 -75 -2 -74 29 -2 -96 45 -40 -50 80 -39 -21 171 -68 121 163 -72 30 -10 -20 1 37 -18 66
6367 66 -44 -86 179 -193 -151 117 53 55 145 -61 124 27 -56 63 -24 -17 48 -71 -109 118 -27 26 -17 -7 68 63 -32
6394 -32 80 4 63 46 -121 3 83 -23 -24 59 -24 76 -119 2 30 -148 -33 88 86 17 -5 -114 74 -105 119
6419 119 184 -56 40 102 -37 37 19 -232 106 36 -63 -70 -75 -121 -23 -114 -4 14 -150 51 71 -22 -116 45 -39 34 27
6446 27 -7 38 -67 -32 170 -1 75 24 -78 122 111 -103 63 17 -69 70 -107 7 56 -18 118 15 -92 71
6470 71 67 18 -2 19 -20 25 -34 -46 49 -51 -41 -58 -30 86 33 -2 11 72 -5 -22 48 -34 -65 -77 107 45 -28 73 -32
6499 -32 -148 111 103 10 -15 -40 6 79 -103 58 60 -123 64 -63 -31 88 -56 -26 56 -50 98 -64 -42 24 -6
$$ packed form
6317E6j23J41J18l09K59m3j04N3j77K49J5r9K1J04q9K9j00l2Q4m9O5j15l0N3k1
6342d4j35J04P3p2J03l1r4J41q5j0J30j19J8J92k39J89M2k35J02m0j0K1L6n5Q4
6367F6j10m2K65l72M2K68o4KR0k06J85r7q3J19q7PO5j19l8K27j45N3m3J0P5nr5
6394c2J12p6N9j7j67J24Q0j06jQ3q3J00j95J21K8j78J15J21ko9k2j09J88j79K24
6419A19O5k40R6O2j39P4j8k51L38p0r9pnm6R8r1J10J8j64K01K0r3r4J61q4P3p
6446B7l4M5j05L5K02j71P6n1j02K00j1k14J66m6q6J39j77J14M9p4J36j03j07J63
6470G1mm9k0K1l9M5n9j2R5j00J0j7K8J16n3l5J3O1p7j7P0q2l1j2J84o2p3J01j05
6499c2j16K59qr3k5k5M6P3j82J61Kj83J87j27L2J19j44L0Q2j06J48j62K2O6l0
$$ plain form
6524 -6 -160 199 -83 3 88 -34 92 2 -44 -55 53 -62 68 47 16 117 14 -54 133 18 -17 95 -97 17
6548 17 32 -49 94 48 -54 146 13 39 32 10 -28 -50 -35 -64 -43 6 131 -77 62 31 -98 36 20 -21 61 48
6574 48 -22 82 15 -35 79 60 -21 57 -90 -11 100 -11 12 -14 -129 78 -2 28 47 -72 -56 1 -2 9 39 -93
6600 -93 1 -58 -51 62 8 -153 97 -82 12 16 92 45 -19 12 71 6 -78 101 -58 -25 69 -11 52 165 -4 2 54 7
6628 7 126 -33 39 126 51 -47 19 -3 102 22 -67 11 -3 -69 24 64 -32 114 28 5 140 -56 2 7 -82 35 112 -17
6656 -17 90 0 30 169 -32 43 28 -66 14 -8 -88 49 100 -20 149 -67 86 122 5 -8 74 -92 77 49 -74
6681 -74 176 -37 -217 64 -113 -125 41 45 61 57 -58 20 81 -38 56 -54 75 89 -13 6 -15 -100 44 -34 -62
6706 -62 1 37 -44 32 -10 -59 96 -46 -84 79 -54 41 1 -2 -9 31 -73 141 -75 43 17 -111 -25 34 -73 60
$$ packed form
6524fj54L59k82Q6Q5j22J26r0m6j1J08j15J30k1l1J01j03o8J87j15l5J12j92J14
6548A7J5q1J43m6j02K00j33K6pk2l8k2J5k9K1M9J25k08J39l1j29J34j6m1Q2j3
6574D8p0J04o7n0J14j9q1P8j47P9J11j11K3k6j15K07q0L0J9j19J6N7lJ1L0j32
6600i3R4n9PJ13n4j61K50j79R4MP6m7o4L1N9o5q4J79j59L3R4q0O3J13j69ON2m7
6628GJ19j59P2Q7p5r8O6k2J05q0q9P8j4o6R3M0r6J46q6k3J35j96N8Nq9J17P7j29
6656a7J07r0L0J39k01P5j5r4Q0k2q0J37N1j20J69k16J53L6j17j3Q2j66J69k8j23
6681g4K50k13j80K81j77j2J66MJ6mj15P8O1j19R4j10J29J4j02J9k1q5J44p8k8
6706f2O3L6q1P6m2m9J55j42l8J63j33R5m0lpM0j04K14k16J18k6j28Q6N9j07J33
$$ plain form
6732 60 -12 -81 129 82 57 20 -51 -35 26 -47 19 32 49 36 74 -80 -11 20 -37 127 32 0 32 35 66 -19 -137 73
6760 73 -32 -85 89 -4 -96 -6 -8 -5 24 -82 92 58 -135 58 129 -23 8 -77 1 64 22 85 -53 -1 0 -50 -80 89
6788 89 -12 -25 63 16 -110 56 67 8 -7 -82 27 -6 -77 116 -40 -45 60 6 12 31 -103 46 -75 -111 -75 -8
6814 -8 -6 94 -87 -44 36 -41 -18 43 12 -17 92 -166 106 -80 -68 -14 26 -47 73 -114 37 -39 -111 91 99 6 113
6841 113 -7 -34 78 66 -94 13 49 -40 6 -147 -56 15 -54 80 -67 -55 -20 -75 50 -32 -33 34 85 -16 83 -45
6867 -45 -90 21 55 -75 2 -127 -33 170 -76 142 40 -76 141 45 -54 100 40 40 217 -86 -87 116 -112 -10
6891 -10 -50 -83 -40 -30 -17 47 -81 -73 101 -123 -43 8 -96 -141 -1 -128 79 4 -60 45 -37 -28 66 -101 13 161
6917 161 -116 69 14 -89 64 1 85 -41 -7 54 86 -28 65 42 -28 41 -77 -10 -27 26 37 23 5 48 -29 -131
$$ packed form
6732F0p2o9K10m7k5l7p1J6O1p3O6J3J7j3L8j54O9L1n7J64r5l2L2LL1q5j18K10
6760G3j05n3J74r3r2R0kLK9j06J74l4j93J93P1j52L1q5P8O3m2O3j38N2Jn0l0J69
6788H9j01j3Q8m7j26J66J1n9j5p5J09l3p1J93j56nJ05n4OJ9j34J49j21l6L6O7
6814hKJ00j81M3Q0p7K3O1l1k9J09k58K72j86J2N4M0p3J20j87J51p6p2K02Qr3J07
6841A13j20k7J12j2j60J07L6q9M6j53R1P1o9J34j47J2L5n5J25q2jO7N1j01R9j28
6867d5m5J11L4j30P7j29R4K03k46K18j02j16K17r6r9J54o0%J77l03jK03k28J02
6891a0m0l3M3J0J3O4j28QJ74k24Q0N1j04m5J40j27K07p5o4J05q2RR4j67J14J48
6917A61k77J85n5j03J53o3Q4j26L4O1L2j14R3k3p0O9j18O7j7N3J1j4j8M3p7j02
$$ plain form
6943 -131 59 47 -29 24 -20 -149 58 -4 -55 66 -65 61 -52 -125 51 11 -58 38 -10 4 -3 -55 36 87 -88 -18
6969 -18 -34 -23 39 66 -1 3 -23 14 -13 -103 -121 21 10 41 44 -150 118 -10 9 6 -84 -76 38 -98 46 37 -137 48
6997 48 25 -150 -9 76 58 62 -56 -33 43 -68 68 44 -112 56 19 -132 195 -24 -13 129 60 -53 123 32
7021 32 102 -22 -39 61 22 22 72 66 -38 -50 -78 -47 -33 -31 41 -1 -63 89 22 -46 22 120 -29 40 34 -14 68 34 129 71
7051 71 -45 58 40 -7 123 -56 33 -110 -11 21 8 21 -77 -72 -116 106 -65 -126 119 -24 -127 16 -178 -48
7075 -48 32 -76 -4 -128 -31 61 -17 29 87 -21 7 97 -6 76 138 -178 -2 35 -25 28 39 -11 210 -62 -19 27
7101 27 -34 98 -29 -31 85 -42 -112 76 45 -47 66 -113 -70 20 35 -1 -62 -14 -47 -86 -36 59 -81 -8 83 -110
7127 -110 8 37 -114 -1 1 13 107 -61 -85 6 33 -4 97 27 138 -51 20 27 55 -71 102 -154 53 -8 -85
$$ packed form
6943a31J90j2p6N3m4j29K07o2n1J21j31J26j13p3J76m0o9R6m8J4pn2R1N1j75P0
6969a8j6J1O2K7o7Mk6L7k7r0j8J42j1L1Lj94K68j28J9lr0QJ14j36J44rj74J85
6997D8k3j75J41Q5j8Mj18K3P6j11J36k4j56J68l7j51L27k19J1J42o9j13J76r1
7021C2P0j24j7J00l9%N0oj04j2k8L1J4KP2m2o2J52o7o8O8R8j49O9om8Q2l4R5n8
7051G1j16J03j8m7J30j79Q9j43R9L2j3J3r8Nm4K22j71o1K45j43j03J43j94J30
7075d8Q0j08P2j24R7R2p8M6N8j08K8R0j03Q2O2l16J76L7o0N3J1n0K21k72M3M6
7101B7o1J32j27kJ16j27p0J88l1r2J13j79M3R0J5l6o1M8l3l9N0R5j40P3R1j93
7127a10J18K9j51J13KJ2R4j68k4R1K7l7J01p0J11j89P1PK8j26J73k56K07o1p7
$$ plain form
7152 -85 -163 88 0 86 -134 -160 -19 -38 -89 136 -108 -82 47 -41 87 47 -45 -25 -15 3 62 -61 46 91 -72
7177 -72 -54 157 2 4 5 75 70 -37 106 -1 7 -5 21 -40 14 61 26 -67 -16 -17 55 -158 -22 -26 9 -4 44 -105 -23
7206 -23 -83 -22 21 151 -110 97 -82 -94 99 -52 -6 -153 -62 25 85 19 183 127 17 18 -39 0 107 -93 37
7231 37 27 -217 29 17 -134 41 -106 -34 196 -4 -93 -37 -27 7 4 -42 -31 -16 -103 -10 -16 -71 -85 8 21 -18 -117 56
7259 56 58 66 77 80 -92 13 -18 22 26 -132 53 41 -22 50 101 -43 62 33 -139 69 -91 -44 -92 -37 106 98 -42
7286 -42 62 103 -90 104 16 -114 76 9 70 69 -9 148 91 -8 112 -67 -55 46 37 2 111 -53 -23 164 7
7311 7 -66 97 -10 72 4 -54 38 44 -68 63 -24 69 78 -57 -10 -91 -36 -37 -30 -72 78 -16 70 94 -73 61 52 -41 -61
7340 -61 45 -32 -85 8 -116 166 22 -137 19 27 -43 -17 52 -33 178 -21 45 43 21 90 36 87 36 -81 -61 250
$$ packed form
7152h5p8K51q8Q6k20k6J41j9n1K25k44K6J29q8J28m0r2K0J0J8N9j23J07M5j63
7177g2J8K11j55KJP0nj07J43j07Qj2K6o1N4M7l5r3N1jP2k13J36mL5j3M8j49Q2
7206b3o0O1M3J30k61K07j79j2J93j51M6j47R1Q7O0o6J64n6j10Jn7L9J07k00J30
7231C7j0k44K46j2j51J75j47P2K30k00q9N6J0L4lm6J1J5q7R3on5j4R3J3l9r9J73
7259E6KQJ1Lj72J05l1M0Mj58J85j2o3P2N1j44J05k9j72K08j60M7m8N5J43qj40
7286d2J04M1j93J94q8j30J90o7O1jp8J57n7r9J20j79J2J01rl5J09j64L0J87j57
7311Gp3J63j07Q2o8n8R2Oj12J31q7R3Rj35M7q1N5jPm2J50r4Q6K4j67J34rr3k0
7340f1J06p7n3R3j24K82j44j59J56Qp0K6O9q5K11j99O6kk2O9n4N1n1j17K0L11
$$ plain form
7366 250 10 -55 150 39 127 -2 -21 42 31 6 -105 -131 -18 2 32 -32 -5 -16 78 -89 -36 82 -121 -27 50
7391 50 -29 39 40 19 220 36 -30 8 -22 39 98 38 27 57 -17 31 -6 -88 87 -31 -25 92 19 -50 70 -34 -13 23
7419 23 4 2 37 -9 -28 34 -94 -17 34 -44 22 -80 -61 -52 -108 -1 37 -60 68 67 -79 187 30 14 -48 -38 -78 -8
7447 -8 41 -5 2 21 27 -80 -81 94 -192 -115 73 -112 -27 -51 -85 -4 -71 14 40 -113 -58 106 91 -11 108 -147 149
7474 149 67 -19 43 -124 -82 122 -71 0 138 -94 77 75 -157 -29 80 -62 69 -11 40 -57 -146 14 30 -123
7498 -123 56 12 -14 -23 35 42 88 -34 124 86 -40 -22 -65 -28 -50 81 -4 145 -20 -70 35 3 -13 145 -37 1
7524 1 -82 -36 106 -32 -89 105 29 31 -98 -52 52 36 -52 116 24 19 40 120 -71 139 -23 -93 -79 -114 -131 34 -52
7551 -52 2 27 -45 24 -55 -54 73 85 121 115 -98 56 83 -126 46 -25 33 -20 -132 -44 29 42 -27 -85 6 24 54 -1
$$ packed form
7366B50k40o5K05j11Q8j29j9O3j1k5j11k6J13K0L0o4K7j1R4j67N3J18k03R4P7
7391E0p9O8Jk1K01j84o6L8l0O1N9o0j1L0p4M8l7q2J75j18OJ17p3o9J20j04K1L6
7419B3j9kL5m6j9O2j28P7N1p8O6j02J9Rn6J07L8r7J28jj46K66j57j6o2J0m0P0
7447hM9m6PJ9Oj07jJ75k86P7J88j85Q5k4l4Q1o7Q5K6j53N5J64j5j02J19k55K96
7474A49q2q6O2j67M2K04j93P1J38k32J71kk32J28J09j42J31q0N1r7q9J60J6j53
7498a23J79m4k6rN8PM6j22J58l8j26J8m3L7k2J31q5J49j65n0J05l2j6J58j82L8
7524Aq3M6J42j38n7J94p6Kj29M6J04j6q8J68r2nK1Q0j91K10j62p0J4l5j7J65q6
7551e2N4K5p2O9p9JJ27J2L6ok13J54K7k09J72p1N8n3j12Q8P3J3o9n8R1J8L0n5
$$ plain form
7579 -1 -5 102 -49 0 -18 -48 75 -3 154 84 -74 48 142 -21 74 119 -68 -56 -100 -1 100 19 -50 0 -55 78
7605 78 15 -80 61 17 -36 -31 7 42 144 7 32 103 101 48 67 23 31 61 -88 61 -107 -19 24 22 -2 97 -59 55
7633 55 -3 -41 -4 -13 -74 135 92 15 13 -71 10 30 -21 -18 37 95 -69 -25 39 157 13 34 77 86 76 28 -24 -32 4 -110
7663 -110 -3 -120 -4 86 -2 106 89 -102 63 -43 21 28 -111 -129 94 -115 -26 129 -17 50 54 -40 -58 96
7687 96 -43 25 67 26 52 -75 -82 91 -25 -7 4 -21 117 96 13 7 63 4 8 70 -18 -47 -141 -16 42 13 -17 24 -216
7716 -216 53 -57 -52 55 -79 60 18 113 89 -135 -94 62 -5 -70 74 -7 -25 -52 -115 77 13 -124 -50 -45 -16 130
7742 130 15 3 105 -24 -43 67 31 -43 36 -112 22 15 -71 58 -30 -5 -21 -2 47 46 8 -9 -67 -109 99 26 -69
7769 -69 12 4 32 -15 10 48 -10 52 17 25 -48 -11 -17 4 104 7 -34 67 53 -15 82 -36 85 17 -76 9 22 67 -2 -38
$$ packed form
7579amJ07j51M9j8l0J23p8J57p0j58J22R4j63R5M5j87J2m4R9J01q1o9N0n5J33
7605G8o3r5J41m4n3NL8L5J02j37K5P1kn3J9m4QL0j49J49j68Q8M3kk4R9j56J14
7633E5n8l8L7ro1K09m3p7kq4Q1K0n1LN5N8j64M4O4J18j44K1M3Rj0m8n2qL6j14
7663a10J07j17J16R0q8J08j7j91J65j06O4Pj39j8K23k09Q9J55j46O7Mr4j8J54
7687I6j39O8M2m1K6j27pJ73j16J8J1k5J38k1q3oN6n9MO2q8k9r4J25N8k9l0M1k40
7716b16K69j10NJ07j34J39m2R5k4k24M1J56o7o5J44q1j8k7o3J92o4j37P4NK9J46
7742A30j15j2J02j29j9J10l6p4P9j48J34pq6J29q8K5j6J9M9jl8j7n8m2K08p3r5
7769f9Q1qK8m7K5L8n8O2l5Qp3L7oK1J00r7m1J01j4o8R7j18J21o8r3Q5J3M5o9l6
$$ plain form
7799 -38 -75 -61 -214 -45 29 25 -32 6 -65 11 71 -29 130 -80 77 58 -4 -123 23 45 -109 -133 -14 169 -38
7824 -38 37 70 -20 118 48 2 75 -16 -104 22 -90 -67 -53 -56 24 -1 -71 74 -23 -53 -143 -34 -46 16 9 5 1 -123 5
7853 5 54 41 97 18 12 66 57 17 -99 17 7 -41 -23 45 75 12 -18 74 -83 -7 59 49 116 -70 4 86 -87 9 -33
7882 -33 -40 7 -16 -50 16 -9 -7 116 14 -158 4 -1 -20 90 -95 45 2 -113 33 -9 14 -29 60 72 41 64 106
7909 106 30 -38 53 -4 76 -66 51 35 -43 -22 -21 22 -100 -14 61 -97 -48 -25 -57 71 18 -51 82 20 -29 -22 -98 41
7937 41 -2 -39 -23 46 69 -9 -36 -25 66 -96 53 104 12 66 51 17 83 15 -37 -15 8 -7 19 -24 8 -47 10 23 67
7966 67 -96 -18 -89 -78 131 36 2 36 -74 -39 -56 -96 -60 6 38 101 -21 -53 62 -82 58 26 -35 -28 32 19 -27
7993 -27 -49 41 136 -20 14 -44 -94 -7 -4 -58 41 81 6 110 -33 -46 -6 -110 41 -34 -6 50 -41 -58 -39 71 -98
$$ packed form
7799c8l7J4j53J69P4mn7L8p1P6O0j00J59k10J57j9o2j19J46K2j54k4J19J83k07
7824c8P5L3r0J38p0m6P3r1q8J26j12K3J4lQ0k5p0J45r7l0r0J09j2O2pmmj24J28
7853EM9j3N6p9oN4rm0j16J16j0m8J8O8L0o3l0R2j57P6O6j0O7j86P4Q2j73R6m2
7882c3pM7k3l4O6k5KJ23j02j72J62nj9J10j85J40m3j15J46m2K3m3Q9J2l1K3M2
7909A06p6o8R1n7Q0j42J17j6p8K1JM3j22Q6P5j58M9K3l2J28n3o9J33o2m9Pp6J39
7937D1m3l7J6O9K3p8k7J1R1j62J49N1r2N4j5l4O6o8n2K2K3j5K6m3L2n5N7J3M4
7966F7j63P8p1J1K09r5l4L4j10L5j7m0L6O6L2O3j22l2J15j44J40l2o1PO0j3m6
7993b7k2R0R5j56L4n8n0Q7Ln4R9M0p5J04j43j3M0j04J51p5K8N6r1j7J9J10j69
$$ plain form
8020 -98 16 -71 45 -59 -20 -14 14 -19 -24 23 4 -68 23 10 50 -25 -16 50 22 4 55 -96 -13 74 30 -27 67 -149 22
8049 22 -73 -75 -104 -63 107 62 -54 9 12 28 89 -17 75 90 -18 92 -7 32 -41 -23 18 34 -1 -59 31 -9 -83 96
8077 96 -8 -30 12 -13 -51 -31 -87 3 51 5 78 -84 -41 82 117 9 65 -91 -1 -2 -12 8 71 -73 34 -138 46
8104 46 -44 -52 -23 48 -53 51 -51 -27 -94 20 -16 13 2 -36 25 65 36 -43 9 80 -14 -13 30 47 -7 35 64 -53 -18
8133 -18 -81 -21 25 -112 -20 -39 -36 21 -47 17 13 -31 -87 -25 71 -8 15 -142 -68 -46 -11 -57 58 95 -70 -18 17 86 -29
8162 -29 93 -23 -25 68 13 -17 23 6 17 -30 -9 6 74 -28 98 -87 -160 62 -75 -47 10 -55 -8 -47 -49 2 59 -22
$$ packed form
8020i8J14q7J16j04L9OK8l3nM7j9p2R1j3M0p5RO6k8j8N1j51Q3Q7m4n7R4k16J71
8049B2r5kk9M1J70m5j16O3LJ6O1j06R2J5j08J10r9L9p3J8M1J6l5n8R0m0p4J79
8077I6j04k2M2k5l8K0n6R0M8m6P3j62M3J23L5j08N6j56R0jj0K0O3j44J07j72J84
8104D6r0qK9P1j01J04j02K4o7J14l6K9j1l8O1M0k9p9N2P1r4JM3J7n4M2K9j17L5
8133a8o3O0M6j37R2j9LN7o8O4mm4n6O2R6p9K3j57P4K2L5m6J15L7j65N2L5O9j15
8162b9J22j16kR3n5l0M0j7J1m7K1J5O8j02J26j85p3K22j37K8N7o5M7l9kN1N7q1
8190b2l
8191b5
$$ Imaginary data points
##PAGE= N=2
##DATA TABLE= (X++(I..I)), XYDATA
$$ plain form
0 0 0 0 0 0 0 0 0 0 0 0 0 0 0 0 0 4 -8 8 -8 8 -8 16 -16 16 -24 24 -32 32 -40 44 -49 56 -64 73 -82 95 -105
37 -105 118 -131 146 -163 181 -201 222 -246 273 -300 331 -365 402 -443 487 -537 594 -658 724
56 724 -805 899 -1005 1131 -1284 1469 -1705 2013 -2436 3053 -4039 5870 -10419 46809 41360
71 41360 -67923 -24547 23784 21810 420 611 -22401 -27539 14744 40479 -17402 -36698 8198
84 8198 11143 1317 18682 -5927 -25324 6146 32222 5298 -23478 -2685 13702 -11001 2975
97 2975 22009 -25353 -31570 28116 22298 -24261 -16483 14506 6226 -11886 12306 18343 -24871
110 -24871 -11273 33352 5591 -20342 4252 4093 -10738 1362 13799 -3034 -23492 -2283
122 -2283 17834 -1413 -1451 1707 -20885 2807 37360 -391 -33194 -1437 27718 6933 -17311
$$ packed form
0@%%%%%%%%%%%%%%%Mj2J6j6J6j6K4l2L2m0M8n6O4p2Q4r3J05j20J37j55J77k00
37a05K23k49K77l09L44l82M23m68N19n73O31o96P67q45R30j024J131j252J382
56G24j529J704j904K136k415K753l174L718m449N489p092R909j6289N7228n449
71D1360j09283M3376M8331j974k1390J91k3012n138M2283K5735n7881j9296M4896
84H198K945r826J7365k4609j9397L1470K6076k6924k8776K0793J6387k4703J3976
97B975J9034m7362o217N9686n818m6559P778L0989q280j8112K4192O037m3214
110b4871J3598M4625k7761k5933K4594j59j4831J2100J2437j6833k0458K1209
122b283K0117j9247l8L158k2592K3692L4553l7751l2803L1757K9155k0785k4244
$$ plain form
135 -17311 329 5255 -16856 6940 25217 -20146 -27391 16224 17786 -8132 -9761 2688 1978
148 1978 -3545 12437 10072 -19608 -5763 19079 822 -4833 2354 -9816 -5642 12052 7452
161 7452 -12317 -14271 10062 10142 -11557 3357 9965 -16772 -2375 24211 1310 -18948 -2221
174 -2221 15518 4012 -12680 1657 5759 -12205 1961 12896 -10166 -8864 6810 2139 -602
187 -602 791 -2 -2137 -1928 9475 4252 -12141 1949 7652 -7522 2570 7343 -10569 -7142
201 -7142 8350 7644 -6988 -11229 8135 7813 -9802 2153 7922 -8133 -284 8518 -1081 -3978
215 -3978 -495 3686 615 -6374 3225 3847 -8546 550 4557 -3691 2054 -155 -5761 4571 5953
230 5953 -1896 -5702 -1478 10402 2278 -11674 2097 6018 -4688 1403 1350 -5089 -38 2280 1973
$$ packed form
135a7311J7640M926k2111K3796J8277m5363p245M3615J562k5918j629J2449p10
148A978n523J5982k365k9680J3845K4842j8257n655P187j2170M174J7694m600
161G452j9769j954K4333Q0k1699J4914O608k6737J4397K6586k2901k0258J6727
174b221J7739j1506j6692J4337M102j7964J4166J0935k3062J302J5674m671k741
187f02J393p93k135K09J1403n223j6393J4090N703j5174J0092M773j7912L427
201g142J5492p06j4632m241J9364l22j7615J1955N769j6055P849Q802r599k897
215c978L483M181l071o989R599O22j2393R096M007q248N745k209n606J0332J382
230E953p849l806M224J1880q124j3952J3771L921j0706O091n3o439N051K318l07
$$ plain form
245 1973 -2246 -5762 5936 4569 -7652 1415 4416 -2143 1254 -1116 -1204 4085 -2015 -2426 1561
260 1561 -1242 2059 -1316 -4895 5278 1372 -5538 2649 1410 -1336 2515 -1539 -147 1519 -1584
275 -1584 3206 -1050 -5767 5083 2632 -5506 -471 796 1983 1762 -5858 279 5381 -1851 -28
290 -28 -616 -1916 4958 -98 -3897 2246 -1223 123 2841 -4330 -768 2834 -1336 1351 -1875 -2723
306 -2723 5576 -166 -4158 2458 426 626 1186 -3688 2255 2361 -4100 1534 618 -2452 2481 -1575
322 -1575 -1685 3105 -2022 13 2134 -3197 2073 2510 -2895 1404 -140 -653 3583 -3251 -2170 4599
338 4599 -1305 -1838 243 -1836 2809 86 -3902 2600 -52 -1145 3542 -2481 -1605 3835 -896 -90
354 -90 551 -2346 2717 343 -3185 2141 -1112 -1106 3138 -3431 -936 4333 -2360 -1043 1686 -224 2097
$$ packed form
245A973m219l516J1698j367j2221R067L001o559L397k370q8N289o100m11L987
260A561k803L301l375l579J0173l906o910Q187j239k746L851m054J392J666l103
275a584M790m256m717J0850k451q138N035J267J187k21p620O137N102p232J823
290b8n88j300O874n056l799O143l469J346K718p171L562L602m170K687l226q48
306b723Q299n742l992O616k032K00N60m874N943J06o461N634r16l070M933m056
322a575j10M790n127K035K121n331N270M37n405M299j544n13M236o834J081O769
338D599n904n33K081k079M645k723l988O502k652j093M687o023Q76N440m731Q06
354i0O41k897N063k374l528N326l253OM244o569K495N269o693J317K729j910K321
$$ plain form
371 2097 -1640 -1623 4107 -1870 -1259 3713 -3798 -1232 4648 -1912 -2221 -18 152 2490 -2146 -1465 3624
388 3624 -2807 -178 4933 -3421 -1356 3953 -1792 -459 1683 -357 -587 -2945 2027 4455 -5861
403 -5861 -2009 5083 -2945 -313 4040 -3531 -2521 3225 3285 -485 -5694 1742 5845 -4307 -410
418 -410 3866 -5689 -499 6391 -2236 -4098 403 2467 546 -3566 2832 2463 -7185 2423 7488 -5414
434 -5414 -2281 4439 -1936 -1221 3122 1457 -4150 -4665 7033 4394 -9524 -104 6014 -5021 637
449 637 5934 -4312 -4709 3573 5589 -1995 -5779 4212 2094 -6717 5429 5451 -10725 -1966 9046
464 9046 -285 -4660 -176 1713 -2164 -539 7961 -1916 -11869 6438 9747 -7268 -2353 4471 -3469
479 -3469 -1600 6003 2630 -8353 -5119 10459 2891 -9999 3259 3549 -8408 3318 9051 -5372
$$ packed form
371B097l737J7N730n977O11M972p511K566N880o560l09K203J70K338m636O81N089
388C624o431K629N111q354K065N309n745J333K142k040k30k358M972K428j0316
403e861L852P092q028K632M353p571J010N746O0l770n209P436M103j0152L897
418d10M276r555N190O890q627j862M501K064j921m112O398l69r648R608N065j2902
434e414L133O720o375P15M343j665n607n15J1698k639j3918R420O118j1035N658
449F37N297j0246l97Q282K016p584l784R991k118q811J2146K2j6176Q759J1012
464I046r331m375M484J889l877J625Q500r877r953J8307L309j7015M915O824p940
479c469J869P603l373j0983L234J5578p568j2890J3258K90j1957J1726N733j4423
$$ plain form
493 -5372 -7589 3433 6770 -2122 -3529 4885 -3860 -7014 12325 5329 -15194 -2207 10216 531
507 531 -3907 683 -21 -5298 2106 11857 -5134 -13664 8091 8186 -6883 1251 3489 -7630 -1717
522 -1717 10542 3915 -11963 -5341 11827 1284 -7905 5667 -509 -10114 6930 9975 -7358
535 -7358 -8035 4683 5835 -3748 -612 5820 -7726 -6396 14529 3223 -14322 453 7874 -2731
549 -2731 -2098 4698 -530 -9184 1957 13073 -4770 -10665 7140 2044 -5681 7171 3097 -10962
563 -10962 -2987 11199 4877 -10345 -3965 7976 -2838 -2297 10142 -5107 -12912 8160 10452
576 10452 -5741 -6790 2523 2528 -2676 4221 5267 -12023 -5114 15541 1836 -11513 1395 3667
590 3667 -3462 1537 5797 -3265 -10088 3957 11699 -5899 -7074 6436 -1939 -3846 9120 1359
$$ packed form
493e372k217J1022L337q892j407Q414q745l154J9339o996k0523J2987J2423r685
507E31m438M590p04n277P404R751j6991q530K1755R5j5069Q134K238j1119N913
522a717J2259o627j5878O622J7168j0543r189J3572o176r605J7044L045j7333
535g358o77J2718J152r583L136O432j3546J330K0925j1306j7545J4775P421j0605
549b731O33O796n228q654J1141J1116j7843n895J7805n096p725J2852m074j4059
563a0962P975J4186o322j5222O380J1941j0814N41J2439j5249p805K1072K292
576A0452j6193j049R313Nn204O897J046j7290O909K0655j3705j3349J2908K272
590C667p129M999M260r062o823J4045P742j7598j175J3510q375j907J2966p761
$$ plain form
604 1359 -10552 -1739 9427 3169 -7909 -726 4991 -5580 530 10399 -6296 -10175 7232 6336
618 6336 -4360 -2584 2127 -926 -3413 6242 5378 -11174 -3643 11441 -218 -5675 2878 -958
632 -958 -4063 3524 5977 -3528 -8864 3728 8191 -5376 -2349 4868 -5167 -2045 9037 204
646 204 -8025 -910 6069 1665 -5013 1427 2550 -6348 1981 8279 -5750 -5776 4996 2006 -2109
661 -2109 63 973 -1966 -2716 5566 3621 -8370 -785 7069 -2604 -1780 3561 -2453 -3095 2565 3758
677 3758 -1761 -5553 2620 3950 -4527 1125 3523 -5654 -614 6197 -557 -3665 -476 2582 936
692 936 -2389 1969 956 -5213 2716 4838 -4812 -1739 2987 -729 -429 634 311 -1088 -2025 3557
708 3557 1852 -5094 1149 3278 -3181 885 2482 -2215 -1091 942 1782 -318 -3329 1803 1634 -3355
$$ packed form
604A359j1911Q813J1166o258j1078P183N717j0571O110R869j6695l879J7407q96
618F336j0696J776M711l053k487R655q64j6552P531J5084j1659n457Q553l836
632i58l105P587K453r505n336J2592M463j3567L027P217j0035L122J1082q833
646B04q229P115O979m404o678O440J123q898Q329O298j4029k6J0772k990m115
661b109K172R10k939p50Q282j945j1991P585P854r673Q24N341o014o42N660J193
677C758n519l792Q173J330q477N652K398r177N040O811o754l108L189L058j646
692I36l325M358j013o169P929K122r650L073M726l716L00J063l23j399r37N582
708C557j705o946O243K129o459M066J597m697J124K033Q40k100l011N132j69m989
$$ plain form
724 -3355 1846 1799 -3892 781 2441 -1062 -158 -350 590 720 -1479 1888 582 -3536 2075 1967 -3053
741 -3053 793 740 -1564 794 -76 89 -97 -1919 2115 1012 -3137 1696 1195 -2308 1612 344 -1292
758 -1292 768 -650 389 651 -2052 1333 630 -2414 1764 360 -2158 1632 -8 -957 1265 -956
774 -956 250 912 -1570 1402 403 -2106 1725 163 -1845 1520 -558 -724 1202 -1246 501 832
790 832 -1738 1227 449 -1736 1729 -232 -1180 1722 -740 -443 1200 -1423 579 733 -1705 1155
806 1155 137 -1638 1785 -687 -1142 1681 -1096 -332 1297 -1445 853 572 -1517 1492 -120 -1368
822 -1368 1866 -767 -1038 1587 -1185 -124 1102 -1480 790 315 -1471 1603 -336 -1112 2017 -741
838 -741 -588 1752 -1321 -76 972 -1207 847 -204 -1242 1781 -897 -1270 1968 -1212 -774 1812
$$ packed form
724c355N201m7n691M673J660l503R04j92R40J30k199L367j306m118N611j08n020
741c053L846n3k304K358q70J65j86j822M034j103m149M833n01l503L920j268j636
758a292K060j418J039K62k703L385p03l044M178j404k518L790j640r49K222k221
774i56J206O62k482K972r99k509L831j562k008L365k078j66J926k448J747L31
790H32k570K965p78k185L465j961r48K902k462K97J643k623K002J54k438K860
806A155j018j775L423k472m55K823k777P64J629k742K298k81k089L009j612j248
822a368L234k633k71K625k772J061J226k582K270m75j786L074j939p76L129k758
838g41J53K340l073J245J048k179K054j051j038L023k678l73L238l180M38K586
$$ plain form
854 1812 -1173 -53 634 -872 1340 -346 -897 1892 -1147 -836 2442 -1443 -765 1629 -1138 14
870 14 512 -962 724 -750 -440 2100 -1925 -880 2635 -1453 -571 1917 -1172 -346 719 40 693
887 693 -1631 -329 2183 -1961 -418 2499 -2341 -829 2463 -679 -817 15 95 1070 -978 437 1594
904 1594 -2955 433 3558 -2388 -1355 1943 -733 -218 661 -111 -451 -1863 1815 2389 -3760 -334
920 -334 3109 -2187 -69 2599 -1705 -1536 1068 1854 62 -2896 1061 2129 -2936 1259 2560 -4236
936 -4236 -662 3754 -317 -1836 -480 1026 270 -1274 2257 469 -4759 2034 4323 -3370 -1268
951 -1268 2131 -1179 -615 1806 996 -2377 -2569 4033 2320 -4859 803 2643 -3239 1137 3553 -2550
967 -2550 -2782 1740 3107 -674 -3079 2070 381 -3367 3849 2113 -6267 -285 4814 -351 -2169
$$ packed form
854A812k985J120O87j506K212j686n51K789l039L11L278l885O78K394k767J152
870A4M98j474J686j474L10K540m025J045L515m088Q82K488l089Q26J065o79O53
887F93k324J302K512m144J543K917m840J512L292l142j38Q32Q0R75k048J415J157
904A594m549L388L125n946J033L298k676N15Q79p72l40j412L678N74o149L426
920c34L443n296K118K668m304J69K604P86j792k958L957J068n065M195J301o796
936d236L574M416m071j519J356J506p56j544L531j788n228O793K289p693K102
951a268L399l310N64K421q10l373j92O602j713p179N662J840n882M376K416o103
967b550k32M522J367l781k405N149j689l748P216j736q380N982N099n165j818
$$ plain form
982 -2169 -12 1041 -1176 -528 4354 -1057 -6075 3472 4179 -3688 -206 1933 -2326 -800 3081 1639
998 1639 -4054 -2879 5241 1240 -4527 2236 955 -4565 2672 4425 -3043 -3675 1880 3447 -1198
1013 -1198 -1947 2667 -1886 -3132 6129 1731 -7008 -36 4329 -647 -1312 774 47 -3097 610 5964
1029 5964 -2354 -6187 4022 2867 -3273 1455 1345 -3843 -663 4288 1714 -5060 -2365 5236 -234
1044 -234 -3209 3533 -972 -5105 3748 4231 -3333 -3174 1830 2521 -1619 -243 3068 -3812 -3072 6682
1060 6682 1013 -6054 790 2566 -1299 -90 1806 -590 -4094 1272 6057 -2834 -4718 3832 570
1075 570 -2481 3255 747 -4399 -596 4354 1626 -4488 -1057 3794 -1920 -1295 4676 -2453 -4914
1090 -4914 3838 3387 -2564 -2015 1290 1195 -1732 1315 2802 -4745 -2086 6173 -202 -4256 1514 694
$$ packed form
982b169K157J053k217O48M882n411n018R547P07p867L482K139m259J526L881j442
998A639n693J175Q120m001n767O763j281n520P237J753p468o32N555J567m645
1013a198p49M614m553j246R261m398q739O972M365m976o65K086p27l144L707N354
1029E964q318l833J0209j155o140M728j10n188L180M951k574o774K695P601n470
1044b34k975O742m505m133Q853M83p564J59N004O91m140J376L311o880P40R754
1060F682n669p067O844J776l865J209J896k396l504N366M785q891j884Q550l262
1075E70l051N736k508n146L803M950k728o114L431M851n714O25N971p129k461
1090d914Q752m51n951N49L305r5k927L047J487p547K659Q259o375m054N770q20
$$ plain form
1106 694 -1484 905 2142 -977 -3843 1452 4776 -2981 -2428 3543 -1327 -1818 3827 311 -3767 -511
1122 -511 2985 1168 -3079 -74 2449 -2873 35 4514 -2765 -3500 3095 1633 -1494 -799 769 -9
1138 -9 -1598 2088 2286 -4441 -1067 4393 -1139 -1967 1811 -730 -1459 1005 1744 -691 -3097 1340 2899
1155 2899 -2800 -388 2586 -2383 -790 3246 -307 -2117 -352 1595 705 -1988 600 1340 -2913
1170 -2913 798 3274 -2569 -1614 2113 72 -496 -21 385 -149 -1419 1753 1494 -3149 109 2530
1186 2530 -1651 -276 1552 -1162 -725 635 985 -96 -2102 974 1568 -2133 662 1596 -2299 166
1202 166 1917 -515 -695 -222 496 562 -1314 866 687 -2184 965 1568 -2039 -60 1000 -569 246
1219 246 -57 43 173 -1092 1220 1051 -2086 755 1120 -1467 653 734 -934 191 -64 326 364 -1446
$$ packed form
1106F94k178K389J237l119k866N295L324p757N53N971m870m91N645l516m078L256
1122e11L496j817m247L005K523n322K908M479p279p35O595j462l127O95J568p78
1138ij589L686J98o727L374N460n532q28L778k541p29K464P39k435k406M437J559
1155B899n699K412K974m969J593M036l553j810J765J947q90k693K588P40m253
1170b913L711K476n843R55L727k041n68M75M06n34j270L172k59m643L258K421
1186B530m181J375J828k714M37J360L50j081k006L076N94l701K795R34l895K465
1202A66J751k432j80M73P18O6j876K180j79k871L149O03l607J979J060j569Q15
1219B46l03J00J30j265K312j69l137K841L65k587K120Q1j668J125k55L90L8j810
$$ plain form
1237 -1446 709 896 -1470 869 735 -1435 772 513 -622 470 -366 175 546 -1022 756 466 -1559
1254 -1559 959 576 -1318 766 95 -524 637 -430 115 570 -984 837 577 -1412 863 328 -1162
1271 -1162 972 -68 -570 711 -570 214 565 -1238 592 332 -1081 1014 56 -900 1033 -257
1287 -257 -314 826 -657 320 475 -950 733 91 -1093 1158 -110 -915 873 -444 -303 647 -753
1304 -753 465 440 -1010 730 148 -904 1015 -213 -491 958 -566 -331 663 -831 235 278 -820
1321 -820 890 -124 -939 987 -251 -514 983 -539 49 554 -646 687 179 -887 849 -204
1337 -204 -698 1192 -434 -688 862 -586 -23 426 -759 624 117 -660 1108 -426 -673 1292 -557
1354 -557 -400 955 -509 49 375 -360 543 -349 -576 1121 -625 -731 1310 -655 -445 1061 -476
$$ packed form
1237a446K155J87k366K339j34k170K207k59j135J092q36N41L71j568J778k90k025
1254a559K518l83j894K084o71o19J161j067N45M55j554J821k60j989K275n35j490
1271a162K134j040n02J281j281P84L51j803J830k60j413K095r58r56J933j290
1287b57n7J140j483R77J55j425J683o42j184K251j268q05J788j317J41R50j400
1304g53J218k5j450J740n82j052J919j228k78J449j524K35R94j494J066M3j098
1321h20J710j014q15J926j238k63J497j522N88N05j200J333n08j066J736j053
1337b04m94J890j626k54J550j448N63M49j185J383n07p77J768j534k47J965j849
1354e57J57J355j464N58L26p35R03q92k27J697j746j06K041j965K10J506j537
$$ plain form
1371 -476 -228 176 -206 620 -404 -349 1175 -927 -244 1414 -944 -640 971 -352 -40 166 -284 411
1389 411 -436 94 1222 -1184 -314 1510 -866 -269 990 -481 -159 286 299 360 -1079 88 1157 -1149
1407 -1149 -114 1325 -1393 -400 1330 -355 -555 15 376 429 -844 348 835 -1752 190 1896 -1500
1424 -1500 -662 1090 -263 -183 202 349 -253 -1046 1092 1215 -1922 -19 1519 -1184 -44 1334 -781
1441 -781 -876 341 994 -20 -1513 599 970 -1649 733 1362 -2144 -405 1787 -202 -796 -73 662
1458 662 -78 -751 1269 378 -2413 881 2044 -1533 -511 1086 -526 -407 807 731 -1050 -1380 1958
1475 1958 942 -2176 566 1261 -1625 456 1703 -994 -1310 651 1464 -375 -1427 1165 235 -1917
1491 -1917 1566 1285 -2582 -323 1871 -167 -740 88 462 -642 -434 2187 -253 -2714 1353 1719
$$ packed form
1371d76K48M04l82Q26j024N5J524k102O83J658k358L04J611j323L12K06m50O95
1389D11q47N30J128k406Q70J824k376N97J259j471L22M45J3O1j439J167J069k306
1407a149J035J439k718R93J730j685k00N70L61N3j273J192M87k587J942J706l396
1424a500Q38J752j353Q0L85J47o02p93K138J23l137J903J538k703J140J378k115
1441g81r5J217O53j014j493K112L71k619K382O29l506J739K192j989n94P23P35
1458F62p40o73K020q91k791L294J163l577J022J597j612J19J214p6j781l30L338
1475A958j016l118K742O95k886K081J247k697l16J961Q13j839j052K592r30k152
1491a917L483k81l867K259K194k038n73Q28L74j104K08K621k440k461M067L66
$$ plain form
1507 1719 -1626 -107 798 -1102 -380 1269 903 -1609 -1254 2116 446 -1922 1295 614 -1962 1006
1523 1006 1875 -1078 -1534 653 1290 -538 -810 1386 -750 -1744 2495 930 -2726 23 1584 -333
1539 -333 -458 438 189 -1243 -71 2577 -864 -2564 1644 1051 -1505 682 723 -1324 -448 1377 853
1556 853 -1704 -1092 1986 -176 -1382 1729 -40 -1996 1213 1643 -892 -1066 504 901 -760 -127
1572 -127 1515 -1413 -1464 2599 459 -2253 292 895 -650 -136 644 -29 -1517 216 2407 -1032 -1660
1589 -1660 1735 62 -1243 1205 508 -1403 -409 1352 703 -1398 -407 1369 -904 -619 1854 -746
1605 -746 -1819 1297 1126 -679 -644 322 490 -779 258 1180 -1604 -903 2154 -105 -1450 670 224
1622 224 -653 -7 740 52 -1329 227 1611 -1062 -823 1444 -603 -628 1307 135 -1205 -344 731
$$ packed form
1507A719l345J519R05j900P22J649l66k512L55L370j670k368L217o81k576K968
1523A006Q69k953m56K187O37j828k72K196k136r94M239j565l656K749J561j917
1539c33j25Q96k49j432J172K648l441j700M208n93k556K187M1k047Q76J825n24
1556H53k557O12L078k162j206L111j769j956L209M30k535j74J570L97j661O33
1572a27J642k928n1M063k140k712K545O03j545N14P80o73j488J733K191l439o28
1589a660L395j673j305K448o97j911R94J761o49k101R91J776k273K85K473k600
1605g46j073L116j71j805L5R66J68j269J037R22k784P01L057k259j345K120m46
1622B24q77O46P47o88j381J556J384k673K39K267k047k5J935j172j340Q61J075
$$ plain form
1639 731 549 -982 -228 841 -1023 -88 1528 -929 -1070 1071 392 -338 -224 277 255 -634 449 1016
1657 1016 -1339 -353 1405 -508 -647 836 -227 -463 263 588 116 -1103 186 968 -764 -166 850
1674 850 -846 -283 843 -96 -566 -135 440 393 -679 43 600 -903 130 960 -700 -343 629 -79
1692 -79 -90 134 203 223 -538 417 725 -990 -136 845 -477 60 368 -403 38 239 305 147 -786 198 683
1713 683 -768 53 702 -670 59 433 -254 64 -19 146 159 -609 368 450 -882 221 642 -551 15
1732 15 270 -292 277 -154 -3 159 -393 364 460 -751 121 276 -450 286 -13 -339 315 -120 -44 202 -408
1753 -408 307 291 -766 373 310 -443 271 45 -152 435 -286 -79 109 -328 197 80 -478 315 197 -427
1773 -427 154 22 -118 438 -258 37 273 -425 310 121 -610 386 254 -448 291 -108 -54 300 -337 17
$$ packed form
1639G31j82j531P54J069j864R35J616k457j41K141o79p30J14N01k2q89J083N67
1657A016k355R86J758j913j39J483j063k36P26L25m72j219J289P82j732N98J016
1674H50j696N63J126r39m70M31N75m7j072P22N57j503J033Q30j660L57R72p08
1692g9j1K24O9K0p61R55L08j715Q54R81j322N37L08p71M41K01O6j58r33R84M85
1713F83j451Q21O49j372P29L74o87L18q3J65J3p68R77Q2j332J103M21j193N66
1732A5K55n62N69m31J51J62n52P57R6j211Q72J55p26P36k99l26O54m35P6K46o10
1753d08P15j6j057J139o3p53P14k26j97N87p21K07J88m37N25j17n58P93j18o24
1773d27N81j32j40N56o96K95K36o98P35j89p31R96j32p02P39l99N4L54o37L54
$$ plain form
1793 17 316 -371 320 97 -485 455 167 -519 397 -155 -58 278 -509 102 318 -376 174 -140 -322 467 -106
1814 -106 -409 407 -121 -9 153 -458 167 198 -419 223 -52 -334 470 -136 -368 286 -106 -141 117 -323 204
1835 204 171 -464 234 73 -217 497 -171 -335 378 -133 -158 53 -262 343 72 -457 297 -87 -161 502 -231
1856 -231 -198 526 -42 -117 57 -168 331 -22 -365 423 -41 -216 346 -172 -177 402 -85 -158 75 -79 272 -250
1878 -250 -316 394 -115 -324 494 -318 -209 523 -175 -244 100 -38 302 -218 -291 508 -276 -258 471 -296 -311 442
1900 442 -209 -115 103 -37 238 -453 92 687 -526 -414 471 -268 -113 350 -208 -361 95 322 184 -578
1920 -578 -118 663 -515 -225 526 -453 -218 588 -42 -225 76 120 217 -407 252 582 -751 -115 820 -254
1940 -254 -359 209 -200 -78 20 114 -27 -543 403 672 -688 -284 624 -370 -139 443 -206 -172 40 408 123
$$ packed form
1793A7K99o87O91k23n82R40k88o86R16n52R7L36p87O11K16o94N50l14j82P89n73
1814a06l03Q16n28J12J62o11O25L1o17O42k75k82Q04o06k32O54l92l5K58m40N27
1835B04l3o35O98j61k90P14o68j64P13n11k5K11l15O05k71n29P54l84p4O63p33
1856b31L3P24n68p5J74k25M99l53l43P88m64j75N62n18nN79m87p3K33j54L51n22
1878b50o6P10n09k09Q18q12J09P32o98o9L44j38L40n20p3P99p84J8P29p67j5P53
1900D42o51R4K18j40K75o91N45N95j213J12Q85p39J55M63n58j53M56K27j38p62
1920e78M60P81j178K90P51r79K35Q06o30j83L01M4R7o24O59L30j333O36R35j074
1940b54j05N68m09J22R8R4j41n16R46K69j360M04R08r94K31N82o49L4K12L68k85
$$ plain form
1961 123 -592 131 484 -710 33 813 -475 -310 557 -41 -47 -46 138 39 -431 495 336 -1028 88 887
1981 887 -346 -216 358 -197 -143 272 142 -105 -537 712 565 -802 101 630 -569 -57 643 -157 -339
2000 -339 -77 560 -5 -467 367 130 -797 432 806 -788 -240 482 188 -187 -113 179 -129 -181 708 117
2020 117 -1077 269 767 -496 -171 355 -155 -276 172 524 -224 -656 632 299 -647 465 378 -730
2038 -730 21 770 -111 -469 -128 462 27 -307 465 51 -675 697 584 -876 -65 511 -21 -184 8
2057 8 207 -202 -393 691 84 -802 266 376 -534 283 293 -323 -292 188 485 -247 -622 356 110 -464 439
2078 439 116 -720 240 549 -178 -443 -83 327 -168 -263 477 -195 -551 548 141 -544 105 402 -141 20
2098 20 184 252 -363 -308 655 68 -562 402 50 -321 309 181 -379 -150 193 408 -146 -335 467 62 -354
$$ packed form
1961A23p15P23L53j194P43P80j288J65Q67n98oJJ84r9m70R26j59j364J116P99
1981H87j233J30N74n55N4M15j30k47m32J249j47j367R03N29j199N12P00q00j82
2000c39K62O37n65m62Q34k37r27J229L74j594N48P22k94l75P4K92l08n2Q89n91
2020A17j194J346M98j263L25N26n10j21M48L52p48m32J288l33r46J112q7j108
2038g30P51P49q81l58L41N90m35l34P72m14p26J372j13j460Q11N76n32j63J92
2057HJ99m09j91J084o07q86J068J10r10Q17J0o16L1M80K97p32l75R78k46n74R03
2078D39l23q36R60L09p27k65L60M10m95r5P40o72l56J099m07o85O49K97n43J61
2098B0J64O8o15N5R63n87o30R64l52l71O30j28n60K29L43K15n54j89Q02m05m16
$$ plain form
2119 -354 400 134 -474 240 230 -122 -75 -94 199 -206 -95 538 -174 -428 518 149 -344 213 -21 -350 94
2140 94 117 208 -352 -184 692 -141 -380 283 -57 -197 152 -24 -299 -94 21 260 -290 -257 466 -291 -356 509
2162 509 -36 -215 143 52 60 22 -117 145 -208 -143 437 -252 -436 372 -108 -183 259 -162 47 14 53 322 -150
2185 -150 -150 400 -130 -228 374 -128 -206 81 -18 19 -103 -100 86 -147 -5 215 -134 -192 310 -113 -77 58 -49
2208 -49 69 -30 -256 80 -83 -2 192 -186 -191 333 -145 15 249 -184 74 4 -118 203 -51 -181 182 -161
2230 -161 -57 227 -53 -80 168 -101 79 -67 -89 169 11 -85 242 -148 29 294 -269 -112 75 -120 -4
2251 -4 -37 -160 213 -83 -3 62 -173 -16 212 -219 43 37 -58 165 -31 -33 240 -252 -41 108 -56 -25 132 -243
2275 -243 -12 93 -163 100 -73 -76 131 -153 -34 194 -194 75 140 -168 10 77 -107 101 -161 -151 130 -131
$$ packed form
2119c54P54k66o08P14j0l52M7j9K93m05J11O33p12k54R46l69m93N57k34l29M44
2140I4K3R1n60J68Q76q33k39O63l40j40L49j76k75K05J15K39n50L3P23p57o5Q65
2162E09n45j79L58r1Ql8j39K62l53O5N80o89j84Q08m80p5M42m21K09l3L9K69m72
2185a50%N50n30r8O02n02p8K87r9L7j22LJ86k33J42K20l49n8N02m23L6J35j07
2208d9J18r9k26L36j63Q1J94l78nN24m78J60K34m33K58p0j22L21k54j30L63l43
2230a61J04K84k80k7K48k69J80j46k2K58j58r6L27l90J77K65n63J57J87j95J16
2251dl3j23L73k96Q0O5k35J57K28m31K62or5K23j96kK73m92K11J49j64L1J57l75
2275b43K31J05k56K63j73lK07k84J19K28l88K69O5l08J78O7j84K08k62J0K81k61
$$ plain form
2297 -131 -13 219 -155 -1 85 -101 60 36 -74 118 -90 -121 186 -183 -5 122 -87 -39 267 -204 129
2318 129 6 -102 140 -148 -13 123 -149 14 92 -175 62 -27 -198 17 74 -48 163 27 -49 57 -183
2339 -183 -72 76 -207 -32 189 -93 245 -95 -61 244 -79 -64 82 -172 39 186 -128 156 145 -208 72
2360 72 10 -131 57 -114 104 62 -208 135 46 -228 78 12 -123 164 77 -65 73 -114 68 8 -228 159
2382 159 97 -254 82 122 -194 117 29 -26 -58 -88 93 32 -183 219 153 -164 181 137 -228 128 44 80 53 -69
2406 -69 120 32 -172 228 64 -173 232 167 -165 23 16 -44 1 -70 130 -59 -202 247 39 -279 87 64 -225
2429 -225 112 188 -139 64 -40 129 -108 -172 287 38 -175 233 80 -163 60 132 -39 -44 -25 74 -15 -41 232
2452 232 -117 -285 161 18 -203 75 41 -97 -105 31 130 -162 -150 301 -56 -377 168 -24 -176 113 37 -65
$$ packed form
2297a31J18K32l74J54Q6j86J61k4j10J92k08l1L07l69J78J27k09M8L06m71L33
2318A29j23j08K42k88J35J36k72J63P8k67K37q9j71K15N7j22K11j36p6J06k40
2339a83J11J48k83J75K21k82L38l40L4L05l23J5J46k54K11J47l14K84j1l53K80
2360G2o2j41J88j71K18m2k70L43q9k74L06o6j35K87q7j42J38j87J82o0k36L87
2382A59o2l51L36M0l16L11q8n5l2l0J81o1k15M02o6l17L45m4l65L56q4L6k7j22
2406f9J89q8k04M00j64k37M05o5l32J88po0M5p1K00j89j43M49k08l18L66k3k89
2429b25L37P6l27K03j04J69k37o4M59k49k13M08j53k43K23P2j71nJ9R9q9k6K73
2452B32l49j68M46j43k21K78l4j38qJ36R9k92J2M51l57l21N45j92j52K89p6j02
$$ plain form
2474 -65 -81 -59 154 -77 -118 76 -184 -215 269 66 -259 19 97 24 -191 129 213 -91 -22 269 -91 -318 363
2497 363 55 -176 88 214 -42 -76 81 117 -199 -125 308 22 -264 197 4 -310 167 113 -90 -123 -21 279
2519 279 -150 -207 364 -67 -136 349 -14 -200 28 68 -120 -192 -12 175 -337 -7 416 -100 -226 234 83
2540 83 -151 178 35 -75 -53 209 156 -238 -160 250 -117 -127 397 -84 -319 178 42 -23 -75 142 209 -159 -29
2563 -29 276 -207 -285 367 -40 -235 72 14 6 7 81 54 -217 72 302 -182 -254 329 -61 -126 116 46 -137 -136 13
2588 13 192 -149 -134 143 -190 -37 199 -93 -90 157 68 7 -116 39 104 -155 24 327 -219 -178 313 -80 -88
2611 -88 217 36 -24 46 147 153 -292 69 400 -148 -107 327 -215 -119 206 78 -57 -21 119 147 -140 10 218
2634 218 -173 -39 280 -189 -177 221 102 106 -91 -25 73 -175 -49 248 -165 140 273 -82 49 5 -159 117
$$ packed form
2474f5j6K2K13k31m1J94k60l1M84k03l25K78P8p3k15L20Q4l04O9K91l60k27O81
2497C63l08k31K64J26k56l4J57L6l16P4M33k86k86M61j93l14M77n4k03l3J02L00
2519B79m29n7N71m31o9M85l63j86K28M0j88p2J80J87n12L30M23n16j26M60j51
2540H3k34L29j43j10K2K62n3l94P8M10l67j0N24m81k35M97j36o5n2K17O7l68J30
2563b9L05m83p8O52m07j95L07n8qJP4k7k71K89K30m84p2N83l90o5K42p0j83JJ49
2588A3J79l41J5K77l33J53K36k92LK47q9o1j23J55O5k59J79L03n46M1M91l93q
2611h8L05j81o0P0J01Om45L61L31n48M1M34n42R6L25j28j35L6J40K8k87J50K08
2634B18l91J34L19m69J2L98j19Mj97O6R8k48J26K97m13L05J33l55J31m4j64K76
$$ plain form
2656 117 -18 106 171 -229 80 197 -213 -68 209 -178 51 193 -132 -41 -85 111 138 -216 82 182 -258
2677 -258 126 61 -77 82 -30 -39 23 -165 20 24 -202 88 211 -220 41 106 -143 130 24 -8 83 -134 24
2700 24 8 -143 134 234 -219 41 84 -79 5 25 34 78 -117 0 204 -27 72 222 -98 18 187 -32 66
2723 66 70 -97 158 -54 -59 159 -237 115 134 -143 48 166 -168 50 13 -122 88 -65 18 50 -260 34 36 -319
2747 -319 83 58 -203 118 -46 -69 97 -113 69 161 -159 131 25 -133 100 45 -148 37 -61 -110 170 -17
2769 -17 85 89 -258 175 124 -181 25 18 -90 122 43 18 84 -139 45 166 -127 80 51 -143 88 -84 -13 152
2793 152 -40 32 126 -56 86 34 -132 -29 88 -122 183 80 -99 60 26 19 114 -156 49 -20 -100 158 -43
2816 -43 8 258 -53 -68 148 -95 -28 100 -58 11 6 -212 119 -54 -164 134 -3 2 80 -62 95 37 -178 95
$$ packed form
2656A17j35J24O5m00L09J17m10J45K77l87K29J42l25R1m4J96K7l54K98J00m40
2677b58L84o5j38J59j12rO2j88J85Mk26K90J23m31K61O5k49K73j06l2R1k17J58
2700B4j6j51K77J00m53K60M3j63Q4K0RM4j95J17K04k31R9J50l20J16J69k19R8
2723F6Mj67K55k12nK18l96L52J9k77J91J18l34K18l7j35K10j53Q3L2l10K94Kl55
2747c19M02k5k61L21j64k3J66k10J82R2l20K90j06j58K33n5j93J85r8m9K80j87
2769a7J02Ml47M33n1l05K06pj08K12p9k5O6k23J84J21k93K07k9j94K31j72P1J65
2793A52j92P2R4j82J42n2j66J03J17k10L05j03j79J59l4pR5k70K05o9q0K58k01
2816d3N1K50l11j5K16k43O7J28j58O9nk18L31j73j10K98j37NP8j42J57n8k15K73
$$ plain form
2840 95 42 -53 183 -6 -170 114 -77 -27 98 -68 -20 -41 -116 138 -31 -115 104 -75 -111 92 -99 -47 161
2863 161 -97 28 -3 -145 54 -77 -122 156 -54 -107 238 -117 -165 136 -37 -90 -130 -34 203 -34 -216 198
2885 198 -154 -200 202 -35 -125 90 -88 -5 -109 -195 144 -62 -78 276 -181 -28 302 -131 -36 154 -81 -20
2907 -20 -97 -32 191 -162 -218 181 -212 -158 156 -152 -159 11 -32 113 -22 18 144 -192 -76 186 -184 -139 212
2930 212 -55 -155 116 -34 73 12 81 187 -159 67 243 -210 14 115 -138 -104 183 -49 -56 -102 2 161
2952 161 -250 -87 179 -209 -42 230 -200 -72 74 24 -70 -181 64 117 -225 84 252 -288 -47 261 -60
2973 -60 -145 -15 -74 -12 -53 78 140 -269 31 325 -262 -5 252 -121 -61 135 -85 68 -142 203 171 -364 34
2996 34 145 -444 14 335 -252 -153 83 72 -64 -40 124 135 -339 217 214 -307 117 285 -243 -109 105 -60
$$ packed form
2840I5n3r5K36j89j64K84j91N0J25j66M8k1p5K54j69q4K19j79l6K03j91N2K08
2863A61k58J25l1j42J99j31m5K78k10n3L45l55m8L01j73n3m0R6K37k37j82M14
2885A98l52m6M02k37r0K15j78Q3j04q6L39k06j6L54m57J53L30m33R5J90k35O1
2907b0p7O5K23l53n6L99l93N4L14l08pJ70m3J45j35M0J26l36J16K62l70M5L51
2930B12k67j00K71j50J07o1O9J06l46K26J76m53K24J01k53L4K87k32pm6J04J59
2952A61m11J63K66l88J67K72m30J28J46n0r4j11K45N3l42L09J68n40K41L08l21
2973f0q5J30n9O2m1J31O2m09L00K94n87K57K57l73O0J96k20J53k10L45l2n35L98
2996C4J11n89M58L21n87R9K36j1j36K4J64J1m74N56ln21M24J68n28J34K14j65
$$ plain form
3018 -60 69 -75 252 126 -328 178 194 -365 284 242 -289 -44 206 36 -121 -169 127 26 -312 237 38
3039 38 -396 152 198 -251 -61 163 -61 3 -23 153 -7 -295 382 136 -304 119 106 -205 107 88 -10 -201
3061 -201 -91 238 5 -357 275 154 -351 237 218 -285 95 93 -45 -85 -33 241 19 -199 261 -20 -455 96
3083 96 71 -167 -40 46 -47 59 -137 240 -74 -210 330 88 -266 206 57 -256 104 56 51 -33 -119 211 -3
3106 -3 -280 251 -25 -180 257 133 -249 90 33 136 -36 -105 268 -129 -146 434 -17 -412 281 -55 -154 26
3128 26 80 14 -122 27 283 -52 -238 373 -168 -122 264 -10 -103 93 22 137 -73 -75 232 -211 -123 233 -135
3151 -135 -207 325 -27 -141 174 6 -29 -42 -52 184 -74 -219 205 -74 -75 176 -102 0 90 -101 -4 -107 -55
3174 -55 171 -151 -134 282 -177 -63 184 -35 -110 136 -180 109 -77 -133 235 -52 -81 284 -142 -116 258 -196
$$ packed form
3018f0J29j44L27j26m54N06J6n59O49m2n31K45K50j70j57m8K96j01l38N49j99
3039C8m34N48M6m49J90K24k24O4k6J76j60k88O77k46m40M23j3l11L12j9r8j91
3061b01J10L29k33l62O32j21n05N88j9n03L80kj38m0N2K74k22k18M60k81m35N51
3083I6k5k38J27Q6r3J06j96L77l14j36N40k42l54M72j49l13L60m8nq4q6L30k14
3106ck77N31k76j55M37j24l82L39n7J03j72o9L73l97j7N80m51l95O93l36r9J80
3128B6N4o6j36J49K56l35j86O11n41M6L86k74r3J96p1J15k10kL07m43Q8L56l68
3151a35p2N32l52j14L15j68l5j3j0K36k58j45M24k79jK51k78J02R0j91R7j03N2
3174e5K26l22J7M16m59J14K47k19p5K46l16K89j86n6L68k87k9L65m26K6L74m54
$$ plain form
3196 -196 -78 59 -44 62 -87 -131 180 -63 18 173 -134 14 40 -161 27 64 -86 21 -1 47 289 -151
3218 -151 51 211 -250 -131 160 -192 23 150 -111 87 -72 -141 215 -241 -116 298 -194 59 186 -130
3238 -130 122 39 -121 167 -55 -71 209 -214 53 136 -202 -4 116 -119 43 -62 23 119 -192 9 154 -167
3260 -167 -28 103 -170 105 112 -138 60 31 -86 84 -84 -144 172 -142 61 92 -307 209 98 -149 56 37
3282 37 -67 208 -93 -13 188 -234 146 157 -210 58 71 -116 90 25 -136 172 -149 65 109 -252 120 230
3304 230 -228 3 14 -174 74 -13 57 101 -91 57 51 -155 125 36 -230 169 9 -95 205 -100 -93 107 -160
3327 -160 10 38 -212 332 4 -285 204 -66 -62 150 -44 11 58 -151 108 138 -203 73 61 -242 127 67 -205
3350 -205 193 2 -83 109 -144 235 124 -165 238 -22 -198 211 -16 -252 110 -85 5 84 -172 136 -1
$$ packed form
3196a96J18J37j03J06j49m4L11k43Q1J55l07J48K6k01J88L7j50J07k2M8K42m40
3218a51K02J60m61J19K91l52K15J27k61J98j59o9L56m56J25M14m92K53J27l16
3238a30K52q3j60K88k22j6K80m23K67Q3l38J98J20k35J62j05Q5R6l11K01J45l21
3260a67J39J31k73K75Pk50J98k9j17J70j68o0L16l14K03L1l99N16j11k47K05j9
3282C7j04K75l01Q0K01m22L80J1l67K68J3j87K06o5j61L08l21K14M4l61L72J10
3304B30m58K31J1j88K48q7P0M4j92J48ok06K80q9k66L99j60j04L00l05PK00k67
3327a60J70K8k50N44l28k89M89k70MK12j94N5M7k09K59L0l41K76j2l03L69o0k72
3350b05L98j91q5J92k53L79j11k89M03k60j76M09k27k36L62j95R0P9k56L08j37
$$ plain form
3371 -1 -187 274 -99 -206 130 -99 -233 157 -145 31 113 -90 238 -82 -319 417 -50 -234 241 -40 -148
3392 -148 77 -5 -11 -55 -175 286 43 -251 244 -111 -137 304 -112 -83 79 -60 91 105 -96 214 -89 -171 307
3415 307 -31 -263 165 -37 -70 86 -102 -16 -256 -133 311 -352 -33 178 -39 -234 198 -62 -77 111 -41
3436 -41 48 -107 -102 380 -111 -145 360 -156 -162 396 -71 -125 114 -41 43 -66 -65 35 -188 -76 412 -196 -239 266
3460 266 -243 -64 209 40 -31 -162 79 328 -207 -66 204 -306 -106 266 -105 -109 143 -64 172 -48 -43 135
3482 135 -229 12 320 -240 -146 294 -149 16 125 -33 0 -87 51 187 -312 -10 325 -309 48 238 -86
3503 -86 18 174 -11 93 -182 -20 274 -308 90 291 -335 24 273 -301 -16 113 -43 10 -153 101 211
3524 211 -352 157 280 -379 -24 248 -296 34 241 -39 -78 -109 76 116 -265 87 220 -350 123 170 -357
$$ packed form
3371aj86M61l73j07L36k29j34L90l02J76Q2k03L28l20k37P36m67j84M75k81j08
3392a48K25q2om4j20M61k43k94M95l55k6M41m16K9J62j39J51J4k01L10l03q2M78
3415C07l38k32M28k02l3J56j88Q6k40J23M44o63L19K11k17j95M32k60j5J88j52
3436d1Q9j55NM82m91l4N05n16oN58m67n4K39j55Q4j09JJ00k23J12M88o08m3N05
3460B66n09J79K73j69p1j31K41K49n35J41K70n10K00L72l71mK52k07K36k20NJ78
3482A35l64K41L08n60R4M40m43J65J09j58L3q7J38J36m99L02L35o34L57J90l24
3503h6J04J56j85J04k75J62K94n82L98K01o26L59K49n74K85J29j56N3j63K54J10
3524B11n63N09J23o59L55K72n44L30K07k80l9l1J85M0l81L52J33n70M73M7n27
$$ plain form
3545 -357 -7 132 -33 -82 -208 164 229 -313 178 133 -390 101 170 -212 19 78 105 -74 -137 60 127 -286 220
3568 220 269 -369 120 103 -135 32 85 -65 -2 -200 145 105 -303 201 218 -321 173 145 -259 35 127 44 -8
3591 -8 -153 153 57 -310 225 166 -394 131 145 -225 167 -9 98 7 -179 220 -36 -256 254 91 -235 290
3613 290 62 -143 117 -66 -98 87 -193 119 28 -318 295 -93 -172 175 39 -248 25 -56 -20 -62 -170 160
3635 160 -24 -248 380 6 -352 125 -4 -122 -4 -28 5 -3 -112 220 -110 -200 282 -39 -263 247 -86 -61
3657 -61 121 18 45 134 -76 332 -122 -164 332 -45 -70 282 -128 -132 257 -103 215 27 -106 242 -151 -174 302
3680 302 -178 -23 112 -83 -79 103 -181 50 14 -85 213 -85 -107 176 -153 -200 234 -33 -133 179 12 129
3702 129 -66 -173 36 42 -157 258 -92 -177 162 -84 -57 76 -111 166 151 -159 59 -197 -128 366 -113 -87
$$ packed form
3545c57L50J39j65m9j26L72O5n42M91m5n23M91O9l82K31N9K7j79o3J97O7m13N06
3568B20M9o38M89j7k38J67N3j50O3j98L45m0m08N04J7n39M94k8m04K94R2q3n2
3591hj45L06r6l67N35n9n60N25J4l70L92j76J07r1j86L99k56k20N10j63l26N25
3613B90k28k05K60j83l2J85k80L12r1l46O13l88p9L47j36k87K73q1L6m2j08L30
3635A60j84k24O28l74l58M77j29j18J18k4L3qj09L32l30r0M82l21k24N10l33K5
3657f1J82j03K7Q9k10M08m54m2M96l77k5L52m10mL89l60L18j88j33L48l93k3M76
3680C02m80J55J35j95MJ82k84K31l6r9K98k98k2K83l29m7M34k67j00L12j67J17
3702A29j95j07K09Oj99M15l50q5L39k46K7J33j87K77j5l10K18k56O9M94m79K6
$$ plain form
3724 -87 182 -183 -41 21 6 160 49 -163 175 -50 -94 204 -167 -41 132 -190 40 -34 -1 88 53 -103 222
3747 222 -93 -4 311 -172 19 154 -126 91 93 -124 148 -95 -169 201 -151 -52 260 -171 -7 168 -119 127
3769 127 -4 -100 143 -174 45 284 -141 -24 205 -211 18 109 -89 22 4 -104 164 -70 -52 208 -158
3790 -158 55 119 -139 138 61 -70 45 63 -80 197 -127 -87 205 -135 87 127 -125 -66 86 -149 74 -64
3812 -64 -122 145 -135 37 174 -240 -65 35 -139 19 174 -24 110 -54 -54 83 -84 135 133 -199 123 116 -226
3835 -226 107 34 -224 117 -126 12 186 -130 -1 99 -164 87 131 -198 182 122 -75 29 -150 -93 91
3856 91 -122 121 113 -340 -8 138 -274 236 -16 -78 191 -118 -81 24 -137 199 35 -278 214 202 -253 138
3878 138 -32 -133 130 12 -81 66 -100 231 31 -172 198 -97 -231 89 -98 -64 -31 -122 -153 50 -106 117
$$ packed form
3724h7K69l65J42O2j5J54j11k12L38k25m4K98l71J26J73l22K30p4L3Q9l5j56L25
3747B22l15Q9L15m83J91J35k80K17Kk17K72k43p4L70l52R9L12m31J64J75k87K46
3769A27j31r6K43l17K19K39m25J17K29m16K29R1j98J11j8j08K68k34J8K60l66
3790a58K13O4k58K77p7j31J15J8j43K77l24M0K92l40K22M0k52N9J52k35K23j38
3812f4n8K67k80J72J37m14J75J00j74J58J55j98J34j64%J37j67K19kl32L22pl42
3835b26L33p3k58L41k43J38J74l16J29J00k63K51M4l29L80o0j97J04j79N7J84
3856I1k13K43qm53L32J46m12N10k52o2K69l09L7J05j61L36j64l13M92j2m55L91
3878A38j70j01K63j18r3J47j66L31k00k03L70k95j34L20j87L4L3r1l1K03j56K23
$$ plain form
3900 117 93 -199 281 53 -206 192 -35 -174 141 -33 110 -61 -85 42 -19 -50 195 -70 -141 215 -14 -72
3922 -72 32 -124 39 71 -100 152 -13 -228 312 2 -198 108 -20 -218 -48 -147 137 -138 6 235 -50
3943 -50 -171 217 -101 -123 216 48 -89 17 -58 83 -67 -206 247 -124 -79 305 -109 -154 326 -43 25 65
3965 65 -5 9 -127 -80 200 -222 -115 198 -137 -205 314 -77 -88 58 -51 63 -175 10 242 -72 -46 190
3987 190 -248 -65 346 -110 -69 32 44 58 -161 26 274 46 -23 334 -264 -131 132 -154 -95 104 -51 36
4009 36 -87 30 176 -105 -15 249 -207 -194 179 -98 8 65 -48 23 -91 12 136 -223 50 286 -246 -46
4031 -46 148 -139 65 87 -101 20 -53 -3 208 -287 4 304 -392 0 156 -131 13 25 -9 17 -91 108
4053 108 267 -251 -23 222 -248 62 246 -100 -17 68 -89 26 -87 113 85 -236 37 180 -310 -3 188
$$ packed form
3900A17k4k92M80k28k59L98k27j39L15j74J43j71k4J27o1l1K45k65p1L56k29n8
3922g2J04j56J63L2j71K52j65k15N40l10k00L06j28j98J70r9K84k75J44K29k85
3943e0j21L88l18k2L39j68j37J06p5J41j50j39M53l71M5L84m14m5M80l69O8M0
3965F5p0J4j36M7K80m22J07L13l35o8N19l91j1J46j09J14k38J85K32l14K6K36
3987A90m38J83M11m56M1J01J2J4k19J87K48k28o9L57n98J33K63k86N9J99j55Q7
4009C6j23J17J46k81R0K64m56J3L73k77J06N7j13P1j14J03J24l59K73K36n32K00
4031d6J94k87K04K2j88J21p3N0K11m95K91L00o96L92J56k87J44J2l4K6j08J99
4053A08J59n18K28K45m70L10J84l46Q3Q5j57J15j13K00k8l21K73J43m90L07J91
$$ plain form
4074 188 -95 73 50 -63 18 -125 76 61 -395 161 286 -284 -5 133 -42 170 -95 13 78 -116 144
4095 144 14 -264 173 67 -289 132 183 -102 61 -1 -36 27 -170 72 154 -320 155 115 -263 170 159 -128
4117 -128 74 -9 38 84 -192 104 140 -232 137 132 -306 145 12 -230 138 -38 -13 71 -171 110 105 -197 191
4140 191 68 -138 199 36 -114 156 -34 115 89 -221 150 -34 -219 239 37 -134 30 -54 -80 116 -73
4161 -73 94 -8 -177 146 -35 -248 120 50 -154 208 30 -124 23 18 2 115 -67 174 -25 -203 221 -108
4183 -108 -127 261 -112 -191 -27 -11 -74 -54 -231 79 -66 -112 272 -198 -149 17 -182 -30 162 -53 76 21 -171
4206 -171 190 -23 -84 132 4 -151 153 -94 -55 -4 -197 147 50 -224 204 41 -143 123 9 -64 117 -74
4228 -74 -7 -42 -135 232 -69 -256 193 2 -237 84 -104 39 185 -147 -28 96 -74 172 -101 -95 269 -7
$$ packed form
4074A88k83J68k3j13Q1j43K01j5m56N56J25n70K79J38j75K12k65J08O5j94K60
4095A44j30k78M37j06l56M21N1k85J63o2l5O3j97K42Q2m74M75m0l78M33j1k87
4117a28K02q3M7M6k76K96L6l72L69nm38M51j33k42L68j76K5Q4k42K81nl02L88
4140A91j23k06L37j63j50K70j90J49k6l10L71j84j85M58k02j71J64q4k6J96j89
4161g3J67j02j69L23j81k13L68p0k04L62j78j54J47nj6J13j82K41j99j78M24l29
4183a08j9L88l73p9J64J6o3K0j77L10j45m6L84m70M9J66j99J52J92k15J29n5j92
4206a71L61k13o1K16j28j55L04k47L9N1j93L44r7k74M28j63j84K66j14p3J81j91
4228g4O7l5r3L67l01j87M49j91k39L21j88J43J46l32J19J24j70K46k73OL64k76
$$ plain form
4250 -7 -98 227 -91 37 55 -131 55 80 -141 132 -49 -123 205 -82 -152 307 -9 -43 80 -146 35 59 -132
4273 -132 144 -81 -128 64 -246 -123 220 -82 4 155 -144 79 38 -86 -59 0 -84 247 -165 55 235 -152
4295 -152 -5 198 -211 63 -45 -121 106 -87 -31 112 -260 -88 336 -229 97 172 -158 196 35 -93 213
4316 213 -132 -140 125 -115 85 114 -255 -104 66 -160 133 -32 -25 194 -16 91 196 -228 63 198 -192 58
4338 58 -4 -226 -25 -88 -58 34 -220 47 187 -194 95 30 -155 40 112 -31 208 -39 -94 193 -179 -3 76
4361 76 -155 49 146 -196 151 64 -128 122 -93 58 115 -84 80 57 -189 63 36 -274 97 10 -135 254
4383 254 -111 -30 25 -171 -15 98 -235 95 0 -425 187 64 -176 71 20 8 42 -135 107 65 -209 193
4405 193 13 -258 128 -46 -141 133 -218 -58 20 -113 59 74 -141 185 86 -152 6 0 -116 -4 -99 38
$$ packed form
4250gr1L25l18J28J8j86J86K5k21K73j81p4L28k87p0M59l16l4J23k26J81K4j91
4273a32K76k25m7J92l10J23L43l02Q6J51k99K23m1j24K7N9q4L31m12K20J80l87
4295a52J47K03m09K74j08p6K27j93N6J43l72J72M24n65L26P5l30L54j61j28L06
4316B13l45qK65k40K00K9l69J51J70k26K93j65PK19k10J07J05m24K91J35l90K50
4338E8o2k22K01o3L0R2k54K67J40l81K89o5j85J95P2j43K39k47n5K87l72J76P9
4361G6k31K04R7l42L47q7j92K50k15J51N7j99J64k3k46K52k7l10L71q7j45L89
4383B54l65Q1N5j96J56J13l33L30r5m25O12j23k40K47n1j2L4j77K42m2k74M02
4405A93j80k71L86j74r5K74l51J60P8j33J72J5k15L26r9k38J58oj16J12r5J37
$$ plain form
4427 38 23 -141 162 -24 -178 174 -89 -184 242 -79 -67 117 -77 92 30 -130 177 4 -231 219 -37 -130
4449 -130 60 -29 -29 52 -97 -110 44 -246 233 -88 -231 294 -86 -157 163 -29 -92 110 -85 8 -20 -60 142
4472 142 3 -178 344 -256 -172 192 -102 -60 141 -88 46 14 -131 285 -179 -253 273 -236 -110 202 -133
4493 -133 -62 47 11 90 -45 -30 131 -179 -87 244 -62 9 105 -63 53 34 16 177 3 -57 153 -159 -164 236
4517 236 -132 -20 242 -139 14 -71 -25 73 -19 59 156 -146 -80 233 -43 -157 204 -67 -178 -49 -89 109 -180
4540 -180 -43 120 -176 -35 142 -203 82 152 -102 -29 24 -61 138 -91 -63 134 -102 -98 133 -219 -82 136
4562 136 -148 50 139 -92 71 -41 -94 189 -242 3 192 -172 -7 90 -210 154 -22 28 142 -143 -54 154
4584 154 -248 63 69 -254 35 140 -124 -8 3 -47 108 -178 34 130 -187 117 115 -275 75 -5 -97 81 -31
$$ packed form
4427C8j5j64L03j86j54L52k63r5M26l21J2J84j94J69o2j60L07j73k35M50k56r3
4449a30J90q9%Q1j49j3J54k90M79l21j43N25l80p1L20j92o3K02j95R3k8m0K02
4472A42j39j81N22o00Q4L64k94M2K01k29J34l2j45M16m64p4N26n09J26L12l35
4493a33P1J09l6P9j35J5J61l10R2L31l06P1R6j68J16j9j8J61j74o0K10l12nM00
4517B36l68J12K62l81J53q5M6R8r2P8R7l02O6L13k76j14L61k71j11J29m0J98k89
4540a80J37J63k96J41J77l45K85P0k54P3N3q5J99k29K8J97k36MK31l52J37K18
4562A36k84J98Q9k31J63j12n3K83m31K45J89l64J65R7l00L64j76N0J14k85Q9K08
4584A54m02L11Ol23K89J05k64J16J1n0J55k86K12R6l17L04kl90L50q0r2J78j12
$$ plain form
4607 -31 -14 16 -69 116 136 -174 78 98 -223 40 113 -163 63 -88 -87 -47 -159 64 155 -253 76 187 -173 127
4631 127 -58 -76 120 58 -86 97 -165 63 134 -203 78 107 -78 147 -47 -4 162 -74 -1 112 -95 44
4653 44 221 -115 58 -12 -75 12 17 -93 166 -110 -86 29 -256 164 29 -247 101 -36 -167 115 30 38 136 -134
4677 -134 48 -3 -112 88 117 -112 152 4 -106 31 -38 1 128 -86 78 83 -106 140 -2 -181 147 -58
4699 -58 -104 171 -6 -44 99 -185 24 103 -196 190 57 -146 115 -41 -41 153 -28 26 27 -54 131 26 -194
4722 -194 127 40 -143 158 -99 -39 76 55 4 172 -92 31 28 -251 209 -18 -154 172 -49 -184 95 29
4744 29 -51 56 -74 135 -26 -202 151 29 -207 194 -57 -71 146 -206 -34 92 -176 170 -26 -102 130
4765 130 -5 -167 178 -213 -97 99 64 18 137 -143 72 -45 -86 79 -94 -45 164 -25 38 149 -71 120
$$ packed form
4607c1J7L0q5J85K0l10K52K0l21K63P3k76K26j51JM0j12K23R1m08L29J11l60L00
4631A27j85j8J96o2j44J83k62K28P1l37K81K9j85K25j94M3J66k36P3J13k07J39
4653D4J77l36J73p0o3Q7Nj10K59k76K4J15k85M20j35k76L48j37j31K82q5QR8k70
4677a34J82n1j09K00K9k29K64j48j10J37o9L9J27k14J64Nj89K46j42j79L28k05
4699e8m6K75j77l8J43k84K09P9k99L86j33k03K61j56%J94j81N4Jq1J85j05k20
4722a94L21q7j83L01k57O0J15k1n1J68k64J23lk79M60k27j36L26k21j35K79o6
4744B9q0J07j30K09j61j76L53j22k36M01k51j4K17l52J72J26k68L46j96p6K32
4765A30j35j62L45l91J16J96l5m6J19k80K15j17m1J65j73M9K09j89O3J11k20J91
$$ plain form
4787 120 -37 -148 76 -62 25 173 -105 -44 102 -186 56 43 -40 80 4 -89 119 -90 -143 288 -109 8
4809 8 35 -105 -39 85 -78 -9 -61 -76 95 -144 -52 210 -64 -89 206 -120 41 3 -126 49 114 -145 72 -93
4833 -93 -143 109 -86 30 69 -139 -93 91 -66 -14 -38 -130 85 -13 -8 161 -125 85 48 -185 108 85 -260 86
4857 86 35 -110 77 -204 0 86 -159 -73 147 -123 89 45 -248 52 85 -44 72 -302 -106 175 -100 46
4879 46 56 -133 59 11 -31 102 -61 -38 22 -157 72 110 -182 4 40 -79 90 19 -76 104 62 -86 -66 -176
4903 -176 82 163 -197 121 45 -137 101 56 6 15 -147 -125 94 -171 71 14 -187 75 6 -166 48 -16 -62 61
4927 61 29 12 83 -190 114 75 -176 -58 -29 -200 39 0 -107 46 -7 84 42 -68 113 79 -113 130 105 -45
4951 -45 49 -99 -38 101 -93 36 -12 -137 84 -54 -141 42 -49 -53 189 -18 -127 1 -9 95 72 -88 73
$$ packed form
4787A20j57j11K24j38Q7J48k78O1J46k88K42j3q3J20p6r3K08k09n3M31l97J17
4809HK7j40O6J24j63O9n2j5J71k39R2K62k74k5K95l26J61l8j29J75O5k59K17j65
4833i3n0K52j95J16L9k08M6J84j57N2k4r2K15r8NJ69k86K10l7k33K93k3l45L46
4857H6n1j45J87k81K04Q6k45Q6K20k70K12m4k93L00L3j29J16l74J96K81k75J46
4879D6J0j89J92m8m2J33j63K3O0j79K29L8k92J86L6j19J69p1r5J80m2j48K0j10
4903a76K58Q1l60L18p6j82K38m5n0Rj62K2K19k65K42n7k01K62o9j72K14o4m6J23
4927F1l2j7P1k73L04l9k51J18K9j71K39l9j07J53n3R1m2j10J81l4j92K43k5j50
4951d5R4j48O1J39j94J29m8j25K21j38q7J83r1mK42k07j09J28j0J04k3j60J61
$$ plain form
4974 73 14 -124 180 -33 -82 163 -89 -193 -56 -42 72 -54 -68 163 -30 -214 194 -4 -30 224 -79 -50
4996 -50 64 -166 32 -138 -123 109 -30 -83 81 -56 -58 43 -121 -54 65 -103 106 -66 -23 -16 -74 -156 207 -101
5020 -101 -85 180 -33 -61 -69 -70 57 -26 -100 63 -133 -62 204 -94 -191 180 -123 -2 63 -26 82 -146 39 107
5044 107 -96 -79 112 -109 -2 44 -138 -2 69 -106 48 -102 -10 145 41 -15 112 -144 18 51 -18 106
5066 106 2 -15 83 -91 26 116 -185 7 68 -60 50 78 -126 121 55 -26 125 -11 -38 -26 -184 -33 124
5089 124 -118 -14 80 -225 22 15 -2 29 -81 41 16 -66 -40 61 -222 1 57 -85 3 -102 56 100 -60 -54
5113 -54 135 -202 -5 23 -110 109 137 38 97 -116 28 -4 -63 -79 101 -110 -137 40 -135 -83 139 -59 -44 -37
5137 -37 -157 82 -89 45 61 -72 45 27 -189 130 72 -91 97 72 -55 86 -172 -31 33 -242 78 83 -153
$$ packed form
4974G3n9j38L04k13m9K45k52j04J37J4J14j26j4K31j93j84M08j98k6K54l03K9
4996e0J14k30J98j70J5K32j39n3J64j37kJ01j64O7J19j68K09j72M3Pn8q2L63l08
5020a01J6K65k13k8qjJ27q3p4J63j96P1K66k98r7L71l03J21O5q9J08k28J85O8
5044A07k03J7J91k21J07M6j82J36P1j75J54j50R2J55j04n6J27k56J62L3o9J24
5066A06j04j7R8j74J17R0l01J92O1j28J10K8k04K47o6q1J51j36k7J2j58J51J57
5089A24k42J04R4l05K47pj7L1j10J22k5q2K6J01k83K23N6j42Q8j05J58M4j60O
5113e4J89l37J97K8j33K19K8r9N9k13J44l2n9j6J80k11k7J77j75N2K22j98J5P
5137c7j20K39j71J34J6j33J17j8k16L19n8j63J88k5j27J41k58J41O4k75L20Nk36
$$ plain form
5160 -153 118 82 -46 9 -75 -85 29 -187 -20 133 -164 39 22 -83 132 -73 -153 -4 -108 -85 -13 -140 -62
5183 -62 7 -154 61 197 -119 33 1 -104 176 -12 -6 90 -56 0 182 -124 108 36 -124 35 53 -243 80
5206 80 -36 -2 87 -48 129 48 -170 154 40 -111 100 -32 -52 34 -118 -18 30 -47 50 27 22 242 -72 -96
5230 -96 2 -45 -57 -35 -34 14 171 -40 175 0 -81 110 -45 -67 181 -38 50 127 -12 123 -2 -125 48 -54
5254 -54 -77 5 -77 -35 -23 -103 -69 52 -94 91 32 -58 39 -4 -71 49 -95 -107 154 -106 -62 -12 -101 168 29 -171
5280 -171 43 -64 -102 114 -128 -91 118 -61 -37 46 -21 50 41 -96 49 -112 -146 68 -87 1 200 -34 -80 -36
5304 -36 13 127 64 -80 99 -36 -43 111 -155 -49 53 -75 51 17 5 138 93 24 91 17 -14 96 -37 -26
5328 -26 -15 -31 11 20 46 88 -24 -164 45 -53 -28 75 2 -10 19 -37 17 -6 -34 213 -90 3 153 -152 39 213
$$ packed form
5160a53K71l6j28N5q4j0J14k16J67J53k97K03j7j05K15k05q0J49j04K3P2j27P8
5183f2O9j61K15J36l16J52l2j05K80j88OR6j46N6J82l06K32p2j60J59J8k96L23
5206H0j16L4Q9j35J77q1k18L24j14j51K11j32k0Q6j52J00M8p7R7k3nK20l14k4
5230i6R8m7j2K2JM8J57k11K15j75q1J91j55k2K48k19Q8P7j39J35j25j23J73j02
5254e4k3Q2q2M2J2q0L4J21j46J85n9r0R7m3o7J20j44j2K61k60M4N0q9K69j39k00
5280a71K14j07l8K16k42L7K09j79K4Q3o7P1rj37J45j61l4K14j55Q8J99k34m6M4
5304c6M9J14o3j44J79j35pJ54k66J06J02j28J26l4j2J33m5o9O7p4l1J10j33J1
5328b6J1j6M2RK6M2j12j40K09r8K5J03p3j2K9n6N4k3k8K47l03R3J50l05J91J74
$$ plain form
5354 213 -99 -33 114 -44 68 -9 -84 67 -118 -46 170 -129 27 176 -151 -55 61 -162 51 -47 -7 21 22
5377 22 -64 69 -153 146 39 -140 -73 59 -94 -75 -1 -88 115 34 -23 20 -169 79 27 -98 35 -56 -62 38
5401 38 -76 100 55 -32 14 129 -39 40 19 -107 58 -65 1 59 1 -9 162 -87 186 -17 -53 74 36 -165
5425 -165 79 43 -59 -46 -67 -37 118 -136 -47 28 -174 31 81 -130 -9 46 16 75 -52 -36 -16 -89 18 24 -69
5450 -69 15 5 -54 136 48 -158 -33 -1 38 -35 -95 137 51 -152 73 122 -127 30 -44 -174 68 -68 13 -63 -78
5475 -78 54 11 -163 60 131 -139 122 15 -60 -26 -74 -4 -7 -159 109 57 -110 202 -30 -3 110 -1 -8 178
5499 178 -151 221 117 -188 102 -6 -155 122 -12 -29 74 -8 22 71 -4 -24 3 -54 89 -44 -25 62 -26 -24
5523 -24 67 52 -13 -55 -37 28 43 -140 209 -70 -42 114 -60 -83 28 -128 40 37 15 46 -24 6 80 -86 -51 143
$$ packed form
5354B13l12O6J47j58J12p7p5J51j85P2K16k99J56J49l27R6J16k23K13r8M0K8J
5377B2q6J33k22K99j07j79O7J32j53J9P4q7K03q1n7M3j89K48n2j25J33r1oJ00
5401C8j14J76m5q7M6J15j68P9k1j26J65j23O6N8n8j0J71k49K73k03l6J27l8k01
5425a65K44l6j02J3k1L0J55k54Q9P5k02K05N0k11J21N5l0N9j27J6K0p3J07Or3
5450f9Q4j0n9J90q8k06J25L2L9p3o0K32q6k03K25M9k49J57p4j30K42j36Q1p6j5
5475g8J32m3j74K23P1k70K61j07p5L4m8P0lj52K68n2j67L12k32K7J13j11pJ86
5499A78l29L72j04l05K90j08j49K77j34j7J03q2L0M9p5k0K7n7J43j33J9Q7q8K
5523b4R1j5o5m2J8O5J5j83L49k79K8J56j74k3J11j56J68lk2L1p0L0P4j66L5J94
$$ plain form
5549 143 54 -56 69 56 -19 82 -58 -1 45 -180 -26 -95 -39 142 30 -19 -74 -175 -28 76 12 69 98 -6
5573 -6 158 -52 -188 148 9 65 68 -135 -64 -159 -90 94 39 -156 96 20 -28 70 -101 41 38 -81 -26 49 24 156
5599 156 -92 14 100 -12 -12 59 -41 73 100 5 -100 -55 -55 -19 -10 -75 36 -93 48 19 -89 64 41 -35 -30 -107
5625 -107 -59 156 -31 -123 144 -87 -45 43 -4 23 36 -89 -2 32 81 104 -32 -109 50 -42 -14 96 -101 -11 40
5650 40 -7 171 -35 -60 169 -187 83 23 -136 31 -17 -22 93 9 -38 112 -25 -154 116 25 -5 86 -116 54
5674 54 5 47 32 44 -37 10 13 -25 139 -17 23 91 -102 54 14 -38 36 43 -56 73 -7 -16 138 -187 60 101 -84
5701 -84 157 112 -93 142 -38 -23 14 -200 -37 138 -164 110 114 -98 43 62 -127 140 -33 -49 -9 -152 39
5724 39 189 36 -16 -7 -58 149 27 -48 95 9 -31 14 23 124 53 -30 73 3 -82 -36 147 -138 73 -12 -106 -2
$$ packed form
5549A43q9j10J25j3p5J01j40N7M6k25J54o9N6J81j12m9n5j01J47J04o4N7K9j04
5573fJ64k10j36L36j39N6Lk03P1r5O9J84n5j95K52p6m8R8j71J42lj19N5P5k5J32
5599A56k48J06Q6j12%P1j00J14K7r5j05M5%L6Ro5J11j29J41k9j08J53k3p6Np7
5625a07M8K15j87r2K67k31M2Q8m7K7J3j25Q7L4M9K3j36p7J59r2K8J10j97R0N1
5650D0m7J78k06k5K29l56K70o0j59J67m8nJ15q4m7J50j37j29K70r1l0R1k02J70
5674E4m9M2j5J2q1M7Ll8J64j56M0O8j93J56m0n2P4Pr9J29q0rJ54l25K47M1j85
5701h4K41m5k05K35j80J5L7k14J63J75l02K74Mk12J41J9j89K67j73j6M0j43J91
5724C9J50j53n2Rn1K07j22p5J43q6m0M5RJ01p1q3J03p0q5M6J83k85K11q5r4J04
$$ plain form
5750 -2 -110 8 94 -311 92 19 -217 59 64 -41 118 9 -6 16 -216 -31 14 -82 199 16 -137 18 0 -29
5774 -29 22 29 -60 191 -36 -41 101 -47 45 -45 -71 41 79 -45 145 -172 -51 145 -25 115 36 -172 144 18
5798 18 -26 122 42 -40 30 1 55 47 67 72 38 -111 76 -3 -82 124 -238 -61 39 -63 -12 21 -124 1 -60 -64 27
$$ packed form
5750bj08J18Q6m05M03p3k36K76Nj05J59j09j5K2k32J85M5r6K81j83j53J55j8k9
5774b9N1Pq9K51k27nJ42j48R2r0k6J12L8j24J90l17J21J96j70J40p9k08L16j26
5798A8m4J48q0q2P0k9N4qK0Nl4j49J87p9p9K06l62J77J00j02N1L3j45J25o1mR1
$$ [...]
8191F5
##END NTUPLES=NMR FID
##END=
