##TITLE=1H_DE-80H_X3
 200.13MHz, d2o
 8 sc
 
 19ns.26.2.2025
##JCAMPDX= 6.0         $$ Bruker NMR JCAMP-DX V2.0
##DATA TYPE= NMR FID
##DATA CLASS= NTUPLES
##ORIGIN= UXNMR, Bruker Analytische Messtechnik GmbH
##OWNER= pz
$$ XWIN-NMR		Version 3.5
$$ Thu Dec 11 11:21:35 2025 Russian Standard Time (UT+4h)  Yarkov@DPX200
##.OBSERVE FREQUENCY= 200.1313
##.OBSERVE NUCLEUS= ^1H
##.DELAY= (6, 6)
##.ACQUISITION MODE= SIMULTANEOUS
##.ACQUISITION SCHEME= undefined
##.AVERAGES= 8
##.DIGITISER RES= 18
##SPECTROMETER/DATA SYSTEM= spect
##.PULSE SEQUENCE= zg30
##.SOLVENT NAME= D2O
##.SHIFT REFERENCE= (INTERNAL, D2O, 0, 14.3821)
##AUDIT TRAIL= $$ (NUMBER, WHEN, WHO, WHERE, WHAT)
$$ ##TITLE= Audit trail, XWIN-NMR		Version 3.5
$$ ##JCAMPDX= 5.01
$$ ##ORIGIN= Bruker BioSpin GmbH
$$ ##OWNER= Yarkov
$$ C:/Bruker/XWIN-NMR/data/yarkov2/nmr/H-C/1/audita.txt
$$ ##AUDIT TRAIL=  $$ (NUMBER, WHEN, WHO, WHERE, WHAT)
(   1,<2025-12-11 11:20:18.76 +0400>,<Yarkov>,<DPX200>,
      <created by zg, POWCHK disabled, PULCHK disabled
       configuration hash MD5:
       00 E9 B6 7A A2 85 ED C7 34 08 36 98 17 FE 4E 26
       data hash MD5: 16K
       10 54 0E 5F 02 22 5F E1 98 D8 55 92 F4 3D C4 A0>)
$$ ##END=
$$ 
$$ hash MD5
$$ 2E 73 C1 18 95 53 DD 63 76 CC 75 0C 46 32 88 22
##$RELAX= 
##$RELAX= 
##$RELAX= 
##$RELAX= 
##$RELAX= 
##$RELAX= 
$$ Bruker specific parameters
$$ --------------------------
##$DU= <C:/Bruker/XWIN-NMR>
##$EXPNO= 1
##$NAME= <H-C>
##$PROCNO= 1
##$TYPE= <nmr>
##$USER= <yarkov2>
##$AMP= (0..31)
100 100 100 100 100 100 100 100 100 100 100 100 100 100 100 100 100 100 
100 100 100 100 100 100 100 100 100 100 100 100 100 100 
##$AQSEQ= 0
##$AQ_mod= 1
##$AUNM= <au_zg>
##$AUTOPOS= <>
##$BF1= 200.13
##$BF2= 200.13
##$BF3= 200.13
##$BF4= 200.13
##$BF5= 200.13
##$BF6= 200.13
##$BF7= 200.13
##$BF8= 200.13
##$BYTORDA= 1
##$CFDGTYP= 0
##$CFRGTYP= 5
##$CHEMSTR= <none>
##$CNST= (0..31)
1 1 145 1 1 1 1 1 1 1 1 1 1 1 1 1 1 1 1 1 1 1 1 1 1 1 1 1 1 1 1 1 
##$CPDPRG= <>
##$CPDPRG1= <>
##$CPDPRG2= <>
##$CPDPRG3= <>
##$CPDPRG4= <mlev>
##$CPDPRG5= <mlev>
##$CPDPRG6= <mlev>
##$CPDPRG7= <mlev>
##$CPDPRG8= <mlev>
##$CPDPRGB= <>
##$CPDPRGT= <>
##$D= (0..31)
0 0.7 0 0 0 0 0 0 0 0 0 0.03 0 0 0 0 0 0 0 0 0 0 0 0 0 0 0 0 0 0 0 0 
##$DATE= 1765437618
##$DBL= (0..7)
120 120 120 120 120 120 120 120 
##$DBP= (0..7)
150 150 150 150 150 150 150 150 
##$DBP07= 0
##$DBPNAM0= <>
##$DBPNAM1= <>
##$DBPNAM2= <>
##$DBPNAM3= <>
##$DBPNAM4= <>
##$DBPNAM5= <>
##$DBPNAM6= <>
##$DBPNAM7= <>
##$DBPOAL= (0..7)
0.5 0.5 0.5 0.5 0.5 0.5 0.5 0.5 
##$DBPOFFS= (0..7)
0 0 0 0 0 0 0 0 
##$DE= 6
##$DECBNUC= <off>
##$DECIM= 32
##$DECNUC= <off>
##$DECSTAT= 4
##$DIGMOD= 1
##$DIGTYP= 9
##$DL= (0..7)
0 120 120 120 120 120 120 120 
##$DP= (0..7)
150 150 150 150 150 150 150 150 
##$DP07= 0
##$DPNAME0= <>
##$DPNAME1= <>
##$DPNAME2= <>
##$DPNAME3= <>
##$DPNAME4= <>
##$DPNAME5= <>
##$DPNAME6= <>
##$DPNAME7= <>
##$DPOAL= (0..7)
0.5 0.5 0.5 0.5 0.5 0.5 0.5 0.5 
##$DPOFFS= (0..7)
0 0 0 0 0 0 0 0 
##$DQDMODE= 0
##$DR= 18
##$DS= 0
$$ [...]
##$SUBNAM2= <"">
##$SUBNAM3= <"">
##$SUBNAM4= <"">
##$SUBNAM5= <"">
##$SUBNAM6= <"">
##$SUBNAM7= <"">
##$SUBNAM8= <"">
##$SUBNAM9= <"">
##$SW= 18.0517328524113
##$SWIBOX= (0..15)
0 0 2 0 0 0 0 0 0 0 0 0 0 0 0 0 
##$SW_h= 3612.71676300578
##$TD= 16384
##$TD0= 1
##$TE= 0
##$TE2= 300
##$TE3= 300
##$TEG= 300
##$TL= (0..7)
0 120 120 120 120 120 120 120 
##$TP= (0..7)
150 150 150 150 150 150 150 150 
##$TP07= 0
##$TPNAME0= <>
##$TPNAME1= <>
##$TPNAME2= <>
##$TPNAME3= <>
##$TPNAME4= <>
##$TPNAME5= <>
##$TPNAME6= <>
##$TPNAME7= <>
##$TPOAL= (0..7)
0.5 0.5 0.5 0.5 0.5 0.5 0.5 0.5 
##$TPOFFS= (0..7)
0 0 0 0 0 0 0 0 
##$TUNHIN= 0
##$TUNHOUT= 0
##$TUNXOUT= 0
##$USERA1= <user>
##$USERA2= <user>
##$USERA3= <user>
##$USERA4= <user>
##$USERA5= <user>
##$V9= 5
##$VALIST= <valist>
##$VCLIST= <CCCCCCCCCCCCCCC>
##$VD= 0
##$VDLIST= <DDDDDDDDDDDDDDD>
##$VPLIST= <PPPPPPPPPPPPPPP>
##$VTLIST= <TTTTTTTTTTTTTTT>
##$WBST= 1024
##$WBSW= 4
##$XGAIN= (0..3)
0 0 0 0 
##$XL= 0
##$YL= 0
##$YMAX_a= 547513
##$YMIN_a= -560710
##$ZGOPTNS= <>
##$ZL1= 120
##$ZL2= 120
##$ZL3= 120
##$ZL4= 120
##$ABSF1= 10
##$ABSF2= 0
##$ABSG= 5
##$ABSL= 3
##$ALPHA= 0
##$AQORDER= 0
##$ASSFAC= 0
##$ASSFACI= 0
##$ASSFACX= 0
##$ASSWID= 0
##$AUNMP= <proc_1d>
##$AZFE= 0.1
##$AZFW= 0.1
##$BCFW= 1
##$BC_mod= 2
##$BYTORDP= 1
##$COROFFS= 0
##$CY= 83.5205535888672
##$DATMOD= 1
##$DC= 2
##$DFILT= <>
##$DTYPP= 0
##$F1P= 10.8118882576601
##$F2P= -7.23987719738617
##$FCOR= 0.5
##$FTSIZE= 0
##$FT_mod= 4
##$GAMMA= 1
##$GB= 0.15
##$INTBC= 1
##$INTSCL= 1
##$ISEN= 128
##$LB= 0.25
##$LEV0= 0
##$LPBIN= 0
##$MAXI= 10000
##$MC2= 0
##$MEAN= 0
##$ME_mod= 0
##$MI= 1.114404
##$NCOEF= 0
##$NC_proc= 0
##$NLEV= 6
##$NOISF1= 3.799351
##$NOISF2= 2.8
##$NSP= 1
##$NTH_PI= 0
##$NZP= 0
##$OFFSET= 14.38212
##$PC= 1
##$PHC0= -5310.083
##$PHC1= 17.82193
##$PH_mod= 1
##$PKNL= yes
##$PPARMOD= 0
##$PSCAL= 0
##$PSIGN= 0
##$REVERSE= no
##$SF= 200.129724274929
##$SI= 16384
##$SIGF1= 3
##$SIGF2= 2
##$SINO= 400
##$SIOLD= 16384
##$SREGLST= <1H.CDCl3>
##$SSB= 0
##$STSI= 0
##$STSR= 0
##$SW_p= 3205.1282051282
##$SYMM= 0
##$S_DEV= 0
##$TDeff= 0
##$TDoff= 0
##$TI= <>
##$TILT= no
##$TM1= 0
##$TM2= 0
##$TOPLEV= 0
##$USERP1= <user>
##$USERP2= <user>
##$USERP3= <user>
##$USERP4= <user>
##$USERP5= <user>
##$WDW= 1
##$XDIM= 8192
##$YMAX_p= 0
##$YMIN_p= 0
$$ End of Bruker specific parameters
$$ ---------------------------------
##NTUPLES= NMR FID
##VAR_NAME=  TIME,          FID/REAL,        FID/IMAG
##SYMBOL=    X,             R,               I
##VAR_TYPE=  INDEPENDENT,   DEPENDENT,       DEPENDENT
##VAR_FORM=  AFFN,          ASDF,            ASDF
##VAR_DIM=   8192,          8192,            8192
##UNITS=     SECONDS,       ARBITRARY UNITS, ARBITRARY UNITS
##FACTOR=    0.0002768,     1,               1
##FIRST=     0,             0,               0
##LAST=      2.2672688,     0,               0
##MIN=       0,             -560710,         0
##MAX=       2.2672688,     547513,          0
$$ Real data points
##PAGE= N=1
##DATA TABLE= (X++(R..R)), XYDATA
$$ [...]
$$ plain form
2233 -571 296 1950 -960 -1542 722 -944 -2176 1111 1223 -824 1449 2083 -1736 -1266 1015 -1576
2249 -1576 -1838 1843 768 -1232 1873 1904 -1932 -561 1310 -2135 -1788 1975 468 -925 2414 1442
2265 1442 -1957 121 927 -2714 -1303 1834 -386 -453 2842 752 -1987 815 363 -3071 -376 1661
2281 1661 -1644 -549 3207 436 -1584 1597 -16 -3470 -108 1770 -1527 283 3095 -549 -1477
2296 -1477 1809 -297 -2946 475 701 -2174 873 2994 -695 -345 2107 -1356 -2852 1083 142 -2198
2312 -2198 1761 2473 -1424 205 2287 -1811 -2224 1478 -561 -2393 1754 1814 -1444 1060 2352 -1963
2328 -1963 -1582 1316 -1576 -1758 2689 1245 -1458 1459 1288 -2602 -402 1830 -1918 -1477 2422 169
2344 169 -1355 2681 1454 -2940 -430 970 -2620 -558 3012 -168 -1144 2471 424 -2547 835
$$ packed form
2233e71Q67J654k910n82K264j666j232L287J12k047K273O34l819M70K281k591
2249a576k62L681j075k000L105L1l836J371J871l445L47L763j507j393L339r72
2265A442l399K078Q06l641J411L137k220o7L295k090k739K802m52l434K695K037
2281A661l305J095L756k771k020L181j613l454L362J878l297J810K812l644r28
2296a477L286k106k649L421K26k875L047K121l689L50K452l463j496L935r41k340
2312b198L959P12l897J629K082m098m13L702k039j832M147O0l258K504J292m315
2328a963L81K898k892j82M447j444k703K917j71l890K200K232l748M41L899k253
2344A69j524M036j227m394K510J400l590K062L570l180r76L615k047k971L382
$$ plain form
2359 835 871 -2793 -391 2073 -1056 -330 3127 -104 -2065 1483 -325 -3182 569 2104 -1445 307
2375 307 2888 -1113 -1853 1910 -358 -2639 1422 1249 -2129 645 2848 -1035 -755 1786 -1577 -2916
2391 -2916 1567 883 -1377 1905 2140 -2087 -498 1912 -1620 -1687 1879 -532 -2350 2246 1959 -1658
2407 -1658 802 1880 -2702 -1890 1888 -707 -1642 2582 1216 -2007 1016 1412 -2367 -590 1831 -1359
2423 -1359 -1254 2437 188 -1455 1878 894 -2572 -42 1134 -2019 -212 2943 -102 -907 1935 -250
2439 -250 -2579 950 1074 -2248 -151 2229 -1107 -417 2852 -7 -2249 725 -123 -2531 769 2144
2455 2144 -1266 -166 2096 -878 -1350 1549 -132 -1989 1070 1029 -1565 945 2135 -1501 -986 1655
2471 1655 -930 -1903 1657 742 -1449 1383 1751 -2012 -478 1507 -1497 -1437 1871 220 -1638 1569
$$ packed form
2359H35L6l664K402K464l129P26L457l231j961L548j808k857L751J535l549J752
2375C07K581m001p40L763k268k281M061j73l378K774K203l883K80K541l363j339
2391b916M483o84k260L282K35m227J589K410l532o7L566k411j818M596k87l617
2407a658K460J078m582Q12L778k595r35M224j366l223L023L96l779J777K421l190
2423a359J05L691k249j643L333r84l466K530J176l153J807L155l045q05K842k185
2439b50k329L529J24l322K097K380l336O90L269k859k242K974q48k408L300J375
2455B144l410J100K262k974m72K899j681j857L059m1k594K510J190l636N15K641
2471A655k585r73L560r15k191K832L68l763J534J985l004O0L308j651j858L207
$$ plain form
2487 1569 1351 -1613 173 1241 -2186 -1343 1541 -417 -882 2102 862 -1555 641 792 -1808 -168
2503 -168 1356 -1364 -831 1987 132 -1265 1270 465 -2062 88 1366 -1238 -95 2096 -491 -1159
2519 -1159 1482 -30 -2104 238 936 -1403 239 1985 -594 -480 1457 -614 -1670 710 73 -1748
2535 -1748 675 1636 -767 218 1481 -948 -1336 1065 -236 -1737 755 979 -993 592 1450 -849
2551 -849 -747 848 -797 -1123 1211 635 -829 778 988 -1231 -338 907 -1029 -908 1217 35 -621
2568 -621 1383 856 -1381 -158 761 -1323 -787 1110 -175 -542 1436 799 -879 199 433 -1459 -561
2585 -561 860 -320 -247 1115 188 -564 718 199 -1214 -101 356 -599 31 1102 -70 -527 585
2602 585 -242 -1005 305 467 -969 298 1033 -226 -382 561 -448 -1155 209 263 -581 468 681 -174
$$ packed form
2487A569k18k964J786J068l427Q43K884j958m65K984j240k417K196J51k600J640
2503a68J524k720N33K818j855j397K535q05k527K150J278k604J143K191k587o68
2519a159K641j512k074K342O98k339J642J746k579J14J937k071j056K380o37j821
2535a748K423R61k403R85J263k429l88K401j301j501K492K24j972J585Q58k299
2551h49J02J595j645l26K334n76j464J607K10k219Q93J245j936J21K125j182o56
2568f21K004n27k237J223R19k084N36J897j285l67J978o37j678J078K34j892Q98
2585e61J421j180P3J362r27p52J282n19j413J113M57r55O30J071j172m57J112
2602E85q27p63J310J62j436J267P35j259j56R43j009p07J364N4q44J049K13q55
$$ plain form
2620 -174 40 731 -445 -795 191 -325 -514 705 659 -384 278 549 -482 -442 282 -396 -620 432 557
2639 557 -121 491 372 -540 -286 297 -279 -238 420 331 -50 300 129 -492 -360 -309 -508 45 597 198 243
2660 243 414 -56 -415 -105 -287 -514 -127 408 176 396 865 192 -294 -216 -230 -427 -131 207 129 213 468
2681 468 194 -146 -108 -364 -454 -111 137 228 171 162 291 -25 -77 -190 -267 -287 -80 254 461 320 218 -181 -319
2704 -319 -309 -232 -347 65 123 75 421 455 130 -218 -182 -319 -555 -3 373 19 173 512 110 -195 177 -232
2726 -232 -632 -1 181 -93 322 535 -227 -210 190 -153 -471 265 68 -356 523 483 -257 -137 206 -678 -510
2747 -510 415 86 -191 582 414 -436 43 324 -784 -559 384 -119 -268 753 327 -463 174 238 -724 -243
2767 -243 552 -352 -236 905 153 -310 577 2 -1041 75 548 -500 -112 1051 -109 -616 741 95
$$ packed form
2620a74K14O91j176l50R86n16j89J219m6j043O62K71j031M0P24o78k24J052J25
2639E57o78O12j19r12K54N83n76M1O58q9l81L50j71o21J32N1j99N53N52l99M5
2660B43J71m70l59L10j82k27L87N35k32K20M69o73m86P8j4j97K96L38p8Q4K55
2681D68k74l40L8k56r0L43K48R1n7rJ29l16n2j13p7k0K07L34K07j41j02l99j38
2704c19J0P7j15M12N8m8L46L4l25l48L6j37k36N52L76l54J54L39m02l05L72m09
2726b32m00O31J82k74M15K13p62J7M00l43l18P36j97m24Q79m0p40J20L43q84J68
2747e10R25l29k77P73j68q50M79K81j108K25R43n03j49J021m26p90O37O4r62M81
2767b43P95r04J16J141p52m63Q87n75j043J116M73j048L88J163j160n07J357o46
$$ plain form
2785 95 -1089 60 284 -762 127 1017 -120 -362 753 -263 -956 309 32 -943 192 907 -292
2802 -292 234 985 -602 -912 714 -26 -1042 702 801 -720 209 1118 -562 -715 615 -439 -937 780
2820 780 491 -723 449 704 -837 -352 636 -658 -744 702 234 -740 878 602 -1112 -39 602 -1033
2838 -1033 -583 1123 -311 -770 1121 567 -1079 264 567 -1322 -278 1200 -443 -534 1071 72 -869
2855 -869 740 452 -1312 -47 650 -811 -123 1474 -323 -973 918 23 -1246 681 706 -1269 -50
2872 -50 1408 -653 -656 1274 -207 -1414 609 533 -1257 336 1382 -712 -431 1235 -571 -1145 888
2889 888 156 -1022 826 937 -1074 214 1131 -883 -699 1199 -479 -1319 1056 672 -923 579 1065
2906 1065 -1371 -666 1104 -538 -895 1281 247 -1359 564 944 -1090 -64 915 -1164 -671 1302
$$ packed form
2785I5j184J149K24j046Q89Q90j137k42J115j016o93J265k77r75J135P15j199
2802b92N26P51j587l10J626p40j016J744R9j521R29R09j680j53J330j054m98J717
2820G80k89j214J172K55j541M85R88j294q6J446m68r74J618k76j714J073O41j635
2838a033M50J706j434m59J891n54j646J343L03j889J044J478j643r1J605r99r41
2855h69J609k88j764J265O97j461O88J597j797o50J891q95j269J927K5j975J219
2872e0J458k061lJ930j481j207K023p6j790J593J046k094K81J666j806n74K033
2889H88p32j178J848J11k011J288R17k014J84J898j678q40K375l84j595J502M86
2906A065k436P05J770j642l57K176j034j606J923L80k034J026R79k079M93J973
$$ plain form
2922 1302 50 -768 1213 261 -1482 349 721 -1181 -94 1437 -599 -666 1371 253 -1200 770
2938 770 546 -1538 -3 1133 -802 -269 1541 -233 -1106 734 47 -1528 699 1031 -1067 10
2954 10 1201 -716 -688 1315 -137 -1252 683 393 -1309 554 1480 -853 -570 979 -742 -1038 1140
2971 1140 305 -1125 536 843 -1160 149 1269 -855 -815 985 -334 -1057 1202 699 -1005 537
2987 537 796 -1374 -371 1197 -470 -720 1283 29 -1187 733 755 -1278 9 1079 -1042 -662
3003 -662 1368 76 -857 1055 294 -1417 225 869 -971 -10 1314 -417 -786 1117 128 -892 771
3020 771 381 -1423 231 1164 -594 -190 1434 -532 -1285 879 138 -1129 599 907 -1059 -13 1164
3037 1164 -682 -746 891 -193 -1176 648 583 -864 448 1133 -862 -499 967 -654 -961 1048 343
$$ packed form
2922A302j252q18J981r52j743J831L72j902J087J531k036o7K037j118j453J970
2938G70k24k084J535J136j935N33J810j774q73J840o87j575K227L32k098J077
2954A0J191j917K8K003j452j115J935k90j702J863R26k333K83J549j721k96K178
2971A140q35j430J661L07k003J309J120k124M0J800j319p23K259n03j704J542
2987E37K59k170J003J568j667k50K003j254j216J920K2k033J287J070k121L80
3003f62K030j292r33J912p61j711J642O44j840R61J324j731l69J903r89j020J663
3020G71l90j804J654R33j758M04J624j966p53K164p41j267J728L08j966J046J177
3037A164j846o4J637j084r83J824o5j447J312O85j995L63J466j621l07K009p05
$$ plain form
3054 343 -1021 568 687 -994 -109 1077 -706 -646 1082 -130 -941 850 745 -884 32 655 -1118
3071 -1118 -431 1162 -359 -724 1006 147 -895 511 573 -1050 -201 633 -617 -392 1140 21 -868
3088 -868 748 277 -1091 69 569 -832 -48 1006 -381 -602 913 -8 -888 435 505 -872 31
3105 31 852 -554 -245 922 -358 -813 589 66 -833 536 842 -675 -162 894 -429 -518 784 -237
3123 -237 -812 494 544 -617 182 714 -530 -430 695 -201 -495 595 119 -609 382 549 -653 -3
3141 -3 573 -528 -355 791 -157 -585 573 306 -804 128 531 -659 -317 753 11 -307 580 255 -691
3160 -691 189 326 -625 -75 457 -273 -40 611 13 -351 465 -56 -724 261 369 -475 -27 647 -338 -310
3180 -310 481 -53 -554 89 277 -518 92 466 -196 -278 371 -177 -401 224 102 -398 253 255 -183 -12 274
$$ packed form
3054C43j364J589J19j681Q85J186j783O0J728j212q11J791j05j629R16O23j773
3071a118O87J593j521l65J730q59j042J406O2j623Q49Q34j250K25J532j119q89
3088h68J616m71j368J160N00j401P84J054j387k21J515r21q80J323P0j377R03
3105C1Q21j406L09J167j280m55J402n23q99J369L06j517N13J056j323q9J302j021
3123b37n75J306N0j161P99N32j244J00J125q96k94J090m76p28R91J67j202O50
3141cN76j101J73J146r48m28J158k67j110R32M03j190L42J070p42l18Q87l25r46
3160f91Q80J37r51N50N32p30K33O51n98l64Q16n21o68R85J08q44M48O74r85K8
3180c10P91n34n01O43J88p95O10L74o62q2O49n48k24O25j22n00O51Km38J71K86
$$ plain form
3201 274 -417 -395 365 -40 -335 358 336 -352 182 330 -429 -277 213 -191 -322 441 196 -184 12 319 -238
3222 -238 -36 247 -186 -123 192 74 -52 193 134 -283 76 220 -199 79 313 -145 -206 336 34 -141 4
3243 4 -57 -159 -69 189 138 -25 117 -13 -272 -151 -98 -105 8 -18 4 226 159 84 -52 48 -51 -184 2 51 86
3268 86 13 183 -10 -49 26 62 -271 -48 118 66 -78 111 155 -115 -178 101 9 -135 -36 173 -54 109 140 -122
3292 -122 -226 -77 104 -143 27 173 -11 57 282 44 -222 -69 -150 -171 72 201 -62 135 165 -211 -194 181
3314 181 -144 -277 100 78 -149 249 384 -173 -140 280 -45 -217 270 9 -82 149 176 -213 42 167 -261
3335 -261 -269 257 -21 -185 356 125 -482 216 122 -440 -143 286 -241 -274 531 56 -304 316 93 -452 66
3356 66 423 -408 -216 489 -13 -255 362 -74 -557 159 243 -411 172 517 -229 -234 414 -209 -522 354 129
$$ packed form
3201B74o91K2P60m05k95O93k2o88N34J48p59J52M90m04j31P63k45l80J96L07n57
3222b38K02K83m33O3L15j18j26K45n9m17L59J44m19K78K34m58o1N42l02j75J45
3243Do1j02R0K58n1j63J42j30k59J21N3pJ13k6K2K22o7p5j36J00r9j33J86M9L5
3268H6p3J70j93l9P5L6l33K23J66n2j44J89M4k70o3K79r2j44R9K09k27J63L1k62
3292a22j04J49J81k47J70J46j84O8K25k38k66J53q1k1K43J29k63J97L0l76J7L75
3314A81l25j33L77k2k27L98J35n57L3M20l25j72M87k61r1K31K7l89K55J25m28
3335b61qN26k78j64N41k31o07O98r4n62K97M29n27l3Q05m75l60O20k23n45N18
3356F6L57q31J92P05n02k42O17m36m83P16Q4o54N83L45p46nO48o23l13Q76k25
$$ plain form
3377 129 -452 207 514 -379 -89 519 -312 -445 367 27 -456 266 421 -410 5 536 -461 -458 495 -125 -540
3398 -540 441 377 -547 308 443 -498 -103 548 -430 -460 575 235 -555 389 365 -723 -92 568 -533 -421
3418 -421 640 -2 -436 664 208 -805 134 390 -636 -136 548 -416 -399 773 106 -609 362 268 -776
3437 -776 114 764 -511 -274 667 -151 -660 601 108 -831 291 543 -618 -11 796 -364 -377 651
3455 651 -144 -702 375 301 -616 210 616 -475 -136 680 -397 -589 726 171 -670 588 381 -764
3473 -764 95 724 -493 -463 782 -187 -708 735 363 -828 161 635 -739 -145 747 -202 -609 697
3491 697 1 -683 475 507 -807 22 643 -561 -334 919 -78 -710 544 186 -990 312 632 -704
3509 -704 -202 841 -335 -620 840 51 -809 325 342 -874 91 746 -409 -240 792 -359 -819 582
$$ packed form
3377A29n81O59L07q93K90O08q31j33Q12l40m83P22J55q31M15N31r97LR53o20m15
3398e40R81o4r24Q55J35r41L95O51r78l0J035l40p90R44k4j088O31O60j101J12
3418d21J061o42m34J100m56j013R39K56j026N00O84r64J7J172o67p15R71r4j044
3437g76Q90O50j275K37R41q18n09J261m93r39J122K52j161O07Q07j160j3J028
3455F51p95n58J077p4r17Q26M06j091L39Q16j077j92J315n55q41J258k07j145
3473g64Q59O29j217L0J245r69n21J443l72j191R89M74j374N94Q92r49m07J306
3491F97o96o84J158L2j314Q29O21j204K27J253r97o32J254l58j176J302L20j336
3509g04N02J043j176k85J460p89q60J134J7j216R65O55j155J69J032j151m60J401
$$ plain form
3527 582 136 -760 400 747 -754 -10 969 -472 -399 872 -282 -990 527 430 -698 257 840 -643
3545 -643 -394 853 -167 -712 717 147 -934 256 425 -752 99 729 -618 -519 678 -41 -641 744
3563 744 365 -921 219 673 -550 -245 845 -257 -576 681 7 -759 372 533 -728 5 501
3580 501 -560 -379 891 -72 -565 638 26 -907 298 611 -643 -73 725 -456 -379 826 78 -707
3598 -707 343 386 -880 111 891 -410 -226 720 -136 -706 562 312 -644 335 517 -670 -62 856 -350
3617 -350 -425 579 -140 -787 585 245 -670 337 685 -676 -410 721 -295 -479 626 98 -741 292
3635 292 665 -581 85 710 -620 -493 614 -51 -515 576 269 -868 110 578 -548 -119 794 -196
3653 -196 -615 672 -9 -670 397 423 -749 4 648 -430 -405 760 7 -570 488 174 -765 160 579
$$ packed form
3527E82m46q96J160L47j501P44R79j441P3J271j154p08J517r7j128R55N83j483
3545f43K49J247j020n45J429n70j081J190J69j177Q51O30j347R9J197p19o00J385
3563G44l79j286J140M54j223L05J090j102l19J257o74p66J131J61j261P33M96
3580E01j061J81J270r63m93J203o12r33J205L13j254N70P98j181P7J205p48p85
3598g07J050M3j266R91P80j301J84R46q56n70J268k50r56R79J82j187O08R18j206
3617c50p5J004p19o47J372l40r15J007L48j361K66J131j016j84J105n28q39J033
3635B92L73j246O66O25j330J27J107o65m64J091l07j137R78M68j126M29R13r90
3653a96m19J287o81o61J067K6j172P53O44j078K5J165p53n77J058l14r39R25M19
$$ plain form
3672 579 -552 -37 649 -121 -369 555 -56 -680 299 316 -589 103 768 -296 -193 617 -302 -588 471
3691 471 109 -640 289 500 -574 20 604 -336 -428 656 -89 -484 487 370 -487 123 436 -469 -361 519
3711 519 -112 -452 419 157 -509 181 284 -475 -34 370 -318 -268 459 -89 -405 346 93 -512 47 261
3731 261 -503 -193 411 -199 -260 474 45 -426 231 363 -483 21 402 -152 -58 476 -105 -350 205 90 -360
3752 -360 76 348 -297 -83 434 -206 -318 161 -105 -452 184 236 -302 107 328 -240 -231 281 -210 -404 178
3773 178 74 -296 261 178 -230 11 299 -179 -110 300 29 -266 245 280 -202 18 281 -180 -81 234 20
3794 20 -187 213 211 -222 124 136 -201 -28 105 -188 -132 295 15 -249 171 88 -224 -48 40 -214 -73 210
3816 210 30 -123 288 90 -222 -22 142 -222 4 225 2 -59 10 76 49 89 -91 -51 -35 46 -133 54 -110
$$ packed form
3672E79j131N15O86p70k48R24o11o24R79J7r05O92O65j064J03Q10r19k86J059
3691D71l62p49R29K11j074N94N84r40r2J084p45l95R71j17q57O10L13r05J08Q80
3711E19o31l40Q71k62o66O90J03p59M41M04o88N0P27n48l16P51k53o05N59K14
3731B61p64L10O04o10o1P34m29m71O57J32q46N04L81n54R4N34n81k45N55j15m50
3752c60M36K72o45K14N17o40j12M79k66l47O36N2n38M09K21n68RN12m91j94N82
3773A78j04l70N57q3m08K41K88m78O9M10k71k95N11L5m82K20K63m61R9L15k14
3794B0k07M00km33L46J2l37J73J33k93N6M27k80k64M20q3l12J76Q8k54J41K83
3816B10j80j53M11j98l12K00J64l64K26K21k23o1O9O6k7M0j80M0J6Q1j79J87j64
$$ plain form
3839 -110 -57 -33 1 53 12 -7 22 26 -18 -135 -45 -53 -59 -29 -20 148 27 -8 -88 48 25 66 -83 -110 -77 -66 53 150 41
3868 41 -46 96 -112 -63 23 69 -91 133 103 -115 -78 84 -27 -169 26 -23 -56 218 93 -19 36 89 -111 -187
3892 -187 151 -144 -103 64 151 -4 81 200 -166 -104 67 -106 -37 202 -17 -238 94 111 -268 26 141 -207
3914 -207 -48 315 -108 -194 160 19 -250 108 179 -359 -22 293 -235 -179 288 26 -253 156 -35 -310 161
3935 161 279 -282 -32 432 -188 -170 245 -51 -373 224 224 -409 68 289 -225 -130 362 -115 -283 452 48
3956 48 -449 96 377 -336 -36 278 -222 -253 390 -17 -461 221 125 -465 47 368 -289 -198 417 -105 -332
3977 -332 488 40 -515 210 278 -399 -13 518 -325 -178 532 -56 -433 302 265 -540 160 495 -381 -69 392
3998 392 -145 -362 351 97 -456 260 368 -514 119 494 -334 -276 571 -256 -481 447 44 -550 146 512
$$ packed form
3839a10N3K4L4N2m1j9K9Mm4j17R0qoL0RJ68j21l5q0J36k3M1j49k7L3J1J19R7j09
3868D1q7J42k08M9Q6M6j60K24l0k18L7J62j11j42J95m9l3K74j25j12N5N3k00p6
3892a87L38k95M1J67Q7j55Q5J19l66O2J71j73O9K39k19k21L32J7l79K94J15l48
3914b07J59L63m23q6L54j41k69L58P1n38L37L15n28N6M67k62k79M09j91k75M71
3935A61J18n61K50M64o20J8M15k96l22N97%o33M77K21n14R5M92m77j68P35m04
3956D8m97N45K81p13L00L14n00l1O43m07m44O82r6n90N12L21o57R1O15n22k27
3977c32Q20m48n55P25O8o77L86N31q43J47P10n88l77P35l7q05P00L35q76L12M61
3998C92n37k17P13k54n53P16J08q82O33L75q28N8Q47q27k25R28m03n94O96L66
$$ plain form
4018 512 -306 -143 573 -348 -396 390 80 -548 296 323 -498 37 556 -433 -299 588 -149 -592 382 254 -573
4039 -573 252 374 -485 -106 575 -368 -367 524 -52 -549 319 341 -500 -29 496 -531 -251 508 -194 -465 419
4060 419 118 -633 231 445 -574 -2 550 -480 -302 533 -17 -485 541 302 -666 68 437 -431 -30
4079 -30 726 -219 -419 431 121 -607 336 348 -627 -92 579 -368 -276 749 -72 -530 319 -9 -595 411
4099 411 548 -563 -197 600 -335 -426 680 84 -632 320 334 -652 103 591 -465 -284 595 -168 -440 538
4119 538 274 -640 253 379 -556 -41 651 -299 -347 692 -42 -565 430 376 -552 20 463 -656 -302 659
4139 659 -241 -396 526 104 -716 221 409 -467 33 648 -345 -418 593 62 -526 647 283 -761 32
4158 32 523 -328 -23 690 -232 -492 505 112 -588 468 377 -746 -102 665 -468 -306 646 -121 -618 419
$$ packed form
4018E12q18J63P16r21m8P86l10o28Q44K7q21N35N19r89J34Q87p37m43R74j28q27
4039e73Q25J22q59L79O81r43JQ91n76m97Q68K2q41M71N25j027K80P59p02k71Q84
4060D19l01p51Q64K14j019N72N52j030J78Q35n50m68J026k39r68P34L69q68M01
4079c0P56r45k00Q50l10p28R43J2r75N35O71r47R2J025q21m58Q49l28n86J006
4099D11J37j111L66P97r35r1J106n96p16R52J4r86P55M88j056J81Q79p63k72R78
4119E38k64r14Q93J26r35N15O92r50m8J039p34n23R95n4r28N72M43j119L54R61
4139F59r00j55R22m22q20R37J88q76N00O15r93p3J011n31n88J173l64j044P93
4158C2M91q51L05P13r22k60R97l93p00J056r1j123O44P67j133J62R52p67m97J037
$$ plain form
4178 419 116 -579 222 535 -552 -112 528 -266 -404 575 30 -695 389 140 -504 198 672 -376 -174
4197 -174 598 -272 -465 581 235 -532 214 445 -546 35 658 -269 -395 570 30 -531 515 336 -546
4216 -546 101 398 -533 -218 477 -268 -322 448 84 -621 314 368 -520 94 380 -376 -343 593 -81 -588 376
4237 376 215 -378 90 507 -707 -552 403 -312 -688 829 -44 -1161 -19 427 -496 2 353 -370 -243
4256 -243 575 -160 -470 395 154 -501 210 404 -424 -69 531 -181 -273 567 -82 -491 291 313 -384 -10 460
4277 460 -327 -219 513 -81 -294 288 60 -418 248 251 -107 -233 273 -482 -196 719 -123 -341 213 349 -629
4298 -629 129 316 -358 -125 676 -207 -27 580 307 -525 372 305 -860 -420 394 -292 -81 247 33 -336
4318 -336 243 155 -439 30 234 -222 63 329 397 137 810 -149 -739 200 496 -257 -38 -173 -256 -102 269
$$ packed form
4178D19l03o95Q01L13j087M40O40p94j38R79n45p25J084k49o44P02M74j048K02
4197a74P72q70j93J046l46p67P46K31r91N81O23r27j26R65n40n61J046j79q82
4216e46O47K97r31L15O95p45n4P70l64p05R35N4q88O14K86p56L3R36o74n07R64
4237C76j61n93M68M17j214J55R55p15l76J517q73j117J142M46r23M98L51p23J27
4256b43Q18p35l10Q65k41o55P11J94q28L55O00p12r2Q40o49m09P82K2o97L74M70
4277D60p87J08P32n94k13N82k28m78O66Ll58j26N06p55K86R15q42k18N54J36r78
4298f29P58J87o74K33Q01q83J80O07k73q32Q97o7j165M40Q14o86K11L28k14l69
4318c36N79q8n94M69K04m56K85K66O8k60O73r59n90R39K96p53K19j35q3J54L71
$$ plain form
4339 269 -71 -165 194 38 -219 198 172 -286 -6 266 -133 -211 327 18 -147 106 -9 -218 38 323 -127
4360 -127 -53 245 -62 -209 177 60 -238 120 196 -328 -337 309 -752 722 673 213 -330 56 124 150 -19 190
4382 190 -99 -10 143 -103 -114 160 -28 -121 -23 45 -184 -85 151 -279 -33 66 -46 -122 52 33 -164 34 -61
4405 -61 -7 -33 231 19 -58 146 78 -41 54 27 22 85 77 -45 -44 94 -87 -55 32 68 -113 73 -34 -110 -58 -78 77
4432 77 -87 -37 -34 -44 33 27 -28 -61 -120 20 -12 -66 -19 31 -60 -4 13 -20 30 4 84 -112 -70 8 -66 -39 -22 -131 -33
4461 -33 84 -41 40 28 5 -81 40 -26 -58 -88 109 101 163 -591 -37 190 64 120 -217 32 71 -168 -65 93
4485 93 -75 -145 147 -81 -56 127 310 73 -96 198 -94 -19 165 71 -97 195 44 -141 42 92 -134 -29
4507 -29 257 -91 -63 79 23 -179 183 193 -222 75 156 -150 -100 240 -39 -230 302 -57 -203 161 145 -199
$$ packed form
4339B69l40r4L59j56k57M17k6m58K80K72l99p8N38l09j65K53j15k09K56K85m50
4360a27P4K98l07j47L86j17k98L58P6n24rO46j061J474m9m60n43L86O8K6j69K09
4382A90k89Q9J53k46j1K74j88r3R8O8k29R9K36m30K46R9j12p6J74j9j97J98r5
4405f1N4k6K64k12p7K04o8j19R5k7nO3qj22JJ38j81L2Q7L6j81J86j07p6N2k0J55
4432G7j64N0Lj0P7on5l3n9J40l2n4M7N0r1N6J7l3N0k6Q0j96M2P8p4K7J7j09R8
4461c3J17j25Q1j2k3q6J21o6l2l0J97qO2p54N54K27j26N6l37K49L9k39J03J58
4485I3j68p0K92k28K5J83J83k37j69K94k92P5J84r4j68K92j51j85J83N0k26J05
4507b9K86l48K8J42n6k02L62J0m15K97Q1l06N0L40k79j91N32l59j46L64j6l44
$$ plain form
4529 -199 -70 268 -81 -200 302 -58 -296 288 84 -346 105 344 -210 -108 302 10 -201 150 100 -270
4549 -270 236 277 -388 16 237 -187 -257 357 -122 -315 276 191 -220 4 331 -217 -240 338 -114 -185 245 21
4571 21 -479 128 274 -303 17 319 -285 -190 371 -83 -302 324 187 -325 136 195 -407 26 346 -75 -177
4592 -177 358 15 -319 163 -28 -359 38 359 -212 -183 408 -211 -279 563 155 -376 196 276 -479 -30 325
4613 325 -281 -164 455 26 -417 297 112 -406 174 384 -248 -57 358 -171 -241 426 21 -449 283 309 -398
4634 -398 -64 430 -215 -311 385 13 -470 332 249 -488 94 405 -631 -69 307 -165 -378 350 -44 -376
4654 -376 329 149 -467 139 356 -354 -187 441 11 -516 395 110 -490 139 287 -365 46 497 -366 -393
4674 -393 419 -51 -389 303 196 -389 64 436 -361 -139 510 -225 -432 377 111 -338 288 283 -401 -180 447
$$ packed form
4529a99J29L38l49j19N02l60k38N84k04m30M51K39n54J02M10k92k11L51n0l70
4549b70N06M1o65M04K21m24p0O14m79j93N91q5m11K24L27n48k3N78m52p1M30k24
4571B1n00O07J46n77L20L02o04R5N61m54k19O26j37n12M61N9o02M33L20m21j02
4592a77N35l43l34M82j91l31L97L21n71K9N91o19o8Q42m08n31N72Q0p55M49L55
4613C25o06J17O19m29m43P14j85n18N80K10o32J91M15n29p0O67m05m70P32K6p07
4634c98L34M94o45r6O96l72m83Q02q3p37N82L11j036N62L76m72k13P28l94l32
4654c76P05j80o16O06K17p10J67O28m30n27R11k85o00O29J48o52M11M51q63k7
4674c93Q12m70l38O92j07n85M53L72p97K22O49p35k07Q09k66m49O26no84K21O27
$$ plain form
4695 447 -287 -237 365 -91 -440 260 132 -492 212 431 -323 -62 497 -192 -336 423 121 -397 186 261 -584
4716 -584 51 548 -266 -253 348 -206 -328 442 202 -453 149 247 -534 -24 536 -317 -364 320 -52 -487 381
4737 381 369 -333 111 481 -365 -186 468 -86 -363 369 33 -440 293 203 -342 24 243 -297 -305 470 38
4758 38 -298 380 116 -382 123 417 -375 31 493 -105 -426 276 50 -264 244 261 -487 -3 458 -349 -239
4779 -239 439 -202 -349 278 19 -308 70 353 -335 -204 456 -163 -212 500 81 -485 275 73 -424 32
4799 32 251 -248 -258 514 -92 -273 380 82 -492 141 214 -304 -30 559 -141 -330 403 -77 -395 334 260
4820 260 -336 33 348 -326 -43 452 -92 -283 344 -30 -272 254 180 -362 75 395 -300 -103 362 -72
4840 -72 -285 230 233 -301 177 230 -309 -188 232 -142 -332 370 11 -285 177 267 -310 -100 258 -337 -212 389
$$ packed form
4695D47p34N0O02m56l49P00j28o24P04K19p54K61N59o89j44P59l02n18N83P5q45
4716e84O35M97q14J3O01n54j22P70k40o55O02R8p81N10N60q53m7O84l72m35Q68
4737C81j2p02M44L70q46J79O54n54k77P32l36m73P33r0n45L66K19n40qP75m32
4758C8l36O78k64m98N05K94p92M06M62n98l21P02k26l14N08J7p48M84M61q07J10
4779b39O78o41j47O27k59l27L78K83o88J31O60o19m9P12m19n66P60k02m97M56
4799C2K19m99j0P72o06j81O53k98n74O33P3n18K74N89p00j89P33m80l18P29p4
4820B60n96L69L15o74K83M95n44j91O27l74k42N26p4n42M37L20o95J97M65m34
4840g2k13N15Ln34M78N3n39J21M20l74j90P02l59k96M62R0n77K10L58n95J25O01
$$ plain form
4862 389 -125 -308 291 56 -312 92 362 -181 94 285 -94 -179 248 -44 -199 198 192 -262 101 286 -135
4883 -135 -136 208 -143 -301 203 167 -203 114 171 -203 -122 202 -164 -97 186 -126 -280 221 62 -234 89 116
4905 116 -181 -110 252 -75 -161 85 56 -322 18 204 -211 26 159 -205 -95 102 -24 -69 175 -28 -173
4926 -173 102 267 -56 -35 105 -25 -56 295 32 -185 68 142 -168 60 54 -58 -105 170 -8 -121 127 -46
4948 -46 -119 -52 81 -63 21 145 7 17 139 -101 -105 -39 -70 -237 74 94 -95 -80 173 95 -15 164 91 -63
4972 -63 52 13 -110 67 34 38 -111 30 -6 -79 77 -36 -194 41 -9 -144 -64 10 33 -62 39 6 29 52 -31
4997 -31 -138 23 125 57 -40 -53 -22 69 75 31 19 -33 -82 -29 -88 -13 21 -39 94 -29 -43 99 28 32 -64 -10 51 68
5025 68 -112 -4 0 -89 111 -42 164 -98 29 -21 36 -14 0 -97 -52 -62 -17 31 74 109 -44 113 2 -15 -1 78
$$ packed form
4862C89n14j83N99k35l68M04K70n43K75J91l79q5M27k92j55L97om54L63J85m21
4883a35jL44l51j58N04l6l70L17N7l74Q1L24l66O7K83l12j54N01j59k96L23K7
4905A16k97P1L62l27q6K46k9l78L40J86m15K37J33l64J10J97j26m5K44k03j45
4926a73K75J65l23K1J40j30l1L51k63k17K53P4l10K28oj12m7K75j78j13K48j73
4948d6p3O7J33j44Q4J24j38J0J22k40mO6l1j67L11K0j89J5K53p8j10J79p3j54
4972f3J15l9j23J77l3Mj49J41l6p3J56j13j58K35n0j35Q0P4K3r5J01l3K3K3q3
4997c1j07J61J02o8r7j3L1R1Om4j2n2m9N3n9P5L4o0J33j23j4J42p1Mr6N4O1J7
5025F8j80J08Mq9K00j53K06k62J27n0N7n0J4r7M5j0M5M8M3L5j53J57j11j7J4P9
$$ plain form
5051 78 -34 43 149 -28 -65 136 9 -3 194 63 -86 -90 0 -123 -25 124 28 -136 -51 32 -105 -15 46 -136
5075 -136 -148 48 -143 -130 157 -8 -136 102 51 -149 78 195 -156 -79 156 -57 -66 115 46 -184 45 86 -169
5098 -169 28 42 -74 -18 135 82 -199 195 141 -145 41 102 -102 -48 115 -26 -266 116 78 -252 187 228 -143
5121 -143 -12 74 -225 -15 292 -92 -289 178 178 -224 12 175 -145 -90 162 -233 -40 254 -3 -282 147
5142 147 102 -291 131 169 -164 -145 267 -121 -221 175 37 -217 60 91 -315 33 329 -251 -86 206 6
5163 6 -186 200 49 -314 50 219 -156 5 278 -230 -96 249 70 -162 196 230 -93 94 168 -193 -156 251
5185 251 19 -142 177 -61 -311 104 189 -272 -2 292 -68 -138 372 -46 -360 224 81 -341 114 250 -209
5206 -209 -99 273 -144 -291 186 176 -173 171 226 -302 -153 244 -232 -120 250 -80 -264 215 86 -289 75
$$ packed form
5051G8j12P7J06j77l7K01j27j2J97j31j49mR0j23R8J49r6j64Q5Q3j37R0O1j82
5075a36j2J96j91J3K87j65j28K38n1k00K27J17l51P7K35k13rJ81o9k30K29M1k55
5098a69J97J4j16N6J53n3k81L94n4k86J86O1k04N4J63j41k40L82l8l30M39M1l71
5121a43J31Q6k99K10L07l84j97M67%m02K36J63l20N5K52l95J93K94k57k79M29
5142A47m5l93M22L8l33J9M12l88j00L96j38k54K77L1m06L48K96n80J65K92k00
5163Fj92L86j51l63L64J69l75J61K73n08J34L45j79k32L58L4l23J87P4l61L7M07
5185B51k32j61L19k38k50M15Q5m61K70K94l60p0N10m18l14N84j43m22M55J36m59
5206b09J10L72m17j47M77j0l49L44N5n28J49L97m76J12L70l30j84M79j29l75L64
$$ plain form
5227 75 170 -213 -47 345 -90 -281 322 0 -295 173 140 -265 66 320 -182 -168 317 -110 -268 209 155 -299
5249 -299 38 53 -336 3 351 -198 -134 376 -97 -219 377 212 -440 107 261 -332 -99 345 32 -227 344
5270 344 24 -310 201 254 -289 37 203 -226 -272 300 -25 -255 146 194 -300 29 272 -240 -103 343 -189
5291 -189 -198 309 43 -230 133 128 -261 77 224 -226 -97 280 -121 -236 268 41 -196 167 242 -316 -135 321
5313 321 -117 -154 332 -42 -363 170 151 -369 192 227 -173 -204 166 -250 -262 256 122 -106 51 95 -222 -15
5335 -15 302 -147 -147 264 -115 -306 223 185 -165 116 301 -177 -5 240 -37 -258 234 -15 -292 93 295
5356 295 -268 51 93 -218 -159 234 102 167 27 -522 -69 343 510 -235 -100 273 33 -97 802 923 214
5377 214 -98 50 -384 -84 244 -135 -104 221 -63 -142 269 97 -155 168 220 -297 11 211 -40 -170 128
$$ packed form
5227G5R5l83J66L92m35j91O03l22k95M68l3m05L31K54n02J4M85m27j58M77n4m54
5249b99L37J5l89L39L48n49O4N10m73j22N96j65o52N47J54n93K33M44l13k59N71
5270C44l20l34N11N3n43L26J66m29m6N72l25k30M01M8m94L29K43n12J37M46n32
5291a89rN07k66k73L63nl89L38J47m50J29L77m01j15N04k27k37L63P5n58J81M56
5313C21m38l7M86l74l21N33j9n20N61L5m00l1L70m16j2N18j34k28J57M4l17K07
5335a5L17m49%M11l79j91N29l8l50K81J85m78J72K45k77k21M92k49k77L85K02
5356B95n63L19M2l11N9L93j32O5j40n49M53M12J67p45J35L73k40j30Q99J21p09
5377B14l12J48m34L00L28l79L1L25k84p9M11j72k52L23N2n17L08K00k51j30K98
$$ plain form
5398 128 64 -376 505 227 -243 78 100 -302 -143 261 2 -106 288 -39 -190 190 101 -324 -12 288 -99
5419 -99 -138 197 -9 -298 151 115 -297 -42 212 -222 -45 303 -89 -184 105 -20 -174 260 176 -204 -22 225
5441 225 -145 -67 164 -80 -166 199 139 -191 -12 142 -222 -103 224 -249 -58 144 16 -284 49 84 -171
5462 -171 -104 139 -18 -180 230 -25 -112 82 -77 49 63 82 -75 -7 205 -35 -66 185 65 -223 41 18
5484 18 -177 11 60 -103 46 188 -72 -70 237 63 -190 33 -8 -169 3 79 -163 -34 8 -58 -174 201 62
5507 62 -174 129 115 -136 -8 218 -59 -93 64 -19 -149 167 168 -125 74 4 -32 -44 28 -50 -78 117 85 -152
5531 -152 20 -23 -31 -28 -14 -56 6 29 -77 -162 -28 158 -198 19 -22 17 -120 114 -16 -135 58 163 -142 79
5555 79 166 -30 17 83 -133 2 149 42 -63 78 48 -50 -7 -60 -88 -15 67 -35 -24 23 21 31 -11 56 78 -50
$$ packed form
5398A28o4m40Q81k78m70L21K2m02J59M04k59j08L94l27j51L80q9m25L12L00l87
5419i9l9L35k06k89M49l6m12K55K54m34J77L48l92r5K89j25j54M34q4l80J82K47
5441B25l70P8K31k44q6L65o0l30J79J54l64J19L27m73J91K02j28l00L33L5k55
5462a71O7K43j57j62M10k55q7J94j59J26J4J9j57O8K12k40l1K51j20k88K64k3
5484A8j95J88M9j63J49J42k60KL07j74k53K23m1j61J72P6k42J29M2o6j16L75j39
5507F2k36L03j4k51J28K26k77l4J57q3j30L16Jk93J99p0l6j2P2p8k8J95l2k37
5531a52J72m3qLJ4m2O2K3j06q5J34J86l56K17m1L9j37K34j30j19J93J05l05K21
5555G9Q7j96M7O6k16J35J47j07j05J41l0r8M3n3k8P3Q2j02J1M7kJ0m2O7K2j28
$$ plain form
5581 -50 -89 -49 -104 -34 -68 -106 42 110 -28 -37 86 43 -24 -69 10 -3 -150 47 -33 85 -77 23 -33 16 14 -26 72
5608 72 43 -21 -26 28 -9 -44 -49 -51 15 -10 7 -44 57 16 27 -24 57 9 -28 17 57 58 -144 18 28 9 -68 -3 10 162
5638 162 56 21 -31 88 16 -113 -5 62 -104 -82 133 -13 -69 59 -6 -88 28 140 -86 56 129 -123 30
5661 30 79 -31 -97 13 81 -45 -87 93 -6 78 203 -128 -153 129 54 -113 46 -4 -93 47 87 -110 -83 90
5685 90 25 64 120 -15 -71 -3 23 -177 -52 170 -137 -140 74 -6 -200 -31 79 -102 7 46 -60 -82 92 -103
5709 -103 -79 94 2 -105 23 65 -159 10 76 -105 -110 181 24 -4 87 -8 -111 75 183 -137 -80 47 -91
5732 -91 -78 155 -8 -176 85 86 -32 74 274 -82 -72 195 -81 -87 32 85 -208 82 140 -80 9 89 -117 -123
5756 -123 181 -16 -149 136 81 -339 12 171 -157 -51 149 -108 -206 192 97 -265 1 114 -222 -42 80
$$ packed form
5581e0l9M0n5P0l4l8J48O8j38rJ23m3o7m5P9j3j47J97q0J18j62J00n6M9km0R8
5608G2k9o4nN4l7l5nkO6k5J7n1J01m1J1n1Q1m8l7M5M0Jk02J62J0j9p7O5J3J52
5638A62j06l5n2J19p2j29J08O7j66K2K15j46n6J28o5q2J16J12k26J42P3k52J53
5661C0M9j10o6J10O8j26m2J80r9Q4J25l31k5K82p5j67J59n0q9J40M0j97K7J73
5685I0o5L9N6j35n6O8K6k00J25K22l07lK14q0j94J69J10j81J09L9j06k2J74j95
5709a03K4J73r2j07J28M2k24J69O6j81nK91j57k8R1r5j03J86J08l20N7J27j38
5732i1J3K33j63j68K61Jj18J06K00l56J0K67k76oJ19N3k93K90N8k20Q9Q0k06o
5756a23L04j97j33K85n5m20L51J59l28J06K00k57r8L98r5l62K66J13l36J80J22
$$ plain form
5777 80 -81 -143 195 10 -176 158 31 -184 -73 112 -277 52 95 -130 -162 72 -96 -159 193 138 -179 -78
5799 -78 201 -175 -72 204 -35 -180 127 69 -172 35 171 -227 9 200 -148 -166 128 95 -200 155 30
5820 30 -254 96 188 -169 -89 320 -138 -193 169 48 -263 141 114 -179 18 285 -186 -131 207 -28 -204 204
5842 204 26 -105 -12 144 -116 -147 267 -170 -190 209 11 -311 120 196 -206 114 356 -164 -87 194 -7 -275
5864 -275 198 71 -233 -51 295 -243 -40 320 -176 -248 125 3 -341 158 178 -205 49 222 -174 -108 299
5885 299 18 -260 165 86 -330 167 244 -258 5 288 -74 -98 202 115 -103 156 173 -266 94 221 -287 -118
5907 -118 272 -91 -65 124 -10 -334 119 89 -303 43 203 -88 -151 259 -53 -152 123 50 -319 164 208 -231
5929 -231 -96 202 -82 -158 83 -39 -288 192 168 -133 62 268 -92 -164 194 -102 -83 237 164 -187 64 159
$$ packed form
5777H0j61o2L38j85j86L34j27k15J11J85l89L29M3k25l2K34j68o3L52n5l17J01
5799g8K79l76J03K76k39j45L07n8k41K07J36l98K36J91l48j8K94l3k95L55j25
5820C0k84L50R2l57Q0M09m58n5L62j21l11M04k7k93J97K67m71N5L38k35j76M08
5842B04j78j31R3J56k60l1M14m37k0L99j98l22M31P6m02L20K42n20P7K81k01k68
5864b75M73j27l04J82L46n38K03L60m96p2L73j22l44M99K0l83K54J73l96O6M07
5885B99k81k78M25p9m16M97P7n02K63K83l62k4L00q7k18K59J7m39L60J27n08J69
5907a18L90l63K6J89j34l24M53l0l92L46J60k91o3M10l12r9K75p3l69M83M4m39
5929b31J35K98k84p6K41j22k49M80k4l01J95K06l60p2L58k96J9L20p3l51K51R5
$$ plain form
5951 159 -204 -90 232 -159 -148 116 41 -203 125 47 -220 98 131 -224 -125 181 -103 -263 192 -27 -272 179
5973 179 104 -146 35 211 -75 -80 128 -63 -234 91 162 -209 149 245 -242 -8 236 -140 -123 119 -12 -324
5995 -324 85 126 -209 97 53 -137 -164 67 -72 -196 84 142 -210 83 137 -141 33 191 -178 11 146 -4
6017 -4 -171 95 85 -118 40 55 -82 14 149 -20 -33 215 95 -165 147 173 -161 74 181 -181 -135 229 92
6040 92 -208 81 128 -290 186 136 -97 92 82 -52 -113 101 -101 -172 180 85 -122 45 101 -83 -66 224 -10
6063 -10 41 23 100 -146 49 82 -169 72 170 -33 -56 176 -28 -25 138 76 -75 59 159 -3 -153 109 -33
6086 -33 11 87 51 -60 63 -40 57 12 140 -68 -117 126 -16 -35 82 113 -26 29 80 -45 -16 173 3 -130
6110 -130 93 166 -43 111 -56 -69 -19 107 21 38 -86 -40 -55 17 17 -59 -156 -35 -51 8 134 -63 -233 137 -30
$$ packed form
5951A59l63J14L22l91J1K64p5k44L28p8k67L18L3l55R9L06k84j60M55k19k45M51
5973A79p5k50J81J76k86nK08j91j71L25P1l71L58R6m87K34K44l76J7K42j31l12
5995c24M09M1l35L06m4j90k7K31j39j24K80N8l52K93N4k78J74J58l69J89J35j50
6017dj67K66j0k03J58J5j37R6J35j69j3K48j20k60L12K6l34K35J07l62M6L64j37
6040I2l00K89M7m18M76n0k33J89j0j34o1K14k02p1L52r5k07J67N6j84J7K90k34
6063a0N1j8P7k46J95L3k51K41R8k03k3K32k04LJ63o2j51J34J00j62j50K62j42
6086c3M4P6l6j11J23j03R7m5J28k08m9K43j42j9J17L1j39N5N1j25K9J89j70j33
6110a30K23P3k09J54j67j3N0J26q6J7j24M6j5P2%p6r7J21j6N9J26j97j70L70j67
$$ plain form
6135 -30 17 91 12 -47 -114 65 -19 20 13 -61 -147 66 121 37 57 76 -57 22 -26 -46 -1 27 37 137 9 16 -56 -13 -4
6164 -4 38 89 10 59 -43 38 35 -37 26 116 -123 73 67 21 -47 -8 -1 -6 55 -147 -55 13 -67 29 -6 -31 90 -13 -42 112
6194 112 -10 -97 89 102 91 -108 19 168 -144 141 49 -53 31 41 -29 -18 142 -56 69 -31 11 43 -16 141
6218 141 50 10 6 -156 52 62 2 -41 41 109 -91 -43 157 30 -22 6 -127 59 74 32 -186 -63 80 -39 -46
6243 -46 108 -26 -1 66 -31 -76 31 158 -134 -53 96 9 -118 7 -88 -66 57 59 -80 -122 145 -50 -21 146
6267 146 -20 -79 0 45 -118 156 166 -28 108 180 -91 -43 61 79 12 137 -30 -210 37 62 -110 -83 76
6290 76 -130 -31 106 -41 -189 -2 -10 -29 -105 71 0 -95 78 14 -106 138 109 -60 53 81 -153 -111 212 -200
6314 -200 -128 186 28 -112 145 99 -183 -2 202 -79 -90 168 -102 -188 128 -146 -133 107 -36 -215 -13 96
$$ packed form
6135c0M7P4p9n9o7J79q4L9pp4q6K13N5q4K0J9j33P9m8k0M5K8J0J00j28Pp2M3R
6164dM2N1p9M9j02Q1lp2O3R0k39J96om6o8L9PnO1k02R2O8q0R6l5k5J21j03k9J54
6194A12j22q7J86J3j1j99J27J49l12K85r2j02Q4J0p0J1J60j98J25j00M2L2n9J57
6218A41r1m0mj62K08J0o0m3Q2O8k00M8K00j27n2K8j33J86J5m2k18J23J43j19p
6243d6J54j34K5O7r7m5J07J27k92Q1J49q7j27J25r5K2J23Kj39m2K67j95K9J67
6267A46j66n9P9M5j63K74J0j94J36P2k71M8J04J8o7J25j67j80K47K5j72K7J59
6290G6k06R9J37j47j48J87qj9p6J76p1r5J73o4j20K44k9j69J13K8k34M2L23m12
6314b00P2L14j58j40K57m6k82J81K04k81j1K58k70q6L16k74J3K40j43j79K02J09
$$ plain form
6336 96 -62 -101 169 39 -130 82 -33 -138 111 231 -113 -124 194 -101 -154 12 131 -211 84 122 -167 -1
6358 -1 63 -187 32 180 -77 -174 81 47 -232 58 120 -89 7 151 -213 -175 100 -85 -206 8 226 -164 35
6381 35 205 -142 -63 171 -27 -144 123 35 -135 17 176 -208 -145 81 -89 -128 19 48 -206 180 105 -296
6403 -296 32 239 3 17 262 -10 -229 220 -33 -231 90 139 -296 -55 146 -63 -48 220 12 -139 215
6424 215 24 -239 -72 111 -183 52 183 -64 -236 229 -11 -243 140 94 -218 31 127 -157 -102 91 -99
6445 -99 -191 190 25 -114 185 144 -243 -47 229 -68 -127 294 -93 -241 51 63 -162 -30 281 -168 -123 141
6467 141 -38 -147 122 44 -63 -25 16 -129 -26 245 -163 -118 166 7 -172 227 132 -258 62 154 -183 -17
6489 -17 232 -200 -226 110 -41 -96 60 151 -242 42 208 -215 -62 310 4 -184 186 -22 -345 28 161
$$ packed form
6336I6j58l9K70j30j69K12j15j05K49J20l44j1L18k95n3J66J19l42K95L8k89J66
6358aO4k50K19J48k57r7K55l4k79K90O2k09R6J44l64L8K75j85j21K14K18l90J99
6381C5J70l47P9K34j98j17K67q8j70J52J59l84O3K26j70l9J47K9k54L86p5m01
6403b96L28K07k36J4K45k72k19M49k53j98L21M9m35K41K01k09J5K68k08j51L54
6424B15j91k63J67J83k94K35J31k47j72M65k40k32L83m6l12K49R6k84N5J93j90
6445i9r2L81j65j39K99m1l87J96K76k97n9M21l87j48K92J2k25J32L11m49M5K64
6467A41j79j09K69p8j07L8M1j45J03K71m08M5K84j59j79L99r5l90L20R2l37J66
6489a7K49m32k6L36j51n5J56R1l93K84J66m23J53L72l06j88L70k08l23L73J33
$$ plain form
6510 161 -243 -59 216 -115 -121 172 102 -194 66 100 -347 144 119 -109 -43 159 -71 -214 233 43 -122 54
6532 54 249 -109 26 200 45 -163 202 33 -228 58 159 -90 62 243 -208 -100 93 -45 -173 185
6552 185 86 -188 136 184 -178 -15 134 -183 -151 253 71 -114 98 137 -147 95 189 -231 -2 257 -154 -86
6574 -86 199 -23 -100 79 -58 -72 9 86 -54 126 142 -148 -117 196 -13 -154 197 73 -186 30 130 -61
6596 -61 -170 199 -64 -50 92 93 -271 51 70 -77 -10 53 4 -290 48 -54 -190 73 111 -101 -80 212 -250
6619 -250 -43 245 -27 -229 184 18 -214 53 98 -90 -83 18 -204 -85 113 58 -126 92 146 -160 145 114
6641 114 -26 -151 47 -5 -112 232 4 -77 127 77 -194 156 103 -15 -59 89 -90 -19 201 107 -198 18
6663 18 118 -156 2 128 -66 -169 111 -34 -108 57 20 -112 34 152 -43 14 145 47 -137 53 49 -45 -12
$$ packed form
6510A61m04J84K75l31oK93p0k96K60L4m47M91k5k28O6K02k30j43M47j90j65J76
6532E4J95l58J35J74j55k08L65j69k61K86J01k49J52J81m51J08J93j38j28L58
6552A85r9k74L24M8l62J63J49l17L2M04j82j85K12L9k84K42R4m20K29K59m11O8
6574h6K85k22p7J79j37j4Q1P7j40J80J6k90L1L13k09j41L51j24k59K16J00j91
6596f1j09L69k63J4J42Jl64L22J9j47O7O3m9k94L38j02j36K63L8k12K1K92m62
6619b50K07K88k72k02M13j66k32K67M5j88PJ01k22J19J98n5j84K18N4l06L05l1
6641A14j40j25J98n2j07L44k28q1K04n0k71L50n3j18m4J48j79P1K20r4l05K16
6663A8J00k74J58J26j94j03K80j45p4J65l7j32J46J18j95N7J31r8j84J90mr4L3
$$ plain form
6686 -12 68 -11 32 105 -118 -38 69 0 -140 75 40 -29 19 55 -2 71 183 55 87 -34 89 -14 26 171 -72
6711 -72 -9 -6 -5 -21 192 -86 -56 102 -11 16 8 -84 -36 33 94 -55 4 22 68 60 68 13 -1 6 2 -104 -79 23 -65 75
6741 75 -19 -63 16 36 196 -89 38 56 -5 69 -86 100 83 77 57 7 18 -25 50 -2 -95 -44 25 -71 6 -59 39 43 -72
6770 -72 -205 39 -1 150 -46 -38 0 31 95 15 92 -101 -42 -46 20 87 -10 28 -13 99 -102 -54 96 8 -74 19 65
6797 65 25 40 55 20 -73 51 -73 -113 -107 -37 -110 76 54 19 75 31 -8 53 125 33 -90 80 -43 -61 46 80 48
6824 48 -40 101 61 42 85 -10 -88 56 35 -16 122 185 -40 -71 111 -79 -29 85 5 -111 71 152 -103 -64 -20
6849 -20 -104 -72 118 48 -106 141 83 42 41 25 -53 26 138 27 -74 25 46 -41 114 123 -81 21 82 -117 -118 122
6875 122 -68 -142 122 46 -9 19 124 -52 -65 53 1 -171 190 23 -93 37 50 -230 43 110 -171 -233 71
$$ packed form
6686a2Q0p9M3P3k23Q0J07o9j40K15l5o9M8L6n7P3J12j28L2j21J23j03M0J45k43
6711g2O3LJj6K13k78L0J58j13K7qr2M8O9O1j49N9J8M6qQn5j4Pmj06K5J02q8J40
6741G5r4m4P9K0J60k85J27J8o1P4j55J86j7ok0n0J1m3P5n2r3N1O9r6P7o5R8Mj15
6770g2j33K44m0J51j96QL8L1O4q0P7j93N9mO6O7r7L8m1J12k01M8J50q8q2R3M6
6797F5m0J5J5l5r3J24j24m0OP0p3J86k2l5N6m4l9O1P2r2j23J70j23j8J07L4l2
6824D8q8J41m0j9M3r5p8J44k1n1J38O3k25l1J82j90N0J14q0j16J82Q1k55L9M4
6849b0q4L2J90p0j54K47n8m1jj6p8P9J12j11j01R9K1q7J55Rk04J02O1j99jK40
6875A22j90p4K64p6n5K8J05j76j3J18n2j72L61j67j16J30J3k80K73O7k81o2L04
$$ plain form
6898 71 -61 -178 124 116 -148 -80 164 -178 -46 113 -60 -14 64 196 -124 102 212 -208 -9 67 -126 -124 241
6921 241 67 -166 153 116 -224 -17 202 -123 -25 204 -124 -43 62 20 -80 24 106 -207 61 122 -159 -53
6943 -53 190 62 -101 143 155 -187 20 80 -129 18 259 -44 -142 164 -117 -247 212 106 -172 18 115 -208
6965 -208 -106 191 -3 -65 172 -15 -151 130 137 -224 -142 236 -165 -60 271 -68 -250 168 83 -227 63 156
6987 156 -180 -108 159 -64 -134 68 91 -214 241 40 -206 -98 282 -57 -144 185 -16 -139 183 85 -266 145
7009 145 88 -64 -29 242 -97 -175 151 3 -240 184 142 -285 -10 163 -251 -47 205 3 -179 76 14 -231
7031 -231 101 123 -214 -21 150 -178 -91 102 12 -144 200 88 -253 1 246 -66 -152 212 -203 -156 130 112
7053 112 -98 150 48 -181 -102 208 -167 -32 164 -27 -52 156 71 -293 -12 147 -169 -83 258 -74 -63 176
$$ packed form
6898G1j32j17L02qk64O8K44l42J32J59j73M6P8J32l20K26J10m20J99P6j93KL65
6921B41j74k33L19l7l40K07K19l25R8K29l28Q1J05m2j00J04Q2l13K68O1k81J06
6943e3K43j28j63K44J2l42K07O0k09J47K41l03r8L06k81j30M59j06k78J90R7l23
6965b08J02K97j94o2K37j87j36K81Pl61Q2L78m01J05L31l39j82M18q5l10K90R3
6987A56l36P2K67k23p0K02K3l05M55k01k46J08L80l39q7L29k01j23L22r8l51M11
7009A45n7j52L5K71l39p8L26j48k43M24m2m27K75J73m14K04K52k02j82K55o2k45
7031b31L32K2l37J93J71l28Q7J93r0j56L44j12l41K54K45l12q6L64m15M7K86j8
7053A12k10K48j02k29P9L10l75J35J96j91k5K08q5l64K81J59l16Q6L41l32J1K39
$$ plain form
7075 176 -15 -99 117 78 -122 95 156 -90 -92 169 -202 -67 139 48 -248 -84 141 -216 120 186 -202 -248 299
7098 299 113 -173 44 153 -150 31 140 -195 -60 116 10 -246 137 8 -155 75 124 -130 -23 122
7118 122 -117 25 264 -10 -169 249 46 -208 90 267 -213 14 167 -109 -68 127 24 -187 192 146 -207
7139 -207 30 291 -162 -77 131 64 -160 135 27 -192 7 138 -140 -47 186 -40 -80 249 -107 -268 141
7160 141 109 -142 80 153 -95 -77 265 -27 -211 265 119 -52 164 118 -45 90 287 -152 -123 119 -66 -109
7182 -109 102 -20 -219 76 280 -144 -63 83 -13 -66 137 50 -209 179 70 -123 70 198 -96 21 64 94
7204 94 -96 34 136 -161 -19 125 -171 -131 151 -56 -109 52 89 -133 146 49 -104 87 59 -143 -155 219
7226 219 -54 -25 105 -9 -215 50 -37 -121 31 71 -17 -169 50 -50 -84 88 3 -60 21 117 -192 18 187
$$ packed form
7075A76j91q4K16l9k00K17O1k46kK61l71J35K06r1k96J64K25l57L36O6l88m6N47
7098B99j86k86K17J09l03J81J09l35J35J76j06k56L83j29j63K30M9k54J07J45
7118A22k39J42K39k74j59M18k03k54K98J77m80K27J53k76M1J95j03k11L79m6l53
7139b07K37K61m53Q5K08o7k24K95j08k19J99J31k78R3K33k26m0L29l56j61M09
7160A41l2k51K22P3k48J8L42k92j84M76j46j71K16m6j63J35J97m39K9K42j85m3
7182a09K11j22j99K95K04m24Q1J46r6n3K03q7k59L88j09j93J93J28k94J17M3L0
7204I4j90J30J02k97J42J44k96M0K82k07n3J61L7k22K79r7j53J91k8k02j2L74
7226B19k73K9J30j14k06K65q7q4J52M0q8j52K19j00l4J72q5o3Q1R6l09K10J69
$$ plain form
7249 187 3 -104 72 14 -17 100 88 -121 62 137 7 -108 77 -120 -36 104 20 -10 -8 29 -11 115 47 44 -66
7274 -66 71 41 -76 24 78 -39 -103 160 80 -133 127 -137 -122 117 36 2 62 144 12 -70 87 -5 -67 112
7298 112 109 1 24 23 -51 115 61 -74 -29 45 52 -33 103 -16 -22 107 74 77 49 -64 -48 64 37 -13 -6 -20 33 21 135
7327 135 -21 -36 -22 31 -45 -79 -12 215 -12 10 -1 58 -16 -59 47 75 21 -16 -28 -33 -46 -24 136 36 41 112 0
7354 0 -12 -38 39 46 -125 -21 31 196 53 38 49 38 -95 -8 9 -10 127 89 -2 -135 18 -78 -117 100 -60 -44
7380 -44 -30 -21 -21 -32 18 123 -63 137 -117 136 12 76 40 -4 -5 -66 -66 -67 2 -42 -19 -21 -96 -19 91 -23 -55 2 102
7409 102 -29 19 29 -76 57 31 1 -172 8 183 5 339 296 -103 181 486 -27 118 -617 -125 409 259
7431 259 17 -83 -1 166 -114 39 81 -86 -101 -85 10 -30 90 -34 -6 100 33 -38 31 122 -185 93 157 5
$$ packed form
7249A87j84j07J76n8l1J17j2k09J83P5j30j15J85j97Q4J40q4l0KL7m0J26o8lj10
7274f6J37l0j17J00N4j17o4K63q0k13K60k64J5K39q1l4O0Q2j32q2J57r2o2J79
7298A12lj08K3jp4J66n4j35M5P4Pq5J36j19oJ29l3Lk8j13J6J12k7n0Pj4N3j2J14
7327A35j56j5J4N3p6l4O7K27k27K2j1N9p4m3J06K8n4l7j2nj3K2J60j00NP1j12
7354@j2k6P7Pj71J04N2J65j43j5J1j1j33Q7J7j9J37l8r1j33J53r6l9K17j60J6
7380d4J4R%j1N0J05j86K00k54K53j24O4l6m4jo1%jO9m4K3kp5P7J10j14l2N7J00
7409A02j31M8J0j05J33k6l0j73J80J75j78L34m3l99K84L05n13J45p35M92N34j50
7431B59k42j00Q2J67k80J53M2j67j5J6R5m0J20j24K8J06o7p1O9R1l07K78O4j52
$$ plain form
7455 5 -68 176 -148 -60 -16 -111 153 19 224 -135 18 193 14 -69 47 61 -14 -16 58 -110 51 196 -212 -227
7479 -227 153 73 -99 18 55 -262 79 170 -100 60 211 26 28 -2 -12 -72 -5 18 -96 29 186 -153 -93 261
7503 261 48 -63 31 158 -184 58 164 -53 -168 55 19 -85 157 -9 -116 57 136 -202 36 12 -192
7524 -192 -117 122 86 -144 205 124 -234 126 76 -146 -35 189 -154 -147 243 101 -96 54 103 -145 167 169 -94
7547 -94 20 226 -46 -62 200 -8 -179 101 122 -164 -86 150 16 -86 181 18 -245 144 0 -183 -5
7568 -5 141 -184 -46 129 -149 -86 88 125 -212 79 131 -136 75 229 57 -110 227 -133 -94 63 22 -55 98
7591 98 80 -230 28 192 -131 -46 195 41 -183 107 150 -268 -49 149 -177 -58 265 -79 -95 123 90 -269
7613 -269 106 199 -178 29 195 -69 -180 209 63 -179 334 125 -233 29 172 -211 -85 203 -112 -155 64
$$ packed form
7455Ep3K44l24Q8M4r5K64j34K05l59J53J75j79q3J16J4p5kP4j68J61J45m08j5
7479b27L80q0j72J17L7l17L41R1k70J60J51j85Kl0j0o0O7K3j14J25J57l39O0L54
7503B61k13j11R4J27l42K42J06k17j15K23l6j04K42j66j07J73P9l38K38k4k04
7524a92P5K39l6k30L49q1l58L60n0k22J11K24l43PL90j42j97J50M9k48L12Kk63
7547i4J14K06k72j6K62k08j71K80K1k86P8K36j34j02K67j63k63L89j44j83J78
7568eJ46l25J38J75k78O3J74L7l37K91N2k67K11J54j72j67L37l60L9J57m1p7J53
7591I8j8l10K58J64l23Q5K41j54k24K90M3m18K19J98l26J19L23l44j6K18l3l59
7613b69L75R3l77K07J66k64j11L89j46k42N13k09l58K62J43l83J26K88l15m3K19
$$ plain form
7634 64 140 -114 202 185 -229 21 207 -10 -70 224 29 -183 80 104 -191 108 174 -46 16 176 -166 -107 182
7657 182 -39 -205 35 141 -186 62 121 -103 -106 313 -28 -190 179 96 -169 132 165 -92 141 231 -52 -59 7
7680 7 10 -188 144 19 -262 -1 145 -212 -181 158 -118 -129 198 71 -3 101 60 -123 -42 81 -117 -149 121
7703 121 54 -273 52 129 -137 86 197 -81 30 208 -111 -94 221 78 -87 175 31 -192 -39 211 -56
7724 -56 -61 216 -8 -111 215 162 -199 67 42 -136 -39 11 -107 -237 123 23 -116 80 73 -237 65 148 -2
7747 -2 -15 183 -97 -126 106 -8 -77 68 136 -266 -24 133 -57 -95 166 -19 -193 49 232 -154 111 150 -83
7770 -83 -56 45 -72 -39 63 1 6 -34 -34 -232 -14 174 -85 -174 126 41 -160 108 76 -69 -87 88 -133 12
7794 12 12 -8 -72 102 25 -92 25 89 -196 27 141 -63 -84 61 6 -73 70 68 -217 49 25 -156 -2 -13 -44
$$ packed form
7634F4P6k54L16j7m14K50J86k17o0K94j95k12K63K4k95K99O6k20O2J60l42N9K89
7657A82k21j66K40J06l27K48N9k24lM19l41j62L69q3k65L01L3k57K33R0k83pO6
7680GLj98L32j25k81K61J46l57L1L39k76j1L27j27p4J04m1j83Q1J23j98l2K70
7703A21o7l27L25P7k66K23J11k78J11J78l19J7L15j43j65K62j44k23J53K50k67
7724e6nK77k24j03L26n3l61K66k5j78R7N0j18j30L60j00j39J96pl10L02Q3j50
7747bj3J98k80k9K32j14o9J45O8m02K42J57j90l8K61j85j74K42J83l86K65L9k33
7770h3K7J01j17L3J02o2Nm0%j98K18J88k59q9L00q5k01K68l2j45j8J75k21J45
7794A2%k0o4J74p7j17J17O4k85K23J14k04k1J45n5p9J43kk85K66k4j81J54j1l1
$$ plain form
7819 -44 -45 8 61 -63 -41 83 -102 -33 9 -220 47 79 -55 24 45 85 -111 77 -6 -106 -12 45 -68 -145 86
7844 86 -28 12 17 18 -29 1 29 -108 -74 146 -48 2 96 -27 -30 71 107 -122 -36 -24 -61 94 35 93 -143 -10 -38
7871 -38 -56 45 -52 28 22 53 -141 -44 -3 -90 -135 -2 95 27 72 -43 -76 105 137 41 -26 25 -159 8 56 44 65
7898 65 60 -7 -112 -81 35 84 -74 -101 23 37 -20 -33 41 68 37 50 -49 5 15 -24 -97 68 -32 56 68 -63 -107
7925 -107 103 -138 -131 140 95 -29 163 72 64 -60 -122 26 27 -52 8 2 22 -2 -49 -93 -46 58 43 16 22 -51 -66 23
7953 23 -50 33 -148 78 -42 -65 25 49 -59 1 129 -39 137 76 -33 -31 15 -7 -29 3 106 50 103 23 -48 -73
7979 -73 15 -68 30 -114 -26 -87 51 87 -4 -13 177 -1 -47 67 -52 -50 -67 95 -81 39 108 -23 -50 10 -119 -11
8005 -11 30 81 -88 86 159 -65 -16 -24 95 75 18 -34 -10 70 38 -110 3 139 -31 -168 133 -69 -191 43
$$ packed form
7819d4jN3N3j24K2J24j85O9M2k29K67L2j34P9K1M0j96J88q3j00R4N7j13p7K31
7844H6j14M0NJm7L0K8j37L4K20j94N0R4j23lJ01L6k29Q6J2l7J55n9N8k36J33k8
7871c8j8J01r7Q0oL1j94R7M1q7m5J33R7o8M5j15l3J81L2r6o7N1j84J67M8j2K1
7898F5no7j05L1J16M9j58k7J24J4n7j3P4K7l1J3r9N4J0l9p3J65j00Q8J2j31m4
7925a07K10k41PK71m5j24J92r1qj24o2J48Jp9O0oK0k4m7m4M7J04j5k7Op3j5Q9
7953B3p3Q3j81K26j20k3R0K4j08O0J28j68J76o1j09KM6k2k2L2J03n6N3q0p1k5
7979g3Q8q3R8j44Q8o1J38L6r1rJ90j78m6J14j19Kj7J62j76J20O9j31k7O0j29J08
8005a1M1N1j69J74P3k24M9qJ19k0n7n2K4Q0l2j48J13J36j70j37L01k02j22K34
$$ plain form
8029 43 -71 -107 -69 104 -126 -78 54 -25 -112 64 -27 -131 76 31 -116 -36 140 -34 -33 187 -54 -65 35 61
8053 61 -39 23 12 -172 -54 76 -96 -106 10 12 -145 94 111 -121 23 125 30 -47 177 -117 -50 134 15
8076 15 -74 87 -42 -69 12 141 -165 -105 223 5 -128 162 86 -118 46 -12 -115 96 69 -53 -50 59 -2 -109
8100 -109 -62 82 -100 -28 91 -111 -104 69 -8 -92 178 -26 -139 76 74 -123 -50 124 -11 -163 116 -53 -132
8123 -132 48 81 -210 36 238 -129 37 88 24 -77 101 -88 -216 -9 78 -122 7 230 -86 -71 118 7
8145 7 -193 120 17 -141 57 89 0 -25 100 2 -105 124 84 -178 44 216 -110 1 218 -107 -117 257 -102
8168 -102 -21 256 113 -150 -94 187 -120 -7 135 -43 -62 145 -67 -76 163 137 -125 5 206 -73 10 275
8190 275 -75
$$ packed form
8029D3j14l6L8J73k30M8J32p9q7J76r1j04K07m5j47Q0J76j74JK20k41j1J00K6
8053F1j00O2j1j84J18J30j72j0J16Kj57K39J7k32J44J02r5p7K24k94O7J84j19
8076A5q9J61j29k7Q1J29l06O0L28k18j33K90p6k04J64n8j03K11k7j22LJ09o1j07
8100a09M7J44j82P2J19k02PJ73p7q4K70k04j13K15kj97P3J74j35j52K79j69p9
8123a32J80L3k91K46K02l67J66N1o4j01J78j89j28K07Q7k00J29K23l16J5J89j11
8145Gk00L13j03j58J98L2q9k5J25r8j07K29m0k62K22J72l26J11K17l25j0L74l59
8168a02Q1K77j43k63N6K81l07J13J42j78j9K07k12rK39k6k62J30K01k79Q3K65
8190B75l50
8191g5
$$ Imaginary data points
##PAGE= N=2
##DATA TABLE= (X++(I..I)), XYDATA
$$ plain form
0 0 0 0 0 0 0 0 0 0 -3 8 -8 9 -11 16 -21 24 -33 40 -49 58 -67 83 -98 116 -135 157 -183 211 -244 281 -319
31 -319 366 -412 468 -529 593 -670 748 -837 933 -1037 1155 -1281 1417 -1566 1730 -1912 2106
48 2106 -2322 2556 -2814 3105 -3421 3777 -4175 4621 -5133 5717 -6404 7211 -8180 9377
62 9377 -10886 12870 -15591 19582 -26024 38152 -69091 321504 547513 31588 54353 -165034
74 -165034 -560710 -553572 -125775 4982 135250 453884 545021 223830 -12177 -161547 -380916
85 -380916 -500628 -297737 7144 231269 341223 397817 329666 65666 -268632 -382313
95 -382313 -334417 -291046 -115689 240733 413485 335171 263521 128343 -203620 -413357 -351121
106 -351121 -261600 -143094 156311 403854 397449 278901 114862 -139548 -347455 -398701 -319874
$$ packed form
0@%%%%%%%%lJ1j6J7k0K7l7M5n7P3q9J07j25J50j81K14k51K92l40L94m55N25o00
31c19O85p78Q80r97J122j263J418j585J770j970K192k436K698k983L296l642M018
48B106m428M878n370N919o526P198p952Q796r754J0850j2121J3615j5391J7557
62I377k0263K3756k8461L5173m5606O4176j07243L90595K26009n15925K2765k19387
74a65034l95676P138M27797J30757J30268L18634R1137l21191k36007j49370k19369
85c80916j19712K02891L04881K24125J09954N6594o8151k64000l34298j13681
95c82313M7896M3371J75357L56422J72752p8314p1650j35178l31963k09737O2236
106c51121Q9521J18506K99405K47543o405j18548j64039k54410k07907n1246P8827
$$ plain form
117 -319874 -109840 148007 292483 348111 341471 150619 -131027 -271408 -327721 -353400 -170814
128 -170814 132821 267750 298055 334881 186014 -121553 -278399 -286155 -294129 -183717 75590
139 75590 264781 315854 294589 161269 -61586 -241836 -329385 -307615 -155490 46503 219409
150 219409 342711 326660 151247 -33198 -183851 -342237 -360508 -163061 40823 167213
160 167213 309418 354883 188671 -15413 -152533 -291816 -341359 -202581 -14410 136298
170 136298 284858 333550 208269 27176 -139577 -281557 -301297 -191090 -52719 118414
180 118414 287342 296915 175922 63937 -93164 -286339 -313313 -182859 -62117 91071
190 91071 282949 314814 187430 69744 -74323 -267182 -322387 -210670 -80743 67167
$$ packed form
117c19874K10034K57847J44476N5628o640j90852k81646j40381n6313k5679J82586
128a70814L03635J34929L0305L6826j48867l07567j56846p756p974J10412K59307
139G5590J89191N1073k1265j33320k22855j80250q7549K1770J52125K01993J72906
150B19409J23302j6051j75413j84445j50653j58386j8271J97447K03884J26390
160A67213J42205M5465j66212k04084j37120j39283m9543J38778J88171J50708
170A36298J48560M8692j25281j81093j66753j41980j9740J10207J38371J71133
180A18414J68928R573j20993j11985j57101j93175k6974J30454J20742J53188
190I1071J91878L1865j27384j17686j44067j92859n5205J11717J29927J47910
$$ plain form
200 67167 245137 314940 238593 103538 -68605 -232744 -288737 -241714 -130757 49794 215977
211 215977 269835 245873 152555 -38862 -207882 -251504 -238038 -164660 29052 205496 238344
222 238344 218429 163081 -9689 -187859 -236051 -221441 -164093 3220 178889 237510 227290
233 227290 162520 -1413 -169165 -235962 -231699 -160840 -6205 145241 227015 249113 175763
244 175763 11283 -134268 -218420 -254570 -184779 -18324 121149 204067 250143 189214 30003
255 30003 -101838 -187373 -247497 -199138 -41559 96076 182533 237737 193942 49421 -86494
266 -86494 -177891 -228300 -185318 -58276 70669 173792 229623 185667 66880 -61472 -178280
277 -178280 -235082 -180789 -67227 49038 171106 238120 183517 72870 -33448 -157385 -241101
$$ packed form
200F7167J77970O9803p6347j35055j72143j64139n5993M7023J10957J80551J66183
211B15977N3858k3962r3318j91417j69020m3622J3466P3378J93712J76444L2848
222B38344j9915n5348j72770j78170m8192J4610N7348J67313J75669N8621j0220
233B27290o4770j63933j67752o6797M263P0859J54635J51446Q1774K2098p3350
244A75763j64480j45551q4152l6150O9791J66455J39473Q2918M6076o0929j59211
255C0003j31841q5535o0124M8359J57579J37635Q6457N5204m3795j44521j35915
266h6494r1397n0409M2982J27042J28945J03123N5831m3956j18787j28352j16808
277a78280n6802N4293J13562J16265J22068O7014n4603j10647j06318j23937q3716
$$ plain form
288 -241101 -197809 -84349 26617 150182 237301 202964 92045 -20499 -136782 -220931 -204196
299 -204196 -108704 8420 127944 208930 204117 124374 434 -129374 -202497 -193532 -126553
310 -126553 -10233 122778 194395 185533 130643 24367 -113429 -194633 -188573 -133421 -30084
321 -30084 107243 194654 191945 132598 30945 -95691 -183110 -194560 -142856 -38869 86140
332 86140 174343 198978 155877 45334 -83862 -167329 -193414 -160527 -54492 76322 156955
343 156955 183141 164296 71577 -64131 -155826 -181916 -162739 -79677 54310 155393 180519
354 180519 154135 80544 -39296 -145187 -180461 -153611 -84448 24919 136826 187113 159528
365 159528 82550 -21643 -126942 -184203 -163788 -84329 17937 114271 174517 169730 97025
$$ packed form
288b41101M3292J13460J10966J23565Q7119l4337j10919j12544j16283q4149J6735
299b04196R5492J17124J19524Q0986m813p9743j23940j29808p3123Q965O6979
310a26553J16320J33011P1617q862n4890j06276j37796q1204O060N5152J03337
321c0084J37327Q7411k709n9347j01653j26636q7419j1450N1704J03987J25009
332H6140Q8203K4635m3101j10543j29196q3467k6085L2887J06035J30814Q0633
343A56955K6186j8845r2719j35708r1695k6090J9177Q3062J33987J01083K5126
354A80519k6384p3591j19840j05891l5274K6850O9163J09367J11907N0287k7585
365A59528p6978j04193j05299n7261K0415P9459J02266R6334O0246m787p2705
$$ plain form
376 97025 -11483 -110087 -169544 -172644 -106191 8356 109137 160904 166375 113369 2205 -104011
388 -104011 -154726 -161665 -121025 -15947 99031 157238 162382 120742 20213 -92950 -153419
399 -153419 -160198 -120196 -25939 81045 145932 162816 126406 31977 -72495 -141540 -168125 -131918
411 -131918 -31219 69502 131490 163269 136116 37740 -62136 -122962 -159997 -141498 -46280
422 -46280 55734 120657 160312 142306 48798 -51354 -116051 -155508 -139172 -54288 39570 110697
434 110697 157529 140724 58199 -30316 -106805 -162081 -143085 -57432 26429 100322 158373 142145
446 142145 61971 -15451 -91511 -157822 -146025 -68427 7976 86754 156511 146977 72107 -3626
458 -3626 -83123 -149355 -140025 -76712 -8799 76138 147312 138876 80503 15756 -73165 -145592 -135784
$$ packed form
376I7025j08508r8604n9457l100O6453J14547J00781N1767N471n3006j11164j06216
388a04011n0715o939M0640J05078J14978N8207N144m1640j00529j13163o0469
399a53419o779M0002R4257J06984O4887J6884l6410r4429j04472o9045k6585L6207
411a31918J00699J00721O1988L1779k7153r8376r9876o0826l7035J8499R5218
422d6280J02014O4923L9655j8006r3508j00152o4697l9457J6336Q4884R3858P1127
434A10697M6832j6805q2525q8515p6489n5276J8996Q5653Q3861P3893N8051j6228
446A42145q0174p7422p6060o6311J1797P7598P6403P8778O9757r534p4870p5733
458c626p9497o6232R330O3313O7913Q4937P1174q436n8373o4747q8921p2427R808
$$ plain form
471 -135784 -81391 -19559 70910 140965 130095 83513 27936 -65179 -138982 -132213 -89719 -31148
483 -31148 64974 135979 130351 94932 35680 -63919 -129740 -124438 -100225 -45977 57028 124506
495 124506 123746 108155 54138 -54487 -121253 -119455 -109060 -58879 48982 114353 113690 107449 62267
508 62267 -39342 -104569 -113345 -111721 -62162 37543 97674 111550 113190 59175 -35821 -88571
520 -88571 -109540 -118127 -59113 35081 80819 108447 126296 61702 -37225 -77891 -104839 -127670
532 -127670 -65211 31218 70655 102309 130438 70926 -20906 -63326 -103696 -133053 -73963 16074
544 16074 59747 103306 129982 69950 -8833 -47587 -98560 -127811 -69355 1442 37698 95947
556 95947 129031 71222 3001 -35985 -97332 -126571 -67815 -5280 33458 96967 122933 66709
$$ packed form
471a35784N4393O1832R0469P0055j0870m6582n5577r3115p3803O769M2494N8571
483c1148R6122P1005n628l5419n9252r9599o5821N302K4213N4248J03005O7478
495A24506p60j5591n4017j08625o6766J798J0395N0181J07861O5371o63o241m5182
508F2267j01609o5227q776J624M9559R9705O0131J3876J640n4015r4996n2750
520h8571k0969q587N9014R4194M5738K7628J7849o4594r8927m0666k6948k2831
532a27670O2459R6429L9437L1654K8129n9512r1832m2420m0370k9357N9090R0037
544A6074M3673M3559K6676o0032p8783l8754n0973k9251N8456P0797L6256N8249
556I5947L3084n7809o8221l8986o1347k9239N8756O2535L8738O3509K5966n6224
$$ plain form
568 66709 11225 -30206 -98010 -121049 -67351 -19377 25876 99858 119657 68364 29042 -18306
580 -18306 -99426 -120213 -72850 -38047 14547 99749 117964 73053 42776 -11357 -94319 -108090
592 -108090 -70232 -49643 3590 85685 99244 72602 59895 1020 -85025 -97044 -73630 -62208
604 -62208 1983 86640 92424 69187 60155 -2602 -80734 -85169 -69017 -63836 -1419 74852 83610
617 83610 76188 69709 2552 -71295 -81944 -81853 -73005 -893 66814 76956 86858 77188 721 -61489
631 -61489 -68642 -87309 -79209 -3282 50912 58627 86800 83439 8478 -41936 -54251 -89454 -86036
644 -86036 -8191 41461 54681 90898 81199 2813 -38560 -49505 -86394 -75872 -4884 28952
656 28952 44966 88939 79054 10465 -23229 -47683 -96094 -81016 -11673 21905 50804 96765
$$ packed form
568F6709n5484m1431o7804k3039N3698M7974M5253P3982J9799n1293l9322m7348
580a8306q1120k0787M7363L4803N2594Q5202J8215m4911l0277n4133q2962j3771
592a08090L7858K0589N3233Q2095J3559k6642j2707n8875q6045j2019K3414J1422
604f2208O4191Q4657N784k3237r032o2757p8132m435J6152N181O2417P6271Q758
617H3610p422o479o7157p3847j0649R1Q848P2112O7707J0142R902r670p6467o2210
631f1489p153j8667Q100P5927N4194P715K8173l361p4961n0414j2315l5203L418
644h6036P7845M9652J3220L6217r699p8386m1373j0945l6889J0522P0988L3836
656B8952J6014M3973r885o8589l3694k4454m8411J5078O9343L3578K8899M5961
$$ plain form
668 96765 77634 12769 -15307 -47604 -94589 -75945 -18427 5973 43350 92857 75356 25843
680 25843 2285 -42240 -91880 -72953 -30677 -8527 43421 91826 68809 31051 10109 -44832
692 -44832 -87730 -60830 -31316 -15391 42232 83776 57329 36540 23063 -41148 -85308 -60573
704 -60573 -41855 -24528 44655 86168 59878 43569 24793 -43323 -81415 -57470 -47377 -29609
716 -29609 36992 74199 59014 55675 34223 -34157 -69670 -59566 -60658 -35105 32956 63424
728 63424 56709 61758 34358 -30823 -55513 -53357 -64123 -34547 30620 50268 50671 65615 35388
741 35388 -27139 -45354 -50399 -67990 -35477 26306 44233 53497 70165 33835 -25269 -41714
753 -41714 -54009 -69711 -32567 19683 35014 54963 72503 34052 -14105 -29478 -56873 -75503
$$ packed form
668I6765j9131o4865k8076l2297m6985J8644N7518K4400L7377M9507j7501m9513
680B5843k3558m4525m9640J8927M2276K2150N1948M8405k3017l7758k0942n4941
692d4832m2898K6900K9514J5925N7623M1544k6447k0789j3477o4211m4160K4735
704f0573J8718J7327O9183M1513k6290j6309j8776o8116l8092K3945J0093J7768
716b9609O6601L7207j5185l339k1452o8380l5513J0104j092K5553O8061L0468
728F3424o715N049k7400o5181k4690K156j0766K9576O5167J9648M03J4944l0227
741C5388o2527j8215n045j7591L2513O1783J7927R264J6668l6330n9104j6445
753d1714j2295j5702L7144N2250J5331J9949J7540l8451m8157j5373k7395j8630
$$ plain form
765 -75503 -34843 10671 26291 56942 74081 32803 -7119 -22095 -54435 -72065 -33222 2915
777 2915 17949 53626 70520 33780 1305 -16966 -54838 -68035 -32378 -5015 15160 55849
789 55849 66366 32330 9055 -13719 -57625 -65579 -31986 -12412 11942 57912 64289 32683
801 32683 16556 -8871 -56163 -63455 -35559 -21034 7415 55098 61664 37417 24218 -6862
813 -6862 -53113 -57741 -37793 -27673 5169 50272 54000 38818 31632 -3806 -49066 -51857 -39330
826 -39330 -33300 2828 47852 50416 39284 33674 -1299 -44358 -49354 -41395 -34847 191 40858
839 40858 48951 44526 35370 -178 -37022 -46616 -47247 -36690 -205 32358 43226 49968 39704
852 39704 602 -30202 -40313 -50367 -41430 -1777 28127 37519 48676 42330 4463 -25585 -36367
$$ packed form
765g5503M0660M5514J5620L0651J7139m1278l9922j4976l2340j7630L8843L6137
777B915J5034L5677J6894l6740l2475j8271l7872j3197L5657K7363K0175M0689
789E5849J0517l4036k3275k2774m3906p954L3593J9574K4354M5970O377l1606
801C2683j6127k5427m7292p292K7896J4525K8449M7683O566k4247j3199l1080
813f862m6251m628J9948J0120L2842M5103L728j5182p186l5438m5260k791J2527
826c9330O030L6128M5024K564j1132n610l4973m3059m996P959O548L5038M0667
839D0858Q093m425r156l5548l6844r594o31J0557L6485L2563J0868O742j0264
852C9704l9102l0804j0111j0054Q937L9653K9904R392J1157o346l7867l0048j0782
$$ plain form
865 -36367 -47471 -42199 -7884 23130 37591 46939 39719 9801 -19302 -37889 -47495 -37263 -11151
878 -11151 14620 37313 48902 36747 12147 -10950 -36596 -50756 -36598 -12131 8590 34226
890 34226 50217 37296 13790 -6439 -32134 -48818 -38269 -16632 4853 31794 47536 37457
902 37457 18362 -2951 -30736 -45433 -36638 -20877 194 29774 44833 35823 21861 2115
914 2115 -28815 -44846 -35930 -21819 -3076 26277 43289 36601 23049 4292 -24055 -41994 -37945
927 -37945 -24664 -5011 22121 40213 38989 26381 5340 -20390 -37369 -38594 -28339 -7329
939 -7329 18511 35755 38467 29119 8616 -16474 -34105 -38352 -29580 -9497 14880 32398 37245
952 37245 29796 11362 -12600 -31815 -37690 -29636 -12044 10742 30931 37558 29322 13102 -8771
$$ packed form
865c6367j1104N272L4315L1014J4461R348p220k9918k9103j8587r606J0232K6112
878a1151K5771K2693J1589j2155k4600k3097k5646j4160J4158K4467K0721K5636
890C4226J5991j2921k3506k0229k5695j6684J0549K1637K1485K6941J5742j0079
902C7457j9095k1313k7785j4697Q795J5761K1071K9580J5059r010j3962j9746
914B115l0930j6031Q916J4111J8743K9353J7012o688j3552j8757k8347j7939M049
927c7945J3281J9653K7132J8092j224j2608k1041k5730j6979j225J0255K1010
939g329K5840J7244K712r348k0503k5090j7631m247Q772K0083K4377J7518M847
952C7245p449j8434k3962j9215n875Q054J7592K2786K0189O627q236j6220k1873
$$ plain form
965 -8771 -29953 -37159 -29162 -14781 5835 29067 37929 29373 15233 -4061 -27180 -37294 -29870
978 -29870 -16818 2577 26103 35780 29559 18374 -563 -24520 -34647 -29679 -19976 -14 23957
991 23957 32403 28834 21861 1469 -23813 -31163 -27590 -22767 -3385 22296 30608 28284 23682 3558
1005 3558 -21498 -28981 -28086 -24842 -4410 19894 27492 29100 25998 4662 -18019 -25206 -30463 -28440
1019 -28440 -4200 17814 22408 29413 29972 5538 -16477 -20675 -29378 -31113 -6170 15066 18784
1032 18784 28880 31789 7444 -13645 -18194 -28576 -30581 -7968 10377 17187 30060 30008 7028
1045 7028 -8019 -15164 -30936 -30178 -7163 5877 14413 31954 29282 6485 -3162 -12580 -33070
1058 -33070 -29939 -6545 1780 11546 32809 29444 7750 741 -11137 -33076 -27863 -8152 -3952
$$ packed form
965h771k1182p206P997J4381K0616K3232Q862q556j4140j9294k3119j0114P424
978b9870J3052J9395K3526R677o221j1185j8937k3957j0127M968R703J9962K3971
991B3957Q446l569o973k0392k5282p350L573M823J9382K5681Q312k324m602k0124
1005C558k5056p483Q95L244K0432K4304P598J608l102k1336k2681p187n257K023
1019b8440K4240K2014M594P005N59k4434k2015m198q703j735K4943K1236L718
1032A8784J0096K909k4345k1089m549j0382k005K2613J8345O810J2873n2k2980
1045G028j5047p145j5772P58K3015J3040Q536J7541k672k2797r647r418k0490
1058c3070L131K3394Q325R766K1263l365k1694p009j1878k1939N213J9711M200
$$ plain form
1071 -3952 9838 33314 27617 9281 5834 -9677 -32915 -25753 -9996 -8392 9332 32835 24087
1084 24087 9813 10053 -8127 -31527 -23191 -11535 -11524 8709 30246 21466 13343 13283 -9690 -30094
1098 -30094 -20270 -14434 -14091 10534 28648 18239 16351 15977 -10831 -27404 -16685 -17688 -18063 9957
1112 9957 26182 16881 19556 18209 -9643 -23839 -16712 -21887 -17915 10379 21007 15178 22987 17236
1126 17236 -10352 -16905 -13229 -25745 -17944 10977 14262 11621 28005 19266 -11551 -14177 -11406
1139 -11406 -28150 -18414 11797 13074 11308 27434 17159 -10418 -10728 -11408 -27299 -16315 7081
1152 7081 7398 14067 29761 15073 -5849 -4673 -16350 -32043 -12875 6281 2339 15956 32158
1165 32158 11033 -5506 955 -14345 -31578 -11155 3227 -3471 13749 31275 12725 -386
$$ packed form
1071c952J3790K3476n697j8336l447j5511k3238P162J5757J604J7724K3503q748
1084B4087j4274K40j8180k3400Q336J1656J1K0233K1537q780q123o0k2973k0404
1098c0094R824N836L43K4625J8114j0409j888l74k6808j6573J0719j003l75K8020
1112I957J6225r301K675j347k7852j4196P127n175L972K8294J0628n829P809n751
1126A7236k7588o553L676j2516P801K8921L285k641J6384q739l0817k626K771
1139a1406j6744R736L0211J277j766J6126j0275k7577l10o80j5891J0984K3396
1152G081L17O669J5694j4688k0922J176j1677j5693J9168J9156l942J3617J6202
1165C2158k1125j6539O461j5300j7233K0423J4382o698J7220J7526j8550j3111
$$ plain form
1177 -386 2874 -15947 -29965 -11324 -917 -1973 18134 27059 7706 2680 3449 -18291 -24494 -6103
1191 -6103 -6568 -6606 19414 25289 6710 9279 7291 -21641 -26596 -7295 -9296 -5924 22078 24549
1205 24549 6457 10012 5765 -19734 -20351 -7331 -13759 -6988 18026 17592 9623 18396 6278 -19666
1219 -19666 -15925 -9846 -19877 -4133 21418 13444 7670 19081 3158 -19854 -10009 -6422 -19935
1232 -19935 -4662 17107 9019 9358 21702 4228 -16371 -10239 -13240 -21359 -594 16127 8613
1245 8613 14405 20657 -1862 -13934 -4513 -14825 -22240 1070 10681 1827 16355 25074 261
1258 261 -9637 -2254 -17752 -25063 -31 9338 2880 16917 21242 -937 -6423 -1782 -16248 -17998
1272 -17998 667 1744 1111 18299 17104 -537 1261 -2027 -22113 -16764 2197 -1579 2917 23645
$$ packed form
1177c86L260j8821j4018J8641J0407j056K0107Q925j9353n026P69k1740o203J8391
1191f103m65l8K6020N875j8579K569j988k8932m955J9301k001L372K8002K471
1205B4549j8092L555m247k5499o17J3020o428O771K5014m34p969Q773j2118k5944
1219a9666L741O079j0031J5744K5551p974n774J1411j5923k3012R845L587j3513
1232a9935J5273K1769q088L39J2344j7474k0599O132l001q119K0765J6721p514
1245H613N792O252k2519j2072R421j0312p415K3310R611q854J4528Q719k4813
1258B61r898P383j5498p311K5032R369o458J4037M325k2179n486M641j4466j750
1272a7998J8665J077o33J7188j195j7641J798l288k0086N349J8961l776M496K0728
$$ plain form
1286 23645 15114 -4064 2378 -1815 -22775 -14280 2571 -4908 593 22370 15082 592 6712
1299 6712 -1966 -22388 -14770 -2699 -7627 3637 21438 11771 3214 8834 -4327 -19308 -8479
1312 -8479 -4037 -11089 3972 18109 6987 5549 12616 -4846 -18410 -6805 -6240 -12054 6493
1325 6493 18114 6046 6799 11092 -7387 -16224 -5271 -8310 -11417 7299 14413 5332 11272 12286
1339 12286 -7439 -13027 -5746 -13846 -12354 8194 11527 5112 14683 12464 -7858 -9402 -3705 -14810
1353 -14810 -12500 6799 7435 3339 15025 11977 -5865 -6056 -3881 -14991 -10427 5511 4910 5049
1367 5049 15065 8413 -5520 -3560 -5820 -15402 -7033 4833 1943 6766 16770 6678 -4215
1380 -4215 -698 -7555 -17885 -6714 3538 -71 7900 17870 6935 -1995 928 -7890 -16921 -6613
$$ packed form
1286B3645q531j9178O442m193k0960Q495J6851p479N501K1777p288j4490O120
1299F712q678k0422P618J2071m928J1264J7801r667q557N620j3161j4981J0829
1312h479M442p052J5061J4137j1122j438P067j7462j3564J1605N65n814J8547
1325F493J1621j2068P53M293j8479q837J0953l039l107J8716P114r081N940J014
1339A2286j9725n588P281q100J492K0548L333o415R571k219k0322j544N697j1105
1353a4810K310J9299O36m096J1686l048j7842j91K175j1110M564J5938o01J39
1367E049J0016o652j3933J960k260r582Q369J1866k890M823J0004j0092j0893
1380d215L517o857j0330J1171J0252l609P971R970j0935q930K923q818r031J0308
$$ plain form
1394 -6613 -57 -1950 8000 15586 6269 1840 2957 -8575 -14690 -4910 -2898 -3804 8911 13861 3851
1409 3851 3056 3999 -9032 -13660 -3698 -3101 -3612 8827 13026 4417 3482 2750 -8608 -12391 -5888 -4883
1425 -4883 -1878 8764 10962 6763 6903 1319 -9148 -9279 -7141 -8977 -1720 9223 8140 6788 10393
1440 10393 2632 -8846 -7368 -5979 -10621 -3495 8087 6942 5736 9856 3465 -6827 -6447 -6180
1454 -6180 -9004 -2743 5676 6037 7095 8819 1679 -5338 -5340 -7921 -9247 -1028 5191 4811 8383 9850
1470 9850 1396 -5005 -4967 -8579 -10167 -2261 4212 5011 8736 9948 3261 -2856 -4916 -8690 -9441 -3595
1486 -3595 1306 4594 8984 8715 3429 -222 -3738 -8857 -8367 -3130 60 3261 8384 8172 3103 -197
1502 -197 -3310 -8161 -7995 -3095 523 3550 7701 8008 3642 -408 -3949 -7557 -8071 -4486 -256 4142
$$ packed form
1394f613O556j893R950P586r317m429J117j1532o115R780K012r06J2715M950j0010
1409C851p95R43j3031m628R962N97n11J2439M199q609r35p32j1358l783O503J005
1425d883L005J0642K198m199J40n584j0467j31K138j836P257J0943j083j352L605
1440A0393p761j1478J478J389m642P126J1582j145j206M120o391j0292L80K67
1454f180k824O261Q419L61J058J724p140p017kk581j326Q219O219l80L572J467
1470I850q454o401L8l612j588P906O473P99L725J212o687o117k060l774p51N846
1486c595M901L288M390k69n286l651l516n119M90N237L190L201N123k12n069l300
1502a97l113m851J66M900L618L027M151L07m366m050l541l608n14L585M230M398
$$ plain form
1518 4142 7745 8290 4999 414 -3804 -7172 -8451 -5723 -1113 3224 6597 8384 6240 1484 -2611
1533 -2611 -6008 -8314 -6295 -1434 2136 5092 8007 6319 1400 -1707 -4587 -7813 -6206 -1242 1565
1548 1565 4365 7848 6274 1130 -1670 -4185 -7860 -6174 -1412 1224 4588 8180 6082 1928 -539
1563 -539 -4815 -8475 -6011 -2168 -391 4573 8348 5721 2755 1447 -4167 -8611 -5517 -2917 -1976
1578 -1976 3846 8269 5051 3060 2412 -3553 -7472 -4545 -3495 -2799 3813 7168 3887 3729 2803 -4219
1594 -4219 -6674 -3361 -3982 -3115 4622 6505 2883 4454 3385 -4807 -6580 -2976 -4970 -3380 4907
1609 4907 5944 3115 5742 3297 -4910 -5092 -3003 -6583 -3465 4927 4221 2925 7339 3344 -4910
1624 -4910 -3254 -2506 -7685 -3306 4737 2560 2294 7735 3216 -4251 -2128 -2856 -7685 -2266 4030 1174
$$ packed form
1518D142L603N45l291m585m218l368j279K728M610M337L373J787k144m756m095
1533b611l397k306K019M861L570K956K915j688m919l107k880l226J607M964K807
1548A565K800L483j574n144k800k515l675J686M762K636L364L592k098m154k467
1563e39m276l660K464L843J777M964L775k627k966j308n614m444L094K600R41
1578a976N822M423l218j991o48n965l919K927J050O96O612L355l281j58r26p022
1594d219k455L313o21Q67P737J883l622J571j069q192j773L604j994J590Q287
1609D907J037k829K627k445q207j82K089l580L118Q392p06j296M414l995q254
1624d910J656P48n179M379Q043k177k66N441m519p467K123p28m829N419O296k856
$$ plain form
1640 1174 3123 7822 1578 -3622 -179 -3635 -8548 -894 3371 -464 4264 8929 618 -3539 993
1655 993 -4228 -8908 -658 2833 -1246 4636 8781 510 -1796 1693 -4910 -8415 -414 557 -1810
1670 -1810 5647 7687 -75 601 2064 -6312 -6870 652 -1483 -2326 6606 6205 -1100 2034 2511 -6806
1686 -6806 -5325 1162 -3298 -2510 7409 5024 -1066 3875 1894 -7767 -4423 1192 -4337 -1526 7724
1701 7724 3161 -1136 5319 1648 -7484 -2639 406 -5994 -1232 7299 2226 507 6511 440 -7167
1716 -7167 -1332 -912 -6690 438 6593 -69 1247 7068 -836 -5610 1156 -2134 -7855 1167 5196
1731 5196 -1617 2919 8041 -1855 -5313 1529 -3330 -7396 2938 4642 -2209 3407 6817 -2967 -3077
1746 -3077 2758 -4357 -6975 2526 1801 -2071 6225 6781 -3289 -1551 1698 -6700 -5815 4023 610
$$ packed form
1640A174J949M699o244n200L443l456m913P654M265l835M728M665q311m157M532
1655I93n221m680Q250L491m079N882M145q271k306L489o603l505Q001R71k367
1670a810P457K040p762O76J463q376n58P522k135q43Q932m01p305L134M77r317
1686f806J481O487m460P88R919k385o090M941j981r661L344N615n529K811R250
1701G724m563m297O455l671r132M845L045o400M762Q531n073j719O004o071p607
1716g167N835M20n778P128O155o662J316N821p904m774O766l290n721R022M029
1731E196o813M536N122r896l458O842m859m066J0334J704o851N616L410r784j10
1746c077N835p115k618R501p25l872Q296N56j0070J738L249q398Q85R838l413
$$ plain form
1761 610 -2240 6586 4892 -3819 1115 2885 -6977 -4848 3026 -2202 -2303 7722 4639 -2728 2284
1776 2284 1080 -7978 -3132 3160 -2747 -601 7530 1444 -3001 4100 667 -7317 -886 1708 -5502
1791 -5502 27 8129 1064 -802 5579 -1458 -8606 -402 997 -4898 2029 7231 -1185 -618 5931
1806 5931 -1712 -6131 1351 -1154 -6906 2157 6117 -967 2402 6382 -3675 -6067 1638 -2348 -5689
1821 -5689 4050 4835 -2401 2389 5330 -3781 -3316 2560 -3880 -5636 3637 2716 -1830 5182 5126 -4467
1837 -4467 -2572 1214 -5772 -3844 5353 1781 -1935 5614 3198 -4827 45 1990 -6276 -3613 3878
1852 3878 -929 -821 7550 3392 -4065 576 -176 -7221 -1779 4188 -1320 12 6631 876 -3132
1867 -3132 2754 -206 -6784 -785 2292 -3242 1091 7176 517 -1919 3159 -2165 -6915 298 1714
$$ packed form
1761F10k850Q826j694q711M934J770r862K129P874n228j01J0025l083p367N012
1776B284j204r058M846O292n907K146Q131o086m445P101l433p984O431K594p210
1791e502N529Q102p065j866O381p037p148Q204J399n895O927N202q416N67O549
1806E931p643m419P482k505n752R063L960p084L369L980j0057k392P705l986l341
1821e689R739P85p236M790K941r111M65N876o440j756R273r21m546P012n6r593
1837d467J895L786o986J928R197l572l716P549k416q025M872J945q266K663P491
1852C878m807J08Q371m158p457M641p52p045N442N967n508J332O619n755m008
1867c132N886k960o578N999L077n534M333O085o659k436N078n324m750P213J416
$$ plain form
1882 1714 -3035 2651 6237 -1052 -1087 3326 -2487 -5621 1146 -286 -3873 3170 5559 -794 1260
1897 1260 3542 -4245 -5171 980 -1433 -2890 4532 4119 -1623 2171 3144 -4180 -3052 1561 -3313 -3252
1913 -3252 4588 2809 -1030 3928 2370 -5198 -2149 1458 -4010 -2232 5284 1663 -1247 4136 1922
1928 1922 -4713 -1319 959 -4628 -1714 4552 810 -354 4778 1381 -3980 -542 -552 -4718 -462
1943 -462 3580 -145 936 4916 -106 -3402 984 -940 -4911 288 2725 -1427 1584 5233 -494
1958 -494 -2740 1309 -1841 -4731 730 2245 -995 1919 4005 -978 -1309 1234 -2753 -3843 1132
1973 1132 816 -1082 3223 3543 -1424 -188 1223 -3593 -3276 1709 -280 -1494 3814 3552 -1548 62
1989 62 1271 -3443 -2918 1061 -523 -1016 3251 2543 -941 917 804 -3200 -2283 242 -1168 190 3235
$$ packed form
1882A714m749N686L586p289l5M413n813l134O767j432l587P043K389o353K054
1897A260K282p787r26O151k413j457P422m13n742L794R73p324J128M613m874O1
1913c252P840j779l839M958j558p568L049L607n468J778P516l621k910N383k214
1928A922o635L394K278n587K914O266l742j164N132l397n361L438j0m166M256
1943d62M042l725J081L980n022l296M386j924l971N199K437m152L011L649n727
1958d94k246M049l150k890N461J515l240K914K086m983l31K543l987j090M975
1973A132l16j898M305L20m967J236J411m816L17M985j989j214N308k62n100J610
1989F2J209m714N25L979j584m93M267p08l484J858j13m004R17K525j410J358L045
$$ plain form
2006 3235 1310 -277 1702 -289 -3449 -952 105 -2149 177 3266 1001 303 2244 -532 -3308
2021 -3308 -662 -115 -2224 399 2887 804 700 2098 -526 -2325 -728 -1233 -2110 1161 2271 290
2037 290 1342 2094 -842 -1739 -227 -1859 -2169 1127 1640 25 1650 2335 -1002 -1880 -199 -1343 -1867
2054 -1867 464 1156 351 1700 1819 -401 -945 -690 -1573 -1415 200 702 925 1693 876 -262 132 -494
2072 -494 -2222 -1218 398 1 639 1917 1291 -314 -153 -621 -1864 -1091 202 -82 206 1558 1490 145
2090 145 -399 -871 -1281 -887 -270 -43 853 1408 776 138 96 -381 -1275 -1394 -444 262 731 1107 1041 414 58
2111 58 -354 -1074 -1247 -420 384 171 637 1619 976 -357 -623 -705 -1112 -575 216 215 615 1492 834 -159 -45
2132 -45 -642 -1482 -894 127 263 891 1453 380 -142 337 -643 -1705 -630 -132 -348 963 1750 626
$$ packed form
2006C235j925j587J979j991l160K497J057k254K326L089k265o98J941k776k776
2021c308K646N47k109K623K488k083j04J398k624j799J597n05q77L271J110j981
2037B90J052P52k936q97J512j632l10L296N13j615J625O85l337q78J681j144n24
2054a867K331O92q05J349J19k220n44K55q83J58J615N02K23P68q17j138L94o26
2072d94j728J004J616l97O38J278o26j605J61m68j243P73J293k84K88J352o8j345
2090A45n44m72m10L94O17K27Q96N55o32o38m2m77q94j19R50P06M69L76o6o27l56
2111E8m12p20j73Q27Q04k13M66R82o43j333k66q2m07N37P91jM00Q77o58r93J14
2132d5n97q40N88J021J36O28N62j073n22M79r80j062J075M98k16J311P87j124
$$ plain form
2150 626 357 522 -1180 -1632 -37 -191 -736 841 1584 298 636 937 -1202 -1655 1 -687 -1118 1304
2168 1304 1708 -73 552 1161 -1024 -1206 -150 -1123 -984 1484 1210 -55 1392 893 -1539 -938 113
2185 113 -1486 -853 1481 373 -119 2357 1062 -1767 -572 218 -2007 -979 1671 220 -318 2056
2201 2056 790 -1398 335 71 -2320 -714 1338 -232 330 2173 83 -1175 746 -401 -2466
2216 -2466 147 1063 -1177 581 2776 -227 -1093 1155 -803 -2568 552 1049 -1377 801 2410 -603
2232 -603 -717 1434 -999 -2529 630 371 -1169 1548 2082 -975 33 1569 -1670 -1897 1204 -556
2248 -556 -1494 2190 1835 -1345 572 1414 -2401 -1597 1723 -687 -1434 2225 1332 -1186 1406 1379 -2651
2265 -2651 -1248 1004 -1568 -882 2857 683 -1044 1756 630 -2589 -187 895 -2520 -561 2816
$$ packed form
2150F26k69J65j702m52J595j54n45J577P43j286L38L01k139m53J656o88m31K422
2168A304M04j781O25O09k185j82J056r73J39K468k74j265J447m99k432O01J051
2185A13j599O33K334j108m92K476j295k829J195P90k225J028K650j451n38K374
2201B056j266k188J733k64k391J606K052j570N62J843k090j258J921j147k065
2216b466K613R16k240J758K195l003q66K248j958j765L120M97k426K178J609l013
2232f03j14K151k433j530L159k59j540K717N34l057J008J536l239k27L101j760
2248e56r38L684l55l180J917Q42l815Q04L320k410p47L659q93k518K592k7m030
2265b651J403K252k572O86L739k174j727K800j126l219K402J082l415J959L377
$$ plain form
2280 2816 -14 -732 2741 238 -2739 265 600 -2688 -73 2739 -690 -397 2872 -206 -2605 735
2296 735 210 -2792 657 2227 -1124 296 2721 -633 -1679 1395 -915 -3134 928 1820 -1218 1226
2312 1226 2701 -1732 -1489 1724 -1199 -2625 1748 697 -2087 1617 2874 -1397 -465 1576 -2183
2327 -2183 -2493 1775 365 -1314 2305 1677 -2240 241 1452 -2315 -1294 1942 -776 -1462 2675 1090
2343 1090 -1907 1223 1283 -2999 -1046 1870 -1431 -706 3393 646 -1881 1383 402 -3163 22 1905
2359 1905 -1747 -589 2585 -350 -948 2562 136 -3006 372 535 -2378 747 3215 -697 -852 2139
2375 2139 -978 -2511 1632 707 -2552 785 2219 -1484 -28 2711 -992 -2309 1227 -499 -2474
2390 -2474 1823 2128 -1308 850 2002 -2064 -1734 1743 -961 -1962 2247 1003 -1905 1436 2204 -2107
$$ packed form
2280B816k830p18L473k503k977L004L35l288K615K812l429K93L269l078k399L340
2296G35n25l002L449J570l351J420K425l354j046L074k310k219M062Q92l038K444
2312A226J475m433K43L213k923j426M373j051k784L704J257m271R32K041l759
2327b183l10M268j410j679L619o28l917K481J211l767J021L236k718o86M137j585
2343A090k997L130O0m282J953K916l301P25M099k747k527L264r81l565L185J883
2359A905l652J158L174k935n98L510k426l142L378J63k913L125K468l912j55K991
2375B139l117j533M143r25l259L337J434l703J456K739l703j317L536j726j975
2390b474M297L05l436K158J152m066L30L477k704j001M209j244k908L341P68m311
$$ plain form
2406 -2107 -547 1828 -2110 -2268 2234 591 -1323 2200 1470 -2691 -252 1747 -1799 -1017 2256 -518
2422 -518 -1629 2080 1000 -1696 799 721 -2777 -655 2000 -571 -359 2762 -56 -2122 1140 546
2438 546 -2626 307 1798 -1699 -244 2885 -343 -1548 1876 29 -2790 436 1101 -1820 439
2453 439 2725 -550 -814 1739 -771 -2156 1287 746 -1831 738 1679 -1435 -98 2085 -1000 -1633
2469 -1633 1325 -322 -1868 1724 1782 -1411 194 1386 -1878 -1269 1918 -622 -1705 1727 990 -1421
2485 -1421 1135 1614 -1989 -963 1255 -1290 -1249 2060 397 -1267 1454 1115 -1829 -250 1015 -1546
2501 -1546 -650 1753 -256 -1053 1683 439 -1636 700 872 -1938 -226 1789 -733 -561 2094 -130
2517 -130 -1973 817 519 -1785 328 1528 -901 -375 1765 -234 -1201 981 -317 -2040 467 1055
$$ packed form
2406b107J560K375l938j58M502j643j914L523p30m161K439J999l546P82L273k774
2422e18j111L709j080k696K495p8l498K122K655k571K12L121k818k066L262n94
2438E46l172K933J491l497J455L129l228j205L424j847k819L226O65k921K259
2453D39K286l275k64K553k510j385L443n41k577K569R41l114J337K183l085o33
2469a633K958j647j546L592N8l193J605J192l264O09L187k540j083L432p37k411
2485a421K556M79l603J026K218k545M1L309j663j664K721l39k944J579J265k561
2501a546Q96K403k009p97K736j244k075K336J72k810J712K015k522J72K655k224
2517a30j843K790k98k304K113J200k429N26K140j999r67K182j298j723K507N88
$$ plain form
2533 1055 -994 606 1860 -772 -777 1154 -543 -1657 870 319 -1474 912 1769 -871 -331 1251
2549 1251 -722 -1191 913 25 -1112 923 1034 -849 250 1223 -1200 -1012 963 -370 -670 1357
2565 1357 532 -1151 641 823 -1448 -732 830 -776 -653 1525 668 -655 888 554 -1393 -275
2581 -275 772 -860 -626 1071 219 -383 1126 436 -1105 -6 151 -967 7 988 -256 -314 1162
2598 1162 91 -780 370 2 -1120 142 938 -301 37 936 -391 -822 454 -96 -934 228 625
2615 625 -316 466 1003 -245 -580 250 -478 -779 361 319 -334 414 693 -231 -56 421 -643 -722 399
2634 399 204 -206 586 598 -493 -100 234 -581 -448 336 25 -209 629 521 -235 -110 -133 -585 -155 127
2654 127 -39 80 459 163 -13 234 -240 -727 -376 37 -141 381 693 154 71 372 -161 -460 -230 -146 -280
$$ packed form
2533A055k049J600J254k632nJ931j697j114K527n51j793K386Q57k640N40J582
2549A251j973m69K104q88j137K035J11j883J099R73k423J88J975j333l00K027
2565A357q25j683J792J82k271P16J562j606J23K178q57j323J543l34j947J118
2581b75J047j632K34J697q52o02J509o90j541J099J57j118R74R81j244n8J476
2598A162j071q71J150l68j122J262P96j239L38Q99j327m31J276n50q38J162L97
2615F25r41P82N37j248l35Q30p28l01J140m2o53P48K79r24J75M77j064p9J121
2634C99j95m10P92J2j091L93L34q15J33P84l11k34Q38j08p56J25k3m52M30K82
2654A27j66J19L79k96j76K47m74m87L51M13j78N22L12n39q3L01n33k99K30Q4j34
$$ plain form
2675 -280 62 683 383 183 130 -123 -354 -256 -125 -188 -48 238 348 269 111 -17 -327 -472 -238 -24 206
2696 206 233 384 69 106 -103 -110 -431 -372 -132 6 234 532 276 -79 68 -322 -479 -85 29 -322 160 526
2718 526 231 227 343 -196 -640 -16 -87 -207 233 477 -145 -43 384 -171 -375 65 -141 -341 369 524 -159
2739 -159 80 262 -486 -406 308 -183 -418 438 301 -308 452 471 -579 -482 255 -348 -396 759 265 -346 407
2760 407 461 -613 -103 175 -704 -387 772 124 -187 632 130 -731 203 396 -763 -167 775 -223 -237 1037
2780 1037 49 -932 131 149 -893 6 794 -382 -144 926 47 -607 403 -50 -1049 79 540 -450
2798 -450 317 957 -406 -479 729 -336 -1001 518 399 -854 456 1118 -592 -265 780 -609 -1024
2815 -1024 693 156 -968 609 953 -640 20 904 -861 -875 688 -191 -744 986 528 -817 296
$$ packed form
2675b80L42O21l00k00n3k53k31R8J31o3J40K86J10p9j58j28l10j45K34K14K30
2696B06K7J51l15L7k09pl21N9K40J38K28K98k56l55J47l90j57L94J14l51M82L66
2718E26k95mJ16n39m44O24p1j20M40K44o22J02M27n55k04M40k06k00P10J55o83
2739a59K39J82p48Q0P14m91k35Q56j37o09P60J9j050R7P37o03m8J155m94o11P53
2760D07N4j074N10K78q79L17J159o48l11Q19n02q61R34J93j159N96R42r98j4J274
2780A037r88r81J063J8j042Q99P88j176K38J070q79o54J010m53r99J128M61r90
2798d50P67O40j363p3J208j065o65J519j19j253J310O62j710L27J045j389m15
2815a024J717n37j124J577L44j593O60Q84j765j4J563q79n53J730m58j345J113
$$ plain form
2832 296 605 -973 -403 787 -664 -764 1305 352 -807 865 502 -1228 -156 907 -711 -643 1237
2849 1237 -23 -811 962 418 -1215 126 642 -1067 -141 1267 -410 -443 1100 -5 -1079 643
2865 643 357 -1400 266 1237 -816 -198 1346 -501 -1140 965 331 -1424 265 889 -1035 52 1498
2882 1498 -541 -948 857 -103 -1164 874 737 -1129 293 989 -943 -313 1158 -700 -1210 860
2898 860 204 -1110 916 1025 -1208 -215 896 -1040 -868 1295 129 -1063 986 732 -1296 151
2914 151 999 -1123 -615 1085 -526 -842 1287 438 -976 746 510 -1531 -254 1028 -726 -321 1526
2931 1526 -230 -1071 937 401 -1384 247 785 -1387 -370 1487 -345 -617 1237 -255 -1511 562
2947 562 643 -1244 306 1220 -975 -543 1348 -264 -1119 883 164 -1538 420 1170 -948 107 1396
$$ packed form
2832B96L09j578N70J190j451j00K069r53j159J672l63j730J072J063j618O8J880
2849A237j260p88J773n44j633J341N16j709R26J408j677l3J543j105j074J722
2865F43k86j757J666R71k053O18J544j847o39K105o34j755J689O24j924J087J446
2882A498k039m07J805r60j061K038j37j866J422O96j932O30J471j858n10K070
2898H60o56j314K026J09k233R93J111j936J72K163j166j192K049k54k028J447
2914A51Q48k122N08J700j611l16K129q49j414J722k36k041J277J282j754M05J847
2931A526j756q41K008n36j785J631N38k172J017J857j832k72J854j492j256K073
2947E62Q1j887J550R14k195M32J891j612q55K002p19j702J958P50k118J055J289
$$ plain form
2964 1396 -878 -1077 954 -67 -1039 918 831 -1103 274 1016 -1056 -507 1181 -456 -954 903 219
2981 219 -953 841 1087 -1131 -263 885 -1010 -800 1494 190 -1041 985 476 -1322 414 1096
2997 1096 -1139 -481 1169 -502 -777 1476 417 -1192 357 478 -1306 -22 1154 -578 -547 1330
3013 1330 -238 -1102 833 301 -1252 345 795 -1072 -105 1529 -399 -751 1199 -39 -1398 460
3029 460 763 -1011 261 1172 -739 -509 1158 -279 -915 884 250 -1202 287 984 -815 82 1109
3046 1109 -889 -897 933 -25 -913 859 674 -1118 61 991 -923 -387 1142 -518 -861 967 402
3063 402 -1054 553 774 -1004 -274 871 -682 -569 1107 -28 -955 801 547 -1184 28 821 -782
3080 -782 -376 1021 -398 -619 1025 323 -1056 375 473 -973 10 983 -353 -379 799 -116 -872 777
$$ packed form
2964A396k274j99K031j021r72J957q7j934J377P42k072N49J688j637m98J857o84
2981B19j172J794K46k218Q68J148j895K10K294j304j231K026n09j798J736O82
2997A096k235O58J650j671k75K253j059j609J549J21j784J284J176j732L1J877
3013A330j568q64J935n32j553J597M50j867R67J634j928l52J950j238j359J858
3029D60L03j774J272R11j911K30J667j437o36J799o34j452J489O97j799Q97J027
3046A109j998qJ830r58q88J772j85j792J179R30j914N36J529j660l43J828n65
3063D02j456J607K21j778P30J145j553J13J676j135r27J756k54j731J212P93j603
3080g82M06J397j419k21J644p02j379J431R8j446R83R73j336k6J178r15p56J649
$$ plain form
3098 777 233 -986 100 799 -700 -121 997 -396 -601 642 -56 -1010 520 568 -797 75 822 -615
3116 -615 -428 779 -304 -915 641 245 -728 237 687 -578 -190 684 -371 -592 630 -36 -506 669
3134 669 430 -614 119 596 -571 -283 703 -277 -624 726 265 -598 490 454 -744 -114 676 -344
3152 -344 -364 761 50 -566 399 297 -815 -36 382 -533 -182 688 41 -213 519 -91 -553 181 234 -816
3172 -816 25 499 -382 -134 716 -53 -493 264 218 -440 218 512 -320 -4 521 -144 -384 172 25 -412
3192 -412 122 263 -340 173 311 -328 -141 380 -245 -261 251 84 -266 263 362 -260 -60 250 -343 -397 273
3213 273 -22 -271 338 412 -152 0 237 -164 -273 196 -81 -216 237 88 -266 103 268 -220 -44 20 -117
3234 -117 -85 311 10 -196 139 -14 -224 -21 138 -98 77 171 79 -35 70 -108 -172 -97 -47 -171 121 256
$$ packed form
3098G77n44j219J086O99j499N79J118j393k05J243o98r54J530M8j365Q72P47j437
3116f15J87J207j083o11J556l96r73R65M50j265L88Q74j055k21J222o66m70J175
3134F69k39j044P33M77j167K88R86r80l47J350m61q63J088l6j198O30P90j020
3152c44k0J125p11o16R65j02j112P79M18r15L51Q70o47k54P32o10m62P34N3j050
3172h16Q41M74q81K48Q50p69m40P57m6o58O58K94q32L16N25o65k40N56j47m37
3192d12N34J41o03N13J38o39J87N21o25j6N12j67l50N29R9o22K00L10n93n4O70
3213B73k95k49O09P4n64J52K37m01j09M69k77j35M53j49l54L69J65m88J76O4j37
3234a17L2L96l01k06L35j53k10K03J59k36J75R4r2j14J05j78o4P5N0j24K92J35
$$ plain form
3256 256 51 92 38 -54 -39 -4 -69 -112 30 109 39 58 99 -31 -77 -127 5 -176 42 91 132 14 -22 -104 -72 -237
3282 -237 32 143 92 -25 319 -70 -151 65 32 -202 -34 179 -54 86 160 149 -148 88 -90 -207 -24 95
3304 95 -131 81 281 -53 14 225 -240 -249 48 -93 -273 159 207 -105 -7 338 -243 -228 319 -86 -204 245
3326 245 136 -174 69 220 -232 -171 185 -207 -204 288 -3 -210 239 124 -374 -115 167 -330 -258 459 11
3347 11 -329 556 201 -464 53 167 -453 -69 435 -114 -232 369 43 -467 203 196 -406 -39 243 -263 -75
3368 -75 462 -89 -433 294 -38 -500 170 393 -399 180 566 -301 -367 394 -16 -580 313 288 -446 189 512
3389 512 -367 -75 496 -250 -485 412 29 -544 334 432 -474 51 468 -400 -340 566 -6 -616 493 265
3409 265 -655 148 524 -546 -362 663 -330 -349 757 242 -563 306 331 -593 -118 591 -394 -346 718 -47
$$ packed form
3256B56k05M1n4r2J5L5o5m3J42P9p0J9M1j30m6n0J32j81K18M9M1j18l6q2L2j65
3282b37K69J11n1j17L44l89q1K16l3k34J68K13k33J40P4j1k97K36j78j17J83J19
3304I5k26K12K00l34O7K11m65rK97j41j80M32M8l12R8L45n81J5N47m05j18M49
3326B45j09l10K43J51m52O1L56l92LM92k91k07M49j15m98K59K82m97P2P17m48
3347A1l40Q85l55o65N17J14o20L84N04n49j18O01l26n10O70po02L67K82n06J88
3368g5N37n51l44P27l32m62O70K23p92N79L86q67o6P61m10n64Q93k5p34O35L23
3389E12q79K92N71p46k35Q97l83n73Q78R8r06N25M17q68O0R06n72o10J109k28
3409B65r20Q03L76j070J84J025r93j9J106n15q05Q69K5r24M75P09r85M8J064p65
$$ plain form
3429 -47 -402 561 74 -742 160 372 -681 13 694 -224 -409 780 -14 -806 360 301 -824 128 700
3448 700 -496 -260 580 -119 -569 509 67 -730 259 520 -516 0 617 -412 -574 530 -60 -627
3466 -627 562 253 -719 305 696 -638 -222 750 -371 -617 657 150 -756 421 703 -874 -199 590
3484 590 -583 -557 869 -32 -683 548 262 -804 199 581 -655 -169 729 -326 -458 862 57 -819
3502 -819 391 297 -860 128 815 -412 -386 752 -167 -832 636 320 -883 75 662 -700 -99 941
3520 941 -285 -565 608 -181 -877 463 460 -766 230 668 -640 -407 921 -223 -796 765 188 -924
3538 -924 395 851 -639 -87 731 -607 -736 809 204 -725 630 419 -841 81 633 -525 -196 724
3556 724 -304 -754 738 214 -834 552 693 -962 -258 767 -412 -452 918 8 -766 514 404
$$ packed form
3429d7l55R63m87q16R02K12j053O94O81r18j85J189p94p92J166n9j125R52N72
3448G00j196K36Q40o99m50J078m42p97R89K61j036N16O17j029j62J104n90n67
3466f27J189l09r72J024L91j334M16R72j121k46J274n07r06J177K82j577O75P89
3484E90j173K6J426r01o51J231k86j066J003L82j236M86Q98j055j32J320q05q76
3502h19J210r4j157R88O87j227K6J138r19o65J468l16j203R58N87j362O01J040
3520I41j226k80J173p89o96J340lj226R96M38j308K33J328j144n73J561n77j112
3538i24J319M56j490N52Q18j338j29J545o05r29J355k11j260R22N52j158L29R20
3556G24j028m50J492n24j048J386J41j655P04J025j179m0J370r10p74J280j10
$$ plain form
3573 404 -764 110 768 -748 -394 698 -202 -441 835 139 -794 199 488 -779 120 903 -617 -321
3591 -321 912 -58 -689 638 420 -859 167 679 -620 -103 820 -275 -450 647 62 -694 506
3608 506 637 -666 49 569 -530 -268 916 -174 -488 444 62 -885 436 714 -701 -52 607 -543
3626 -543 -587 707 -2 -642 469 320 -827 135 654 -492 -264 699 -278 -578 721 133 -585 416
3644 416 515 -777 -30 562 -355 -324 721 -60 -614 574 228 -562 188 637 -540 -364 754 -172 -390
3663 -390 610 77 -841 203 380 -693 41 662 -383 -345 610 -48 -502 501 104 -649 78 534 -420
3682 -420 -29 858 -270 -395 571 -18 -664 273 372 -454 154 582 -342 -230 705 -210 -653 413 93 -570
3702 -570 305 492 -493 -140 426 -318 -335 470 -9 -530 316 265 -550 41 391 -450 -247 482 -174 -321 374
$$ packed form
3573D04j168Q74O58j516L54J092r00k39J276o96r33R93K89j267Q99P83j520K96
3591c21J233r70o31J327k18j279J026N12j299N17R23j095j75J097n85p56J200
3608E06J31j303P15N20j099K62J184j090l14R32l82r47J321K78j415O49O59j150
3626e43m4J294p09o40J111j49j147R62N19j146K28R63r77l00J299n88p18J001
3644D16R9j292P47N92r17L1J045p81n54J188l46p90P50M49j177J76J118r26k18
3663c90J000n33r18J044J77j073P34O21j045L8R55o58m54J003l97p53P27M56r54
3682d20L91Q87j128j25R66n89o46R37R9q26O08M28r24J12R35r15m43J066l20o63
3702e70Q75J87r85L53N66p44j7Q05m79n21Q46n1q15N91L50q41K03P29o56j47O95
$$ plain form
3723 374 176 -335 233 305 -493 -82 437 -223 -284 451 20 -352 344 220 -540 54 407 -374 -165 529 -156
3744 -156 -392 331 30 -440 124 250 -352 -38 482 -289 -297 347 -56 -342 296 26 -316 72 293 -285 -75
3765 -75 326 -247 -271 241 37 -412 250 150 -331 176 394 -148 -75 217 -138 -291 263 253 -224 83 228
3786 228 -170 -105 191 -8 -97 269 61 -105 62 133 -310 -35 161 -213 -109 157 -16 -78 226 -51 -147 123
3808 123 92 -206 71 238 -41 13 206 8 -38 28 105 -190 18 93 -41 -108 105 -106 -222 41 -82 -94 39
3831 39 58 -122 -1 45 -100 16 48 -117 20 91 86 -14 130 76 7 -23 29 -51 -168 31 3 -87 -1 63 129 -14
3857 -14 -72 28 -8 -82 -75 44 -36 50 250 15 -36 35 -18 -106 79 107 -80 -22 172 -108 -36 271 -73 -44 136
3882 136 78 -215 132 49 -5 -52 18 -183 -182 82 4 -37 125 206 -105 28 156 -99 -178 112 -53 -119 212 113
$$ packed form
3723C74j98n11N68P2p98M11N19o60o1P35m31l72O96j24p60N94L53p81K09O94o85
3744a56k36P23l01m70N64J26o02L14N20p71qO44m03k86O38k70l42L88K21n78K10
3765g5M01n73k4N12k04m49O62j00m81N07K18n42P3K92l55j53N54j0m77L07J45
3786B28l98O5K96j99q9L66k08j66J67P1m43K75J96l74J04K66j73o2L04k77r6K70
3808A23l1k98K77J67k79N4J93j98m6O6P7k95K08P5j34o7K13k11j16K63j23j2J33
3831C9J9j80J21M6j45J16L2j65J37P1nj00J44n4o9l0N2q0j17J99k8r0Q6O4O6j43
3857a4n8J00l6p4PJ19q0Q6K00k35n1P1n3q8J85K8j87N8J94k80P2L07l44K9J80
3882A36n8k93L47q3n4m7P0k01JK64p8m1J62Q1l11J33J28k55p9K90j65o6L31r9
$$ plain form
3906 113 -131 -50 160 -148 47 216 -73 -237 197 21 -135 214 115 -375 -11 208 -240 -134 281 -85 -214
3927 -214 175 67 -244 86 201 -250 43 355 -169 -271 171 -17 -384 214 61 -358 134 416 -179 -185 383
3948 383 -165 -396 355 104 -459 324 262 -441 60 391 -214 -223 256 -129 -332 254 208 -335 87 288 -374
3969 -374 -107 367 -207 -299 432 64 -359 295 173 -380 34 334 -384 -95 522 -126 -260 470 198 -514
3989 -514 196 261 -455 -123 572 -229 -373 525 -31 -539 272 173 -582 66 456 -309 -35 487 -74 -311 481
4010 481 90 -661 282 248 -388 78 536 -346 -257 501 -63 -600 447 314 -609 171 448 -319 10 600
4030 600 -214 -443 471 -57 -490 221 425 -390 0 541 -537 -399 648 -52 -551 497 257 -560 265
4049 265 494 -490 -96 494 -464 -399 520 5 -506 453 362 -583 141 517 -374 -200 586 -175 -548 631
$$ packed form
3906A13k44Q1K10l08J95J69k89j64M34j76j56L49r9m90L64K19m48J06M15l66j29
3927b14L89j08l11L30J15m51K93L12n24j02M42j88l67N98j53m19M92K82n95oN68
3948C83n48k31P51k51n63P83o2p03N01L31o05rM79l85k03N86m6n43M22K01o62
3969c74K67M74n74r2P31l68m23O54j22n53M14L00p18K89O17o48j34P30k72p12
3989e14P10O5p16L32O95q01j44Q98n56n08Q11r9p55O48L90p65K74N22n61k37P92
4010D81l91p51R43l4o36M66M58q82Q9P58n64n37J047j33r23P80K77p67L29N90
4030F00q14k29R14n28m33P11K04q15L90N41j078J38J047p00m99J048k40q17Q25
4049B65K29r84L94N90r58O5R19n15n11R59r1r45P24L76q91J74P86p61l73J179
$$ plain form
4069 631 241 -550 326 438 -688 -36 645 -178 -329 575 -70 -659 407 410 -505 98 490 -539 -302 534
4089 534 -69 -377 687 116 -665 349 410 -546 -27 694 -415 -329 545 -85 -468 490 293 -663 72 442
4109 442 -495 -203 585 -282 -540 578 -12 -568 451 390 -633 -67 579 -493 -356 731 -22 -522 434
4128 434 46 -594 334 609 -642 -174 482 -389 -373 695 101 -564 381 217 -645 215 647 -523 -204
4147 -204 626 -169 -469 575 161 -574 295 427 -764 25 699 -318 -309 649 -89 -585 436 315 -692
4166 -692 222 473 -505 -236 703 -190 -507 591 3 -739 173 289 -507 34 527 -483 -444 632 -26
4185 -26 -443 416 164 -705 153 445 -453 -108 719 -307 -480 530 47 -579 456 354 -584 24 522
4204 522 -443 -239 622 -113 -636 485 234 -510 335 408 -535 -164 391 -341 -271 512 21 -562 377 314 -570
$$ packed form
4069F31l90p91Q76J12j126O52O81q23j51R04o45n89J066Lr15O03L92j029K37Q36
4089E34o03l08J064n71p81J014O1r56N19P21j109Q6Q74o30l83R58j97r56P35L70
4109D42r37K92P88q67k58J118n90n56J019o1j023N66O46j072J37J087p53n00R56
4128D34l88o40R28K75j251M68O56q71J6J068n94o65R45j64q62Q60M32j170L19
4147b04Q30p95l00J044m14p35Q69J32j191P89O74j017RR58p38m96J021j21j007
4166f92R14K51r78K69R39q93l17J098n88p42R12J16p96N41M93j010L9J076o58
4185b6m17Q59k52q69Q58K92q98L45Q27j026j73J010m83o26J035j02r38O08M98
4204E22r65K04Q61p35n23J121k51p44Q45P3r43L71N55p32P0P83m91n83R39o3q84
$$ plain form
4225 -570 47 519 -339 -313 494 -262 -460 450 155 -667 258 321 -440 3 538 123 -394 -126 -106 -379 962
4246 962 835 491 135 194 -248 -187 541 -327 -392 267 67 -497 405 240 -381 29 474 -313 -287 483 -134
4267 -134 -497 226 174 -378 102 413 -506 -18 321 -126 -308 435 36 -446 231 352 -470 -24 294 -40
4287 -40 -717 -79 -269 -335 530 -183 -260 253 337 -633 2 291 -193 -532 1174 137 -241 916 212 -311
4307 -311 -410 154 -400 -332 542 287 -362 524 -39 -289 45 279 -411 -19 339 -115 -142 288 -66 -94 -170 75
4329 75 556 256 -65 20 79 268 -569 -103 151 47 -327 181 91 -244 -64 214 -162 -151 75 -166 -268 251
4351 251 45 -273 71 185 -165 -91 297 -154 -126 156 -16 -213 168 103 -182 -12 188 -106 -307 -59 872
4372 872 316 34 -418 -954 606 -101 -432 815 479 -242 26 57 -22 -233 27 -55 -132 138 125 -149 -34
$$ packed form
4225e70O17M72q58K6Q07p56j98R10k95q22R25O3p61M43N35m15n17K68K0k73J341
4246I62j27l44l56N9m42O1P28q68o5O59k00n64R02j65o21M10M45p87K6P70o17
4267a34l63P23n2n52M80L11r19M88L39m47j82P43l99m82O77J21q22M46L18l34
4287d0o77O38j90o6Q65p13p7N13Q4r70O35K89m84l39J706j037l78J157p04n23
4307c11r9N64n54O8Q74k55o49Q86n63k50L34K34o90L92L58m54k7M30l54k8p6K45
4329G5M81l00l21Q5N9J89q37M66K54j04l74N08r0l35J80K78l76J1K26k41j02N19
4351B51k06l18L44J14l50P4L88m51K8K82j72j97L81o5k85J70K00k94k01K48R31
4372H72n56k82m52n36J560p07l31J247l36p21K68L1p9k11K60q2p7K70j3k74J15
$$ plain form
4393 -34 162 10 -15 50 69 -168 39 143 -14 40 -45 -45 -26 88 -52 -162 44 -15 -36 17 0 -11 10 22 88 -54
4419 -54 100 -71 -91 40 101 -88 -31 -151 -101 -7 -85 -36 -121 144 100 -23 -131 -29 110 94 -11 -4 -13 -1 8 70
4445 70 126 -38 11 101 -28 75 -17 -155 -9 22 -61 36 357 52 19 150 -49 -23 47 92 -217 78 48 -52
4469 -52 -57 106 -55 103 70 -184 365 -120 7 -144 16 165 -13 20 157 78 -120 76 -14 -87 -22 252 -432
4492 -432 -204 289 -166 -157 6 26 -98 107 121 -277 -73 287 14 -90 111 -61 -214 162 57 -224 -3
4513 -3 218 -169 -50 161 -85 -193 145 62 -253 225 107 -224 -11 143 -127 -3 230 -96 -286 128 136 -275
4535 -275 108 273 -210 -25 325 -112 -343 190 -12 -237 249 175 -203 -25 208 -310 -82 299 -144 -158 194
4556 194 35 -246 5 279 -237 -58 282 -235 -68 369 53 -322 296 185 -346 63 364 -346 -39 389
$$ packed form
4393c4J96j52k5O5J9k37K07J04j57N4q5%J9J14j40j10K06n9k1N3j7j1K1J2O6j42
4419e4J54j71k0J31O1j89N7j20N0R4p8M9q5K65m4j23j08J02J39j6j05PrJ2RO2
4445G0N6j64M9R0j29J03r2j38J46L1q3R7L21l05l3J31j99K6P0M5l09K95l0j00
4469e2nJ63j61J58l3k54N49m85J27j51J60J49j78L3J37p9j98J96r0p3O5K74o84
4492d32K28M93m55RJ63K0j24K05J4l98K04L60k73j04K01j72j53L76j05k81K21
4513cK21l87J19K11k46j08L38q3l15M78j18l31K13J54k70J24K33l26j90M14Qm11
4535b75L83J65m83J85L50m37k31N33k02k25M86p4l78J78K33n18K28L81m43j4L52
4556A94j59k81K51K74n16J79L40n17J67M37l16l75O18j11n31M09L01p10L07M28
$$ plain form
4576 389 -159 -222 362 25 -354 171 137 -394 -64 287 -227 -185 382 -171 -278 303 222 -363 91 203 -431
4597 -431 -128 461 -137 -146 348 43 -296 300 345 -369 90 325 -337 -324 420 -55 -270 294 84 -498 95
4618 95 342 -439 -33 410 -177 -318 513 10 -365 332 193 -398 36 390 -200 -135 518 -154 -408 341 134
4639 134 -457 221 335 -414 46 410 -311 -206 437 -90 -413 327 140 -344 192 571 -305 -129 419 -269
4659 -269 -298 545 81 -409 238 353 -438 43 453 -394 -289 438 -93 -358 403 124 -365 158 334 -428
4679 -428 -20 524 -236 -293 514 -66 -489 218 181 -320 102 309 -327 -362 415 -105 -365 475 74 -536 267
4700 267 321 -314 -19 438 -369 -352 445 4 -426 405 117 -522 123 348 -318 -88 467 -229 -399 443 71
4721 71 -442 237 305 -493 69 322 -253 -174 476 -64 -350 329 181 -498 123 510 -298 -87 434 -208 -282
$$ packed form
4576C89n48o3N84l37l79N25l4n31L30L51n14M2N67n53j07N81q1n85M54J12o34
4597d31L03N89n98rM94l05l39N96M5p14M59K35o62J3P44m75k15N64k10n82N93
4618I5K47p81M06M43n87j41Q31n03l75O97j39n91M34L54n90O5O53o72k54P49k07
4639A34n91O78J14p49M60L64p21J05O43n27l23P40j87m84N36L79q76J76N48o88
4659b69k9Q43m64m90O47J15p91M81M10q47J05P27n31k65P61k79m89N23J76p62
4679d28M08N44p60n7Q07n80m23P07l7n01M22K07o36l5P77n20k60Q40m01o10Q03
4700B67N4o35K95M57q07J7P97m41m30Q31k88o39O45K25o66K30N55o96j70Q42l72
4721G1n13O79O8p98N62K53n75P9O50n40k86O79j48o79O21L87q08K11N21o42p4
$$ plain form
4742 -282 540 107 -496 360 214 -367 173 541 -259 -152 482 -185 -340 445 69 -461 245 193 -439 -75
$$ packed form
4742b82Q22m33o03Q56j46n81N40L68q00J07O34o67j55P85l76n30P06n2o32L64
$$ [...]
8191a47
##END NTUPLES=NMR FID
##END=
