##TITLE=1H_DE-80H_X3
 200.13MHz, d2o
 8 sc
 
 19ns.26.2.2025
##JCAMPDX= 6.0         $$ Bruker NMR JCAMP-DX V2.0
##DATA TYPE= NMR FID
##DATA CLASS= NTUPLES
##ORIGIN= UXNMR, Bruker Analytische Messtechnik GmbH
##OWNER= pz
$$ XWIN-NMR		Version 3.5
$$ Thu Dec 11 11:10:06 2025 Russian Standard Time (UT+4h)  Yarkov@DPX200
##.OBSERVE FREQUENCY= 200.1313
##.OBSERVE NUCLEUS= ^1H
##.DELAY= (6, 6)
##.ACQUISITION MODE= SIMULTANEOUS
##.ACQUISITION SCHEME= undefined
##.AVERAGES= 8
##.DIGITISER RES= 18
##SPECTROMETER/DATA SYSTEM= spect
##.PULSE SEQUENCE= zg30
##.SOLVENT NAME= CDCl3
##.SHIFT REFERENCE= (INTERNAL, CDCl3, 0, 14.3821)
##AUDIT TRAIL= $$ (NUMBER, WHEN, WHO, WHERE, WHAT)
$$ ##TITLE= Audit trail, XWIN-NMR		Version 3.5
$$ ##JCAMPDX= 5.01
$$ ##ORIGIN= Bruker BioSpin GmbH
$$ ##OWNER= Yarkov
$$ C:/Bruker/XWIN-NMR/data/yarkov2/nmr/H-C/1/audita.txt
$$ ##AUDIT TRAIL=  $$ (NUMBER, WHEN, WHO, WHERE, WHAT)
(   1,<2025-12-11 11:09:11.20 +0400>,<Yarkov>,<DPX200>,
      <created by zg, POWCHK disabled, PULCHK disabled
       configuration hash MD5:
       00 E9 B6 7A A2 85 ED C7 34 08 36 98 17 FE 4E 26
       data hash MD5: 16K
       14 84 E9 53 72 4E DE 3A 2C BB 62 02 1C 79 CF 08>)
$$ ##END=
$$ 
$$ hash MD5
$$ 74 61 FB 56 7C F1 D9 B6 7B 0B 17 E4 3C D3 F9 7D
##$RELAX= 
##$RELAX= 
##$RELAX= 
##$RELAX= 
##$RELAX= 
##$RELAX= 
$$ Bruker specific parameters
$$ --------------------------
##$DU= <C:/Bruker/XWIN-NMR>
##$EXPNO= 1
##$NAME= <H-C>
##$PROCNO= 1
##$TYPE= <nmr>
##$USER= <yarkov2>
##$AMP= (0..31)
100 100 100 100 100 100 100 100 100 100 100 100 100 100 100 100 100 100 
100 100 100 100 100 100 100 100 100 100 100 100 100 100 
##$AQSEQ= 0
##$AQ_mod= 1
##$AUNM= <au_zg>
##$AUTOPOS= <>
##$BF1= 200.13
##$BF2= 200.13
##$BF3= 200.13
##$BF4= 200.13
##$BF5= 200.13
##$BF6= 200.13
##$BF7= 200.13
##$BF8= 200.13
##$BYTORDA= 1
##$CFDGTYP= 0
##$CFRGTYP= 5
##$CHEMSTR= <none>
##$CNST= (0..31)
1 1 145 1 1 1 1 1 1 1 1 1 1 1 1 1 1 1 1 1 1 1 1 1 1 1 1 1 1 1 1 1 
##$CPDPRG= <>
##$CPDPRG1= <>
##$CPDPRG2= <>
##$CPDPRG3= <>
##$CPDPRG4= <mlev>
##$CPDPRG5= <mlev>
##$CPDPRG6= <mlev>
##$CPDPRG7= <mlev>
##$CPDPRG8= <mlev>
##$CPDPRGB= <>
##$CPDPRGT= <>
##$D= (0..31)
0 0.7 0 0 0 0 0 0 0 0 0 0.03 0 0 0 0 0 0 0 0 0 0 0 0 0 0 0 0 0 0 0 0 
##$DATE= 1765436950
##$DBL= (0..7)
120 120 120 120 120 120 120 120 
##$DBP= (0..7)
150 150 150 150 150 150 150 150 
##$DBP07= 0
##$DBPNAM0= <>
##$DBPNAM1= <>
##$DBPNAM2= <>
##$DBPNAM3= <>
##$DBPNAM4= <>
##$DBPNAM5= <>
##$DBPNAM6= <>
##$DBPNAM7= <>
##$DBPOAL= (0..7)
0.5 0.5 0.5 0.5 0.5 0.5 0.5 0.5 
##$DBPOFFS= (0..7)
0 0 0 0 0 0 0 0 
##$DE= 6
##$DECBNUC= <off>
##$DECIM= 32
##$DECNUC= <off>
##$DECSTAT= 4
##$DIGMOD= 1
##$DIGTYP= 9
##$DL= (0..7)
0 120 120 120 120 120 120 120 
##$DP= (0..7)
150 150 150 150 150 150 150 150 
##$DP07= 0
##$DPNAME0= <>
##$DPNAME1= <>
##$DPNAME2= <>
##$DPNAME3= <>
##$DPNAME4= <>
##$DPNAME5= <>
##$DPNAME6= <>
##$DPNAME7= <>
##$DPOAL= (0..7)
0.5 0.5 0.5 0.5 0.5 0.5 0.5 0.5 
##$DPOFFS= (0..7)
0 0 0 0 0 0 0 0 
##$DQDMODE= 0
##$DR= 18
##$DS= 0
$$ [...]
##$SUBNAM2= <"">
##$SUBNAM3= <"">
##$SUBNAM4= <"">
##$SUBNAM5= <"">
##$SUBNAM6= <"">
##$SUBNAM7= <"">
##$SUBNAM8= <"">
##$SUBNAM9= <"">
##$SW= 18.0517328524113
##$SWIBOX= (0..15)
0 0 2 0 0 0 0 0 0 0 0 0 0 0 0 0 
##$SW_h= 3612.71676300578
##$TD= 16384
##$TD0= 1
##$TE= 0
##$TE2= 300
##$TE3= 300
##$TEG= 300
##$TL= (0..7)
0 120 120 120 120 120 120 120 
##$TP= (0..7)
150 150 150 150 150 150 150 150 
##$TP07= 0
##$TPNAME0= <>
##$TPNAME1= <>
##$TPNAME2= <>
##$TPNAME3= <>
##$TPNAME4= <>
##$TPNAME5= <>
##$TPNAME6= <>
##$TPNAME7= <>
##$TPOAL= (0..7)
0.5 0.5 0.5 0.5 0.5 0.5 0.5 0.5 
##$TPOFFS= (0..7)
0 0 0 0 0 0 0 0 
##$TUNHIN= 0
##$TUNHOUT= 0
##$TUNXOUT= 0
##$USERA1= <user>
##$USERA2= <user>
##$USERA3= <user>
##$USERA4= <user>
##$USERA5= <user>
##$V9= 5
##$VALIST= <valist>
##$VCLIST= <CCCCCCCCCCCCCCC>
##$VD= 0
##$VDLIST= <DDDDDDDDDDDDDDD>
##$VPLIST= <PPPPPPPPPPPPPPP>
##$VTLIST= <TTTTTTTTTTTTTTT>
##$WBST= 1024
##$WBSW= 4
##$XGAIN= (0..3)
0 0 0 0 
##$XL= 0
##$YL= 0
##$YMAX_a= 408255
##$YMIN_a= -368313
##$ZGOPTNS= <>
##$ZL1= 120
##$ZL2= 120
##$ZL3= 120
##$ZL4= 120
##$ABSF1= 10
##$ABSF2= 0
##$ABSG= 5
##$ABSL= 3
##$ALPHA= 0
##$AQORDER= 0
##$ASSFAC= 0
##$ASSFACI= 0
##$ASSFACX= 0
##$ASSWID= 0
##$AUNMP= <proc_1d>
##$AZFE= 0.1
##$AZFW= 0.1
##$BCFW= 1
##$BC_mod= 2
##$BYTORDP= 1
##$COROFFS= 0
##$CY= 83.5205535888672
##$DATMOD= 1
##$DC= 2
##$DFILT= <>
##$DTYPP= 0
##$F1P= 10.8118882576601
##$F2P= -7.23987719738617
##$FCOR= 0.5
##$FTSIZE= 0
##$FT_mod= 4
##$GAMMA= 1
##$GB= 0.15
##$INTBC= 1
##$INTSCL= 1
##$ISEN= 128
##$LB= 0.25
##$LEV0= 0
##$LPBIN= 0
##$MAXI= 10000
##$MC2= 0
##$MEAN= 0
##$ME_mod= 0
##$MI= 1.114404
##$NCOEF= 0
##$NC_proc= 0
##$NLEV= 6
##$NOISF1= 3.799351
##$NOISF2= 2.8
##$NSP= 1
##$NTH_PI= 0
##$NZP= 0
##$OFFSET= 14.38212
##$PC= 1
##$PHC0= -5306.083
##$PHC1= 17.82193
##$PH_mod= 1
##$PKNL= yes
##$PPARMOD= 0
##$PSCAL= 0
##$PSIGN= 0
##$REVERSE= no
##$SF= 200.129724274929
##$SI= 16384
##$SIGF1= 3
##$SIGF2= 2
##$SINO= 400
##$SIOLD= 16384
##$SREGLST= <1H.CDCl3>
##$SSB= 0
##$STSI= 0
##$STSR= 0
##$SW_p= 3205.1282051282
##$SYMM= 0
##$S_DEV= 0
##$TDeff= 0
##$TDoff= 0
##$TI= <>
##$TILT= no
##$TM1= 0
##$TM2= 0
##$TOPLEV= 0
##$USERP1= <user>
##$USERP2= <user>
##$USERP3= <user>
##$USERP4= <user>
##$USERP5= <user>
##$WDW= 1
##$XDIM= 8192
##$YMAX_p= 0
##$YMIN_p= 0
$$ End of Bruker specific parameters
$$ ---------------------------------
##NTUPLES= NMR FID
##VAR_NAME=  TIME,          FID/REAL,        FID/IMAG
##SYMBOL=    X,             R,               I
##VAR_TYPE=  INDEPENDENT,   DEPENDENT,       DEPENDENT
##VAR_FORM=  AFFN,          ASDF,            ASDF
##VAR_DIM=   8192,          8192,            8192
##UNITS=     SECONDS,       ARBITRARY UNITS, ARBITRARY UNITS
##FACTOR=    0.0002768,     1,               1
##FIRST=     0,             0,               0
##LAST=      2.2672688,     0,               0
##MIN=       0,             -368313,         0
##MAX=       2.2672688,     408255,          0
$$ Real data points
##PAGE= N=1
##DATA TABLE= (X++(R..R)), XYDATA
$$ plain form
0 0 0 0 0 0 0 0 0 0 0 0 0 0 0 0 6 -8 8 -8 8 -12 15 -16 20 -24 28 -32 38 -44 52 -60 68 -76 85 -100 113 -126
36 -126 143 -159 180 -199 222 -248 273 -307 339 -372 413 -456 503 -552 611 -673 740 -817 901
55 901 -996 1102 -1224 1364 -1523 1716 -1943 2223 -2577 3036 -3656 4536 -5879 8070 -18523
70 -18523 261096 271601 43838 194305 326491 56086 -271364 -239671 -127258 -149370 -141024
81 -141024 -6983 97798 187754 291837 248023 -12811 -202157 -142201 -55492 -158495 -242110
92 -242110 -64236 202701 248841 138635 103711 108763 -15382 -191020 -230975 -144102 -65931
103 -65931 -31376 16828 128964 259693 258230 62052 -137405 -151966 -84003 -116207 -186328
114 -186328 -126738 54183 207856 233193 144873 42837 -4428 -49359 -146892 -214729 -159261
$$ packed form
0@%%%%%%%%%%%%%%Oj4J6j6J6k0K7l1L6m4N2o0P0q2R6j12J28j44J61j85K13k39
36a26K69l02L39l79M21m70N21n80O46p11P85q69R59j055J163j284J413j557J718
55I01j897K098k326K588k887L239l659M166m800N613o692Q192j0415J3949k6593
70a8523K79619J0505k27763J50467J32186k70405l27450L1693J12413k2112Q346
81a41024J34041J04781Q9956J04083m3814k60834j89346N9956Q6709j03003q3615
92b42110J77874K66937M6140j10206l4924N052j24145j75638l9955Q6873P8171
103f5931L4555M8204J12136J30729j463j96178j99457j4561O7963l2204p0121
114a86328N9590J80921J53673K5337q8320j02036m7265m4931r7533o7837N5468
$$ plain form
125 -159261 -37026 45055 86458 149771 216015 173238 -8317 -162153 -138543 -59558 -112868
136 -112868 -187335 -60529 170701 238726 139869 58651 30204 -21670 -94566 -149078 -174050
147 -174050 -131908 -5872 114465 145991 134677 133985 88733 -35589 -137912 -131902 -91244 -108827
159 -108827 -109790 22390 197590 217321 85823 -6437 3722 -9301 -106634 -186910 -159590 -50017
171 -50017 65980 131470 134422 110555 84999 34141 -51667 -122696 -137747 -116255 -80090 -10598
183 -10598 93859 168474 147112 55716 -10149 -16458 -37353 -121584 -183809 -120819 26066 122289
195 122289 120308 87140 78047 66880 10212 -76646 -135137 -133337 -88754 -24347 52276 116456
207 116456 127435 85890 36937 2676 -36521 -92163 -137457 -129373 -46908 66691 124290 97835
$$ packed form
125a59261J22235Q2081M1403O3313O6244m2777j81555j53836K3610P8985n3310
136a12868p4467J26806K31230O8025r8857q1218k8447n1874p2896n4512k4972
147a74050M2142J26036J20337L1526j1314o92m5252j24322j02323O010M0658j7583
159a08827r63J32180J75200J9731j31498r2260J0159j3023r7333q0276K7320J09573
171e0017J15997O5490K952k3867k5556n0858q5808p1029j5051K1492L6165O9492
183a0598J04457P4615k1362r1396o5865o309k0895q4231o2225O2990J46885R6223
195A22289j981l3168r093j1167n6668q6858n8491J800M4583O4407P6623O4180
207A16456J0979m1545m8953l4261l9197n5642m5294Q084Q2465J13599N7599k6455
$$ plain form
219 97835 59333 62633 55324 -18776 -112950 -144627 -103401 -35299 26320 71741 95218 92778 69083
232 69083 32411 -15118 -71398 -118280 -120910 -64806 18394 78653 91042 72904 60052 55907
244 55907 19609 -62747 -130623 -120491 -51679 12606 47880 66018 75970 78123 62162 12798
256 12798 -57750 -106729 -107797 -69804 -12776 41004 69061 71757 71264 68892 36592 -33003 -100249
269 -100249 -116290 -72940 -10924 27225 41519 56893 76331 77534 42017 -24653 -88806 -106892
281 -106892 -71203 -20643 12475 34112 55743 72212 75146 52761 -5326 -74560 -103559 -75523
293 -75523 -26908 6033 23268 41566 64715 78427 59185 1586 -63307 -93576 -75885 -34681
305 -34681 -2202 14723 34012 62708 80459 64482 14133 -46942 -83549 -75043 -38704 -10553
$$ packed form
219I7835l8502L300p309p4100r4174l1677M1226O8102O1619M5421K3477k440k3695
232F9083l6672m7529n6280m6882k630N6104Q3200O0259J2389j8138j2852m145
244E5907l6298q2356o7876J0132O8812O4285L5274J8138R952K153j5961m9364
256A2798p0548m8979j068L7993N7028N3780K8057K696m93k372l2300o9595o7246
269a00249j6041M3350O2016L8149J4294J5374J9438J203l5517o6670o4153j8086
281a06892L5689N0560L3118K1637K1631J6469K934k2385n8087o9234k8999K8036
293g5523M8615L2941J7235J8298K3149J3712j9242n7599o4893l0269J7691M1204
305c4681L2479J6925J9289K8696J7751j5977n0349o1075l6607Q506L6339K8151
$$ plain form
317 -10553 2315 21859 54647 76933 65637 20575 -36533 -73047 -69762 -41548 -16687 -3500
329 -3500 14936 47594 75890 71166 28119 -27192 -61432 -62667 -42977 -23515 -12375 4483 38815
342 38815 71298 69916 30590 -18647 -51617 -57745 -43185 -25812 -16266 -2527 30776 68001 74689
355 74689 39697 -11816 -45576 -49097 -37334 -29984 -26811 -11286 24396 61518 69847 40044 -4568
368 -4568 -35286 -44186 -39657 -31777 -24537 -13529 12901 52114 73105 51350 2772 -33171 -39271
381 -39271 -30038 -27950 -33933 -26962 7977 51760 66943 42392 4908 -18683 -27285 -32693 -36971
394 -36971 -32904 -18201 4778 33508 58118 56391 21678 -18907 -33240 -24612 -21344 -33173 -37210
407 -37210 -9940 37162 63886 46527 8362 -12548 -12129 -15705 -33501 -44733 -29799 3108 29864
$$ packed form
317a0553J2868J9544L2788K2286j1296m5062n7108l6514L285K8214K4861J3187
329c500J8436L2658K8296m724m3047n5311l4240j235J9690J9462J1140J6858L4332
342C8815L2483j382l9326m9237l2970o128J4560J7373R546J3739L3303L7225O688
355G4689l4992n1513l3760l521J1763P350L173J5525L5682L7122Q329k9803m4612
368d568l0718q900M529P880P240J1008K6430L9213K0991k1755m8578l5943o100
381c9271R233K088n983O971L4939M3783J5183k4551l7484k3591q602n408m278
394c6971M067J4703K2979K8730K4610j727l4713m0585j4333Q628L268j1829m037
407c7210K7270M7102K6724j7359l8165k0910M19l576j7796j1232J4934L2907K6756
$$ plain form
420 29864 41050 41953 31967 6571 -21848 -29796 -20941 -21975 -34910 -27147 15951 57450 53677 13986
434 13986 -12929 -6661 523 -20134 -47719 -43755 -7589 27820 39079 31256 21749 16063 4942
447 4942 -15998 -31880 -30262 -22390 -19890 -6975 28636 55585 35900 -7742 -19054 4860 6989
460 6989 -33793 -61678 -29058 27800 44654 22667 8826 16929 19560 967 -24159 -36196 -30548
473 -30548 -15280 -1058 12004 28407 37608 21464 -8287 -15830 655 -1989 -38310 -55128 -9913
486 -9913 49253 48311 1844 -10893 23070 33330 -10111 -49280 -37569 -6866 1814 478 13148
499 13148 29053 26411 9069 -5252 -9552 -10755 -19140 -31769 -26629 8281 42900 35006 -2607
512 -2607 -10802 22271 31504 -19628 -64857 -35985 21736 24522 -10413 -6416 33029 38688 1135
$$ packed form
420B9864J1186R03r986k5396k8419p948Q855j034j2935P763M3098M1499l773l9691
434A3986k6915O268P184k0657k7585L964L6166L5409J1259p823r507n686j1121
447D942k0940j5882J618P872K500J2915L5611K6949j9685m3642j1312K3914K129
460F989m0782k7885L2620N6858J6854k1987j3841Q103K631j8593k5126j2037N648
473c0548J5268J4222J3062J6403R201j6144k9751p543J6485k644l6321j6818M5215
486i913N9166r42m6467j2737L3963J0260m3441l9169J1711L0703Q680j336J2670
499A3148J5905k642j7342j4321m300j203q385j2629N140L4910L4619p894l7613
512b607q195L3073R233n1132m5229K8872N7721K786l4935L997L9445N659l7553
$$ plain form
525 1135 -21878 -12024 -7290 -22816 -27840 -3721 24636 28393 12189 1421 7542 16884 5118
538 5118 -29436 -49893 -20992 27926 29821 -11960 -18524 29797 50443 1182 -44272 -25884 6542
551 6542 -4734 -25360 -4772 30862 28489 502 -3300 17509 15964 -18863 -41450 -24139 7341
564 7341 19076 8565 -5770 -1577 24496 34513 -2714 -45701 -31921 13069 14698 -19526 -16953
577 -16953 26165 39402 5444 -15353 4531 15243 -16993 -43216 -15900 24695 18540 -11583
589 -11583 -7362 23181 29304 3604 -22403 -28399 -12908 9058 8951 -12220 -12315 20959 38858 11229
603 11229 -20201 -12679 7662 -3096 -28332 -18758 17325 23003 -6046 -10092 23162 30276 -11001
616 -11001 -38471 -15762 12535 7357 -10923 -10726 7886 25934 24179 524 -18839 -12541 3119
$$ packed form
525A135k3013R854M734j5526n024K4119K8357L757j6204j0768O121R342j1766
538E118l4554k0457K8901M8918J895m1781o564M8321K0646m9261m5454J8388L2426
551F542j1276k0626K0588L5634k373k7987l802K0809j545l4827k2587J7311L1480
564G341J1735j0511j4335M193K6073J0017l7227m2987J3780M4990J629l4224K573
577a6953M3118J3237l3958k0797J9884J0712l2236k6223K7316M0595o155l0123
589a1583M221L0543O123k5700k6007n996J5491K1966j07k1171r5L3274J7899k7629
603A1229l1430P522K0341j0758k5236R574L6083N678k9049m046L3254P114m1277
616a1001k7470K2709K8297n178j8280J97J8612J8048j755k3655j9363O298J5660
$$ plain form
629 3119 -116 -16107 -15559 6574 21052 9146 -4572 6186 16250 -6161 -31832 -15073 17245
642 17245 10564 -18050 -12687 21900 33281 8477 -16998 -15765 761 4954 -7924 -16328 -5941
655 -5941 10555 15850 9298 164 -2165 911 -2874 -14208 -12638 4458 8675 -6046 -5132 19509
669 19509 26961 -314 -22701 -11345 8753 4674 -14788 -17699 2861 19887 13742 -1321 -4182
682 -4182 814 32 -5664 -8920 -7440 -1489 4639 5206 4952 10944 11937 -2839 -15154 -6492 6225
697 6225 -318 -14677 -10811 9240 20092 8732 -7848 -7534 4152 4635 -8182 -13628 -4414 5109
711 5109 6502 5725 6495 5668 2254 -2736 -6079 -4299 -1941 -5277 -8243 -219 12064 12400 674 -7316
727 -7316 -3006 4592 2121 -9659 -13861 -1924 11076 10050 2285 1296 3941 2054 -2264 -4192 -5074
$$ packed form
629C119l235j5991N48K2133J4478j1906j3718J0758J0064k2411k5671J6759L2318
642A7245o681k8614N363L4587J1381k4804k5475J233J6526M193j2878q404J0387
655e941J6496N295o552r134k329L076l785j1334J570J7096M217j4721R14K4641
669A9509P452k7275k2387J1356K0098m079j9462k911K0560J7026o145j5063k861
682d182M996p82n696l256J480N951O128N67k54N992R93j4776j2315Q662J2717
697F225o543j4359L866K0051J0852j1360j6580L14J1686M83j2817n446R214R523
711E109J393p77P70q27l414m990l343J780K358l336k966Q024J2283L36j1726p990
727g316M310P598k471j1780m202J1937J3000j026p765r89K645j887m318j928q82
$$ plain form
742 -5074 -6001 -5009 -468 5699 8894 4631 -2692 -3897 1379 2687 -4227 -10451 -7056 3716 10990
757 10990 7570 -92 -1031 3706 3579 -2865 -7291 -6554 -4125 -853 3638 5610 3751 795 -294 -44
773 -44 210 -2000 -6763 -7393 -264 7255 7247 2514 36 1997 3626 716 -5245 -8244 -4932 175 2593
790 2593 2647 2317 1931 1633 1979 89 -3603 -5760 -4500 -970 3148 5156 3477 746 2176 4546 2118
807 2118 -4067 -7268 -5520 -1023 2338 2315 365 208 2715 3738 1195 -2912 -5613 -4878 -1064 2670
823 2670 3164 1828 1565 2486 3930 3175 -1293 -6327 -6354 -1915 1561 1514 169 -31 1662 3710 3156 -1419
841 -1419 -5417 -4751 -1162 1504 1979 1484 1476 2692 3893 2961 -558 -3995 -5116 -3133 80 1245 232
858 232 -610 1135 3284 3020 -101 -3820 -4838 -1882 1371 1374 -103 771 3323 4125 2458 -59 -2420
$$ packed form
742e074r27R92M541O167L195m263p323j205N276J308o914o224L395J0772P274
757A0990l420p662r39M737j27o444m426P37K429L272M491J972j859k956j089K50
773d4K54k210m763o30P129P519qm733k478J961J629k910n961k999L312N107K418
790B593N4l30l86k98L46j890l692k157J260L530M118K008j679k731J430K370k428
807B118o185l201J748M497L361k3j950j57K507J023k543m107k701P35L814L734
823B670M94j336k63R21J444p55m468n034k7M439L476m7j345k00J693K048n54m575
841a419l998O66L589K666M75m95qJ216J201r32l519l437j121J983L213J165j013
858B32q42J745K149k64l121l719j018K956L253Lj477Q74K552Q02j667k517k361
$$ plain form
875 -2420 -3460 -2805 -1359 -419 27 224 899 2057 2691 1160 -2442 -4156 -2245 801 1389 -296 -669
892 -669 2654 5286 3691 -635 -2974 -2134 -922 -1389 -2252 -1666 203 1783 1817 1423 992 -225 -2707
909 -2707 -3157 -475 1797 366 -1532 198 4534 5296 974 -3353 -3062 -34 472 -1934 -3379 -1471
925 -1471 2020 3121 1165 -702 -273 60 -1582 -2404 -234 1855 513 -1207 1117 5150 4214 -1411
941 -1411 -4541 -1505 1949 302 -3812 -3535 765 3777 2227 -921 -1352 298 804 -1404 -2300 -423
957 -423 2093 1344 -225 990 3754 2857 -1928 -4196 -907 2195 -337 -4591 -2949 2991 4439 -137
973 -137 -3508 -566 2774 583 -3077 -2615 1084 3036 1273 -279 701 2449 1558 -1444 -2924 -1043
989 -1043 1006 -449 -3324 -1808 3350 3991 -1383 -4522 31 4260 848 -5014 -3246 3298 4654
$$ packed form
875b420j040O55J446R40M46J97O75J158O34j531l602j714J911L046N88j685l73
892f69L323K632j595m326k339Q40J212m67q63N86J869J580L4l94m31j217k482
909b707m50K682K272j431j898J730M336P62m322m327K91L028N06k406j445J908
925a471L491J101j956j867M29L33j642q22K170K089j342j720K324M033r36n625
941a411l130L036L454j647m114K77M300L012j550l148m31J650N06k208q96J877
957d23K516p49j569J215K764q97m785k268L289L102k532m254J642N940J448m576
973a37l371K942L340k191l660M62L699J952j763j552R80J748q91l002j480J881
989a043K049j455k875J516N158O41n374l139M553M229l412n862J768O544J356
$$ plain form
1004 4654 227 -1934 1020 2871 648 -2318 -2294 -378 47 -1368 -1945 -210 2416 2105 -1375 -3201
1020 -3201 276 3476 535 -4316 -2737 3742 5251 -337 -3374 811 4262 811 -4073 -3105 1153
1035 1153 1171 -2218 -2477 1131 3000 450 -2350 -1311 1380 1644 -802 -2529 -623 3075 3539 -189
1051 -189 -2572 451 3652 819 -4260 -3570 1662 2661 -2102 -3659 892 4080 556 -3171 -1264 2344
1067 2344 1590 -1810 -1784 1550 2981 1222 -856 -667 1276 1634 -739 -3292 -2429 1182 2019 -1430 -3140
1084 -3140 279 3514 1112 -3034 -2019 2087 2301 -1524 -2137 1688 3498 609 -1919 -217 1912
1099 1912 827 -2302 -2941 -446 1401 322 -1715 -1435 919 2228 195 -2136 -1198 1551 1800 -685
1115 -685 -1497 1161 3026 950 -1763 -905 1605 732 -2299 -2658 30 1706 -299 -1919 -667 1823
$$ packed form
1004D654m427k161K954J851k223k966K4J916M25j415n77J735K626l11l480j826
1020c201L477L200k941m851J579O479J509n588l037M185L451l451m884R68M258
1035A153J8l389k59L608J869k550k800J039K691K64k446j727J906L698M64l728
1051a89k383L023L201k833n079O90N232R99m763j557M551L188l524l727J907L608
1067B344p54l400K6L334J431j759k078J89J943L58k373k553Q63L611Q37l449j710
1084c140L419L235k402m146J015M106K14l825o13L825J810k889k528J702K129
1099A912j085l129o39K495J847j079k037K80K354J309k033k331R38K749K49k485
1115f85q12K658J865k076k713Q58K510q73l031l59K688J676k005j620J252K490
$$ plain form
1131 1823 1321 -870 -1689 103 1604 908 -640 -436 1105 1844 582 -1270 -913 736 494 -1711 -2044
1148 -2044 -91 1280 -150 -1691 -447 1496 1074 -916 -1244 507 1586 503 -724 68 1660 1322
1164 1322 -526 -1115 -200 581 -155 -1564 -1420 76 795 -120 -1086 -399 905 674 -457 -572 532 1116
1182 1116 457 -189 253 1139 897 -602 -1036 -12 553 -611 -1610 -931 307 506 -408 -787 -16 732
1200 732 418 -310 -47 720 821 254 209 528 748 246 -563 -787 -264 225 -366 -1233 -709 296 178 -402
1220 -402 -386 86 453 264 -110 177 838 1036 216 -54 511 664 -176 -594 -532 -406 -304 -215 -588 -498 -104
1241 -104 17 -239 -114 290 273 -69 116 590 969 734 257 -193 -51 604 46 -795 -912 -250 -294 -281 -215
1262 -215 -255 -468 -238 9 -42 199 327 2 167 833 901 439 -32 -75 -86 56 51 -420 -794 -436 -4 -443
$$ packed form
1131A823n02k191q19J792J501o96j548K04J541P39j262j852L57J649k42k205l33
1148b044J953J371j430j541J244J943m22j990l28J751J079j083j227P92J592l38
1164A322j848n89R15P81p36j409J44J496P19r15r66O87J304k31j131j15J104N84
1182A116o59o46M42Q86k42j499m34J024N65j164r99O79J238J99r14l79P71P48
1200G32l14p28K63P67J01n67m5L19K20n02q09k24N23M89n91q67N24J005j18n80
1220d02J6M72L67j89l74K87O61J98q20k70N65J53q40m18O2J26J02Q9l73R0L94
1241a04J21k56J25M04j7l42J85M74L79k35m77m50J42O55n58q41j17O62m4J3O6
1262b15m0k13K30K47n1K41J28l25J65O66O8m62m71m3j1J42nm71l74L58M32m39
$$ plain form
1284 -443 -494 -98 -271 -341 -24 225 179 378 588 347 434 659 363 -69 -99 38 -322 -396 -157 -336 -531 -161
1306 -161 -183 -481 -294 20 -205 -315 94 583 501 595 708 349 210 450 241 -348 -264 -106 -486 -261 57
1327 57 -257 -577 -369 -201 -247 -23 19 -119 -62 727 900 369 310 382 126 107 239 -236 -593 -408 -101 -222
1349 -222 -173 -336 -435 -527 -158 -7 -289 -85 299 327 518 1025 626 91 246 340 -8 -209 -197 -519 -596 16
1371 16 110 -381 -465 -211 -362 -297 173 106 -207 134 688 570 448 632 284 -50 -32 186 -300 -475 -273 -303
1393 -303 -337 -106 -282 -458 -246 -104 -388 -206 248 232 124 595 616 358 376 555 166 -310 -153 -108 -378 -229
1415 -229 -42 -307 -340 -325 -274 -314 -229 -136 -217 352 678 396 147 562 580 365 125 -95 -432 -524 -91 38 -223
1438 -223 -282 -320 -273 -249 -51 -360 -288 -128 7 442 697 792 126 105 684 504 -271 -423 -42 -209 -424 96
$$ packed form
1284d43n1L96j73p0L17K49m6J99K10k41Q7K25k96m32l0J37l60p4K39j79j95L70
1306a61k2k98J87L14k25j10M09M89q2R4J13l59j39K40k09n89Q4J58l80K25L18
1327E7l14l20K08J68m6K24M2j38N7P89J73n31n9P2k56j9J32m75l57J85L07j21
1349b22M9j63r9r2L69J51k82K04L84K8J91N07l99n35J55R4l48k01J2l22p7O12
1371A6R4m91q4K54j51O5M70o7l13L41N54j18j22J84l48l34J8K18m86j75K02l0
1393c03l4K31j76j76K12J42k84J82M54j6j08M71K1k58J8J79l89m76J57M5k70J49
1415b29J87k65l3J5N1m0Q5R3q1N69L26k82k49M15J8k15k40k20l37r2M33J29k61
1438b23n9l8M7K4J98l09P2J60J35M35K55R5o66k1N79j80p75j52L81j67k15N20
$$ plain form
1460 96 166 -395 -440 -221 -51 -195 -320 -107 149 292 225 603 942 420 -135 267 641 -57 -834 -204 331
1481 331 -408 -597 -52 207 -372 -903 -341 236 -197 -376 218 560 342 200 681 861 -45 -505 164 421
1501 421 -486 -709 144 185 -669 -691 278 237 -877 -1135 219 653 -150 -243 690 970 195 107 837 756 -557
1522 -557 -831 452 537 -594 -868 85 208 -686 -581 489 124 -1082 -820 837 939 -233 -202 1166
1540 1166 990 -281 -193 874 346 -1089 -679 719 542 -1144 -792 575 297 -1117 -801 551 242
1557 242 -941 -180 1341 861 -518 -2 1351 581 -924 -310 832 91 -1218 -303 989 29 -1332
1574 -1332 -439 662 -139 -1336 -461 947 227 -871 337 1794 616 -862 147 1349 13 -1351
1590 -1351 -210 946 -309 -1297 -101 1029 -314 -1286 -326 774 -270 -1130 39 1221 136 -740
$$ packed form
1460I6P0n61m5K19J70j44j25K13K56J43o7L78L39n22n55M02L74o98p77O30N35
1481C31p39j89N45K59n79n31N62N77m33j79N94L42k18j42M81J80r06m60O69K57
1501D21r07k23Q53M1q54k2R69m1j114k58J354M34q03r3R33K80p75q8P30q1j313
1522e57k74J283Q5j131k74R53J23q94J05J070l65j206K62J657J02j172L1J368
1540A166j76j271Q8J067n28j435M10J398j77j686L52J367k78j414L16J352l09
1557B42j183P61J521m80j379N16J353p70j505O14J142p41j309R15J292r60j361
1574a332Q93J101q01j197Q75J408p20j098J208J457j178j478J009J202j336j364
1590a351J141J156j255r88J196J130j343r72R60J100j044q60J169J182j085q76
$$ plain form
1606 -740 842 1637 90 -1197 310 1336 -438 -1376 105 965 -543 -1206 279 740 -834 -1337 67
1623 67 872 -267 -727 394 1214 354 -345 822 1030 -474 -937 609 748 -976 -1186 504 667 -889
1641 -889 -1006 634 265 -999 -882 707 864 -369 -490 855 1292 218 -534 432 778 -491 -797 436
1659 436 505 -830 -901 485 222 -994 -591 472 -146 -985 -55 1007 610 -366 94 1116 957 -320
1677 -320 -702 451 585 -788 -948 459 463 -766 -776 369 55 -774 -320 317 -246 -456 411 767 455
1696 455 138 351 638 424 -395 -329 434 34 -1017 -392 830 97 -1217 -541 694 77 -845 -211 338
1715 338 6 -2 678 610 116 182 -33 198 162 -103 -451 -99 -173 -265 -58 423 -468 -964 102 568 -355 -642
1737 -642 175 492 287 397 670 342 86 208 -175 -102 170 -285 -540 -84 169 -352 -217 106 -212 -665
$$ packed form
1606g40J582P95j547j287J507J026j774r38J481Q60j508o63J485M61j574n03J404
1623F7Q05j139m60J121Q20q60o99J167K08j504m63J546J39j724k10J690J63j556
1641h89j17J640l69j264J17J589J57j233j21J345M37j074p52R66L46j269l06J233
1659D36O9j335p1J386k63j216M03J063o18q39R30J062l97r76M60J022j59j277
1677c20l82J153J34j373j60J407Mj229j0J145l14q29M54O37n63k10Q67L56l12
1696D55l17K13K87k14q19O6P63m00j051O25J222p33j314O76J235o17r22O34N49
1715C38l32qO80o8m94O6k15K31l6k65l48L52p4r2K07M81q91m96J066M66r23k87
1737f42Q17L17k05J10K73l28k56J22l83P3K72m55k55M56K53n21J35L23l18m53
$$ plain form
1757 -665 109 182 -404 77 734 559 173 445 577 87 67 -18 -378 -4 73 -361 -487 147 -21 -548 -232
1778 -232 107 -329 -608 252 389 131 453 597 174 101 612 297 -339 -251 -39 -206 -39 -5 -252 -310 -126
1799 -126 -4 -310 -106 -67 -403 9 602 482 -6 261 443 182 136 294 -253 -698 -141 53 -444 -219 -23
1820 -23 -248 -473 42 -11 -444 -219 194 89 302 468 228 -53 475 354 64 -99 -121 -355 -236 8 -33
1841 -33 -423 -138 -36 -297 -245 25 -154 -266 241 517 244 192 522 341 137 317 131 -449 -173 82 -250
1862 -250 -343 -159 14 -266 -172 15 -363 -213 166 138 163 368 370 233 428 583 93 -168 -98 -88 -286 -73 -110
1885 -110 -365 -354 120 50 -330 -188 -221 -208 76 467 222 -192 229 603 417 208 97 -277 -290 176 31 -430
1907 -430 -254 -158 -272 -147 143 -47 -482 -86 141 243 375 30 -127 198 871 462 -221 -301 156 -26 -146
$$ packed form
1757f65P74P3n86M81O57j75l86K72J32m90k0q5l60L74P7m34j26O34j68n27L16
1778b32L39m36k79Q60J37k58L22J44m23p3N11l15o36Q8K12j67J67L4k47n8J84
1799a26J22l06K04L9l36M12N93j20m88K67J82k61m6J58n47m45N57J94m97K25J96
1820b3k25k25N15n3m33K25M13j05K13J66k40k81N28j21k90j63k2k34J19K44m1
1841c3l90K85J02k61N2K70j79j12N07K76k73n2L30j81k04J80j86n80K76K55l32
1862b50r3J84J73k80R4J87l78J50L79k8K5K05Kj37J95J55m90k61P0J0j98K13l7
1885a10k55J1M74p0l80J42l3J3K84L91k45m14M21L74j86k09j11l74j3M66j45m61
1907d30J76R6j14J25K90j90m35L96K27J02J32l45j57L25O73m09o83q0M57j82j20
$$ plain form
1928 -146 -68 -184 -459 3 55 -209 -357 -97 -69 -307 5 324 429 119 122 237 575 323 -328 -410 338 304
1950 304 -508 -609 -71 203 -178 -226 -305 -178 27 234 -33 -282 416 487 309 246 307 368 146 -220 -379 272
1972 272 340 -558 -1108 -66 787 -88 -972 -520 447 261 -144 -261 14 454 478 292 85 261 326 -80 -274
1993 -274 -97 130 180 -478 -837 -202 822 355 -1265 -892 721 904 -557 -797 536 1062 488 -419 -58
2012 -58 634 347 -259 -445 36 271 -309 -549 -318 36 207 -112 -745 -490 586 1004 -402 -1027 444
2031 444 1471 629 -914 -429 884 932 -679 -1195 109 739 -123 -1028 -306 582 138 -628 -294 172 532
2050 532 166 -226 -391 475 1247 443 -1023 -498 1041 1049 -671 -1581 -23 1263 67 -1432 -692 774
2068 774 630 -915 -858 623 903 -380 -661 319 1030 482 -320 -488 119 812 405 -850 -1087 7 1057
$$ packed form
1928a46P8j16k75M62N2k64j48K60K8k38L12L19J05l10LJ15L38k52o51q2P48l4
1950C04q12j01N38K74l81m8p9J27K05K07k67k49O98P1j78o3O1O1k22l66j59O51
1972B72O8q98n50J042Q53q75q84M52R67j86m05j17K75M40K4j86k07J76O5m06j94
1993b74J77K27N0o58l59O35J024m67j620L73J613J83j461k40J333N26n74r07L61
2012e8O92k87o06j86M81K35n80k40K31L54J71l19o33K55J076M18j406o25J471
2031D44J027q42j543M85J313M8j611n16J304O30q62r05P22Q88m44p66L34M66L60
2050E32l66l92j65Q66P72q04j466N25J539Qj720r10J558J286j196j499P40J466
2068G74j44j545N7J481K80j283k81R80P11n48q02j68O07O93m07j255k37J094J050
$$ plain form
2087 1057 171 -1329 -935 953 1039 -668 -1294 341 1163 15 -1008 244 1483 599 -1021 -611 819
2104 819 822 -442 -1207 -500 529 603 -456 -1059 -440 586 700 -534 -1035 226 1164 498 -885 -46 1240
2123 1240 900 -773 -783 794 1062 -576 -1366 -147 1087 318 -1133 -821 592 805 -196 -745 -372
2140 -372 620 878 107 -554 -28 927 826 -470 -875 166 853 -237 -1263 -346 837 209 -1230 -795
2158 -795 698 939 -688 -1224 224 1310 588 -608 -568 397 1068 297 -502 -603 206 595 -136 -761 -297
2177 -297 295 158 -707 -636 415 675 -515 -927 295 1446 568 -845 -549 966 1089 -91 -853 -379
2195 -379 480 112 -562 -659 -14 125 -100 -411 -357 386 383 -139 -524 342 901 483 -633 -251 790 841 -265
2216 -265 -871 -42 719 132 -900 -583 247 447 -271 -740 -139 347 189 -94 -106 271 381 220 -111 79
$$ packed form
2087A057q86j500L94J888Q6j707o26J635Q22j148j023J252J239q84j620M10J430
2104H19Lj264p65P07J029P4j059o03O19J026J14j234n01J261R38o66j383Q39J286
2123A240l40j673j0J577K68j638p90J219J234p69j451L12J413K13j001n49L73
2140c72R92K58p71o61N26R55j01j296m05J041O87j090j026R17J183o28j439M35
2158g95J493K41j627n36J448J086p22j196M0R65O71p71p99j01Q09L89p31o25M64
2177b97N92j37q65P1J051K60j190m12J222J151q78j413K96J515J23j180p62M74
2195c79Q59l68o74r7O45J39k25l11N4P43ln22l85Q66N59m18j116L82J041N1j106
2216b65o06Q29P61n87j032L17Q30K00p18m69O01M86j58k83j2L77J10j61l31J90
$$ plain form
2236 79 384 407 -433 -583 137 532 -146 -973 -587 355 440 -510 -704 -73 569 313 -232 -74 401 443 36
2257 36 -28 266 162 -108 -352 -271 216 137 -368 -672 -114 467 255 -403 -471 183 500 350 -301 -76 250 439
2279 439 193 5 150 186 -44 -264 -126 163 -48 -356 -389 6 123 -75 -362 -325 201 348 160 -179 164
2300 164 518 404 34 -155 77 257 -114 -197 -126 -122 -171 -200 -147 27 -8 -176 -248 -10 305 128 -27 -4 330
2323 330 456 186 -100 -94 -75 54 -146 -287 -356 -89 12 -89 -90 -50 -2 -81 3 85 223 164 17 203 263 345 52
2348 52 -191 -27 90 71 -149 -295 -250 -124 -11 -178 -276 -117 37 52 39 65 74 22 233 312 292 221 81 -105
2372 -105 24 101 -69 -279 -258 -145 77 -47 -273 -275 -74 75 11 100 12 91 209 187 160 373 149 -56 -133 -83
2396 -83 -99 -192 -297 -288 -17 79 4 -78 -138 39 122 -79 -117 140 211 307 166 58 278 199 42 -273 -181 -108 -72 -354
$$ packed form
2236G9L05K3q40j50P20L95o78q27L86R42Q5r50j94O31O42k56n45J58M75M2m07
2257C6o4K94j04k70k44Q1M87p9n05l04N58N81k12o58o8O54L17j50o51K25L26J89
2279D39k46j88J45L6k30k20J38K89k11l08l3L95J17j98k87L7N26J47j88l39L43
2300A64L54j14l70j89K32J80l71q3P1Mm9k9N3J74l5j68p2K38L15j77j55K3L34
2323C30J26k70k86OJ9J29k00j41o9K67J01j01jM0M8p9Q4Q2J38n9j47J86O0Q2k93
2348E2k43J64J17j9k20j46M5J26J13j67r8J59J54J5j3K6Rn2K11P9k0p1j40j86
2372a05J29P7j70k10K1J13K22j24k26kK01J49o4Q9q8P9J18k2k7K13k24k05p7N0
2396h3j6r3j05RK71R6p5q2o0J77Q3k01l8K57P1R6j41j08K20p9j57l15R2P3L6k82
$$ plain form
2422 -354 -222 0 10 -59 -239 -84 202 177 -111 -129 220 417 206 -69 -55 281 281 -34 -313 -167 -8 -107 -297
2445 -297 -269 -161 76 -91 -284 -91 238 70 -206 -218 349 507 243 -230 -63 427 296 -253 -216 -159 36
2466 36 -90 -238 -336 59 159 -154 -383 -13 342 178 -159 -180 329 556 56 -305 -38 391 263 -336 -359
2487 -359 -31 105 -261 -365 -240 223 153 -186 -266 106 544 240 -281 -100 509 596 -96 -303 68 467 111
2508 111 -453 -471 63 268 -209 -565 -178 231 121 -354 -339 146 585 59 -329 -88 454 597 -101 -465 55
2529 55 405 -12 -663 -267 225 258 -151 -614 -22 416 92 -447 -276 327 503 -45 -278 11 655 302 -186
2550 -186 -359 262 492 -239 -620 -230 342 334 -432 -634 -56 450 117 -456 -213 400 609 -115 -355 206 510
2571 510 230 -324 -164 281 335 -291 -545 -148 405 99 -586 -502 72 645 34 -399 -352 529 478 -155 -385
$$ packed form
2422c54J32K22J0o9j80J55K86k5k88j8L49J97k11k75J4L36%l15k79J46J59r9j90
2445b97K8J08K37j67j93J93L29j68k76j2N67J58k64m73J67M90j31n49L7N7J95
2466C6j26j48r8L95J00l13k29L70L55j64l37k1N09K27n00l61K67M29j28n99k3
2487c59L28J36l66j04J25M63p0l39q0L72M38l04n21J81O09Q7o92k07L71L99l56
2508A11n64j8N34K05m77l56L87M09j10m75J5M85M39n26l88K41N42J43o98l64N20
2529E5L50m17o51L96M92L3m09m63N92M38l24n39J71O03J76n48k33K89O44l53m88
2550a86j73O21K30p31l81L90N72qp66k02N78N06l33n73K43O13K09p24k40N61L04
2571E10k80n54J60M45N4o26k54L97N53l06o85Q4N74N73o11m33M7Q81n1o33k30
$$ plain form
2592 -385 261 621 99 -495 -34 391 134 -564 -444 73 495 -72 -585 -195 315 586 -118 -444 -52 586
2612 586 390 -141 -263 137 664 86 -496 -258 336 205 -486 -569 115 386 -205 -578 -206 569 359 -265
2632 -265 -435 276 604 244 -355 -174 413 444 18 -549 -194 236 171 -398 -554 5 315 -60 -492 -144 317
2653 317 152 -369 -159 477 508 -67 -402 74 616 299 -372 -524 -83 182 -27 -461 -413 -163 317 -45 -218
2674 -218 -26 260 146 -284 -33 521 427 -148 -324 88 752 139 -602 -536 162 295 -52 -394 -345 131 146
2695 146 -23 -124 82 131 189 210 23 173 282 14 -76 201 424 92 -582 -264 216 153 -403 -582 -103 344
2717 344 233 -282 -243 23 364 69 67 45 72 133 65 71 105 20 -212 -268 -91 53 -55 -379 -511 97 492 63
2741 63 -505 -319 326 515 118 -146 28 279 206 75 69 -114 -99 -92 -91 -95 -191 -305 -337 19 110 237 -134 -358 -3
$$ packed form
2592c85O46L60n22n94M61M25k57o98J20N17M22n67n13L90N10K71p04l26L92O38
2612E86j96n31j22M00N27n78n82K38N94j31o91q3O84K71n91l73L72P75k10o24
2632b65j70P11L28l60n99J81N87L1m26n67L55M30o5n69j56N59L10l75m32L48M61
2653C17j65n21K10O36L1n75l35M76N42l17o71j52M41K65k09m34M8K50M80l62j73
2674b18J92K86j14m30K51N54r4n75j76M12O64o13p41O6O98J33l47l42M9M76J5
2695A46j69j01K06M9N8K1j87J50J09k68r0K77K23l32o74L18M80o3n56j79M79M47
2717C44j11n15L9K66L41k95kk2K7O1o8OL4q5k32n6J77J44j08l24j32O08L95m29
2741F3n68J86O45J89l97k64J74K51p3j31oj83J5PJmr6j14l2L56R1J27l71k24L55
$$ plain form
2766 -3 327 373 -49 -162 -10 411 249 -66 -169 -27 -21 -63 28 -125 -270 -156 4 256 170 -190 -240 29 324
2789 324 317 116 -245 -78 259 357 250 -168 -270 98 357 -100 -346 -215 -84 -34 54 26 -170 -184 -42 382
2811 382 306 29 -142 -200 123 463 221 -77 -145 33 150 68 -98 -388 -193 124 90 -71 -38 -94 4 181 218
2834 218 52 -193 5 282 192 133 17 -183 28 259 145 -284 -444 -223 124 80 8 -308 -153 75 388
2855 388 226 -96 -175 -70 165 396 291 -127 -268 -13 246 65 -119 -410 -422 31 291 -12 -352 -210 -38
2876 -38 267 289 -8 -297 -11 307 305 116 -41 -214 -14 130 181 -105 -408 -264 -10 178 109 -157 -371 10
2898 10 292 360 -23 -76 24 128 368 136 -242 -172 104 222 13 -140 -193 -302 -32 238 18 -232 -244 19
2920 19 221 206 90 -323 -190 276 465 87 -223 -169 79 234 133 -258 -422 -221 204 89 -61 -148 -301
$$ packed form
2766cL30M6m22j13J52M21j62l15j03J42Om2R1j53j45J14J60K52q6l60n0K69K95
2789C24pk01l61J67L37R8j07m18j02L68K59m57k46J31J31N0Q8k8j96j4J42M24
2811C82p6k77j71n8L23L40k42k98o8J78J17q2j66k90J95L17l4j61L3n6R8J77L7
2834B18j66k45J98K77r0n9j16k00K11K31j14m29j60K21L47m4p2l16J55K28L13
2855C88j62l22p9J05K35K31j05m18j41K55K59j81j84k91j2M53K60l03l40J42J72
2876c8L05K2k97k89K86L18kj89j57j73K00J44N1k86l03J44K54J88o9k66k14L81
2898A0K82O8l83n3J00J04K40k32l78P0K76J18k09j53n3j09K70K70k20k50j2K63
2920A9K02j5j16m13J33M66J89l78l10N4K48J55j01l91j64K01M25j15j50q7j53
$$ plain form
2941 -301 -61 412 334 7 -103 -87 101 394 297 -14 -400 -5 322 254 -193 -255 -241 -80 142 69 -385 -274
2963 -274 -114 145 281 11 -196 -198 376 470 96 -113 -12 -62 132 246 106 -366 -511 -27 337 59 -311
2984 -311 -419 -15 279 247 -187 -187 -26 15 361 291 18 -287 -85 367 246 -56 -249 -136 -42 27 124 -296 -388
3007 -388 -53 110 236 107 -221 -116 302 494 137 -204 -12 110 27 196 42 -385 -443 142 272 33 -328
3028 -328 -298 -95 254 286 25 -270 -103 102 355 305 -37 -277 8 489 173 -329 -201 -38 -8 34 77 -28
3050 -28 -447 -182 191 370 115 -337 -331 177 468 137 -138 -203 25 244 172 88 -407 -504 17 293 -25 -413
3072 -413 -227 -163 35 218 116 -67 -267 198 411 263 -112 -346 -17 372 281 -265 -342 -58 39 68 50 -108
3094 -108 -427 -263 136 244 -131 -335 -35 155 326 186 -136 -214 -58 300 375 109 -334 -465 212 421 -169
$$ packed form
2941c01K40M73p8l27j10J6J88K93r7l11l86L95L27o8m47o2J4J61K22p3m54J11
2963b74J60K59J36k70k07kN74R4l74k09J01n0J94J14j40m72j45M84L64k78l70
2984c11j08M04K94l2m34%J61M1L46p0k73l05K02M52j21l02j93J13R4O9R7m20r2
3007c88L35J63J26j29l28J05M18J92l57l41J92J22q3J69j54m27n8N85J30k39l61
3028c28L0K03L49L2k61k95J67K05K53n0l42k40K85M81l16n02J28J63L0M2M3j05
3050b8m19K65L73J79k55m52ON08K91l31k75o5K28K19p2q4m95r7N21K76l18l88
3072d13J86O4J98J83j02j83k00M65K13j48l75k34L29L89r1n46p7K84R7K9j8j58
3094a08l19J64L99J08l75k04L00J90J71j40l22p8J56L58P5k66m43j31O77K09n90
$$ plain form
3115 -169 -476 -97 -4 233 82 44 -130 -338 -7 451 234 -112 -215 31 374 314 -72 -351 -259 -78 141
3136 141 216 -66 -613 -254 416 142 -264 -351 -22 24 154 154 -5 -153 -143 217 352 179 -245 -375 -56 246
3158 246 94 -181 -344 -152 56 235 60 -237 -338 195 486 57 -155 -156 143 133 153 97 -69 -351 -131 156
3180 156 266 -232 -517 -268 348 441 -108 -334 -246 148 245 201 -80 -383 3 356 408 -53 -447 -147 196 106
3202 106 -7 -164 -201 -301 47 279 257 -362 -419 79 517 191 -259 -300 -1 208 225 64 -181 -348 174 238
3224 238 120 -272 -331 -115 68 169 16 -192 -284 -187 243 325 31 -379 -111 322 491 -29 -426 -59 167
3245 167 209 129 -151 -148 -217 78 236 6 -355 -261 129 210 102 -81 -139 -214 174 333 190 -317 -354 -9 397
3268 397 173 -273 -437 -26 91 123 42 -170 -214 5 246 280 -37 -152 34 313 223 -49 -256 -182 150 232
$$ packed form
3115a69l07L79R3K37j51l8j74k08L31M58k17l46j03K46L43o0l86k79R2J81K19
3136A41P5k82n47L59O70k74m06q7L29M6J30%j59j48J0L60J35j73m24j30L19L02
3158B46j52k75j63J92K08J79j75k97j01N33K91m29k12jK99j0K0n6j66k82K20K87
3180A56J10m98k85K49O16R3n49k26Q8L94R7m4k81l03L86L53N2m61l94L00L43r0
3202A06j13j57l7j00L48K32k2o19n7M98M38l26m50m1K99K09J7j61k45j67N22O4
3224B38j18l92n9K16J83J01j53k08r2R7M30Q2k94m10K68M33J69n20l97L67K26
3245A67M2q0k80Lo9K95J58k30l61R4L90Q1j08j83n8p5L88J59j43n07l7L45M06
3268C97k24m46j64M11J17L2q1k12m4K19K41L4l17j15J86K79r0k72k07P4L32Q2
$$ plain form
3290 232 262 -161 -410 -241 -35 332 -175 -421 -142 239 342 236 -94 -156 -144 219 374 171 -53 -186 46
3311 46 207 238 -172 -388 -261 27 415 142 -301 -398 -16 435 228 -25 -208 7 149 182 155 -161 -211 -90
3333 -90 119 2 -122 -261 -264 30 247 23 -151 -252 18 11 276 -89 -255 -78 247 365 -9 -191 -50 220
3355 220 285 211 -123 -303 -64 112 212 15 -234 -241 -53 285 115 -3 -107 -135 271 338 177 -242 -185 53
3377 53 269 218 -160 -212 -10 181 135 40 -238 -249 -23 217 278 -13 -257 -107 103 285 266 -109 -339 -41 218
3400 218 271 1 -286 -318 152 263 -80 -269 -151 -74 162 230 18 -178 -158 135 292 73 -80 -131 -19 89
3422 89 214 -127 -292 -183 49 51 -110 -127 -400 -129 256 176 -146 -182 -118 186 273 77 -66 -177 111 105 110 89
3446 89 -216 -156 6 346 -80 -297 -193 -94 168 277 28 -189 -87 249 377 91 -256 -227 -72 342 179
$$ packed form
3290B32L0m23k49J69K06L67n07k46K79L81J03j06l30o2J2L63J55k03k24j33K32
3311D6J61L1m10k16J27K88L88k73m43r7L82M51k07k53j83K15J42L3k7l16n0J21
3333i0K09j17j24j39lK94K17k24j74j01K70pK65l65j66J77L25J18l74j82J41K70
3355B20O5p4l34j80K39J76J00j97k49pJ88L38j70j18j04k8M06O7j61m19N7K38
3377E3K16n1l78n2K02J91m6r5k78j1K26K40O1k91k44J50K10J82j9l75k30K98K59
3400B18N3k70k87l2M70J11l43j89J18P7K36O8k12j96K0K93J57k19j53n1J12J08
3422H9J25l41j65J09K32Kj61j7k73K71L85q0l22l6O4L04Q7j96j43j11K88oNk1
3446H9l05O0J62L40m26k17J04R9K62J09k49k17J02L36J28k86l47K9J55M14j63
$$ plain form
3467 179 -223 -275 -159 -17 54 33 -69 -281 -132 145 292 -4 -349 -119 96 224 292 -124 -247 61 243
3488 243 244 7 -272 -168 161 242 -30 -338 -165 43 37 45 20 -4 -186 11 196 166 -67 -338 96 168 322 -85
3512 -85 -232 -139 282 8 38 -83 -226 -217 166 249 -123 -161 21 85 91 195 131 -41 -120 218 248 121 -236 -254 41
3537 41 307 100 -381 -187 142 102 -27 -27 27 36 21 230 142 -46 -56 -17 126 -97 52 13 -200 110 69 65 25
3562 25 -248 -217 158 398 -151 -366 -81 177 83 -52 15 -64 19 69 106 23 -123 -31 18 256 102 -88 -112 -108 38
3587 38 95 98 -73 -317 37 452 137 -271 -251 76 244 63 54 28 -66 144 -8 11 76 -46 -178 -48 300 65
3611 65 -102 -146 87 37 134 14 -286 -161 166 313 26 -213 -42 129 75 -63 -240 -89 65 65 -68 19 118
3634 118 -11 -164 188 320 -14 -248 2 158 193 65 -160 -156 62 243 46 -234 -209 -56 187 76 -155
$$ packed form
3467A79m02n2J16J42P1k1j02k12J49K77J47k96l45K30K15J28O8m16j23L08J82
3488B43Jk37k79J04L29Q1k72l08J73K08oQk5k4j82J97J85l0k33k71M34P2J54m07
3512h5j47R3M21k74L0j21j43RL83Q3l72l8J82O4OJ04o4j72p9L38L0j27l57j8K95
3537D1K66k07m81J94L29m0j29%N4Rj5K09q8j88j0L9J43k23J49l9k13L10m1mm0
3562B5k73L1L75K40n49k15K85K58r4j35O7p9Q3N0L7q3j46R2M9K38j54j90k4MJ46
3587C8N7Lj71k44L54M15l15m08K0L27J68j81rk6r4K10j52J9O5j22j32J30L48k35
3611F5j67m4K33n0R7j20l00J25L27J47k87k39J71J71n4j38j77J51J54%j33Q7R9
3634A18j29j53L52J32l34k34K50J56L5j28k25MK18J81j97k80K5J53K43j11k31
$$ plain form
3655 -155 -116 55 125 18 -20 234 41 -125 76 221 32 -190 -215 42 154 110 -90 -230 -166 182 45 -130
3677 -130 -262 -120 177 243 -82 -125 -162 9 -47 -7 188 161 -144 -122 167 166 -68 -207 -220 0 222 76 -84
3700 -84 -115 76 325 47 18 -63 -61 153 210 -68 -63 -34 54 -39 -1 213 -102 -65 58 197 37 -148 -69 15 211
3725 211 17 -114 -145 102 277 99 -59 -173 -181 63 32 -63 -197 -16 -17 -90 -64 16 25 -230 -43 258 234 34
3749 34 -200 -99 202 309 -2 -184 24 208 88 11 1 -63 -129 133 70 -82 -105 43 -31 3 109 58 30 -236
3773 -236 24 250 69 -49 -112 -14 27 75 -80 -176 30 -42 -61 -90 -20 -27 3 114 2 24 8 18 -38 79 142 31
3799 31 -133 -61 7 121 10 -127 -91 145 106 -111 -184 39 45 -8 73 -39 -59 -55 -51 55 60 42 53 33 -87 91 -53
3826 -53 -117 -113 47 130 51 -80 -131 -20 100 -113 -110 -185 -24 32 42 76 3 -139 -13 13 14 20 -125 5 -138 187
$$ packed form
3655a55L9J71P0j07l8K54j93j66K01J45j89k22k5K57J12m4k00j40O4L48j37j75
3677a30j32J42K97O6l25m3l7J71n6M0J95k7l05K2K89jk34j39j3K20K22j46j60
3700h4l1J91K49k78k9q1KK14N7k78NK9Q8r3L8K14l15L7J23J39j60j85P9Q4J96
3725B11j94j31l1K47J75j78j58j14qK44l1r5j34J81jp3K6Q0Rk55J87L01k4k00
3749C4k34J01L01J07l11j82K08J84j20p7j0o4o6K62o3j52k3J48p4L4J06n1k8k66
3773b36K60K26j81j18o3R8M1M8j55r6K06p2j9k9P0pL0J11j12K2j6J0n6J17O3j11
3799C1j64P2O8J14j11j37L6K36l9k17p3K23On3Q1j12k0MMJ06Nj8J1k0j20J78j44
3826e3o4MJ60Q3p9j31n1J11J20k13Lp5J61N6J0L4p3j42J26K6JOj45J30j43L25
$$ plain form
3852 187 139 -91 -165 -73 95 26 -30 -63 -131 127 171 16 -65 -67 -15 95 95 42 -47 -170 8 47 41 -26 -70 -65 -60 96
3880 96 6 88 -25 87 113 76 -35 39 -13 7 -42 -81 11 4 -129 -42 115 -78 -45 25 -52 15 -79 -67 18 -48 111
3907 111 141 -5 -88 -39 92 126 42 -43 44 -2 32 34 -76 -21 29 24 -9 27 127 12 50 66 11 38 -45 96 -3 71
3935 71 -10 0 -39 -56 -22 52 29 -99 -45 52 -11 32 -46 18 39 86 -1 -100 -31 113 74 25 39 -23 -32 27 161 44 -67
3964 -67 -2 16 49 58 -44 55 -7 35 69 55 -31 -56 14 92 -13 -29 16 -141 -70 0 -180 50 -102 -49 3 115 -30
3991 -30 -27 -28 92 -28 116 -15 11 -37 29 155 -103 -48 -61 72 91 58 -127 126 12 12 -41 -40 55 25 -5 78 68
4018 68 25 -85 -1 -49 61 15 -4 -181 -88 98 96 -34 -29 39 47 56 -60 -142 5 77 -33 28 -16 94 108 76 88 1
4046 1 -83 -6 32 65 49 -57 -96 -76 -90 19 56 -52 -78 -16 51 77 13 22 73 -69 -87 53 38 -35 -14 12 -96 -47
$$ packed form
3852A87m8k30p4R2J68o9n6l3o8K58M4j55q1kN2J10%n3q9j23J78L9oo7m4NNJ56
3880I6r0Q2j13J12K6l7j11P4n2K0m9l9R2pj33Q7J57j93L3P0p7O7r4J2Q5o6J59
3907A11L0j46q3M9J31L4q4q5Q7m6L4Kj10N5N0nl3L6J00j15L8J6n5K7q3J41r9P4
3935G1q1J0l9j7L4P4k3j28N4R7o3M3p8O4K1M7q7r9O9J44l9m9J4o2rN9J34j17j11
3964f7O5J8L3Rj02R9o2M2L4j4q6k5P0P8j05j6M5j57P1P0j80K30j52N3N2J12j45
3991c0LjJ20j20J44j31K6m8O6J26k58N5j3J33J9l3j85K53j14%n3JR5l0l0Q3j0
4018F8m3j10Q4m8J10m6j9j77R3J86kj30NO8QRj16q2J47P2j10O1m4J10J4l2J2q7
4046Aq4P7L8L3j6j06l9K0j4J09L7j08k6O2O7K6o4RN1j42j8J40j5p3K1K6j08M9
$$ plain form
4074 -47 -89 1 -45 35 -23 1 -49 32 40 -59 137 -58 89 -11 58 -49 -90 -9 -9 -36 -33 -94 -50 123 -18 -6 -48 -33
4102 -33 -13 -61 130 -33 -31 -47 12 76 134 -17 5 -74 5 -32 9 26 -86 -69 14 57 9 29 -91 30 73 147 12
4129 12 17 5 25 54 16 -81 30 -8 -6 -100 -19 -47 -87 -10 7 26 153 90 -33 19 39 -61 -65 -95 92 -3 24 125 62
4158 62 -9 -30 -52 -89 -80 -128 -1 -4 48 -78 -51 -80 41 49 157 51 57 31 43 -30 -74 -113 67 -31 -52 13 -161 -47
4186 -47 18 -3 -92 62 97 34 -144 99 17 11 49 -5 -33 65 72 -50 -84 -51 22 -44 9 -14 -117 27 17 14 -25 -1 40
4215 40 -26 8 30 116 -68 -95 -29 88 -85 -14 -38 7 96 -108 -87 -47 -93 65 40 -58 8 -5 7 -83 26 64 69 0
4243 0 -128 73 39 -25 -11 -10 73 -109 -189 -190 -6 131 -45 -83 16 111 28 -4 -60 22 83 112 32 -21 70 37 -49 -37 11
4272 11 103 -57 -98 -78 -202 -164 11 -49 -6 -39 -97 -53 73 165 40 -65 -68 -33 71 30 -15 -81 -38 -97 -104 -2 -85
$$ packed form
4074d7m2R0m6Q0n8K4n0Q1Qr9J96j95J47j00O9j07m1Q1%k7Lo1M4J73j41J2m2J5
4102c3K0m8J91j63Kj6N9O4N8j51K2p9P9l7M1J7j12J7Q3M3m8K0j20J21M3P4j35
4129A2Nj2K0K9l8r7J11l8Kr4Q1k8m0P7J7J9J27o3j23N2K0j00ml0J87r5K7J01o3
4158F2p1k1k2l7Rm8J27lN2j26K7k9J21QJ08j06Ok6J2p3m4l9J80r8k1O5j74J14
4186d7O5k1q9J54L5o3j78K43q2oL8n4k8R8Pj22l4L3P3o6N3k3j03J44j0ll9K4M1
4215D0o6L4K2Q6j84k7O6J17j73P1k4M5Q9k04K1M0m6J58k5r8O6j3J2r0J09L8No9
4243@j28K01l4o4J4JQ3j82q0jJ84J37j76l8R9R5q3l2n6Q2O1K9q0n3R1l3q6J2M8
4272A1R2j60m1K0j24L8J75o0M3l3n8M4J26R2j25j05lL5J04m1m5o6M3n9pJ02q3
$$ plain form
4299 -85 -88 -71 75 -1 47 100 65 -1 -37 26 67 113 3 25 -13 108 -7 -96 -49 37 83 -54 -3 -18 -43 -62 13 72
4327 72 55 -64 -10 40 -72 40 53 -81 -14 50 2 -15 62 37 -166 -27 13 -88 -120 -50 42 -174 95 102 5 62
4353 62 35 24 -23 -24 21 -127 -8 -22 14 130 -76 -36 -79 -20 -21 -45 -68 63 18 -78 -54 122 -57 114 34 -13 0
4380 0 -69 -33 -78 16 70 40 -98 -18 -37 86 -9 110 90 -15 14 -11 -94 45 103 38 -11 -81 -6 -8 -47 -53 -179 78
4408 78 38 -170 2 36 -19 41 74 -87 62 65 25 -73 -87 93 -25 17 31 12 62 -165 -57 -121 24 23 34 73 -28
4435 -28 60 -130 61 101 53 1 59 60 31 -31 -56 -5 -47 -73 -86 -88 -55 -110 10 -134 -25 -45 86 -69 -26 -102 13
4462 13 70 26 68 6 32 -33 -87 -20 101 58 -38 -58 -8 -7 68 -65 -70 19 127 42 95 29 21 33 76 66 19 -27 -12 -63
4492 -63 -183 -111 11 6 -34 5 -65 -114 67 -83 26 114 -1 -79 -51 137 130 -10 -38 -74 49 -40 42 27 95 -97
$$ packed form
4299h5lJ7J46p6M8N3l5o6l6O3M1M6j10K2l8J21j15q9M7Q6M6j37N1j5k5j9P5N9
4327G2j7j19N4N0j12J12J3j34O7O4m8j7P7k5k03J39M0j01l2P0R2k16K69Pr7N7
4353F2k7j1m7jM5j48J19j4L6J16k06M0m3N9jk4k3J31m5r6K4J76j79J71q0m7J3
4380@o9L6m5R4N4l0j38Q0j9J23r5J19k0j05K9k5q3J39N8o5m9p0P5kl9oj26K57
4408G8m0k08J72L4n5O0L3j61J49Lm0r8j4J80j18M2J4j9N0k27J08o4J45jJ1L9j01
4435b8Q8j90J91M0m8n2N8Jk9o2k5N1m2k6j3kL3n5J20j44J09k0J31j55M3p6J15
4462A3N7m4M2o2K6o5n4O7J21m3r6k0N0JP5j33nQ9J08q5N3o6qJ2M3j0m7m6J5n1
4492f3j20P2J22nm0L9p0m9J81j50J09Q8j15p8K8J88pj40k8l6J23q9Q2j5O8j92
$$ plain form
4518 -97 -70 -129 -4 114 -3 6 -117 114 101 58 -97 -25 145 19 -149 2 16 56 4 -147 -20 -53 -108 -195 -67
4543 -67 -6 -76 -30 -50 -63 173 104 16 -7 92 89 101 107 62 8 -5 -50 -71 -62 -70 -93 -46 -89 106 -2 -46 -2 91 -19 -18 -15
4574 -15 10 -42 -8 -16 -79 -29 13 26 -158 -37 -112 19 54 -115 -90 13 18 -42 -20 -35 -2 -3 111 73 -25 8 -12 12 90
4603 90 -59 -19 -90 -105 -77 104 -58 -71 -106 86 18 50 20 -34 118 32 -46 -61 -51 78 -2 -3 10 26 -33 -78 -140 -26
4631 -26 -143 -51 -66 -63 -46 103 61 27 -80 46 151 -23 143 71 -68 -61 111 -9 -46 151 28 -76 -18 -27 -38
4656 -38 22 14 62 -95 56 -25 -3 7 4 -12 -82 5 -33 60 -70 42 -71 -49 -61 -53 32 110 -134 -42 -45 128 -33 -83
4684 -83 127 -15 -80 -99 -91 139 -56 -21 -52 -115 -105 -115 -11 -15 -95 -65 5 -55 53 1 -174 94 52 22 112 -21 -190
4711 -190 13 82 55 51 -55 66 54 -4 10 -47 30 -141 9 4 4 20 -61 6 93 74 -47 -83 55 -65 -59 -5 9 -17
$$ packed form
4518i7K7n9J25J18j17Rj23K31j3m3j55P2J70j26j68J51J4M0n2j51J27l3n5q7J28
4543f7O1p0M6k0j3K36o9q8k3R9lJ2Om5n4j3m5k1Rqk3M7m3J95j08m4M4R3j10JL
4574a5K5n2L4qo3N0M2J3j84J21p5J31L5j69K5J03No0K2j5L3jJ14l8r8L3k0K4P8
4603I0j49M0p1j5K8J81j62j3l5J92o8L2l0n4J52q6p8j5J0J29q0jJ3J6n9m5o2J14
4631b6j17R2j5LJ7J49m2l4j07J26J05j74J66p2j39PJ72j20l7J97j23j04N8rj1
4656c8O0qM8j57J51q1K2J0lj6p0Q7l8R3j30J12j13K2j2QQ5P8k44R2lJ73j61n0
4684h3K10j42o5j9QK30j95L5l1o3J0j0J04mq0L0P0o0J08n2j75K68m2l0R0j33j69
4711a90K03O9k7mj06J21j2n8J4n7P7j71J50n%J6q1O7Q7j9j21l6J38j20ON4J4k6
$$ plain form
4739 -17 23 74 -95 -41 -71 -25 -76 -2 -6 -54 -88 51 -86 76 120 34 -19 0 39 -104 55 68 -136 11 -36 136
4765 136 -83 -37 146 94 64 28 10 15 76 108 41 -49 139 51 5 38 -53 -38 51 165 -8 -164 6 -27 -41 -132 76
4792 76 -22 -116 63 12 19 36 -42 -11 100 71 68 20 -47 24 -25 74 4 -134 -90 120 80 -39 -10 -28 51 14 119 97
4820 97 32 4 -12 145 38 -51 -60 -21 10 -122 -128 28 -61 -17 -90 27 -50 -30 2 24 118 24 -38 -26 -6 -26 20 -139
4848 -139 37 4 -87 -146 -146 -145 -148 25 104 -87 -57 -129 68 41 -3 72 -53 -54 6 175 17 9 -235 20 37 -30 -58 -97
4876 -97 -79 -46 -61 -4 -4 -59 41 -18 -45 -43 -142 -112 -21 88 91 31 -126 52 82 -7 48 -81 -155 -71 130 -27 -53 -89
4904 -89 45 90 83 42 -60 45 4 92 17 73 -18 -38 -3 101 -46 -124 -95 -83 -92 -135 33 -56 -48 3 137 6 -18 15
4932 15 -2 35 41 -7 -104 54 -110 70 -46 97 -190 -42 65 -28 -47 -86 -96 120 97 -20 -21 72 8 112 48 -20
$$ packed form
4739a7M0N1j69N4l0M6n1P4mm8l4J39j37J62M4q6n3J9L9j43J59J3k04J47m7J72
4765A36k19M6J83n2l0l6j8NO1L2o7r0J88q8m6L3r1J5Q9J14j73j56J70l3j4r1K08
4792G6r8r4J79n1PJ7p8L1J11k9lm8o7P1m9R9p0j38M4K10m0j19K9j8P9l7J05k2
4820I7o5k8j6J57j07q9rL9L1j32oJ56q9M4p3J17p7K0L2K2R4r4o2J2K0k0M6j59
4848a39J76l3r1n9%JlJ73P9j91L0p2J97k7m4P5j25jO0J69j58qk44K55J7o7k8l9
4876i7J8L3j5N7%n5J00n9k7Kr9L0R1J09Lo0j57J78L0q9N5j29p4Q4K01j57k6l6
4904h9J34M5pm1j02J05m1Q8p5N6r1k0L5J04j47p8K9J2rm3J68q9QN1J34j31k4L3
4932A5j7L7Om8r7J58j64J80j16J43k87J48J07r3j9l9j0K16k3j17jR3o4J04o4o8
$$ plain form
4958 -20 -31 -3 91 33 -112 -205 29 -5 37 -59 39 -16 -62 4 44 25 -13 27 8 123 180 2 -35 93 135 -58 -36
4985 -36 93 8 84 123 4 -70 -44 -97 86 184 69 -35 7 120 55 111 90 7 -157 -38 55 17 -100 -172 52
5010 52 -54 31 -19 37 61 -100 90 78 102 0 108 142 113 -41 23 -8 -22 -20 -20 79 -115 -88 100 26 -38 -81 73
5037 73 114 16 3 -53 182 35 48 -32 55 -54 -1 6 134 -39 -104 -148 33 39 21 -53 -37 -108 60 99 45 -101 -125
5064 -125 93 92 131 -39 74 -4 90 170 136 -119 -38 -173 109 171 62 -221 -148 30 1 13 -60 31 22 145 180 62
5090 62 -97 -116 65 48 -59 -42 -72 -54 -18 69 33 -116 -92 5 38 14 -45 -42 29 59 31 86 -16 -72 54 53 53 -70
5118 -70 -182 -59 25 -31 -35 -153 22 -51 18 63 13 -34 -68 69 33 -65 -45 157 42 95 -67 -75 -124 37 18 24 -51
5145 -51 -68 -21 33 62 105 -23 -20 75 124 134 -20 24 -71 -88 107 -55 -107 -209 -157 106 39 -118 -69 -69 -148 -19 73
$$ packed form
4958b0j1K8R4n8j45r3K34l4M2r6R8n5m6O6M0j9l8M0j9J15N7j78l7J28M2j93K2
4985c6J29q5P6L9j19p4K6n3J83R8j15j04M2J13o5N6k1q3j64J19R3l8j17p2K24
5010E2j06Q5n0N6K4j61J90j2K4j02J08L4k9j54O4l1j4K%R9j94K7J88p4o4m3J54
5037G3M1r8j3n6K35j47J3q0Q7j09N3PJ28j73o5m4J81Oj8p4J6p1J68L9n4j46k4
5064a25K18jL9j70J13p8R4Q0l4k55Q1j35K82O2j09k83P3J78k9J2p3R1rJ23L5j18
5090F2j59j9J81j7j07J7l0J8L6Q7l6j49K4R7L3k4n9LP1L0k8N5j02n6J26j%j23
5118g0j12J23Q4n6mj18J75p3O9M5n0m7l4J37l6r8K0K02j15N3j62qm9J61j9Op5
5145e1j7M7N4K9M3j28LR5M9J0j54M4r5j7J95j62n2j02N2K63o7j57M9%p9J29R2
$$ plain form
5172 73 -52 -183 -71 96 228 98 -70 -88 27 90 -40 -153 -5 -82 64 123 32 -141 -101 25 104 9 48
5195 48 -80 -42 -7 65 85 -25 -107 4 53 -1 23 -14 -84 -10 38 -95 -137 -88 32 35 27 -31 -166 -33 89 37 -8
5222 -8 -17 32 76 59 102 -60 9 -11 -63 14 -58 -120 -154 31 128 -39 -100 -19 -29 59 91 101 -76 -138 -22 128 78 -90
5250 -90 -138 13 -10 -26 -126 -119 -89 -107 148 144 -19 -130 -84 123 174 -45 -12 -86 -2 80 -14 -97 -168 -66 -22 114 53
5277 53 -133 -136 25 58 60 -3 28 -65 25 173 219 -7 -156 28 120 162 -11 -80 -39 66 61 -9 -106 -56 16 -22 79
5304 79 -28 -48 -116 147 158 10 36 38 5 66 38 -82 -95 66 -38 12 84 -136 -120 10 123 -19 -117 -70 37
5329 37 29 95 154 18 -91 -27 59 42 -15 -67 25 61 41 40 -183 -150 -53 12 2 -55 -83 -47 77 128 -59 105 44 -84
5357 -84 103 68 -70 -104 -4 17 112 15 -120 -137 -26 109 -20 -63 -28 -104 12 92 121 -133 -110 -62 39 48 32 -107
$$ packed form
5172G3j25j31J12J67J32j30j68j8J15O3j30j13J48p7J46N9r1j73M0J26P9r5L9
5195D8j28L8L5P2K0j10q2J11M9n4K4l7p0P4M8j33m2M9J20Lqn8j35J33J22n2m5
5222hrM9M4j7M3j62O9k0n2P7p2o2l4J85R7j67o1Q1j0Q8L2J0j77o2J16J50n0j68
5250i0m8J51k3j6j00PL0j8K55mj63j11M6K07N1k19L3p4Q4Q2r4q3p1J02M4J36o1
5277E3j86lJ61L3Ko3L1r3R0J48M6k26j49J84R2M2j73o9M1J05np0r7N0P2l8J01
5304G9j07k0o8K63J1j48K6Kl3O1k8j20j3J61j04N0P2k20J6J30J13j42r8M7J07
5329C7qO6N9j36j09O4Q6j7n7n2R2L6k0jk23L3R7O5j0n7k8L6J24N1j87J64o1j28
5357h4J87l5j38l4J00K1R5r7j35j7J11J35j29m3L5p6J16Q0K9k54K3M8J01Rj6j39
$$ plain form
5383 -107 -14 55 -13 59 -2 -134 -61 -115 99 -6 -52 -139 85 109 -4 -70 -100 -16 53 48 61 -122 -93 -62 -35 -34 -31 -47
5411 -47 2 95 26 -6 0 -76 -49 29 116 -38 -34 78 116 75 -21 -21 -176 104 -92 65 -65 -95 -39 -39 31 59 -109 -98
5439 -98 -6 159 154 92 -107 -16 21 115 84 -75 -69 78 65 10 10 -115 -40 63 43 -73 -53 -116 18 21 59 105 59 -87
5467 -87 93 146 63 27 -2 -139 152 -30 -95 -39 -96 45 18 27 -117 -123 49 159 87 -22 -16 9 93 92 157 55 -2
5494 -2 -76 134 11 -16 -135 -157 31 82 -43 -154 -25 -1 51 80 15 66 -55 88 191 35 -16 -111 -9 101
5518 101 70 -33 -43 -65 44 138 -29 -102 -141 -171 60 203 -73 -154 -11 96 43 -57 -52 32 -29 73 -32 -89 -70
5543 -70 -97 -14 80 -40 -65 -179 -71 -65 34 6 -24 -112 115 12 144 -126 -28 -33 29 41 46 69 -20 -39 -41 40 -23 -80 -65
5572 -65 43 49 -81 9 5 41 271 84 -41 -93 25 108 73 -91 -6 -53 3 3 -59 -44 47 -2 -130 -4 65 -30 -75
$$ packed form
5383a07R3O9o8P2o1j32P3n4K14j05m6q7K24K4j13o6l0Q4O9nJ3j83K9L1K7JLj6
5411d7M9R3o9l2Op6K7P8Q7j54MJ12L8m1r6%j55K80j96J57j30l0N6%P0K8j68J1
5439i8R2J65no2j99R1L7R4l1j59OJ47j3n5%j25P5J03k0j16K0o3J34LL8M6m6j46
5467h7J80N3q3l6k9j37K91j82o5N6n7J41k7Rj44oJ72J10p2j09OK5Q4jO5j02n7
5494bp4K10j23k7j19k2J88N1j25j11J29K4N2K9o5N1j21J43J03j56n1r5J02J10
5518A01l1j03j0k2J09R4j67p3l9l0K31J43k76q1J43J07n3j00NQ4o1J02j05n7J9
5543g0k7Q3R4j20k5j14J08OR9k8l0q8K27j03J32k70R8nO2J2NK3q9j9kQ1o3n7J5
5572f5J08Oj30R0mL6K30j87j25n2J18Q3l5j64Q5m7N6%o2J5R1m9j28J26O9r5m5
$$ plain form
5599 -75 89 132 -10 -5 -72 2 148 -4 0 -88 -7 2 79 -55 -259 -56 53 46 -11 -100 -17 22 -30 94 153 109 -138
5626 -138 2 150 169 5 1 10 -77 53 45 -62 -91 14 0 95 -28 -101 -31 56 71 65 -20 -19 -40 -17 84 -30 -68 -47
5654 -47 -85 78 145 -47 -95 -50 -11 61 14 33 -64 -8 136 -25 -58 81 39 10 -13 -3 73 27 -51 -145 -31 5 -139
5681 -139 -247 46 158 45 -44 -54 61 67 -49 33 23 19 -18 3 46 -42 14 35 15 -116 -23 -110 -136 38 17 17 -11
5708 -11 -116 -50 105 144 84 -90 48 69 144 -97 -47 43 72 -46 -57 -55 -46 -3 -38 3 -53 -84 -1 -44 30 65 57 -83
5736 -83 -66 -33 116 108 -132 -22 20 46 -108 4 -38 38 38 -137 -14 25 -11 19 -76 46 35 115 93 19 31 63 -40
5763 -40 129 -113 -2 148 9 -109 -36 -21 40 64 -142 -1 26 1 27 -36 120 51 -3 162 89 81 37 99 88 73
5789 73 -20 32 -60 -24 19 -1 -74 -88 29 214 54 -17 -36 181 93 21 61 3 -33 -58 -64 -28 128 2 -32 -34 -30 -51 -131
$$ packed form
5599g5J64M3j42No7P4J46j52Mq8Q1RP7j34k04K03J09pn7q9Q3L9n2J24N9m4k47
5626a38J40J48J9j64mRq7J30qj07k9J05j4R5j23p3P0Q7J5oq5Jk1K3J01j14l8K1
5654d7l8J63O7j92m8M5L9P2m7J9r7N6J44j61l3J39m2k9k3J0P6m6p8r4J14L6j44
5681a39j08K93J12j13q9j0J15Oj16Q2j0ml7K1M3q8N6K1k0j31R3q7k6J74k1%k8
5708a1j05O6J55L9o0j74J38K1P5k41N0R0K9j18j1KRM3l5M1n6l1Q3m3P4L5qj40
5736h3J7L3J49qk40J10M2K6j54J12m2P6%j75J23L9l6L0r5J22j1Q0k2p4J2L2j03
5763d0J69k42J11J50j39j18P3J5O1K4k06J41K7k5K6o3J56o9n4J65p3qm4O2j1j5
5789G3r3N2r2L6M3k0p3j4J17J85j60p1j9K17q8p2M0n8l6k5oL6J56j26l4kMk1q0
$$ plain form
5818 -131 -92 110 -96 50 111 -78 0 100 23 37 -60 -22 38 -6 62 64 127 -58 -94 -163 16 -9 -23 -4 3 70 154
5845 154 -34 -40 50 97 69 -87 -87 -60 17 -101 19 -49 -58 -8 -169 -117 39 -99 -59 20 -52 133 44 -6 -99 67 97
5872 97 2 -39 29 30 70 -68 -77 -29 97 -21 -27 24 29 -6 -48 105 97 71 25 45 -8 -100 146 68 -54 -6 11 34 -12 -100
5902 -100 -41 111 30 -108 -120 38 52 44 23 70 52 17 -29 -21 150 34 -6 19 77 52 -73 -46 36 119 -5 -62 -63 2
5930 2 -15 30 -51 143 -14 51 -58 1 78 35 17 -38 14 -32 87 9 13 -50 3 30 -52 -129 -61 -11 2 -48 -21 15 38
5959 38 -25 33 -63 67 78 -38 33 75 -21 -40 19 -72 -25 55 -79 6 -42 -34 -34 -135 -35 85 32 -18 47 15 104 -52
5987 -52 15 26 101 2 33 5 -88 -11 -60 -22 -35 67 58 -8 -157 98 88 43 -32 -79 -53 96 -33 -52 -112 29 -14 48
6015 48 -16 -19 55 9 -7 30 58 -52 102 -75 48 115 77 24 -59 64 58 -141 -101 -38 62 18 -16 -119 -22 61 -90
$$ packed form
5818a31L9K02k06J46O1j89P8J00p7J4r7L8O0m4O8KO3j85l6o9J79k5j4J9PO7Q4
5845A54j88oR0M7k8j56%K7P7j18J20o8rN0j61N2J56j38M0P9p2J85q9n0r3J66L0
5872I7r5m1O8JM0j38rM8J26j18oN1Nl5m2J53qk6m6K0n3r2K46p8j22M8J7K3m6q8
5902a00N9J52q1j38j2J58J4qk1M7j8l5m6QJ71j16m0K5N8k5j25K7Q2Q3j24n7jO5
5930Bj7M5q1J94j57O5j09N9P7m3j8n5N2m6J19p8Mo3N3K7q2p7O8N0J3n0K7L6K3
5959C8o3N8r6J30J1j16P1M2r6j9N9r1M7Q0j34Q5m8Q%j01J00J20n3n0O5l2Q9j56
5987e2O7J1P5r9L1k8r3P7m9L8j3J02ro6j49K55j0m5p5m7K6J49j29j9o0J41m3O2
6015D8o4lP4m6j6L7K8j10J54j77J23O7l8n3q3J23oj99M0O3J00m4l4j03R7Q3j51
$$ plain form
6042 -90 -96 -87 -32 26 28 -101 36 51 -3 -17 72 79 36 -33 -93 8 54 -41 -135 -97 -39 4 -22 -8 -52 -4 160 -34 -47 131
6072 131 34 -30 12 54 91 33 -31 -117 16 165 -66 -89 15 149 -122 28 -7 70 29 -23 66 -23 48 22 -6 94
6098 94 96 114 149 -34 28 -63 22 -115 46 18 98 -18 -83 -68 129 25 41 -16 -16 0 107 -41 -31 30 68 -2 -52
6125 -52 -83 72 48 -106 -31 50 116 64 -28 14 63 195 2 -84 38 112 123 -139 5 15 52 -153 -64 -13 -21 -98 -91
6152 -91 -113 43 99 -42 -82 -35 86 81 -47 -112 84 61 -55 -59 -10 32 0 -36 -77 -132 72 -20 -92 -126 -28 -1 -110
6179 -110 -94 -109 174 24 7 -29 139 51 99 73 -122 35 -76 -7 -47 -32 69 -78 -17 -59 146 11 -28 13 30
6204 30 72 -9 -39 30 128 -11 -101 -126 43 126 64 -186 -94 108 34 -114 19 52 95 45 39 -47 41 114 -22 -35 10
6231 10 9 54 -12 -36 -47 48 -69 -56 -126 -64 -44 -161 -12 34 18 54 -129 20 27 37 88 -37 4 47 81 -30 -18 1
$$ packed form
6042i0oRN5N8Kj29J37J5n4j4Q9Pm3o9o0J01M6r5r4L8N8M3k6J4m4M8J64j94j3J78
6072A31r7o4M2M2L7n8o4q6J33J49k31k3J04J34k71J50l5P7m1n2Q9q9P1k6k8J00
6098I4KJ8L5j83O2r1Q5j37J61k8Q0j16o5J5J97j04J6n7%J6J07j48J0O1L8p0n0
6125e2l1J55k4j54P5Q1O6n2r2M2M9J32j93q6J22P4J1k62J44J0L7k05Q9N1qp7P
6152i1k2J56N6j41m0M7J21nj28o5J96k3j16mM9M2l2l6m1n5K04r2p2l4R8K7j09
6179a10J6j5K83j50j7l6J68q8M8k6j95J57j11O9m0J5J01j47O1m2K05j35l9M1J7
6204C0M2q1l0O9R8j39r0k5J69Q3o2k50R2K02p4j48J33L3M3n0oq6Q8P3j36j3M5
6231A0jM5o6k4j1R5j17J3p0O2K0j17J49M6j6L6j83J49PJ0N1j25M1M3L4j11J2J9
$$ plain form
6259 1 72 31 -18 3 36 143 9 -144 102 69 -52 -12 -11 98 115 62 -112 49 75 8 -107 -123 37 42 -69 -32
6285 -32 6 -113 -101 -44 26 -95 -26 9 1 -35 105 175 0 -24 23 -14 173 -97 -44 -51 -22 -23 -19 56 119 -25 30 38 -43
6314 -43 39 138 -14 29 22 89 -8 5 66 33 67 -133 22 -79 -43 -45 -54 -31 73 33 75 60 116 148 -5 -31 -28 75 2
6343 2 38 83 -88 -43 12 62 -55 -33 -38 -64 -81 -32 16 17 1 -82 -31 -10 -42 7 43 164 74 -7 113 36 67 -15 -55 22
6373 22 22 -60 31 28 45 -56 62 10 80 53 13 42 50 125 -57 41 25 -42 -83 -53 56 6 -113 -54 67 -33 -32 59 158
6402 158 -58 34 70 220 31 17 -47 24 39 -72 -34 -20 -78 -128 -70 -17 -21 -21 1 -87 -25 73 -69 -50 70 43 17 -25
6430 -25 -8 172 -76 116 119 100 -45 75 136 -63 -12 48 -126 -80 47 -44 2 -48 26 31 10 -57 50 43 -149 14
6456 14 42 126 39 -130 -57 19 -53 -84 61 -23 -59 -36 29 -55 -33 8 35 -46 111 27 37 57 -7 -56 -14 33 -38 13 33
$$ packed form
6259AP1m1m9K1L3J07j34j53K46l3j21M0JJ09J7n3j74J61K6o7j15j6J60Nj11L7
6285c2L8j19J2N7P0j21O9L5ql6J40P0j75k4M7l7J87k70N3pK9jMP5O3j44N5Qq1
6314d3Q2R9j52M3pO7r7J3O1l3L4k00J55j01L6krK3J04m0M2j5N6L2j53k6LJ03p3
6343BL6M5j71M5N5N0j17K2nk6j7M9M8Jj6q3N1K1l2M9L6J21r0q1J20p7L1q2m0P7
6373B2%q2R1lJ7j01J18n2P0k7m0K9QP5j82R8j6o7m1L0J09n0j19N9J21j00JR1R9
6402A58k16R2L6J50j89j4o4P1J5j11L8J4n8n0N8N3m%K2q8O2R8j42J9J20k7k6m2
6430b5J7J80k48J92Lj9j45J20O1j99N1O0j74M6J27r1M6n0P4Nk1o7J07pj92J63
6456A4K8Q4q7j69P3P6p2l1J45q4l6K3O5q4K2M1K7q1J57q4J0K0o4m9M2M7p1N1K0
$$ plain form
6485 33 50 -29 -58 -12 18 -32 -60 -13 -13 90 56 -34 22 -39 54 89 -9 4 -70 -6 -17 -90 -37 87 18 32 -51 -52 77 -42
6515 -42 123 -12 10 98 -43 -8 56 -44 1 -55 7 113 -7 82 2 -60 -8 20 40 -91 8 35 144 0 25 -23
6541 -23 -6 82 -57 -34 -23 -2 -121 -106 -24 -55 -66 -9 -36 58 -148 1 135 -183 51 66 72 13 81 -38 23 9 -30
6568 -30 58 -19 0 -24 -145 48 33 -109 -67 50 -10 -14 59 65 47 -11 -7 -33 -149 102 157 70 15 -51 -29 -49 -77 -13 -9
6597 -9 -116 -80 -70 41 20 4 -8 -56 102 -74 58 -67 60 17 -6 48 -40 -16 50 71 39 -125 -164 -124 53 29
6623 29 11 -78 97 -31 -5 194 69 69 -84 10 -88 -43 -91 -24 54 -37 64 -32 -41 83 -55 148 -70 -80 36 126
6649 126 69 85 -18 59 -37 -19 -42 2 41 -75 -95 46 90 -83 -117 -69 -28 122 0 -130 -25 99 -39 -20 -30
6674 -30 17 -55 107 24 -99 103 87 -49 46 91 24 -1 -2 -18 42 -9 4 -8 -18 89 -149 26 -28 -80 126 -72
$$ packed form
6485C3J7p9k9M6L0n0k8M7%J03l4r0N6o1R3L5r8J3p4O4j1p3N3J24o9J4q3jJ29j19
6515d2J65j35K2Q8j41L5O4j00M5n6O2J06j20Q9q0o2N2K8K0j31R9K7J09j44K5m8
6541b3J7Q8j39K3J1K1j19J5Q2l1j1N7k7R4k06J49J34l18K34J5On9O8j19O1j4l9
6568c0Q8p7J9k4j21J93j5j42M2J17o0mP3Oj8n8Mk6j16K51N5q7n5o6K2k0k8O4M
6597ij07L6J0J11k1j6j2m8J58j76J32j25J27m3k3N4q8K4O6K1l2j64l9M0J77k4
6623B9j8q9J75j28K6J99j25%j53R4r8M5m8O7P8r1J01r6rJ24j38K03k18j0J16R0
6649A26n7J6j03P7r6J8k3M4L9j16k0J41M4j73l4M8M1J50j22j30J05J24j38J9j0
6674c0M7p2J62q3j23K02j6j36R5M5o7k5jj6O0n1J3j2j0J07k38J75n4n2K06j98
$$ plain form
6700 -72 4 0 27 -6 -46 -72 -19 80 -59 10 -77 -90 3 39 -107 -34 41 81 1 -27 108 12 -43 7 34 13 -30 52 35
6729 35 -40 -47 -165 0 3 -14 -58 -87 -23 -1 1 -20 8 69 96 56 -29 -37 -5 -98 -54 -162 15 33 -19 58 -49 -117 -112 -50
6759 -50 70 -1 44 -131 -28 -30 38 -5 3 24 26 -7 53 -36 -29 -9 22 42 20 -16 -45 66 60 -56 117 66 90 -7 26 68
6789 68 -41 46 -24 -73 -99 -58 -31 48 -57 21 77 14 -44 -51 -17 -64 39 -151 28 1 177 -2 27 87 -73 86
6815 86 38 147 12 18 -50 -33 -27 0 11 16 -31 -58 -22 14 -79 -49 147 56 19 -52 -38 -25 -24 -84 29 -2 -51 -100 -6 33
6845 33 99 -28 3 4 2 18 -25 12 89 91 58 78 -45 102 -93 4 -47 -88 22 -5 30 -6 -18 -34 41 -15 -67 56 -60
6874 -60 34 99 66 49 -72 14 -4 16 -34 -10 -51 -95 -65 93 -117 13 -139 51 -30 -42 -30 110 154 -49 6 38
6900 38 -17 0 91 79 3 136 -25 -25 128 -164 109 -133 76 20 69 -27 -7 -75 -46 -4 76 38 32 -34 9 -19 -1 -104
$$ packed form
6700g2P6mK7l3m0k6N3R9j39O9q7j3R3L6j46P3P5M0q0k8J35r6n5N0K7k1m3Q2j7
6729C5p5pj18J65Lj7m4k9O4K2Kk1K8O1K7m0q5qL2r3M4j08J77J8n2P7j07o8NO2
6759e0J20p1M5j75J03kO8m3QK1Kl3O0q9PK0L1K0k2l6k9J11oj16J73n1K4r7L3M2
6789F8j09Q7p0m9k6M1K7P9j05P8N6o3n8pL4m7J03j90J79k7J76j79K9O0j60J59
6815H6m8J09j35Oo8J7OK7J1Nm7k7L6L6r3L0J96r1l7p1J4J3Jo0J13l1m9m9R4L9
6845C3O6j27L1JkJ6m3L7P7Kl3K0j23J47j95R7n1m1J10k7L5l6j2j6P5n6n2J23j16
6874f0R4O5l3j7j21Q6j8K0n0K4m1m4L0J58k10J30j52J90q1j2J2J40M4k03N5L2
6900C8n5J7R1j2p6J33j61%J53k92K73k42K09n6M9r6K0o8K9M2Q0l8oo6M3k8J8j03
$$ plain form
6928 -104 2 145 31 -65 -27 -11 -121 40 -125 3 45 20 118 177 119 -12 63 27 94 -41 -12 74 -103 64
6952 64 55 -11 -120 54 23 -11 26 -107 55 26 -59 67 -89 -2 7 16 -138 67 19 103 -51 87 -34 -98 -75 -25
6978 -25 -59 -66 36 -57 -65 13 -1 47 -30 -37 79 11 82 93 -7 91 35 -58 26 -40 -9 -35 4 73 29 1 -43 -49 -89 74
7008 74 -32 32 15 -57 103 -10 -3 37 61 37 3 -15 -7 71 -10 -70 -57 63 -36 20 -52 -97 -40 129 43 101 185 -55
7036 -55 -50 4 27 68 0 -27 -5 -58 -25 -31 -16 -114 -39 -29 -37 36 12 -11 -53 -80 36 -57 80 -47 -9 26 96 -19 49 -50
7066 -50 -12 -5 -51 25 79 38 -5 -53 62 101 -19 29 -115 128 -5 15 29 -81 27 124 40 -33 -13 18 -111 -23 -75
7093 -75 -49 3 -42 37 1 26 -50 -40 114 -72 -10 -46 16 -110 -123 -11 -73 35 -31 -47 -69 134 -23 35 76 46 86
7120 86 -32 23 -5 17 -47 94 -18 -10 90 -13 33 -41 -58 30 79 70 29 -99 -25 17 65 -57 5 -112 -47 81 -48
$$ packed form
6928a04J06J43j14r6L8J6j10J61j65J28M2k5R8N9n8j31P5l6O7j35K9Q6j77J67
6952F4ro6j09J74l1l4L7j33J62k9q5J26j56Q7RRj54K05m8Q4j54J38j21o4K3N0
6978b5l4pJ02r3qP8j4M8p7pJ16o8P1J1j00R8n6r3Q4o6L1k6L9O9m4k8m4om0J63
7008G4j06O4j7p2J60j13PM0K4k4l4j8QP8q1o0J3J20r9N6p2m5N7J69q6N8Q4k40
7036e5NN4K3M1o8k7K2n3L3oJ5r8P5J0qP3k4k3m2k7J16r3J37j27L8L5P0j15O8r9
7066e0L8Pm6P6N4m1m3m8J15L9j20M8j44K43j33K0J4j10J08R7q4p3K0L1j29Q8n2
7093g5K6N2m5P9l6K5p6J0J54j86O2l6O2j26j3J12o2J08o6j6k2K03j57N8M1l0M0
7120H6j18N5k8K2o4J41j12QJ00j03M6p4j7Q8M9rm1j28P4M2M8j22O2j17O5J28j29
$$ plain form
7147 -48 48 23 55 -23 4 5 -47 -42 1 -129 72 -31 -41 -16 -38 -36 -21 4 101 60 70 35 -33 -32 26 -90 84 47 -18 -39
7177 -39 6 -21 -8 69 -71 -44 -107 -2 9 29 14 62 -9 47 -15 13 70 -19 46 -57 -32 -35 28 83 -4 47 -50 68 -57
7206 -57 -12 12 116 83 19 83 -74 100 1 -90 -42 1 -112 -32 -123 -42 -30 -68 -12 -119 33 -88 33 7 -60 -39
7232 -39 -2 37 -16 -7 29 -88 11 53 -65 33 -42 -4 61 21 49 87 -18 -8 -36 -17 8 -55 91 73 30 37 94 78 -73
7261 -73 -18 84 27 30 52 -87 2 -43 -118 -8 52 127 -60 40 31 -25 -38 90 -37 3 64 34 -48 37 6 -26 18 -54
7289 -54 -41 60 132 -159 38 29 21 -55 79 -101 55 100 -92 71 3 66 -86 -16 -91 70 -39 -142 -68 98 -32
7314 -32 -67 39 18 -51 48 -96 -25 22 93 -74 29 -72 21 -33 -41 22 -22 30 -52 -71 -53 8 -46 -20 -140 -53 -83 204
7342 204 -77 27 67 40 65 -46 32 -92 -25 -21 94 51 -93 6 23 -112 -72 -54 -34 -31 -40 -42 -16 132 44 -40 41 -69
$$ packed form
7147d8R6k5L2p8K7Jn2NM3j30K01j03j0K5k2KJ5K5R7m1J0l5o8JN8j16J74l7o5k1
7177c9M5k7J3P7j40K7o3J05J1K0j5M8p1N6o2K8N7q9O5j03K5lO3N5q7N1r7J18j25
7206e7M5K4J04l3o4O4j57J74r9r1M8M3j13Q0r1Q1J2l8N6j07J52j21J21k6o7K1
7232c9L7L9n3RL6j17R9M2j18R8p5L8O5m0K8L8j05J0k8J9K5o3J46j8m3PN7j6j51
7261g3N5J02n7LK2j39Q9m5p5J10O0P5j87J00rn6j3J28j27M0O1l0q2Q5l1l2M4p2
7289e4J3J01P2k91J97rqp6J34j80J56M5j92J63o8O3j52P0p5J61j09j03P4J66j30
7314c2l5J06k1o9R9j44P1M7P1j67J03j01R3n4qO3m4N2q2j9J8O1n4K6j20Q7l0K87
7342B04k81J04M0k7K5j11P8j24O7MJ15m3j44R9J7j35M0J8K0LrkK6J48q8q4Q1j10
$$ plain form
7370 -69 39 24 78 13 -44 -13 56 45 -61 35 -53 66 -62 -53 34 -5 -60 21 -94 -35 -40 2 100 44 -57 -116 -19 -57
7398 -57 -67 12 117 -162 -102 -58 -13 -10 -66 -16 61 -31 32 13 31 58 -88 10 -21 66 -60 -4 -68 -98 2 93 4 36
7426 36 99 34 -88 -106 -26 -116 -6 -12 79 106 -24 162 -18 23 15 7 -97 15 46 36 56 39 -40 15 47 -31 24 31 21
7455 21 43 -44 -39 12 -56 -68 30 -23 -4 3 17 -86 -15 -98 10 -109 -41 -36 -51 -69 59 3 73 38 73 3 35 175 42
7484 42 12 -44 115 -117 -40 4 -15 105 -62 21 63 19 -10 7 53 109 65 154 11 106 -70 -89 81 41 -17 39 -28
7511 -28 -12 -95 96 -1 -40 -61 14 68 -12 -31 22 26 -60 -80 -49 -20 -24 -29 5 85 115 62 90 137 44 -3 -102 -19 41 -59 21
7542 21 56 -2 -28 117 71 -32 -22 -62 -28 4 -142 100 -21 -79 -33 -125 -48 53 31 -56 -30 14 -54 -106 10 38 72
7569 72 71 -28 80 -106 -101 5 -40 -2 33 4 -80 -35 -30 -15 -41 17 -39 -141 -3 -12 -109 61 90 18 -10 -73 59 -10 -78
$$ packed form
7370f9J08j5N4o5n7L1O9j1j06R6q8J19j28RQ7l9n5Q1j15N9nM2R8n6j01n9R7l8
7398e7j0P9J05k79O0M4M5Ln6N0P7r2O3j9J8K7j46R8l1Q7j26N6o4l0J00R1q9L2
7426C6O3o5j22j8Q0r0J10oR1K7j30J86j80M1qqj04J12L1j0K0j7p9N5L2p8N5Pj0
7455B1K2q7NN1o8j2R8n3J9PJ4j03P1q3J08j19O8Nj5j8J28n6P0l5L5p0L2J40j33
7484D2l0n6J59k32P7M4j9J20j67Q3M2m4k9J7M6N6m4Q9j43R5j76j9J70m0n8N6o7
7511b8J6q3J91r7l9k1P5N4q0j9N3Mq6k0L1K9mnL4Q0L0n3K8M7r3m7r9Q3O0j00Q0
7542B1L5n8k6J45m6j03J0m0L4L2j46K42j21n8M6r2P7J01k2q7K6M4o8n2J16K8L4
7569G2jr9J08j86NJ06m5L8L5k9q4M5NJ5k6N8n6j02J38rr7J70K9p2k8o3J32o9o8
$$ plain form
7598 -78 -6 38 -97 7 17 -15 -91 -17 -32 62 50 -36 14 55 -47 7 71 32 8 -83 -15 132 10 -96 47 8 -5
7625 -5 -116 22 37 -79 2 36 38 97 73 -7 111 1 12 42 149 4 8 73 -3 19 -6 83 -46 -44 7 1 -35 -47 115
7654 115 -92 119 115 51 43 3 39 35 43 10 138 111 116 -105 -72 24 -39 -55 62 85 -63 -84 -9 106 48 75 34 104 18
7683 18 24 40 -66 31 -20 35 -46 -73 31 -102 -1 -34 -104 71 119 -121 -75 115 38 40 -32 10 -10 -26 68 65 -68 -69
7711 -69 21 -37 -119 24 -3 74 38 -64 66 42 -38 96 -52 -3 46 32 -77 17 105 -7 -179 -19 42 -1 -41 -87
7737 -87 11 -81 -13 35 -31 64 98 -55 -97 -76 32 37 -31 -35 104 34 -8 -90 -95 68 82 112 -54 3 -35 -52 11 -29 -78
7766 -78 26 -22 -6 148 -14 -13 -29 -44 19 -14 95 -36 5 4 48 2 68 18 2 172 -40 -35 -40 25 -89 13 5 128
7794 128 -40 23 104 37 -50 1 -61 23 61 37 -47 -80 5 49 92 63 -2 -43 -46 2 -17 114 58 -7 43 -108 -48 -63 69
$$ packed form
7598g8P2M4j35J04J0l2p6P4j5R4j2q6N0M1j02N4O4l9k4r1O8J47j22j06J43l9j3
7625ej11J38J5j16Q1L4KN9k4q0J18j10J1L0J07j45MO5p6K2k5Q9j29KN1ol6j2J62
7654A15k07K11mo4qm0L6mQl3J28k7Nk21L3R6o3j6J17K3j48k1P5J15n8K7m1P0q6
7683A8OJ6j06R7n1N5q1k7J04j33J01l3p0J75M8k40M6J90p7Kp2M2k0j6R4lj33j
7711f9R0n8q2J43k7P7l6j02J30k4q0J34j48M9M9j4j09R4Q8j12j72J60O1m3m0m6
7737h7R8r2O8M8o6R5L4j53m2K1J08No8mJ39p0m2q2nJ63J4L0j66N7l8j7O3m0m9
7766g8J04m8J6J54j62Jj6j5O3l3J09j31M1jM4m6O6n0j6J70k12NnO5j14J02qJ23
7794A28j68O3Q1o7q7N1o2Q4L8k4q4l3Q5M4M3k9o5m1lM8j9J31n6o5N0j51O0j5J32
$$ plain form
7823 69 -17 78 79 36 -164 58 54 93 16 -102 -38 -40 82 -38 136 -55 8 -26 -18 45 12 62 59 -58 -22 -49 16 -79 -21
7852 -21 -108 -35 94 -43 14 15 52 93 -22 -53 -36 -33 -60 -35 -1 -108 74 -121 -9 48 45 -42 -46 -78 46 1 -49 28
7880 28 -16 22 45 19 104 41 25 35 55 11 -31 -33 -25 -20 -26 -26 14 53 -25 38 6 139 -9 -6 -22 -119 57 -51 65 47 -24
7911 -24 -86 -4 100 24 29 0 19 -23 89 -5 57 99 -18 -80 152 46 -65 -110 83 -14 48 35 -20 -46 3 62 13
7938 13 -95 -32 74 -42 62 -3 -25 17 103 -9 15 23 -7 -20 30 89 1 -13 -70 11 45 -79 -31 27 -48 -12 -42 -31
7966 -31 6 46 26 -27 -84 31 66 -14 -13 3 -40 -118 -29 -58 -117 -74 -17 -144 21 58 -73 54 76 76 31 -16 -55 56
7994 56 -74 24 70 16 63 -54 -107 58 25 -53 -43 -13 -62 48 109 -101 -39 35 94 100 -19 -60 62 -4 -1 -50 117
8021 117 44 43 -16 -49 -4 -81 59 -23 -20 27 38 -47 -46 -79 4 62 -24 86 94 -95 -78 -38 18 -29 -21 -3 20 -35 -70 74
$$ packed form
7823F9q6R5Jm3k00K22mL9p7j18O4kJ22j20J74j91O3l4QO3l3N0lj17L6k7O5r5N8
7852b1q7P3J29j37N7JL7M1j15l1J7Lk7K5L4j07J82j95J12N7lq7ml2J24m5n0P7
7880B8m4L8K3k6Q5o3j6J0K0m4m2kQNo%M0L9p8O3l2J33j48Lj6r7J76j08J16j8p1
7911b4o2Q2J04p6Nk9J9m2J12r4O2M2j17o2K32j06j11m5J93r7O2j3n5k6M9N9m9
7938A3j08O3J06j16J04o5k2M2Q6j12K4Ql0j3N0N9q8j4n7Q1L4j24M8N8p5L6l0J1
7966c1L7M0k0n3n7J15L5q0JJ6m3p8Q9k9n9M3N7j27J65L7j31J27K2%m5m7l9J11
7994E6j30R8M6n4M7j17n3J65l3p8J0L0m9J10O1k10O2P4N9Oj19m1J22o6Lm9J67
8021A17p3jn9l3M5p7J40q2LM7J1q5Jl3Q3N8q6J10Qj89J7M0N6m7QJ8K3n5l5J44
$$ plain form
8051 74 -30 -78 32 -26 40 25 0 -1 -91 0 21 -37 87 -52 29 22 -80 -14 -2 0 -67 -43 -48 23 27 -37 11 -55 -49 9 -58
8082 -58 -99 56 -116 -14 35 -11 -95 -53 62 114 19 -155 -53 61 -142 56 -63 38 40 18 -24 23 52 25 20 44
8108 44 43 -121 -21 -7 162 2 -62 -33 11 -46 25 -94 -43 30 69 25 16 -62 77 110 -94 -50 4 12 105 25 -43 105
8136 105 -61 -12 89 41 -39 64 14 -90 -23 25 -34 -16 -33 -51 -28 150 40 4 90 39 66 -45 39 94 -46 -144
8162 -144 -9 -48 59 0 23 122 -61 -113 -45 48 10 -56 78 -2 -1 -30 -19 -1 -6 -37 -42 85 76 -12 39 -26 -65 116 -4
$$ packed form
8051G4j04m8J10n8O6j5k5jr0R1K1n8J24j39Q1pj02O6J2Ko7K4nP1Mo4M8o6ON8o7
8082e8m1J55j72J02M9m6q4M2J15N2r5j74J02J14k03J98j19J01Kk2m2M7K9k7nK4
8108D4jj64J00J4J69j60o4K9M4n7P1j19N1P3L9m4rp8J39L3k04M4N4QR3q0o8J48
8136A05j66M9J01m8q0J03n0j04O7M8n9J8j7j8K3J78j10l6Q6n1K7j11Q4N5j40r8
8162a44J35l9J07n9K3R9j83n2O8R3l8o6J34q0Jk9J1J8nl1nJ27rq8N1o5l9J81j20
8191d
$$ Imaginary data points
##PAGE= N=2
##DATA TABLE= (X++(I..I)), XYDATA
$$ plain form
0 0 0 0 0 0 0 0 0 0 0 8 -8 8 -8 16 -16 24 -24 32 -40 48 -56 67 -80 96 -112 129 -152 176 -201 230 -265 300
32 300 -340 388 -436 492 -549 616 -692 768 -856 951 -1055 1168 -1291 1426 -1573 1735 -1911
49 -1911 2105 -2322 2555 -2820 3110 -3437 3807 -4227 4711 -5273 5941 -6742 7725 -8974
63 -8974 10607 -12853 16149 -21465 31484 -56990 263976 408255 -127326 -65072 86872 -73578
75 -73578 -368313 -269596 -78390 7365 86326 247411 238183 126616 65060 17790 -156081
86 -156081 -263336 -182069 -59306 -61335 -9138 200988 342514 181973 -55656 -83613 -4840
97 -4840 -93552 -261731 -247243 -34963 152709 200291 150908 106781 103727 65611 -82860 -226988
109 -226988 -217262 -112370 -49885 6832 129680 232295 203145 82944 -22419 -69654 -92829
$$ packed form
0@%%%%%%%%%Qj6J6j6K4l2M0m8N6p2Q8j04J23j47J76k08K41k81L28l77M31m95N65
32C00o40P28q24R28j041J165j308J460j624J807k006K223k459K717k999L308l646
49a911M016m427M877n375N930o547P244q034Q938r984J1214j2683J4467j6699
63h974J9581k3460K9002l7614N2949q8474L20966J44279n35581O2254J51944j60450
75g3578k94735R8717J91206Q5755P8961J61085r228j11567o1556m7270j73871
86a56081j07255Q1267J22763k029N2197K10126J41526j60541k37629k7957P8773
97d840q8712j68179J4488K12280J87672M7582m9383m4127l054l8116j48471j44128
109b26988R726J04892O2485N6717J22848J02615k9150j20201j05363m7235k3175
$$ plain form
120 -92829 -149080 -214961 -165063 32840 206785 202693 95353 51412 83096 46431 -122260
131 -122260 -263784 -203444 -31572 42424 40813 120194 216130 156921 10728 -47608 -55539 -128070
143 -128070 -200199 -156322 -25491 99724 168685 153808 81140 41491 47666 -12025 -165124
154 -165124 -248644 -142965 31542 94370 68527 95163 163918 136097 4645 -92828 -111584
165 -111584 -131259 -154988 -95230 39900 135691 138548 100136 73652 54697 3935 -98112 -191817
177 -191817 -178283 -54801 61970 88911 74888 97559 134544 100115 -18412 -129551 -153541
188 -153541 -114305 -73065 -27481 48808 118760 126661 89512 58474 25655 -49337 -142960 -170670
200 -170670 -96781 12388 67598 65284 74046 113590 117762 39255 -74827 -142507 -133855 -77907
$$ packed form
120i2829n6251o5881M9898J97903J73945m092j07340m3941L1684l6665j68691
131a22260j41524O0340J71872P3996j611P9381R5936n9209j46193n8336p931p2531
143a28070p2129M3877J30831J25215O8961j4877p2668l9649O175n9691j53099
154a65124q3520J05679J74507O2828k5843K6636O8755k7821j31452r7473j8756
165a11584j9675k3729N9758J35130R5791K857l8412k6484j8955n0762j02047r3705
177a91817J3534J23482J16771K6941j4023K2671L6985l4429j18527j11139k3990
188a53541L9236M1240M5584P6289O9952P901l7149l1038l2819p4992r3623k7710
200a70670P3889J09169N5210k314Q762L9544M172p8507j14082o7680Q652N5948
$$ plain form
212 -77907 -21504 13994 48536 97425 125950 94790 26164 -37053 -92206 -132774 -116496 -39252
224 -39252 33002 54527 61706 92874 116826 76944 -22839 -113173 -131462 -86307 -33865 -5529
236 -5529 17031 57774 104718 116356 66306 -18156 -82365 -103044 -92179 -59479 -11584 29160
248 29160 53731 80849 106021 86686 11155 -72383 -111516 -95527 -51261 -15770 1021 28514
260 28514 81152 116873 88812 12360 -57853 -88997 -83460 -60742 -35477 -7241 30534 73210
272 73210 101650 91712 35483 -38670 -83383 -82138 -59957 -39671 -18970 12567 56682 97267
284 97267 97604 40937 -32875 -69787 -67585 -56879 -47482 -28154 6562 52899 92344 94294 47517
297 47517 -16552 -57125 -64743 -57231 -50330 -38903 -8219 41665 85101 91685 53455 -5573 -47014
$$ packed form
212g7907N6403L5498L4542M8889K8525l1160o8626o3217n5153m0568J6278P7244
224c9252P2254K1525P179L1168K3952l9882r9783r0334j8289M5155N2442K8336
236e529K2560M0743M6944J1638n0050q4462o4209k0679J0865L2700M7895M0744
248B9160K4571K7118K5172j9335p5531q3538l9133J5989M4266L5491J6791K7493
260B8514N2638L5721k8061p6452p0213l1144N537K2718K5265K8236L7775M2676
272G3210K8440r938n6229p4153m4713J245K2181K0286K0701L1537M4115M0585
284I7267L37n6667p3812l6912K202J0706R397J9328L4716M6337L9445J950m6777
297D7517o4069m0573p618P512O901J1427L0684M9884M3436O584l8230n9028m1441
$$ plain form
310 -47014 -54907 -49219 -50379 -47182 -17266 33861 78532 90036 58934 3698 -37425 -46673 -43671
323 -43671 -49758 -53527 -30165 20365 69834 85728 58861 10664 -26425 -38558 -39090 -45270 -52267
336 -52267 -36242 10771 62196 81915 61259 19127 -17708 -33022 -34375 -42343 -55370 -44884
348 -44884 567 52301 73929 58135 23731 -7160 -23305 -30536 -41128 -51969 -44131 -7106
360 -7106 41621 70052 61380 28284 -2518 -16841 -22982 -36116 -54511 -53521 -15995 37166 63740
373 63740 51805 25804 8129 -3463 -18597 -37866 -52265 -47441 -16944 24678 52963 54715
385 54715 35753 11111 -5501 -13451 -25362 -47028 -57916 -32401 19751 55746 49337 22106
397 22106 9994 12867 2108 -29286 -54955 -50949 -21025 13859 36436 41878 35300 22802 7916
$$ packed form
310d7014p893N688j160L197K9916N1127M4671J1504l1102n5236m1123r248L002
323d3671o087l769K3362N0530M9469J5894k6867m8197l7089j2133n32o180o997
336e2267J6025M7013N1425J9719k0656m2132l6835j5314j353p968j3027J0486
348d4884M5451N1734K1628j5794l4404l0891j6145p231j0592j0841P838L7025
360g106M8727K8431q672l3096l0802j4323o141j3134j8395R90L7526N3161K6574
373F3740j1935k6001j7675j1592j5134j9269j4399M824L0497M1622K8285J752
385E4715j8962k4642j6612p950j1911k1666j0888K5515N2152L5995o409k7231
397B2106j2112K873j0759l1394k5669M006K9924L4884K2577N442o578j2498j4886
$$ plain form
410 7916 -6254 -20122 -36829 -50350 -41351 -2313 40326 50330 26610 5375 10526 18738 -5445
423 -5445 -49805 -63657 -28802 15208 29693 23590 24238 30999 24655 1866 -20054 -31471 -38286
436 -38286 -38991 -18548 19351 42899 33110 11446 7362 16365 8995 -25568 -58226 -49328 -1494
449 -1494 35139 27254 5479 14342 38937 29662 -14605 -43821 -34694 -18777 -18244 -10210 20100 40718
463 40718 26166 4116 7920 16352 -6804 -45417 -52099 -17283 20840 28598 11585 3827 22498
476 22498 39516 16775 -33805 -55109 -26266 4830 -398 -12870 8697 41442 35778 2129
488 2129 -8448 3212 -10000 -44986 -43030 5349 35650 15047 -6674 12750 41047 29121
500 29121 -16250 -47604 -38124 -6190 10569 -636 -11580 8382 40704 38950 -389 -26576
$$ packed form
410G916j4170j3868j6707j3521Q999L9038M2639J0004k3720k1235N151Q212k4183
423e445m4360j3852L4855M4010J4485o103O48O761o344k2789k1920j1417o815
436c8286p05K0443L7899K3548r789k1664m084R003p370l4563l2658Q898M7834
449a494L6633p885k1775Q863K4595r275m4267k9216R127J5917N33Q034L0310K0618
463D0718j4552k2050L804Q432k3156l8613o682L4816L8123P758j7013p758J8671
476B2498J7018k2741n0580k1304K8843L1096n228j2472K1567L2745n664l3649
488B129j0577J1660j3212l4986J956M8379L0301k0603k1721J9424K8297j1926
500B9121m5371l1354R480L1934J6759j1205j0944J9962L2322j754l9339k6187
$$ plain form
512 -26576 -14854 -4633 -24072 -33239 2770 37759 19525 -11003 9602 45647 21351 -42133
524 -42133 -57058 -12001 19639 2572 -19178 -3991 29916 40359 17360 -13655 -25165 -14950
536 -14950 -4556 -10888 -19743 -3347 27354 29588 3302 -804 22645 13629 -37248 -52752 -3747
549 -3747 30911 480 -30616 1310 50157 40170 -12461 -34833 -11665 6742 -7070 -22567
561 -22567 -11698 11478 23697 21864 10642 -932 -1566 -1317 -18198 -31945 -10354 18982 7928
574 7928 -17539 3124 45464 33140 -25407 -44831 -2747 25572 -5408 -38972 -13766 34351
586 34351 36890 4052 -7697 3622 2058 -12944 -18041 -13262 -6611 2684 8212 5356 10113 23031
600 23031 14055 -19685 -31610 -2217 19284 -4434 -33281 -10621 39020 42388 -4520 -27492
$$ packed form
512b6576J1722J0221j9439r167L6009L4989j8234l0528K0605L6045k4296o3484
524d2133j4925M5057L1640j7067k1750J5187L3907J0443k2999l1015j1510J0215
536a4950J0394o332q855J6396L0701K234k6286m106K3449r016n0877j5504M9005
549c747L4658l0431l1096L1926M8847r987n2631k2372K3168J8407j3812j5497
561b2567J0869K3176J2219j833j1222j1574o34K49j6881j3747K1591K9336j1054
574G928k5467K0663M2340j2324n8547j9424M2084K8319l0980l3564K5206M8117
586C4351K539l2838j1749J1319j564j5002n097M779O651R295N528k856M757J2918
600B3031q976l3740j1925K9393K1501k3718k8847K2660M9641L368m6908k2972
$$ plain form
612 -27492 582 18119 -9173 -31397 -13244 9291 6794 1274 9439 16002 9336 -3639 -13741
625 -13741 -12725 -1701 2599 -8348 -13522 5816 30660 25689 -7147 -24564 -2587 18566 -3069
638 -3069 -34834 -20985 18829 23671 -1136 -5227 12436 13114 -6603 -16124 -7205 966 -3813 -9552
652 -9552 -10 18107 21190 4588 -10503 -8434 2398 4265 -9529 -23400 -12094 17732 25310
665 25310 773 -13141 4552 17056 -1112 -20112 -12905 2566 2710 -2860 3268 15493 13866
678 13866 -2122 -10064 -1037 4949 -6188 -18260 -12141 5407 16172 11517 -2038 -7080 4250
691 4250 12621 -1328 -19771 -14710 4692 10164 2289 1007 7772 8998 578 -6054 -3662 -894
705 -894 -7302 -14243 -4872 12219 14252 894 -5879 1400 8465 3448 -9347 -15539 -6845 7449
$$ packed form
612b7492K8074J7537k7292k2224J8153K2535k497n520Q165O563o666j2975j0102
625a3741J016J1024M300j0947n174J9338K4844m971l2836j7417K1977K1153k1635
638c069l1765J3849L9814M842k4807m091J7663O78j9717r521Q919Q171m779n739
652i552R542J8117L083j6602j5091K069J0832J867j3794j3871J1306K9826P578
665B5310k4537j3914J7693J2504j8168j9000P207J5471J44n570O128J2225j627
678A3866j5988p942R027N986j1137j2072O119J7548J0765m655j3555n042J1330
691D250Q371j3949j8443N061J9402N472p875j282O765J226q420o632K392K768
705h94o408o941R371J7091K033j3358o773P279P065n017j2795o192Q694J4294
$$ plain form
719 7449 10363 2182 -946 4850 7816 2035 -5282 -7581 -6316 -5329 -4279 488 7709 8631 585 -3083
735 -3083 3695 6756 -3234 -13260 -9402 2384 8326 4946 -188 608 6174 7082 -991 -8942 -8835
750 -8835 -4133 -1121 -12 1513 3345 4388 3583 2178 1466 -931 -6502 -8913 -2350 5863 5481 53
766 53 -197 4918 7371 2695 -5487 -10157 -6784 111 2154 -493 -636 2647 5157 4716 2218 -2052
782 -2052 -5866 -5915 -2392 1920 3484 1747 106 2685 6648 4847 -2617 -8019 -7068 -2479 1234 995
798 995 -1351 -537 4252 6613 3299 -1691 -4361 -4509 -2745 493 1938 573 396 3065 5165 4122
814 4122 -217 -5015 -6430 -3499 -127 -69 -1350 -515 2726 5364 4600 116 -3857 -3832 -1405 -150 -351
831 -351 -59 831 2797 4947 4265 68 -3617 -4152 -2988 -1866 -1324 -1475 -907 1773 4943 4599 751
$$ packed form
719G449K914q181l128N796K966n781p317k299J265R87J050M767P221R22q046l668
735c083O778L061r990j0026L858J1786N942l380n134P96N566R08q073p951J07
750h835M702L012J109J525J832J043q05j405p12k397n571k411O563Q213l82n428
766E3k50N115K453m676q182m670L373O895K043k647j43L283K510m41k498m270
782b052l814m9L523M312J564j737j641K579L963j801p464n402R51M589L713k39
798I95k346Q14M789K361l314m990k670j48J764L238J445j365j77K669K100j043
814D122m339m798j415K931L372N8j281Q35L241K638p64m484l973K5K427J255k01
831c51K92Q90J966K150o82m197l685n35J164J122N42j51N68K680L170l44l848
$$ plain form
848 751 -2776 -3110 -1012 349 -763 -1825 -349 3044 5075 3797 427 -2659 -3235 -1967 -1323 -2361
864 -2361 -2649 -986 1395 3529 4289 2347 -1633 -3213 -1225 841 -2 -2152 -1786 1674 5114 4796
880 4796 860 -2668 -2384 -730 -971 -2708 -3285 -1485 1233 2832 2880 2197 550 -1461 -1954 -394 721
897 721 -876 -2194 -325 3634 5170 2494 -1868 -3089 -588 563 -1893 -4555 -2736 1539 3145
912 3145 1809 726 1138 933 -766 -1776 -681 240 -574 -1011 1113 3707 3584 299 -2533 -1990 646
929 646 193 -3503 -4763 -495 3982 2965 -1009 -1176 1926 2633 -918 -3193 -1251 1236 919 -275
945 -275 1043 2940 2301 -901 -2256 -542 521 -1490 -4184 -3028 1893 4252 1478 -2400 -1125 3161
961 3161 3272 -1577 -4521 -1265 3137 2483 -807 -453 2739 2548 -1396 -3086 -272 905 -2268 -4353
$$ packed form
848G51l527l34K098J361j112j062J476L393K031j278l370l086n76J268O44j038
864b361k88J663K381K134P60j942l980j580J988K066q43k150L66L460L440l18
880D796l936l528K84J654k41j737n77J800K718J599M8o83j647k011m93J560J115
897G21j597j318J869L959J536k676m362j221K501J151k456k662J819M275J606
912C145j336j083M12k05j699j010J095R21q14m37K124K594j23l285k832N43K636
929F46m53l696j260M268M477j017l974j67L102P07l551k275J942K487l17j194
945b75J318J897o39l202j355J714J063k011k694J156M921K359k774l878J275M286
961C161J11m849k944L256M402o54l290L54L192j91l944j690K814J177l173k085
$$ plain form
977 -4353 -1004 3698 3078 -987 -2532 613 3433 1560 -2673 -3747 124 3856 2394 -1467 -1436 2349
993 2349 3145 -1408 -4282 -1137 1966 -1087 -4454 -898 4417 3083 -2113 -2362 2221 3496 -560 -3866
1009 -3866 -1715 2339 2901 284 -1527 -4 2574 1936 -2016 -4113 -1400 1952 37 -3385 -1710
1024 -1710 3501 3730 -1362 -2839 1499 3564 -639 -4109 -906 4249 2775 -2014 -2225 2106 3560
1039 3560 -416 -3998 -2825 439 1381 -851 -2459 -663 2479 2816 -243 -2023 482 2696 248
1054 248 -3161 -1085 3435 2977 -2157 -2870 2110 3891 -1084 -5247 -2243 2389 1417 -2508 -2293 1292
1070 1292 2983 963 -1049 -906 792 1354 -131 -1571 -379 2308 2030 -1051 -2064 1058 2536 -1005
1086 -1005 -4335 -2112 2255 1655 -2523 -2640 2034 3530 184 -2412 -320 2298 1344 -1323 -1624 1012
$$ packed form
977d353L349M702o20m065j545L145K820j873m233j074L871L732j462l861L1L785
993B349P96m553k874L145L103l053l367L556N315j334n196k49M583J275m056l306
1009c866K151M054N62k617j811J523K578o38l952k097K713L352j915l422J675
1024a710N211K29n092j477M338K065m203l470L203N155j474m789k11M331J454
1039C560l976l582J173L264R42k232j608J796L142L37l059j780K505K214k448
1054B48l409K076M520m58n134p13M980J781m975m163L004M632r72l925K15L585
1070A292J691k020k012J43J698N62j485j440J192K687k78l081j013L122J478l541
1086a005l330K223M367o00m178j17M674J496l346k596K092K618r54k667l01K636
$$ plain form
1102 1012 2196 753 -1212 -930 885 1015 -1345 -2864 -1275 1234 877 -1505 -1516 1515 2811 201
1118 201 -2147 -463 2473 1452 -1514 -1630 1282 2547 71 -1760 -660 1165 396 -1897 -2162 -277
1134 -277 893 128 -1061 -236 1358 1495 -64 -1012 -6 1511 956 -1071 -1051 1120 2005 -134 -1951
1151 -1951 -690 1050 299 -1766 -2065 26 1108 64 -1050 -56 1575 1014 -481 -605 729 1223
1167 1223 360 -599 -160 972 994 -354 -1320 -594 440 -207 -1461 -1289 26 731 23 -578 123 1199
1185 1199 849 -329 -614 642 1350 141 -765 -59 890 496 -702 -1077 -528 -142 -491 -1127 -644 516
1203 516 430 -301 -187 534 960 501 -83 -220 713 1065 392 -563 -239 515 281 -711 -840 -545 -429 -373 -518
1224 -518 -239 368 241 -344 -175 757 874 27 -219 415 720 536 215 -233 -228 27 160 -557 -896 -506 -381
$$ packed form
1102A012J184j443j965K82J815J30k360j519J589K509l57k382j1L031J296k610
1118B01k348J684K936j021k966j16K912J265k476j831J100J825p69k293k65J885
1134b77J170p65j189Q25J594J37j559r48J006J517n55k027K0K171Q85k139j817
1151a951J261J740p51k065k99K091J082j044j114R94J631n61j495j24J334M94
1167A223q63r59M39J132K2j348r66P26J034o47j254J72J315P05p08o01P01J076
1185A199l50j178k85J256P08j209r06P06R49l94j198l75N49L86l49o36M83J160
1203E16q6p31J14P21M26m59n84j37R33L52o73r55L24P54k34r92j29K95J16N6j45
1224e18K79O07j27n85J69R32J17q47k46O34L05j84l21m48NK55J33p17l39L90J25
$$ plain form
1245 -381 -625 -301 31 97 23 25 86 414 810 445 20 257 780 520 -49 -13 18 -339 -450 -614 -670 -380 -150
1268 -150 -299 -426 148 355 58 -30 192 220 423 593 429 261 233 260 -53 -132 54 -310 -885 -585 -211 -56
1290 -56 -249 -93 -303 -54 475 479 -3 -92 491 727 601 597 387 -92 70 248 -125 -459 -545 -674 -725 -80 37
1313 37 -161 -320 -26 124 -10 255 246 -48 413 732 626 410 343 41 -200 -80 -216 -630 -661 -303 -289 -353
1335 -353 145 72 -322 -70 306 63 65 396 510 358 549 616 174 151 223 -217 -566 -440 -376 -535 -487 -91 -278
1358 -278 -283 78 185 -165 -123 216 120 344 601 541 250 333 565 53 -62 -253 -559 -664 -208 -91 -532 -350
1380 -350 40 79 -61 219 77 -184 -44 385 552 367 539 262 326 403 185 -503 -541 -541 -606 -289 -59 -265
1402 -265 -537 -93 189 37 -204 179 75 -149 654 743 354 203 303 370 -20 22 -373 -617 -451 -351 -359 -318
$$ packed form
1245c81k44L24L32O6p4KO1L28L96l65m25K37N23k60n69L6L1l57j11j64n6K90K30
1268a50j49j27N74K07k97q8K22K8K03J70j64j68k8K7l13p9J86l64n75L00L74J55
1290e6j93J56k10K49N29Mm82q9N83K36j26mk10m79J62J78l73l34q6j29n1O45J17
1313C7j98j59K94J50j34K65rk94M61L19j06k16o7l02k41J20j36m14l1L58J4o4
1335c53M98p3l94K52L76k43KL31J14j52J91O7m42k3P2m40l49J26O4j59M8L96j87
1358b78nL61J07l50M2L39r6K24K57o0k91Q3K32n12j15j91l06j05M56J17m41J82
1380c50L90L9j40K80j42k61J40M29J67j85J72k77O4P7k18o88l8%o5L17K30k06
1402b65k72M44K82j52k41L83j04k24Q03Q9l89j51J00O7l90M2l95k44J66J00qM1
$$ plain form
1424 -318 0 -177 -356 158 337 -57 -61 321 353 345 635 652 293 160 240 -41 -346 -437 -494 -521 -294 -303 -306 132 154
1449 154 -359 -403 284 278 -182 126 769 472 287 596 722 111 -369 -183 -93 -407 -393 -411 -345 -311 -361 87 410
1472 410 -205 -642 19 702 454 -95 381 863 395 -35 493 604 -457 -891 -352 183 -197 -676 -397 174
1492 174 -102 -376 75 299 -399 -404 463 1028 65 -162 750 1010 40 -370 318 173 -879 -1055 162 287
1512 287 -599 -953 200 544 -279 -538 286 527 -213 -216 853 1154 28 -57 709 648 -586 -759 265 -5
1532 -5 -1133 -960 405 309 -873 -688 670 530 -743 -495 761 733 -517 -194 1375 990 -441 -329
1550 -329 761 290 -1063 -801 420 41 -1158 -557 970 368 -1188 -524 985 421 -779 -70 1275
1567 1275 584 -720 375 1751 511 -1092 -303 721 -134 -1266 -562 636 -91 -1259 -221 1060
$$ packed form
1424c18L18j77j79N14J79l94mL82L2qK90J7l59j33Q0k81l05r1n7k7K27rlM38K2
1449A54n13m4O87om60L08O43k97j85L09J26o11m80J86R0l14J4j8O6L4n0M48L23
1472D10o15m37O61O83k48n49M76M82m68m30N28J11j061m34N39N35l80m79K79N71
1492A74k76k74M51K24o98nQ67N65r63k27R12K60r70m10O88j45j052j76J217J25
1512B87q86l54J153L44q23k59Q24K41p40lJ069L01j126q5P66o1j234j73J024k70
1532ej128J73J365r6j182J85J358j40j273K48J256k8j250L23J569l85j431J12
1550c29J090m71j353K62J221l79j199O01J527o02j556O64J509n64j200P09J345
1567A275o91j304J095J376j240j603P89J024q55j132P04J198p27j168J038J281
$$ plain form
1583 1060 3 -1376 -213 1269 295 -1062 206 1520 609 -667 369 1306 -176 -1323 -284 647
1599 647 -430 -1262 -272 815 -244 -1012 128 1085 -261 -1248 392 1457 -50 -863 852 1759 -39
1616 -39 -899 371 911 -594 -1219 37 581 -625 -1206 98 817 -266 -931 242 892 -453 -828 806
1634 806 1317 -320 -570 1194 1252 -813 -863 603 275 -1183 -1038 321 625 -631 -954 311 722 -286
1652 -286 -847 401 780 -220 -308 813 1120 -240 -455 859 549 -714 -578 361 -289 -1176 -308 724
1670 724 71 -812 -429 587 566 -381 -623 515 1043 -128 -112 1134 1101 -545 -506 742 343 -791 -654
1689 -654 -104 -361 -599 86 356 -276 -467 95 473 210 -297 -210 848 774 -206 72 1029 416 -885 -467
1709 -467 680 -80 -1187 -438 258 -266 -430 97 216 -166 -4 29 33 364 277 215 529 676 17 312 588
$$ packed form
1583A060j057j379J163J482r74j357J268J314r11j276J036R37j482j147J039R31
1599F47j077q32R90J087j059p68J140R57j346r87J640J065j507q13J715R07j798
1616c9q60J270N40j505o25J256N44j206n81J304P19j083o65J173O50j345l75J634
1634H06N11j637k50J764N8k065n0J466l28j458J45J359L04j256l23J265M11j008
1652b86n61J248L79j000q8J121L07j360k15J314l10j263J36R39o50q87Q68J032
1670G24o53q83L83J016k1r47k42J138N28j171J6J246l3j646L9J248l99j134J37
1689f54N50k57k38O85K70o32j91N62L78k63n07Q7J058p4r80K78R57o13j301M18
1709d67J147p60j107P49O96n24j64N27J19l82J62L3ML31q7o2L14J47o59K95K76
$$ plain form
1730 588 -146 -1033 -156 314 -458 -816 130 217 -282 -195 309 162 -278 -35 -86 189 707 402 -140 286 549
1751 549 113 -74 133 -383 -828 -177 236 -362 -482 189 -7 -211 211 305 -136 -180 334 420 462 476 110 -70
1773 -70 424 483 -304 -443 -92 -467 -620 -9 69 -427 -432 347 47 -270 121 86 -106 277 570 300 175 308
1795 308 310 3 142 -169 -736 -305 -125 -264 -299 25 67 -305 23 228 -92 -39 250 318 -5 344 413 88
1817 88 215 476 -62 -540 -191 -162 -613 -340 -194 -279 -256 92 104 -184 -43 184 63 92 625 165 -5 315
1839 315 558 217 52 -93 -563 -472 35 -60 -588 -254 85 -43 -128 274 -10 -288 174 316 91 39 281
1860 281 106 249 601 246 -222 -383 -234 -271 -288 -193 -353 -468 -25 263 -136 -128 180 -84 82 370 281 -49
1882 -49 229 487 375 124 -2 -177 -408 -150 7 -307 -306 -44 -81 -71 120 198 -138 -175 240 182 80 260 289
$$ packed form
1730E88p34q87Q77M70p72l58R46Q7m99Q7N04j47m40K43n1K75N18l05n42M26K63
1751E49m36j87K07n16m45O51M13n98j20O71j96k04M22R4m41m4N14Q6M2J4l66j80
1773g0M94N9p87j39L51l75j53O11P8m96nP79l00l17L91l5j92L83K93k70j25J33
1795C08Kl07J39l11n67M31J80j39l5L24M2l72L28K05l20N3K89O8l23L49O9l25
1817H8J27K61n38m78L49K9m51K73J46q5K3L48J2k88J41K27j21K9N33m60j70L20
1839C15K43l41j65j45m70R1N07r5n28L34L39j28q5M02k84k78M62J42k25n2K42
1860B81j75J43L52l55m68j61J49l7j7R5j60j15M43K88l99QL08k64J66K88q9l30
1882d9K78K58j12k51j26j75k31K58J57l14JK62l7J0J91P8l36l7M15n8j02J80K9
$$ plain form
1905 289 213 301 487 -104 -288 -83 -49 -278 -363 -264 -342 23 163 -221 -279 263 213 -119 71 323 82 45 380
1928 380 488 239 57 -116 -360 -174 130 -154 -768 -492 223 171 -73 -284 -96 271 444 -55 -226 368
1948 368 476 -129 85 571 312 -301 -260 64 105 -163 -367 -518 -297 284 323 -290 -547 -22 397 438 -62
1969 -62 -304 440 773 123 -279 240 747 -229 -844 -210 344 -114 -746 -648 244 259 -79 -465 -235 413 548
1990 548 -8 -232 45 662 800 31 -405 -212 683 323 -959 -886 507 294 -847 -827 387 669 -409
2009 -409 -826 164 981 347 -516 -485 695 1004 291 -265 -302 230 371 70 -740 -799 30 603 -484 -1058
2029 -1058 -10 1002 139 -935 -120 1131 625 -868 -623 987 1411 -59 -1130 -77 958 308
2045 308 -887 -857 -115 229 32 -486 -707 -124 688 372 -501 -400 802 915 -416 -666 875 1348 -163
$$ packed form
1905B89p6Q8J86n91j84K05L4k29q5R9p8L65J40l84n8N42n0l32J90K52k41l7L35
1928C80J08k49j82j73k44J86L04k84o14K76P15n2k44k11J88L67J73m99j71N94
1948C68J08o05K14M86k59o13M1L24M1k68k04j51K21N81L9o13k57N25M19M1n00
1969f2k42P44L33o50m02N19N07r76o15O34N54m58o32R8Q92J5l38l86K30O48J35
1990E48n56k24K77O17J38p69m36J93Q95l60j282P3J393k13j141K0J214K82j078
2009d09m17R90Q17o34q63L1J180L09p13n56l7N32J41l01q10n9Q29N73j087n74
2029a058J048J012q63j074Q15J251n06j493K45J610M24j470j071J053J035o50
2045C08j195L0P42L44j97n18k21N83Q12l16q73J01J202J13j331k50J541M73j511
$$ plain form
2064 -163 -1493 -79 1423 600 -1482 -1166 555 891 -598 -1059 -292 664 398 -221 -393 -5 574 413
2082 413 -270 -379 511 961 76 -917 -208 1063 552 -1388 -1382 656 1209 -659 -1723 -40 1433 676
2100 676 -1101 -773 889 1053 -23 -517 125 538 406 -209 -437 -55 372 6 -815 -777 318 748 -376
2119 -376 -1302 -158 1459 651 -1220 -969 1073 1555 -101 -1252 108 1299 513 -855 -546 403 191
2136 191 -632 -766 -56 340 95 -498 -445 340 905 170 -790 -630 1068 1316 -238 -1204 -35 1374 768
2155 768 -1066 -1131 512 718 -766 -1119 -11 694 5 -784 -302 658 472 -198 -415 135 862 637 -195
2174 -195 -606 174 904 227 -1058 -880 464 708 -598 -1237 -244 906 335 -873 -458 666 712 -298
2192 -298 -543 343 848 194 -470 -102 736 471 -347 -913 -238 550 289 -657 -1045 -298 741 298 -709
$$ packed form
2064a63j330J414J502q23k082L16J721L36j489m61P67R56k66o19j72L88N79j61
2082D13o83j09Q90M50q85r93P09J271n11j940OK038N53j868j064J683J473p57
2100F76j777L28J662J64j076m94O42M13j32o15k28L82M27l66q21L8J095M30j124
2119c76r26J144J617q08j871K51K042M82j656j151J360J191p86j368L09R49k12
2136A91q23j34P10L96k45n93N3P85N65p35r60J60J698K48j554r66J169J409o06
2155G68j834o5J643K06j484l53J108P05o89p89M82R60j86o70k17N50P27k25q32
2174a95m11P80P30o77j285J78J344K44j306o39R93J150n71j208M15J124M6j010
2192b98k45Q86N05o54o64L68Q38k65q18n66O75P88k61r46l88P47J039m43j007
$$ plain form
2211 -709 -526 566 826 -141 -322 359 647 84 -377 -79 695 275 -802 -807 111 468 -137 -815 -481 278
2231 278 607 -34 -450 -355 551 531 55 -280 162 487 238 -313 -60 210 215 -516 -494 56 286 -337 -746 -172
2253 -172 454 417 -442 -374 172 572 249 -203 -30 177 519 184 -324 -146 161 9 -373 -478 -192 69 -261
2274 -261 -314 58 247 106 -375 -186 431 580 7 -245 120 443 514 -113 -279 -128 139 50 -215 -409 -184
2295 -184 20 -150 -164 -6 101 -160 -145 83 257 356 -56 -139 253 452 300 -237 -257 -4 164 -91 -448 -290
2317 -290 -110 -90 -48 -183 9 91 -15 82 138 192 7 -45 76 358 357 -16 -137 -129 126 -30 -275 -540 -268 7
2341 7 100 -41 -117 -60 72 154 158 230 120 99 228 162 319 154 -114 -173 -141 51 -236 -322 -338 -91 72 21 -126
2366 -126 -80 21 198 141 85 67 154 230 245 127 84 17 -56 4 -196 -129 -204 -254 -302 -80 86 -35 -158 -8 268
$$ packed form
2211g09J83J092K60r67j81O81K88n63m61K98P74m20j077nR18L57o05o78L34P59
2231B78L29o41m16R5R06k0m76l35M42L25k49n51K53K70Np31K2N50K30o23m09N74
2253a72O26l7q59O8N46M00l23m52J73K07L42l35n08J78L07j52l82j05K86K61l30
2274b61n3L72J89j41m81J89O17J49n73k52L65L23P1o27j66J51K67q9k65j94K25
2295a84K04j70j4J58J07k61J5K28J74R9m12q3L92J99j52n37k0K53J68k55l57J58
2317b90J80K0M2j35J92Q2j06R7N6N4j85n2J21K82jl73j21QK55j56k45k65K72K75
2341GR3j41p6N7J32Q2MP2j10k1J29o6J57j65k68n9L2J92k87q6j6K47J63n1j47
2366a26M6J01J77n7n6j8Q7P6J5j18m3o7p3O0k00O7p5n0m8K22J66j21j23J50K76
$$ plain form
2391 268 291 -14 -137 79 297 308 77 -77 26 291 53 -241 -249 -125 -135 -206 -160 -85 -5 -64 -222 103 293
2414 293 143 12 -137 196 328 315 4 -39 124 52 56 -230 -361 -131 -145 -225 -217 0 151 -70 -165 182 234 303
2438 303 68 -42 133 234 186 -192 -177 61 180 -194 -341 -247 -58 -110 -281 -296 129 366 -44 -217 -31 427
2460 427 248 -72 -90 199 331 182 -140 -28 157 66 -280 -513 -203 150 -156 -537 -191 118 307 59 -344
2481 -344 49 502 430 -202 -152 314 423 -57 -340 -6 428 80 -428 -509 40 241 -151 -488 -294 373 406
2502 406 -79 -260 132 409 146 -211 -146 423 503 -193 -392 30 300 -29 -503 -470 75 222 -249 -509 -98
2523 -98 443 429 -242 -167 262 606 132 -311 52 428 367 -339 -378 101 472 -107 -684 -382 263 142 -325 -537
2545 -537 -8 392 301 -248 -222 171 509 121 -422 -12 465 220 -290 -396 39 242 -336 -690 -263 400 387
$$ packed form
2391B68K3l05j23K16K18J1k31j54J03K65k38k94qJ24j0p1M6P5Q0n9j58L25J90
2414B93j50j31j49L33J32j3l11m3J63p2Mk86j31K30j4q0QK17J51k21r5L47N2O9
2438C03k35j10J75J01m8l78J5K38J19l74j47R4J89n2j71j5M25K37m10j73J86M58
2460D27j79l20j8K89J32j49l22J12J85r1l46k33L10L53l06l81L46L09J89k48m03
2481c44L93M53p2o32N0M66J09m80k83L34M34l48n08q1N49K01l92l37J94O67L3
2502D06m85j81L92K77k63l57O5N69Q0o96j99M22K70l29m74L3N45J47m71k60M11
2523i8N41j4o71P5M29L44m74m43L63L76o1p06l9M79L71n79n77L02O45j21m67k12
2545e37N29M00r1n49K6L93L38l88n43M10M77k45n10j06M35K03n78l54M27O63j3
$$ plain form
2566 387 -466 -530 195 605 232 -439 -231 393 479 -251 -350 60 599 127 -314 -339 276 216 -327 -562 -174 411
2588 411 203 -437 -451 331 686 15 -492 13 649 429 -358 -330 232 530 108 -475 -307 183 144 -273 -572
2609 -572 33 259 21 -254 -160 324 510 11 -488 78 713 278 -477 -329 319 609 -66 -592 -319 213
2629 213 215 -336 -375 78 244 -6 -150 84 378 232 -227 -145 276 556 131 -502 -231 291 504 -120 -741
2650 -741 -364 349 279 -476 -569 42 350 -27 -401 145 456 146 -171 -29 330 326 -70 -246 -100 277 250 -352
2672 -352 -571 -90 327 172 -463 -492 307 488 -68 -360 67 400 345 -125 -25 334 284 -241 -128 229 130
2693 130 -221 -478 -220 87 88 -195 -455 -227 386 418 -80 -287 14 576 255 -185 -164 169 273 -60 -192
2714 -192 77 103 -291 -436 -4 111 -30 -461 -235 234 415 17 -233 -80 322 367 256 -244 -384 139 363
$$ packed form
2566C87q53o4P25M10l73o71K08O24Q6p30r9M10N39m72m41k5O15o0n43k35L88N85
2588D11k08o40j4P82L55o71n07N05O36k20p87K8N62K98m22n83J68M90l9m17k99
2609e72O05K26k38k75R4M84J86m99m99N66O35m35p55J48O48K90o75n26K73N32
2629B13Kn51l9M53J66k50j44K34K94j46m59Q2M21K80m25o33K71N22K13o24o21
2650g41L77P13p0p55r3O11L08l77l74N46L11l10l17J42L59ml96j76J46L77k7o02
2672c52k19M81M17j55o35k9P99J81n56k92M27L33n5m70J00L59n0n25J13L57r9
2693A30l51k57K58L07Jk83k60K28O13L2m98k07L01N62l21m40K1L33J04l33j32
2714a92K69K6l94j45M32J15j41m31K26M69J81l98k50J53M02M5j11n00j40N23K24
$$ plain form
2735 363 164 -251 -105 -7 26 -175 -95 91 -130 -309 -80 214 270 -38 -239 133 383 261 -54 -295 79
2756 79 274 355 -74 -264 -280 67 14 -307 -292 -190 -73 84 -41 77 101 -173 -104 220 246 48 -321 -167 201
2779 201 348 -59 -357 -171 40 247 -66 -246 -356 -79 76 49 -77 -69 -47 105 168 209 25 -132 -70 100
2801 100 333 90 -314 -358 63 201 -45 -256 -314 -102 95 224 -153 -254 -138 230 277 254 99 -127 1
2822 1 159 328 46 -158 -280 -102 231 36 -248 -378 -160 122 178 90 -204 -167 125 336 236 -84 -123 66
2844 66 164 251 59 -212 -222 93 135 77 -210 -283 -115 28 231 61 -278 -128 179 252 159 28 -172 -68 191
2867 191 270 -17 -126 -121 40 195 37 -161 -336 -240 112 76 -27 -214 -210 40 301 431 -49 -161 21 254
2889 254 358 3 -347 -263 71 302 117 -377 -311 -238 -53 209 -25 -391 -323 261 254 243 46 -149 -143 277 536
$$ packed form
2735C63j99m15J46R8L3k01Q0J86k21j79K29K94N6l08k01L72K50j22l15k41L74
2756G9J95Q1m29j90j6L47n3l21J5J02J17J57j25J18K4k74O9L24K6j98l69J54L68
2779B01J47m07k98J86K11K07l13j80j10K77J55k7j26QK2J52O3M1j84j57O2J70
2801A00K33k43m04m4M21J38k46k11n8K12J97J29l77j01J16L68M7k3j55k26J28
2822AJ58J69k82k04j22J78L33j95k84j30K18K82N6q8k94L7K92K11j00l20l9J89
2844F6R8Q7j92k71j0L15M2n8k87p3J68J43K03j70l39J50L07P3r3j31k00J04K59
2867A91P9k87j09NJ61J55j58j98j75R6L52l6j03j87MK50K61J30m80j12J82K33
2889B54J04l55l50Q4L34K31j85m94O6P3J85K62k34l66O8N84pj1j97j95OM20K59
$$ plain form
2912 536 91 -248 -257 -4 196 108 -179 -487 -227 157 193 -49 -194 -239 -113 353 351 -20 -186 -98 344 309 101
2935 101 -100 -225 -83 248 104 -246 -298 -160 -4 309 64 -262 -313 143 209 157 -55 -26 -2 280 453 140
2957 140 -114 -298 54 252 117 -155 -531 -285 186 209 -91 -245 -190 -73 263 338 -60 -358 -14 488 316
2978 316 -16 -171 -28 -52 201 102 -164 -232 -354 63 169 249 -370 -350 94 448 224 -152 -118 -85 127 360
3000 360 221 -187 -282 -6 391 176 -97 -365 -218 -4 159 11 -218 -309 -197 162 434 27 -540 -226 366
3021 366 398 -41 -245 -104 1 279 211 -103 -502 -247 88 231 96 -236 -408 -61 404 221 48 -34 -103
3042 -103 26 414 445 -225 -286 122 478 96 -285 -297 -126 144 121 -50 -221 -253 -133 183 421 10 -329 -212
3064 -212 488 496 53 -152 -226 -19 130 388 -4 -491 -306 174 377 -70 -359 -273 46 201 125 -45 -41 -136 96
$$ packed form
2912E36m45l39rK53K00q8k87l08K60L84L6k42j45m5J26M66kl71j66Q8M42l5k08
2935A01k01j25J42L31j44l50n2J38J56L13k45l26n1M56O6n2k12K9K4K82J73l13
2957A40k54j84L52J98j35k72l76K46M71K3l00j54N5J17L36P5l98k98L44N02j72
2978C16l32j55J43k4K53r9k66o8j22M17J06Q0o19K0M44L54k24l76L4L3K12K33
3000C60j39m08r5K76L97k15k73k68J47K14J63j48k29r1J12L59K72m07n67L14N92
3021C66L2m39k04J41J05K78o8l14l99K55L35J43j35l32j72L47M65j83j73q2o9
3042a03J29L88L1o70o1M08L56l82l81j2J71K70k3j71j71l2J20L16K38m11l39J17
3064b12P00Qm43k05p4K07J49K58l92m87J85M80K03m47k89Q6L19J55p6j70Mr5K32
$$ plain form
3087 96 376 405 -63 -539 170 437 351 -204 -293 -262 7 155 202 -296 -455 -125 348 260 -180 -293 -147 291
3109 291 270 49 11 -56 -170 63 433 35 -401 -373 84 513 -83 -304 -241 -37 279 257 64 -136 -85 155
3131 155 266 181 -223 -309 220 244 50 -180 -105 -263 -87 61 196 -173 -446 -139 416 207 -96 -447 -5
3152 -5 409 293 69 -109 -113 20 194 354 -44 -370 -195 8 177 -12 -259 -276 -166 51 391 144 -331 -281
3174 -281 260 428 207 -119 -401 72 437 254 -110 -214 -218 -38 81 180 -129 -469 -169 232 173 40 -268
3195 -268 -275 -78 290 378 -102 -342 -163 399 451 -147 -428 -160 247 174 -92 -149 -203 -167 36 265 0 -231 -204
3218 -204 40 396 190 59 -171 -92 134 442 168 -256 -357 137 398 35 -456 -473 74 260 55 -78 -147
3239 -147 -145 -44 293 349 -42 -181 55 312 366 -39 -248 -195 16 320 130 -144 -370 -232 309 371 -100 -380
$$ packed form
3087I6K80K9m68m76P09K67q6n55q9L1K69J48M7m98j59L30M73q8m40j13J46M38
3109B91k1k21l8o7j14K33L70l98m36K8M57M29n96k21O3K04L16k2j93k00N1K40
3131A55J11q5m04q6N29K4j94k30P5j58J76J48J35l69k73L07N55k09l03l51M42
3152eM14j16k24j78mJ33J74J60l98l26J75K03J69j89k47j7J10K17L40k47m75N0
3174b81N41J68k21l26k82M73L65j83l64j04mJ80J19R9l09l40L00M01n9j33l08
3195b68pJ97L68Q8m80k40J79N62N2n98k81K68M07p3k66n7n4L6K03K29k65k31K7
3218b04K44L56k06j31k30P9K26L08k74m24j01M94K61l63m91j7N47J86k05j33o9
3239a47KJ01L37N6l91j39K36K57N4m05k09N3K11L04j90k74k26J38N41O2m71k80
$$ plain form
3261 -380 -205 246 264 122 -119 -15 -51 202 278 124 -265 -335 -11 289 169 -238 -438 -128 235 250 9 -251
3283 -251 -236 -34 450 175 -64 -311 -36 278 195 21 -122 -150 18 182 221 -76 -239 -299 121 226 52 -347
3305 -347 -242 170 289 151 -127 -248 -97 171 308 32 -243 -121 -15 241 52 -180 -309 -282 20 75 5
3326 5 -159 -230 -49 307 279 -89 -147 25 233 255 40 -279 -288 119 261 94 -242 -317 -93 106 325 -111 -212
3349 -212 -167 -41 287 273 -91 -249 -143 275 268 23 -253 -245 -163 304 245 -187 -400 -289 169 122 103 -343 -155
3372 -155 28 149 188 15 -78 -71 169 308 78 -197 -249 32 333 203 -130 -340 -19 183 160 -13 -377 -245
3394 -245 56 200 279 -23 -230 73 282 228 -1 -125 -77 23 252 162 -56 -354 -102 81 241 41 -241
3415 -241 -104 33 207 266 -183 -86 -61 193 212 81 -224 -179 234 230 260 -114 -178 -130 33 161 -23 -241 -482
$$ packed form
3261c80J75M51J8j42k41J04l6K53P6j54l89p0L24L00j20m07k00L10L63J5k41k60
3283b51J5K02M84k75k39k47K75L14q3j74j43k8J68J64L9k97j63o0M20J05j74l99
3305c47J05M12J19j38k78j21J51K68J37k76k75J22J06K56j89k32j29K7L02N5p0
3326Ej64p1J81L56k8l68n8J72K08K2k15l19rM07J42j67l36p5K24J99K19m36j01
3349b12M5J26L28j4l64j58J06M18pk45k76QQ2M67n9m32k13J11M58m7j9m46J88
3372a55J83J21L9j73r3PK40J39k30k75n2K81L01j30l33k10L21K02k3j73l64J32
3394b45L01J44P9l02k07L03K09n4k29j24M8J00K29r0k18k98K52J83J60k00k82
3415b41J37J37J74N9m49R7K5K54J9j31l05M5M13mL0l74o4M8J63J28j84k18k41
$$ plain form
3438 -482 9 332 256 -85 -296 -101 310 283 125 -135 -91 87 98 159 26 -252 -119 94 215 124 -169 -122
3460 -122 11 249 169 -24 -186 -24 118 317 120 -59 -136 30 344 201 -278 -274 -5 20 216 68 -224 -212
3482 -212 -46 221 133 -38 -89 -210 157 184 18 -225 -49 -60 8 282 60 -302 -276 98 145 -212 -224 -146 65
3505 65 137 104 -45 -134 36 67 134 128 -83 7 -99 320 143 -148 -248 -18 50 64 172 -155 -414 -2 288 173
$$ packed form
3438d82M91L23p6l41k11J95M11k7j58k60M4J78J1O1j33k78J33K13J21r1k93M7
3460a22J33K38q0j93j62J62J42J99j97j79p7J66L14j43m79MK69K5J96j48k92J2
3482b12J66K67q8j71n1j21L67K7j66k43J76j1O8K74k22l62K6L74M7l57j2P8K11
3505F5P2l3j49q9J70L1O7ok11R0j06M19j77k91j00K30O8J4J08l27k59M12K90j15
$$ [...]
8191B
##END NTUPLES=NMR FID
##END=
