##TITLE=1H_DE-80H_X3
 200.13MHz, d2o
 8 sc
 
 19ns.26.2.2025
##JCAMPDX= 6.0         $$ Bruker NMR JCAMP-DX V2.0
##DATA TYPE= NMR FID
##DATA CLASS= NTUPLES
##ORIGIN= UXNMR, Bruker Analytische Messtechnik GmbH
##OWNER= pz
$$ XWIN-NMR		Version 3.5
$$ Fri Oct 31 12:08:31 2025 Russian Standard Time (UT+4h)  Yarkov@DPX200
##.OBSERVE FREQUENCY= 200.1313
##.OBSERVE NUCLEUS= ^1H
##.DELAY= (6, 6)
##.ACQUISITION MODE= SIMULTANEOUS
##.ACQUISITION SCHEME= undefined
##.AVERAGES= 8
##.DIGITISER RES= 18
##SPECTROMETER/DATA SYSTEM= spect
##.PULSE SEQUENCE= zg30
##.SOLVENT NAME= MeOD
##.SHIFT REFERENCE= (INTERNAL, MeOD, 0, 14.3821)
##AUDIT TRAIL= $$ (NUMBER, WHEN, WHO, WHERE, WHAT)
$$ ##TITLE= Audit trail, XWIN-NMR		Version 3.5
$$ ##JCAMPDX= 5.01
$$ ##ORIGIN= Bruker BioSpin GmbH
$$ ##OWNER= Yarkov
$$ C:/Bruker/XWIN-NMR/data/yarkov2/nmr/H-C/1/audita.txt
$$ ##AUDIT TRAIL=  $$ (NUMBER, WHEN, WHO, WHERE, WHAT)
(   1,<2025-10-31 12:06:23.48 +0400>,<Yarkov>,<DPX200>,
      <created by zg, POWCHK disabled, PULCHK disabled
       configuration hash MD5:
       00 E9 B6 7A A2 85 ED C7 34 08 36 98 17 FE 4E 26
       data hash MD5: 16K
       1C 15 76 A7 A8 DC E9 B9 82 2E E3 B6 A8 67 50 66>)
$$ ##END=
$$ 
$$ hash MD5
$$ 8A 43 5E 0B 81 BE 55 1C 18 CC 74 09 EF B3 4F A4
##$RELAX= 
##$RELAX= 
##$RELAX= 
##$RELAX= 
##$RELAX= 
##$RELAX= 
$$ Bruker specific parameters
$$ --------------------------
##$DU= <C:/Bruker/XWIN-NMR>
##$EXPNO= 1
##$NAME= <H-C>
##$PROCNO= 1
##$TYPE= <nmr>
##$USER= <yarkov2>
##$AMP= (0..31)
100 100 100 100 100 100 100 100 100 100 100 100 100 100 100 100 100 100 
100 100 100 100 100 100 100 100 100 100 100 100 100 100 
##$AQSEQ= 0
##$AQ_mod= 1
##$AUNM= <au_zg>
##$AUTOPOS= <>
##$BF1= 200.13
##$BF2= 200.13
##$BF3= 200.13
##$BF4= 200.13
##$BF5= 200.13
##$BF6= 200.13
##$BF7= 200.13
##$BF8= 200.13
##$BYTORDA= 1
##$CFDGTYP= 0
##$CFRGTYP= 5
##$CHEMSTR= <none>
##$CNST= (0..31)
1 1 145 1 1 1 1 1 1 1 1 1 1 1 1 1 1 1 1 1 1 1 1 1 1 1 1 1 1 1 1 1 
##$CPDPRG= <>
##$CPDPRG1= <>
##$CPDPRG2= <>
##$CPDPRG3= <>
##$CPDPRG4= <mlev>
##$CPDPRG5= <mlev>
##$CPDPRG6= <mlev>
##$CPDPRG7= <mlev>
##$CPDPRG8= <mlev>
##$CPDPRGB= <>
##$CPDPRGT= <>
##$D= (0..31)
0 0.7 0 0 0 0 0 0 0 0 0 0.03 0 0 0 0 0 0 0 0 0 0 0 0 0 0 0 0 0 0 0 0 
##$DATE= 1761897982
##$DBL= (0..7)
120 120 120 120 120 120 120 120 
##$DBP= (0..7)
150 150 150 150 150 150 150 150 
##$DBP07= 0
##$DBPNAM0= <>
##$DBPNAM1= <>
##$DBPNAM2= <>
##$DBPNAM3= <>
##$DBPNAM4= <>
##$DBPNAM5= <>
##$DBPNAM6= <>
##$DBPNAM7= <>
##$DBPOAL= (0..7)
0.5 0.5 0.5 0.5 0.5 0.5 0.5 0.5 
##$DBPOFFS= (0..7)
0 0 0 0 0 0 0 0 
##$DE= 6
##$DECBNUC= <off>
##$DECIM= 32
##$DECNUC= <off>
##$DECSTAT= 4
##$DIGMOD= 1
##$DIGTYP= 9
##$DL= (0..7)
0 120 120 120 120 120 120 120 
##$DP= (0..7)
150 150 150 150 150 150 150 150 
##$DP07= 0
##$DPNAME0= <>
##$DPNAME1= <>
##$DPNAME2= <>
##$DPNAME3= <>
##$DPNAME4= <>
##$DPNAME5= <>
##$DPNAME6= <>
##$DPNAME7= <>
##$DPOAL= (0..7)
0.5 0.5 0.5 0.5 0.5 0.5 0.5 0.5 
##$DPOFFS= (0..7)
0 0 0 0 0 0 0 0 
##$DQDMODE= 0
##$DR= 18
##$DS= 0
$$ [...]
##$SUBNAM2= <"">
##$SUBNAM3= <"">
##$SUBNAM4= <"">
##$SUBNAM5= <"">
##$SUBNAM6= <"">
##$SUBNAM7= <"">
##$SUBNAM8= <"">
##$SUBNAM9= <"">
##$SW= 18.0517328524113
##$SWIBOX= (0..15)
0 0 2 0 0 0 0 0 0 0 0 0 0 0 0 0 
##$SW_h= 3612.71676300578
##$TD= 16384
##$TD0= 1
##$TE= 0
##$TE2= 300
##$TE3= 300
##$TEG= 300
##$TL= (0..7)
0 120 120 120 120 120 120 120 
##$TP= (0..7)
150 150 150 150 150 150 150 150 
##$TP07= 0
##$TPNAME0= <>
##$TPNAME1= <>
##$TPNAME2= <>
##$TPNAME3= <>
##$TPNAME4= <>
##$TPNAME5= <>
##$TPNAME6= <>
##$TPNAME7= <>
##$TPOAL= (0..7)
0.5 0.5 0.5 0.5 0.5 0.5 0.5 0.5 
##$TPOFFS= (0..7)
0 0 0 0 0 0 0 0 
##$TUNHIN= 0
##$TUNHOUT= 0
##$TUNXOUT= 0
##$USERA1= <user>
##$USERA2= <user>
##$USERA3= <user>
##$USERA4= <user>
##$USERA5= <user>
##$V9= 5
##$VALIST= <valist>
##$VCLIST= <CCCCCCCCCCCCCCC>
##$VD= 0
##$VDLIST= <DDDDDDDDDDDDDDD>
##$VPLIST= <PPPPPPPPPPPPPPP>
##$VTLIST= <TTTTTTTTTTTTTTT>
##$WBST= 1024
##$WBSW= 4
##$XGAIN= (0..3)
0 0 0 0 
##$XL= 0
##$YL= 0
##$YMAX_a= 680968
##$YMIN_a= -640850
##$ZGOPTNS= <>
##$ZL1= 120
##$ZL2= 120
##$ZL3= 120
##$ZL4= 120
##$ABSF1= 10
##$ABSF2= 0
##$ABSG= 5
##$ABSL= 3
##$ALPHA= 0
##$AQORDER= 0
##$ASSFAC= 0
##$ASSFACI= 0
##$ASSFACX= 0
##$ASSWID= 0
##$AUNMP= <proc_1d>
##$AZFE= 0.1
##$AZFW= 0.1
##$BCFW= 1
##$BC_mod= 2
##$BYTORDP= 1
##$COROFFS= 0
##$CY= 83.5205535888672
##$DATMOD= 1
##$DC= 2
##$DFILT= <>
##$DTYPP= 0
##$F1P= 10.8118882576601
##$F2P= -7.23987719738617
##$FCOR= 0.5
##$FTSIZE= 0
##$FT_mod= 4
##$GAMMA= 1
##$GB= 0.15
##$INTBC= 1
##$INTSCL= 1
##$ISEN= 128
##$LB= 0.25
##$LEV0= 0
##$LPBIN= 0
##$MAXI= 10000
##$MC2= 0
##$MEAN= 0
##$ME_mod= 0
##$MI= 1.114404
##$NCOEF= 0
##$NC_proc= 0
##$NLEV= 6
##$NOISF1= 3.799351
##$NOISF2= 2.8
##$NSP= 1
##$NTH_PI= 0
##$NZP= 0
##$OFFSET= 14.38212
##$PC= 1
##$PHC0= -4686.579
##$PHC1= -4.378087
##$PH_mod= 1
##$PKNL= yes
##$PPARMOD= 0
##$PSCAL= 0
##$PSIGN= 0
##$REVERSE= no
##$SF= 200.129724274929
##$SI= 16384
##$SIGF1= 3
##$SIGF2= 2
##$SINO= 400
##$SIOLD= 16384
##$SREGLST= <1H.CDCl3>
##$SSB= 0
##$STSI= 0
##$STSR= 0
##$SW_p= 3205.1282051282
##$SYMM= 0
##$S_DEV= 0
##$TDeff= 0
##$TDoff= 0
##$TI= <>
##$TILT= no
##$TM1= 0
##$TM2= 0
##$TOPLEV= 0
##$USERP1= <user>
##$USERP2= <user>
##$USERP3= <user>
##$USERP4= <user>
##$USERP5= <user>
##$WDW= 1
##$XDIM= 8192
##$YMAX_p= 0
##$YMIN_p= 0
$$ End of Bruker specific parameters
$$ ---------------------------------
##NTUPLES= NMR FID
##VAR_NAME=  TIME,          FID/REAL,        FID/IMAG
##SYMBOL=    X,             R,               I
##VAR_TYPE=  INDEPENDENT,   DEPENDENT,       DEPENDENT
##VAR_FORM=  AFFN,          ASDF,            ASDF
##VAR_DIM=   8192,          8192,            8192
##UNITS=     SECONDS,       ARBITRARY UNITS, ARBITRARY UNITS
##FACTOR=    0.0002768,     1,               1
##FIRST=     0,             0,               0
##LAST=      2.2672688,     0,               0
##MIN=       0,             -640850,         0
##MAX=       2.2672688,     680968,          0
$$ Real data points
##PAGE= N=1
##DATA TABLE= (X++(R..R)), XYDATA
0@%%%%%%%%qJ6k4M0n6P3r7J28j61K02k53L12l81M63n57O66p93R35j097J282j487
29g97J717j979K272k596K959l363L806m295M835n427O075o785P560q407R333j0341
45e433J1441j2643J3955j5384J6946j8660K0538k2601K4878k7398L0198l3332
57a7495L6860m0863M5453n0772N7022o4493P3612q5035R9848j20020J49649k00332
69a16566M11510q69011J003401o15411R3288M56430r36031J233862j277914J088868
79D72426p49179L35864R2039m56257O68194o91922N67366l58494J06746J46325
89A33108l28501L73858k82109J11050Q3512k66756L89624l84566K22733M7603
99I9556l41613N95365p63040P87108o20981K85554J29335n27204Q44869j030466
$$ y = [0, 0, 0, 0, 0, 0, 0, 0, 0, -8, 8, -16, 24, -32, 41, -56, 72, -89, 113, -140, 172, -209, 254, -303, 363, -430, 505, -592, 690, -797, 920, -1059, 1213, -1383, 1576, -1787, 2019, -2276, 2559, -2868, 3207, -3578, 3982, -4425, 4908, -5433, 6008, -6635, 7320, -8064, 8882, -9778, 10760, -11841, 13037, -14361, 15837, -17495, 19365, -21498, 23955, -26817, 30205, -34288, 39324, -45711, 54137, -65883, 83766, -116566, 294944, -574067, 429334, -186077, -92789, 363641, -572390, 661472, -616442, 472426, -276753, 59111, 151150, -305107, 363087, -328835, 238531, -119963, -13217, 133108, -195393, 178465, -103644, 7406, 90918, -175838, 213786, -170780, 51953, 99556, -242057, 353308, -409732, 377376, -243605, 41949, 171284, -355920, 488949, -541517]
109e41517J026668q11563M36894J698m25872P83184j013307J054759q94711N87694
119B03927k08784j86912N45777p93596Q66681p63318N37466k47544o0863L30170
129B23004m89391N01730l94954K28337m7578j13685K10866k04914J04509L5780
139E3704j62403K50003k80600K28035q5322j09336K95905m35373N11864n05137
149b38660L91355j77903q5527L40611n49422O82006o99486N76328l33262L0249
159f3711K72110n28206O92650p21198O02541l75958J04285J61076l81088N14927
169B77428n32580M41919k86307J10661N8026j96218K74319k75361K13974j22644
179c6783K4595O6717j30594J41221r1901M253R1655j74149K23918k15989J35007
$$ y = [-541517, 485151, -326412, 110482, 112180, -313692, 469492, -543815, 510944, -383767, 203927, -4857, -191769, 354008, -439588, 427093, -336225, 201241, -46303, -107166, 223004, -266387, 235343, -159611, 68726, 21148, -92537, 118329, -86585, 17924, 53704, -108699, 141304, -139296, 88739, 3417, -105919, 189986, -245387, 266477, -238660, 152695, -25208, -110735, 229876, -319546, 362460, -337026, 239302, -93960, -63711, 208399, -319807, 372843, -348355, 254186, -121772, -17487, 143589, -237499, 277428, -255152, 186767, -99540, 11121, 69147, -127071, 147248, -128113, 85861, -36783, -12188, 54529, -76065, 65156, -26745, -22492, 69163, -104986, 118932, -97057, 37950]
190C7950M042j61611K98358l86324M02122l28561J72171K9228k26066L79964m66925
201b45652M69121l80391K19401k5586j61287L14243m12689M37740l82177K60446
211I3169j01467o6339K17774l25426L63896l25036K23735q7448n5209J75406k44421
222a31366K44806j82250Q2282K4843j13505J62766j59070J04431j8973o9302J37693
233H2355j72086J64451j14242L2448O0788j45167K05610k30877K12481j49104
243e3343N0731O3949j73667K57406k95474K74259j93954P0926O7990j93247K78267
254A53843l03743K63784j69505M5672P8192j76011K29560k31137J85376j07411
264c1380J7374O5590j26742J56717j52463J17644o1422m289O6706j12989J32175
$$ y = [37950, 41992, -119619, 178739, -207585, 194537, -134024, 38147, 67375, -158691, 221273, -245652, 223469, -156922, 62479, 36893, -124394, 189849, -222840, 214900, -167277, 93169, -8298, -74637, 143137, -182289, 181607, -143429, 80306, -7142, -62351, 113055, -131366, 113440, -68810, 13472, 38315, -75190, 87576, -71494, 32937, 13964, -55338, 82355, -89731, 74720, -39522, -7074, 53714, -91453, 114157, -116720, 95761, -53343, -2612, 61337, -112330, 145076, -150398, 123861, -70093, 833, 68823, -124424, 153843, -149900, 113884, -55621, -9949, 68243, -107768, 121792, -109345, 76031, -31380, -14006, 51584, -75158, 81559, -70904, 46740, -14682, -18971, 47735, -65254, 66921]
275F6921j18560P4245r171o1141J18827j47636J37733q9466J4241O8485j36813
286h2335J72374j65505J17834m1725m3694J18008j64493J74074j46956R1379k0621
297H340n0856J10382j48226J58572j39988R5770l3443l6278J00480j45978J62034
308H0809j43445R2946k1238n5097J17525j50721J46830j07861M4854K5270q4383
319e4511J18244j20217R2699m5560p609N3733q3216R1421p8883N0252j2695k6029
331b2371N8957q0538Q6640p4912M5854l727m3387Q4976j10308J11366q5449L6734
343C835K3956q1706J21578j32940J12711o6307N944N3189r7243J17198j10723
354e0508Q1966l9633n857M5136p1842Q3236p9552O2756l5885L210K9526n6170
$$ y = [66921, -51639, 22606, 13435, -47706, 71121, -76515, 61218, -28248, -14007, 54478, -82335, 90039, -75466, 42368, 643, -43051, 74957, -89536, 84538, -62418, 28961, 8340, -42516, 67866, -80360, 78212, -61776, 33994, 551, -35727, 64753, -81225, 80809, -62636, 30310, 9072, -46025, 71500, -79221, 67609, -40252, 4602, 29872, -54511, 63733, -56484, 36215, -9345, -16954, 36779, -46437, 44984, -33899, 16353, 3658, -22371, 36586, -43952, 42688, -32224, 13630, 9903, -33484, 51492, -58816, 52550, -32899, 3835, 27791, -53915, 67663, -65277, 47434, -18873, -12929, 40260, -56983, 60215, -50508, 31458, -8175, -14032, 31104, -40738, 42498, -37054, 25702, -10183, -6973, 22553, -33617]
366c3617P1235p0923N4027k2935j5404N0726p2757P4790n5681J9936K3028o0980
378c8555Q2606q1763N9281k1690k1265N8790q1556Q4890p0159M2963r637k4069
390b0164N2619p1106P7140p1240N4780k8627m852L9710o7871Q2853q1532O3190
402B4900l0126j0480M7253o9794P3433n9187L1366K832l3038M9497m8665L4264
414A2255j2691j0683L0602m1034L8679k6413J0187O706k3920L9529m8859M8977
426B3335m0844K5931l474k5702N4808p4240P8497o7529M2624n920l5253O8332
438D0565q3523P9906o2135L4241o29k9984M7999n1047M4917l5250K2704p863m597
451d696J0424j2049J4383j6863J4626p157J50K632k946K226L175j5457K8217l1629
$$ y = [-33617, 37618, -33305, 20722, -2213, -17617, 33109, -39648, 35142, -20539, -603, 22425, -38555, 44051, -37712, 21569, -121, -21386, 37404, -44152, 40738, -29421, 13542, 3905, -20164, 32455, -38651, 38489, -32751, 22029, -6598, -11450, 28260, -39611, 43242, -38290, 24900, -5226, -15706, 31547, -38247, 35186, -24001, 7365, 10197, -22841, 26656, -22009, 12255, -436, -11119, 19483, -21551, 17128, -9285, 902, 7608, -16312, 23217, -25642, 23335, -17509, 8422, 4948, -20754, 34054, -40186, 38311, -29218, 13406, 7486, -27767, 40565, -42958, 36948, -25187, 9054, 8425, -21559, 26440, -24607, 20310, -14940, 7764, -99, -4696, 5728, -6321, 8062, -8801, 5825, -1332, -1182, 1450, -1496, 730, 3905, -11552, 16665, -14964]
465a4964K3059p405j2103L5470n7917O8118n9006L5630p828k0066M6806o6055
477c6261O9318n6839L8248k0405J688J9305l6671M4345m5004M4524m1346K8902
489I804q074j1439K3305l0305L5029l2623J9594l545m080J846K710o070J1298
502G450j7224J4509J908k3608L8979m6111M8895m4884K7738l78k4559L9613m9209
515b6881N7568n9111M7614k7831R207Q008l0098N4727o9648O7895n5208L8276
527A4518j5063j5972M4847n8172N5055m5208L3575j7107k832J5890j6005J0678
539D204r984J2815j2344R841j2702K0211k2453J5360o889L921j506p423J9307
552A2358k5755K7617l2488L9580l8180K3040j760j7405L5660n5117O7723o2742
$$ y = [-14964, 8095, 690, -11413, 24057, -33860, 34258, -24748, 10882, 3054, -17012, 29794, -36261, 33057, -23782, 14466, -5939, -4251, 15054, -21617, 22728, -22276, 22248, -19098, 9804, 1730, -9709, 13596, -16709, 18320, -14303, 5291, 1746, -2334, -488, 2222, -3848, 7450, -9774, 4735, 6643, -16965, 22014, -24097, 24798, -20086, 7652, 7274, -17285, 22328, -26881, 30687, -28424, 19190, -8641, 566, 8574, -21524, 33203, -36445, 31450, -23758, 14518, -545, -16517, 28330, -29842, 25213, -19995, 13580, -3527, -6359, 9531, -6474, 4204, -5780, 7035, -5309, 4532, -8170, 12041, -10412, 4948, -1941, 1980, 474, -6949, 12358, -13397, 14220, -18268, 21312, -16868, 6172, 4412, -12993, 22667, -32450, 35273, -27469]
564b7469M2026j7640m024K5806m7039N8262n4065M1964l1739K2225o910j2063
576a0666K5604l1606L6744m3084M2779l0486J2834Q25j0477K0961k9752K9390
588A3066k0663J3512j3261J4220j0940O705n778L749O396k1686L1923l3215L0934
601A4962k8074J9915m163j1885K0218k2851K6743l1591L1002k3997J6618j1248
613d351K350J3290k9116L6924l7148L4715k9072J5976K258j6388K1766k3004K4828
626A3028k4902J9900j3302J0665j0300N541M875j4982K0952k5261K9499k9344
638a3631K0987q315j671P861j4133K0904k3988K2218k0043K0232j8805J1101R48
651C665j1910K0412k8471L4447l3010K2805r301j972J0904j8992K3976k2766J7334
$$ y = [-27469, 14557, -3083, -7107, 18699, -28340, 29922, -24143, 17821, -13918, 8307, 1397, -10666, 14938, -16668, 20076, -23008, 19771, -10715, 2119, 2944, -7533, 13428, -16324, 13066, -7597, 5915, -7346, 6874, -4066, 2639, -3139, 610, 7006, -14680, 17243, -15972, 14962, -13112, 6803, 2640, -9245, 10973, -11878, 14865, -16726, 14276, -9721, 6897, -4351, -2001, 11289, -17827, 19097, -18051, 16664, -12408, 3568, 5826, -10562, 11204, -11800, 13028, -11874, 8026, -5276, 5389, -4911, 630, 5505, -9477, 11475, -13786, 15713, -13631, 7356, -959, -2630, 5231, -8902, 12002, -11986, 10232, -9811, 10421, -8384, 2717, 3665, -8245, 12167, -16304, 18143, -14867, 7938, -1363, -3335, 7569, -11423, 12553, -10213, 7121]
664G121j2924J0980q211K742K883o511J0005j5094J9090j8027J2502o643K413
677C26J641n893P888o576N121o872J0877j3751J4267j3366J0400l260p554J7746
691A0994k3509K4675k2617J7262q269k004R888j4348J7181j9469J9905j7312J2717
704E094p448R62P508j6298K2001k2825J9622j3642N359L900j1100J3892j2723
717e698R827o619L443j165R55k379L336k245m58L431o145Q487r632Q620n899L102
733I61j213k02J880l903O098q584J1237j2869J1791p482R34O370j2992J7310j7851
748h515J4257p867Q69N099r150J0879j0267Q121n809M122k920J574K48k423M749
763B967o803P891p290N011j905r16K669l066K148n95m37L4J894m578O887p747
$$ y = [7121, -5803, 5177, -3034, -292, 2591, -3920, 6085, -9009, 10081, -7946, 4556, -2087, 326, 1967, -3926, 3962, -2614, 2507, -4365, 6512, -7239, 7028, -6338, 4062, 802, -6752, 10994, -12515, 12160, -10457, 6805, -1464, -3468, 6420, -7928, 9253, -10216, 9689, -7623, 5094, -2354, -1392, 6116, -10182, 11819, -11006, 8616, -5026, 333, 4233, -6867, 7025, -5698, 4129, -2490, 953, -212, 743, -1636, 1700, -545, -1003, 2428, -3717, 4770, -4862, 3758, -2141, 961, -252, -454, 1426, -2477, 3621, -4963, 6274, -6595, 5196, -2286, -1352, 5018, -7974, 9336, -8515, 5742, -2125, -1256, 3843, -5307, 5572, -4695, 3426, -2383, 1739, -1181, 393, 641, -1782, 2967, -3836, 4055, -3235, 1776, -129, -1045, 1624, -1442, 706, 111, -326, -292, 1602, -2976, 3911, -3836]
779c836O463l017j875O760j0119J1014r426N977j740k114M822o083O204n762N205
794B473m643L830k390J11K848n850P938q298O672l402n98M123o086N966m006J187
810a25J251k356J823r0j999L420l502K089L64k947M745n213M368k705Q90N20j329
827g96J723k085K738l693M646n004M118j830j517N119p794Q609p260M077O1l908
843b796O402o910N557l106N66J237j953J726j026M92m99J028j769K169j879Q96
859A35M66j618K018j495K85Q98j377Q11P02k644M173m476L139l83k931N721p124
876c700O694m537J337J933m335N406n232M219k882J640p11k8R59k225L640m711
892b533N050m397K574J61l022M963n372M304k257r3J992k725K007l85j189J983
$$ y = [-3836, 2627, -390, -2265, 4495, -5624, 5390, -4036, 1941, 201, -1913, 2909, -3174, 3030, -2732, 2473, -2170, 1660, -730, -619, 2229, -3621, 4317, -3981, 2691, -711, -1309, 2814, -3272, 2694, -1312, -125, 1126, -1230, 593, 503, -1496, 1924, -1578, 511, 875, -2072, 2673, -2540, 1828, -877, 13, 533, -796, 927, -1158, 1580, -2113, 2533, -2471, 1647, -183, -1700, 3419, -4375, 4234, -3026, 1051, 1112, -2796, 3606, -3304, 2253, -853, -287, 950, -1003, 723, -303, 189, -310, 718, -1051, 1118, -761, 135, 601, -1017, 1001, -494, -209, 689, -688, 123, 825, -1819, 2354, -2122, 1017, 634, -2297, 3424, -3700, 2994, -1543, -206, 1727, -2608, 2798, -2434, 1785, -1097, 543, -168, -196, 763, -1462, 2178, -2533, 2517, -1880, 694, 855, -2167, 2796, -2576, 1728, -529, -622, 1370, -1355, 652, 267, -922, 1061]
908A061j733N27J296l077L967l532K140m93r82K135k752K676k252K126k468K676
924A315k131Q35R73l136N344o707O304m119J045J996m486N960n813M030j701j8
940c09Q38j140J110o48J74m90J711k879L095k521J716p21o87J991k317J720j252
957f09J611k295K653k812K872k054l68L698o284P255o890N409k460j596N141o661
973c390O390n495M249k260n8J483j780K097l185M200m119L230k337J257P09l000
989b009L949l041J523n25j96R86r73p31L096m062L105j377m87K939n795P429o550
1006b719M072j757j78K529m991O167n804N315n341M684k160j289M065o149Q152
1021D596r366Q070m177j85L361n651P438p719N579k299J81M26r73J938k230J493
$$ y = [1061, -672, -145, 1151, -1926, 2041, -1491, 649, 156, -826, 1309, -1443, 1233, -1019, 1107, -1361, 1315, -816, 19, 992, -2144, 3200, -3507, 2797, -1322, -277, 1719, -2767, 3193, -2620, 1410, -291, -309, 529, -611, 499, -149, 25, -465, 1246, -1633, 1462, -1059, 657, -64, -751, 1240, -1077, 643, -609, 1002, -1293, 1360, -1452, 1420, -634, -1002, 2696, -3588, 3667, -3223, 2186, -274, -1870, 3271, -3390, 3000, -2495, 1754, -506, -564, 919, -861, 1236, -1949, 2251, -1868, 1362, -975, 282, 991, -2009, 1940, -1101, 422, -103, -299, 687, -286, -1017, 2079, -1983, 1122, -255, -742, 2197, -3598, 3831, -2719, 1353, -404, -582, 1947, -3044, 3123, -2681, 2634, -2707, 1977, -183, -1472, 2593, -3556, 4596, -4770, 3300, -877, -1062, 2299, -3352, 4086, -3633, 1946, -353, -172, 254, -719, 1219, -1011, 482]
1037D82j219K331l482L042j563O92m85l02J647k012R88l43J434l155L836l635
1053a744L621l248R41L025o245P246o947O358m676J217K520m420M591m801N471
1068B909n268L727k291J788q68j753M896o463O321n867N186l015n62L368m017
1083a909L647l785M037l251K023j887K567k093j99K716m130N061o190O435m410
1098a368J042J388k381L240m415M716l593K496k650L058k021k12K017l070M374
1113B621n895N994l965J283L22j152K284l261K967j865J692k825L708l234K110
1128G84j182j56K723n454O471n613M267l115J437J012k933L456l491M237n293
1143b850N326m106K597j041j415M740p336P804o577M821k659l03L327m909M741
$$ y = [482, -737, 1594, -1888, 1154, -409, 283, -202, -504, 1143, -869, 119, -224, 1210, -1945, 1891, -1744, 1877, -1371, -430, 2595, -3650, 3596, -3351, 3007, -1669, -452, 2068, -2352, 2239, -2562, 2909, -2359, 1368, -923, 865, -3, -1756, 3140, -3323, 2998, -2869, 2317, -698, -1260, 2108, -1909, 1738, -2047, 1990, -1261, 762, -1125, 1442, -651, -850, 1866, -2264, 2797, -3393, 3042, -1368, -326, 1062, -1319, 1921, -2494, 2222, -1371, 1125, -1525, 1533, -488, -700, 1317, -1753, 2621, -3274, 2720, -1245, 38, 360, -792, 1492, -1769, 1198, -667, 1025, -1800, 1908, -1326, 784, -398, -554, 2169, -3285, 3186, -2427, 1840, -1275, 162, 1174, -1759, 1697, -1794, 2443, -2850, 2476, -1630, 967, -74, -1489, 3251, -4085, 3719, -2858, 1963, -696, -999, 2328, -2581, 2160]
1158B160m063L788l437K410j289P37k41j101L039m279M286l745L080j884N7J502
1174A020j813J250r81J306j631J857k518L506l729K485k97j780L445m869N617
1189B868n026L253j338j3J075k261L268l726L883m200M328l450J445R59l131M922
1205B856o123O139m620K213K3j655K778l387L300k641K106k041K059j680Q47J85
1221C59j324K625l698L930l166J914p40k05R50j316J205j003J213j893K605k942
1237a486K738j963N25J395l200M240m301L566k324Q30N31j436J797j867K019k296
1253a232K512k502K191j420J17J545l028L826l775K999j724K72R30j554J592j319
1269e70J081j064J299j666J957j827J092J07j455K535l113L051k359J275k09n39
$$ y = [2160, -1903, 1885, -1552, 858, -431, 306, 65, -1036, 2003, -2276, 2010, -1735, 1345, -539, -482, 1020, -793, 457, -524, 782, -849, 1008, -1510, 1996, -1733, 752, 455, -1325, 2120, -2749, 2868, -2158, 1095, -243, -256, 819, -1442, 1826, -1900, 1983, -2217, 2111, -1339, 106, 1065, -2066, 2856, -3267, 2872, -1748, 465, 488, -1167, 1611, -1776, 1524, -1117, 989, -1052, 1007, -673, 174, 359, -965, 1660, -2038, 1892, -1274, 640, -100, -305, 645, -671, 534, -469, 744, -1149, 1456, -1486, 1252, -711, -186, 1209, -1991, 2249, -2052, 1514, -810, 20, 551, -885, 912, -955, 1064, -1232, 1280, -1222, 969, -451, -334, 1211, -1817, 2009, -1766, 1233, -491, -219, 711, -843, 749, -570, 511, -553, 746, -920, 1037, -790, 302, 409, -1046, 1489, -1624, 1427, -932, 343, 134, -405]
1285d05R11j037J095j286J653k091K352k176J418j28j399K721l454L390k565J280
1301B79Q8j109J623j654J356j000Q37r29J143j219R53k86o50J570k181K275j861
1318g65J053j39n47Q29p26M31k44L41p46J302j772J843j342L42R07k043K700k681
1336a257K073j100O7P34j142J222j118J020j039J187j308J189o94j49J150j986
1352a151K389k221J518m99n26J189j344J066n63J33%J98n91R51j069P71r8p38
1370e85J473j835J681j148M75J18m96O18n40M63n43Q23j198J457j382Q77J7j077
1388h02J979k415K255j578N93M06j131J435j309R39o03M58m72N43n80M12Oo43
1406e07J292j622J527j088M29K68p90R28o94L12p2P3k63N89r56J112p82P3P39
$$ y = [-405, 506, -531, 564, -722, 931, -1160, 1192, -984, 434, 306, -1093, 1628, -1826, 1564, -1001, 279, 367, -742, 881, -773, 583, -417, 420, -509, 634, -585, 368, 82, -568, 1002, -1179, 1096, -765, 288, 149, -398, 431, -295, 136, -108, 233, -513, 789, -983, 860, -482, -140, 767, -1276, 1424, -1257, 816, -284, -217, 517, -625, 597, -521, 499, -540, 647, -661, 528, -166, -315, 835, -1151, 1238, -983, 535, 36, -490, 699, -645, 421, -142, -9, -9, 189, -402, 549, -520, 251, 153, -585, 888, -947, 734, -414, 61, 179, -317, 301, -239, 224, -319, 504, -694, 763, -619, 258, 275, -802, 1177, -1238, 1017, -561, 32, 438, -693, 742, -567, 372, -231, 227, -245, 298, -282, 130, 136, -507, 785, -837, 690, -398, 31, 299, -491, 437, -257, 55, -17, 56, -207, 382, -574, 538, -244, -171, 568]
1425E68j381J698j642J191m29l07P40p91O54n52M94n02O46r07R97o42m0P53j308
1444g60J650j688J276n01k68O60p28O93o05M09k91M94q94J092q57L18L01r47J581
1463I35j916J651r18J86L33p20R85r66O91m90O31q82Q38m86P9L58r63J572j765
1482h47J348n90p6N36r00J085q23K47P8J4k63L81m27N47m82m4P32j071R72p79
1502c62O59m34K1K70j24j06p1N87r85J158j322J401r87oJ067j655J822j858J639
1521G14q93j07P50q65Q72j067J188r95P39p13O63j37p45J363j502J434j325Q60
1539B34M2q67J106q55O29n34K42J56j69k53N97m35M6J44k53N92r68R00l83L0p8
1560g7J86m7j60J35j27N60j205J418j077O11k28l81J227j789J648j085O51l72
$$ y = [568, -813, 885, -757, 434, 5, -302, 438, -353, 301, -251, 243, -259, 387, -520, 477, -165, -205, 548, -760, 890, -798, 478, -23, -291, 369, -359, 334, -271, 138, -153, 341, -553, 539, -318, 0, 301, -646, 935, -981, 670, -248, -62, 271, -449, 536, -430, 261, -229, 402, -480, 358, -128, -49, 309, -654, 918, -847, 501, -89, -165, 371, -529, 556, -267, -20, 58, 72, -191, 190, -237, 310, -172, -216, 516, -555, 417, -362, 297, -137, -116, 154, 30, -76, -147, 440, -545, 613, -709, 692, -295, -301, 766, -889, 933, -925, 714, -179, -286, 464, -401, 471, -596, 592, -403, 336, -377, 286, 149, -596, 767, -735, 699, -626, 234, 276, -591, 515, -340, 289, -245, -3, 153, -16, -269, 328, -107, -61, 83, -170, 422, -546, 354, -29, 1, -77, 109, 62, -98, 37, -90, 470, -735, 683, -394, 217, -11, -392, 835, -954, 694, -391, 260, -112]
1578a12j05O49q72P19o41R23j175J013n64K21J11p35J447j690J309p66L85on38
1597d27R48q26M39l34N38o18M29k50K62j19m33J013j115Q36n91M16p7m08N99l58
1617g6P0j18L17l64L62n59P60n79J5N03o98P69r15R21n31O5Q8J1K5l02N46o37
1639c27P91j065J159p60O0N37r57J296j495J297o82P5K31m32O97r03Q60o96O34
1658C20o78N36p2m40P49r33J117j100O77n9l69N06n66N75m13J46JJ25l33L92k73
1679i2J72n7k25N80p64O66m47L14j94L0J16j59J34k69N73q37Q85p55M97r1m63
1700c86R69j192J089q28N14j16k97N40n69N01m98N60n44M59l63J84J33n33Q43
1719D66r17P95n72K72J12l68M33l58K56k40K98l57L94m24L82j58k25N56p47Q04
$$ y = [-112, -217, 432, -440, 279, -362, 561, -614, 399, -165, 56, 167, -568, 879, -811, 498, -268, 117, 111, -427, 521, -305, 134, -200, 338, -280, 149, -101, 161, 42, -391, 622, -493, 343, -248, 168, 91, -317, 282, -76, -6, -124, 193, -171, 191, -368, 392, -187, -172, 331, -367, 402, -513, 408, -123, -58, 30, 41, 66, -236, 310, -327, 464, -601, 558, -202, -142, 395, -562, 734, -761, 536, -146, -71, 160, -272, 425, -478, 382, -314, 320, -358, 178, 106, -334, 415, -518, 599, -501, 176, 117, -252, 254, -312, 263, -150, -4, -3, 122, -211, 181, -92, 80, 23, -202, 378, -386, 280, -167, 147, -47, -17, 99, -60, 74, -195, 378, -459, 426, -329, 168, 77, -386, 583, -609, 480, -348, 166, 50, -247, 293, -276, 225, -273, 287, -257, 202, -161, 23, 156, -377, 466, -451, 344, -228, 44, 156, -212, 221, -137, 119, -121, 177, -180, 214, -210, 172, 14, -211, 345, -402, 402]
1739D02p26M91j48j44L08l62L33l17L33l62M22m50L61j36j88M81p00P79o77M41
1759A41j12j56K95l07K77k42K10k36L33m21M19k76J8K91n72P27p24N62k86J2J70
1780A23k86L44l64L67l87M31m62L91k20n2L84o53P97p67N76k69o3L13m47M52l60
1801a52K81k26K16k31K40j94L9K02m22N54n68M55k62M3J39k46K61k08J53j64K55
1822A65l64M06l69K13N5l66O02p20O66m67J94P0k69L76l91L44l02K94k80K69j98
1843g2M8J82m05N76o19N34l37N8J92l42L79l10K01r7N9j12J89k15J69o5j35L34
1865B12m97N47m55K62l8j33K36k65K31k03K09k51K98l13K48n7j83M30o15O54n40
1886b23L10j5k31L94m29L66k95K09j45J38j34R8mj51L26m58M89m09K41k6j85K97
$$ y = [402, -324, 167, 19, -125, 183, -179, 154, -163, 170, -192, 230, -220, 141, 5, -183, 298, -402, 377, -300, 141, 29, -127, 168, -139, 138, -104, 106, -130, 203, -218, 201, -75, -57, 234, -338, 389, -335, 227, -59, -47, 123, -163, 181, -183, 184, -203, 228, -234, 157, -63, -115, 269, -384, 413, -354, 222, -47, -110, 203, -244, 208, -152, 129, -97, 119, -112, 128, -66, -27, 175, -247, 307, -261, 194, -68, -25, 114, -132, 129, -79, 74, -90, 165, -199, 207, -162, 51, 106, -260, 342, -378, 288, -179, 15, 85, -184, 192, -199, 145, -157, 137, -143, 126, -72, -24, 158, -247, 329, -290, 244, -93, -35, 157, -185, 194, -116, 85, -12, 47, -65, 124, -91, 78, 13, -122, 212, -285, 262, -193, 69, 31, -102, 134, -131, 100, -103, 106, -145, 153, -160, 88, 31, -152, 278, -337, 317, -223, 87, 72, -159, 235, -194, 172, -123, 86, -59, 79, -55, 43, 39, -112, 214, -244, 245, -164, 77, 51, -134, 163]
1908A63l11K43j55J03j08J56k16K37j60j2K16l96N17n30L98j68o4K48l36L52l07
1929a30K30j65J42j54J62r6n1K26l74M77m86L60j29j09K54k96K84k29J30o2P7
1950F1j69K06j82J01N0k51M33n18M68l10J10O7k18L28l21K57k43K84k94K35j42
1971d8K0J59l88N98o37N04k76L2K13m24N31m56K75j46R0k8k7L7l6P6k13L22l31
1994a53K47j70P1Q3k04K01j04J8j0O1j02J71k90L40k26k5K61l89N01n49M52j90
2016fn3J59k29L16l87L81k95K61k82K04L9l18M88n89O29n57L21K4l24M30m44M38
2038B06l67J85k4j1m2L6O8j45J90k60L57l65J97K7j26J49j85K31j60K2J5J05k22
2061a19K27j48R4j4k00M47n28M13k50J15J3j85L05k67J57j89K89l18K63j76J07
$$ y = [163, -148, 95, -60, 43, -65, 91, -125, 112, -48, -60, 156, -240, 277, -253, 145, -23, -87, 161, -175, 177, -130, 100, -65, 77, -77, 85, -11, -62, 164, -210, 267, -219, 141, 12, -97, 157, -139, 145, -84, 46, -16, 61, -108, 98, -84, 17, 67, -184, 249, -269, 199, -111, -1, 66, -152, 176, -145, 112, -131, 153, -141, 94, -48, -28, 131, -257, 341, -296, 208, -68, -36, 177, -247, 284, -172, 103, -43, 47, 19, -8, 29, -7, 69, -144, 178, -153, 94, -76, -5, 78, -126, 75, -29, -11, -21, 40, -62, 109, -181, 159, -67, -92, 169, -220, 281, -268, 184, -6, -59, 100, -129, 187, -200, 181, -114, 147, -135, 69, 108, -210, 278, -311, 318, -239, 82, 106, -218, 212, -232, 206, -161, 24, 0, -11, -53, -17, 51, -94, 96, -164, 193, -172, 25, 52, -74, 75, -110, 121, -39, -17, -2, 103, -119, 108, -40, 54, 40, -160, 287, -241, 172, -78, 37, 50, -135, 170, -97, 60, -129, 160, -158, 105, -71, 36]
2082C6M1l26N57n80M63l34J91K6k90M15l53K61k63K99k32J42j17R1Q5l53N43n22
2104b20M21l45J74J13l40L72k94K21k21J76o8L3j14J46Qk11K92k95L25l40J89
2125B2M3j93J72r0J02j18Q0n8J87l42L49k24M3J24k94M92n65M59k39P0Nj07K51
2148A69l21L00l16M04m36L16j13j00K89n18O86o59M39j45p8K40m01M68l87K45
2168H2j49J43j19L9J9n7J23k66L99l70K31r0rJ05j86J88o9k5qJ16k10K49k85K62
2192A13j30q7L28m63M76m31L16j34l5J32j86J98k66L50l57L36l11K33m1k53M68
2213B56n58N86m76K69k9k04L12k99K59k14J86j59J85k20J94o8j14K71l77M21l88
2234a67K65q5p0J34j48J53j39J22j57K13k92L08j87J3J59l44M61m71L75k08M0
$$ y = [36, 77, -249, 308, -272, 191, -143, 48, 74, -216, 199, -154, 107, -156, 143, -89, 53, -64, 27, 112, -241, 302, -220, 201, -144, 30, 143, -197, 175, -119, 102, -119, 57, -11, 22, -92, 54, 62, -149, 143, -152, 173, -167, 22, 65, -128, 44, -46, 56, -62, 18, -40, 147, -195, 154, -70, -27, 97, -197, 295, -270, 189, -50, 20, 25, -82, 169, -152, 148, -168, 236, -200, 116, 3, -97, 192, -326, 360, -299, 140, -5, -83, 157, -244, 224, -163, 82, -67, 76, -43, -4, 15, -42, 81, -185, 214, -156, 75, -15, -24, 81, -105, 83, 14, -11, -19, 97, -113, 136, -149, 113, -17, -104, 224, -239, 237, -194, 122, -12, -47, 85, -101, 97, -169, 181, -176, 160, -151, 82, 41, -212, 256, -302, 284, -192, 77, 48, -156, 156, -143, 116, -98, 88, -71, 114, -106, 88, 20, -94, 177, -200, 221, -167, 98, 13, -57, 77, -71, 82, -57, 65, -92, 121, -171, 137, -50, -37, 122, -222, 239, -232, 143, -65, -25]
2255b5J04j89K24k04J62j40J89k62K73k04Q3R8k78M12m59M00k52Q8M1j26J41j27
2277e1J15j46J97k57K90k71J96l1k07L95m89M62l47J70mj22K00j88J59j70K01
2298A02k27K58k50J69j8j80L46m35M33l27J69Jj01J61j74J34q9J05j45J94k55
2319a29K24j25j0J80l18L75l68K65j42J4R3j20J14j21J43j93K60l10L02j96K3
2340c9J66l38M37m38L29j56lJ32j80J81j63J44j37J66k01K07j57N3R8k53L39l70
2362a83K95j51J8Q0j15J04p2M6o2J09k06K58k53J95m4j47L16m07L83l07J74rq2
2385f0J16j17J26j33J62k25K82k63J71j7j52K90l90M04k97J42J0j27J75j62J19
2406E4q8O2r5J64j94J84j18m3J99l16L40k85J87m7n1J12j36J07o2P4j23J89k17
$$ y = [-25, 79, -110, 114, -90, 72, -68, 121, -141, 132, -72, 11, 109, -169, 243, -216, 184, -68, 20, 61, -65, 76, -51, 64, -82, 115, -142, 148, -123, 73, 42, -165, 230, -259, 203, -144, 26, 22, -100, 100, -88, 71, -99, 102, -125, 133, -117, 52, 34, -146, 200, -235, 198, -129, 40, 41, -60, 101, -73, 61, -28, 77, -68, 126, -129, 95, -30, -40, 140, -178, 197, -171, 94, -48, -34, 59, -61, 53, -68, 75, -118, 142, -168, 134, -62, -39, 127, -211, 226, -212, 117, -39, -42, 90, -90, 91, -72, 72, -65, 101, -100, 107, -50, 3, 101, -152, 187, -183, 112, -39, -21, 59, -56, 48, -24, 22, -40, 69, -137, 121, -132, 63, 19, -128, 188, -219, 164, -143, 31, 22, -60, 56, -61, 65, -68, 94, -131, 151, -112, 59, 42, -110, 180, -210, 194, -103, 39, 49, -78, 97, -65, 54, -34, 28, -67, 97, -97, 87, -31, -74, 125, -191, 149, -136, 51, 4, -47, 65, -71, 36, -26, 48, -75, 114, -103]
2429a03K12j66M7J26k91L65l44K56j12k0J15j43J11o9M4p0J24j69J97j89J11M4
2451G6k18L09l27K91k02O1N5j04Q9p2P2j14J73k03K57k82J67M5k18L37m01L96
2473A87k92J14O5j64J80j80J82j58J20j24J68j71Q6N5j88K75l28L27k18L3J12
2494H1j62J50j42P5J5n0OJ11j92J83j26N3N2j87K90k54J50q4N4j6k4K4PK9j60
2519a17K99l49L33k75J39P5l20M65m53L36k08J03N1k10K43j75J57k23K53j96J31
2540E9r2%J70l57L92l08K02r6m1J97k62J93o7K6k3J2rQ3j84J72l2j00J49j61J86
2565A09j71P3M9n4n1R5m2k5L7r7K51l69L16j48j9J30k55L81l94K49q1J5nl7J23
2590H0j69J39j67K96l49K38o5p4K14l36M27l82J75Ko0J26k19K35j40M2o2J35j46
$$ y = [-103, 109, -57, -10, 116, -175, 190, -154, 102, -10, -30, 85, -58, 53, -16, 28, -42, 82, -87, 110, -79, 32, 76, -142, 167, -160, 131, -71, -10, 45, -59, 30, -42, 30, -84, 89, -114, 143, -139, 28, 73, -145, 192, -209, 187, -105, 9, 74, -90, 90, -90, 92, -66, 54, -70, 98, -73, 13, 68, -120, 155, -173, 154, -64, -31, 81, -81, 69, -73, 2, 17, -33, -27, 84, -108, 75, -51, 2, 54, -133, 157, -97, 53, -31, 23, 7, -17, 7, 14, 43, -117, 182, -167, 166, -109, 30, 105, -215, 250, -203, 133, -75, 28, 79, -131, 112, -63, 94, -129, 124, -72, 59, -33, -33, 137, -220, 172, -136, 66, -30, -71, 126, -136, 57, -10, 16, -7, 5, -4, 79, -105, 67, 35, -65, 84, -77, 109, -62, 11, 60, 6, -45, 50, 8, -17, 20, -77, 174, -195, 121, -27, -46, 84, -171, 210, -184, 65, -16, -1, -6, -43, 80, -89, 50, -117, 179, -170, 68, 3, -71, 143, -193, 234, -148, 27, 29, -31, 95, -124, 111, -29, 13, -49, 86, -60]
2613f0Q3k8%R1k46K99k15P2J6l6P0j11O0O3j23L2R6j55J87k00J97r6q9K05k09
2638i7J82j63J46o6%j4O5m3q5J97k49L03l27K76r3j60L05l69L88l39K10l7r3R7
2662C4r5J59k03J92j88K03k01J36J8j86K58k75K76k10O7Q3j36J15p1N3k1j7J5
2685FR0j90J77j16K5M4r0J61j66J03n0L3m2M5m7M8l6n6J92k89K95k40J44J1j79
2710a27L03l43K71j67R6l6k9R0p0P0j46K12k41K29j84J06L9j98K99k99K30j37
2732c2N7J8p9P9k9qj6P4j49J91k05J67p1o2J67k02J86j48Q4k6j4mL8l3%N5j23
2759h5J99k36K12j14nJ24k00K15k06J53n6J1mJ4j1pN1j18J83k40K34j52M2Q2j88
2784a02K41k33J65r7L5j1pRJK3r0J62k36K52j97R9M2j43K08k32J86j07L7J4rk
$$ y = [-60, 23, -5, -5, 86, -160, 139, -76, -4, 12, -24, 46, -65, -5, 58, -65, -33, 63, -92, 95, -105, 92, -4, -93, 112, -97, 85, -78, 68, 2, 2, -12, 53, 10, -75, 122, -127, 176, -151, 125, 32, -128, 177, -192, 196, -143, 67, 30, -63, 34, -61, 98, -105, 87, -101, 102, -99, 37, 55, -131, 127, -148, 128, -82, -15, 68, -68, 47, -24, 29, 8, -9, 6, 96, -94, 83, -33, -8, 36, -54, 107, -59, 44, -6, 27, -15, 30, -17, 31, -5, -61, 131, -158, 137, -103, 41, 52, -127, 176, -167, 104, -63, 33, -3, -32, 58, -12, 58, -88, 124, -117, 112, -72, 34, 73, -125, 174, -125, 105, -32, 25, 43, -36, 43, 14, 6, -10, 64, -85, 106, -99, 68, -3, -65, 102, -100, 86, -62, 22, -4, -18, -22, 16, -17, -17, 38, -85, 114, -122, 90, -24, -29, 95, -105, 110, -96, 57, 1, 12, 8, 22, 11, 4, 55, -63, 120, -120, 114, -38, 4, 86, -102, 139, -94, 71, -26, 9, -2, -9, 0, 1, 24, -66, 96, -140, 112, -85, 14, 56, -87, 121, -111, 75, -32, 5, 19, 10, 8]
2810HJ4rm4J14j73K00j88J34j7r5J71k07J98j41O3l5J6j3L4l9j5R7j84K33k52
2835a30J95r9l4J52j81K02j90J38q0M3k0J9j7j0P7j50K28k70K24j20mJ34k06K14
2859A15j83J11l1j1K3Mm4K7Jo3J65k28K13j49O0L4j43J80j85J53r5N6k0L1n5N5
2885B1no1J59k38K53k23J35rj05J88k16J80j19P1k7J4k7L0nm6J24j93K08j95J32
2910D6l0q5J66j87J62j13M9Mj1j2K2l6J6L6j14J78j93J77r0k4J08j64J78j29R1
2935D5k5j6J2J7n1L9J4q4J76k29K02j44M7N1j36J76j55R3n3L3j7L9r8R1l3n6J48
2962H6k17K28j93J33j6j02J60j63J33j15J00m9L0l3M6ro0J55k28K41j94J17Pj42
2986h5J98j98J74j33N7K2o1L4Ok1oK3o9J30j38R3j9m3O2q4Q2n1K1K2qo7J33j35
$$ y = [8, 22, 13, -31, 83, -90, 110, -78, 56, 39, -56, 115, -92, 106, -35, 28, -7, 9, -4, 30, -9, -24, 73, -111, 122, -130, 65, -34, -68, 84, -97, 105, -85, 53, -27, 16, -4, 15, -2, -12, 65, -85, 143, -127, 97, -23, -27, 107, -99, 115, -68, 43, 12, 1, 24, 28, -16, 11, 12, -51, 114, -114, 99, -50, 10, 44, -99, 81, -104, 49, -46, 10, -10, 21, -34, 21, 16, -45, 114, -124, 129, -94, 41, 32, -73, 115, -101, 79, -40, 31, 4, 18, -9, 21, 16, -30, 94, -99, 109, -86, 46, 16, -69, 97, -90, 72, -41, 8, 12, 1, -11, 11, -25, -9, 27, -87, 91, -102, 75, -15, -39, 69, -95, 83, -46, 45, 20, 4, 16, 33, -18, 21, 35, -49, 127, -102, 100, -44, 3, 54, -82, 94, -61, 32, -21, 12, -5, 34, -64, 27, -6, -62, 86, -131, 97, -96, 37, 21, -81, 79, -84, 49, -66, 34, -15, 15, -18, 28, 19, -41, 114, -114, 127, -67, 50, 57, -85, 113, -85, 89, -44, 13, 35, -26, 8, 14, -7, -13, 10, -59, 71, -67, 26, 7, -36, 26, -58, 24, -27, -6, 16, 8, -59, 74, -61]
3014f1J03m7k9J58k56K61j90R5k2o1J49j78J42q7J01j33J03m4RJ3j27K64l25K58
3038I6j51M6Q0j96K57k61J68n6JL0p1Q6l5jl3J05j29R5m0K5J6j00J60j10K1J7
3064B0l0L4k1n4J42j55Q4K1r9J37j78K12j65M5N2o2M6q3R5q0Q1j16J64j59N6N8
3090D5j27J99k62K72j69J0P9j20J76j89J54r1M7l8P0m6k8P4j08J68k23J85p6l3
3114c1R9j45J69j66Q0L8p6J6J3qJ9m1M0L7j23J39r2M3j0j0K9m4J0N7l5l9R2j17
3142e6J48j85J15L7j44J91j93J89j66Q3M9j14J01p9Q0j20J30j13J18j18J5J20
3164H8k06K28k24K01j29k1J36j79J82j25R0m9j4K1Pk9K2M4r3J03j08J13n7k0O9
3189E0p4L8qPJ9l6pQ4j48J52j22M8K1j05J86j85J24p9M3nm3N1l2M8q8J36j36J12
$$ y = [-61, 42, -5, -34, 124, -132, 129, -61, 34, 12, -49, 100, -78, 64, -23, 78, -55, 48, 4, 13, 26, -101, 163, -162, 96, -55, -9, 71, -125, 132, -129, 39, -17, -16, 14, -57, 29, -6, -7, -40, 65, -64, 31, -9, 16, 32, -68, 92, -18, 3, 20, -10, 24, 3, -51, 91, -64, 20, 41, -58, 79, -99, 113, -52, -7, 45, -17, 29, -54, 41, -39, 42, -74, 90, -69, -13, 45, -82, 117, -145, 127, -42, -32, 47, -73, 103, -86, 68, -23, 24, -14, 56, 10, -18, 56, -52, 116, -107, 78, 2, -31, 68, -77, 92, -74, 6, 44, -32, -16, -3, -11, 8, -33, 7, 44, -79, 60, -32, 11, 1, -9, 20, -24, -14, 43, 8, -31, 61, -56, 92, -93, 22, 59, -85, 106, -87, 102, -64, 19, 68, -46, 55, -24, 56, -64, 66, -47, 71, -47, -32, 88, -118, 110, -114, 87, -42, -63, 73, -106, 76, -49, 41, -8, -22, -1, 6, -23, -1, 43, -50, 53, -55, 58, 1, -19, 50, -24, 14, 6, 13, 32, -4, -11, 73, -75, 77, -45, 3, 24, -81, 105, -80, 44, -35, 8, 3, -40, 11, -21, 27, -61, 75, -61, 51]
3217E1q5J8Q0j68K25k15J45p3PP1j08J18p4L6l5M2o3P3n5K1M4j01J25j36J10o7
3243a4JN2q9Q0k7k1J5J2l8O5j01R6l5k6J00j46J44j24P8rl8L8k8K9k7L3m7R5j19
3272e1J08q8K7O6j37J59j35Q9l2j1L2l2K1k0K4l6N8j08J15r8M0M9j13J29j22J24
3298E8p6qL9l2K8jMl6N8q3J04q5M6J4o6J03j29J14o0NM4m9M0l1%QJ2n4Q9j05R0
3329D1n7j2O5j06J33j09N0j9J1JLqj5L7n9R0j12J04p1L4N5j08J22j24Q3k9j0L2
3357B2k2J6lPk4M7r7J10q7M9Oq1J08r6P2m0J1kjoJ9k6JM2p0J02j25P8k0k8Q1q7
3389d4R5p4M1j6Pj8J8j3J7J5p1J09j18J04m8j7O3r0Q4o9N4k3j0K7pl3J6Pm1O0
3419B5q3J15q8L5Rn3P3p0M9j9J5j3J4j8J9k9JO0q4J08r7O5j0l8N8n7O3n2K8k7
$$ y = [51, -34, -16, 64, -104, 121, -94, 51, -22, -15, 56, -52, 66, -8, 28, -7, 35, -28, 45, -10, 11, 55, -46, 79, -57, 53, -14, -13, 39, -50, 30, 3, -18, -3, 9, -29, 36, -65, 31, -4, -30, 70, -76, 68, -56, 22, 13, -25, 13, -15, 14, -13, 20, -27, 68, -51, 57, -31, -4, 62, -75, 84, -51, 38, 6, -5, 27, -5, 16, -4, 20, -16, 42, -66, 49, -49, -9, 40, -73, 56, -66, 58, -18, -26, 13, -19, 9, 8, 12, -24, 34, -49, 55, -30, 16, 30, -36, 67, -62, 52, -8, -3, 41, -8, 32, 1, 1, 9, 21, -33, 56, -49, 41, -16, -28, 37, -69, 64, -45, 5, -14, -3, -2, 1, -7, -22, 15, -44, 46, -66, 38, -33, 1, 56, -52, 70, -54, 29, 0, -10, 22, 0, 16, 13, 20, -4, 43, -54, 56, -31, 18, 24, -57, 51, -45, 27, -13, -2, -4, -5, -11, 8, -18, -17, 25, -45, 57, -68, 10, -10, -38, 43, -44, 51, -23, 18, 2, 9, -9, 9, -4, 13, 28, -43, 66, -52, 52, 4, -13, 50, -40, 44, -25, 29, 6, -4, 23, 16, -17, -1, 6, -35, 25, -58, 57, -31, 4, 13, -40, 33, -37, 12, -7, 8, -5, 9, -9, 10, -19, -18, 42, -42, 66, -31, 34, 24, -14, 44, -13, 50, -2, 26, -1]
3449aK9l7L3l8J5K6p2J00j09P2k2j8N6p6P3o9L7j2KjK8l3ML6p7J25j38J21m4j6
3479fN7p8Q5o5M0k1j3J2J5j0k0L0l8N7r4R4m6k7M4n3P6o0K4kk0K5Ll9M5m0K3O
3511Dn3Q3q4O3l9L2Ql3L8k4J9k4M3n3N1m8J8N8j21J40j15Q4m2k3O1r9J00r2O8
3540B0n2J3J5j1lrM5o4Q1p4M7j3k0O5q0O5l9J4Rk5L6mm0N2k7nL2m6N7n6M2rlL
3574A6j4NJ1j6pM2p2P1l2j0L0q3J35j16N6j7pK9o9Q2o1K9l9O1m1J8Nj8N8j03J29
3605G2r8M7j0k3N3p7Q8m4J8k7KK5k6j%K0m5N5n4M6k5j6L1l2L0k0RLj5mK3m3O9
3638C1l8lL8m9N6p2O3j9qK1j8J7j9M6o5O8n5L5k7k9P3r7J02q5M9j3m4N9m2N2o4
3669c7K6J3Ok2JL1n0O3o2O0n0J8Pm0O5l7L2oj3K0k2lK0j1J4j1j6M6l4K6l8J4M
$$ y = [-1, 28, -9, 24, -14, 1, 27, -45, 55, -54, 18, -4, -22, 34, -42, 31, -38, -1, -13, -11, -12, 16, -17, -13, 23, -54, 71, -67, 54, 10, -6, 51, -27, 58, -7, 33, 12, -1, 11, 26, 16, -4, 26, -12, 45, -49, 45, -1, -28, 16, -37, 39, -21, 3, 1, -19, 6, 9, -30, 15, -25, -2, 4, -49, 34, -50, 13, -26, 6, 14, -19, 19, -5, 14, -10, 33, -20, 31, -17, 1, 59, -62, 78, -37, 47, 5, -18, 43, -56, 44, -48, 20, -32, -19, -4, -15, -18, -27, 18, -46, 35, -39, 8, -5, -25, 40, -40, 25, -14, 0, 9, -16, 20, 16, -24, 28, 1, -4, 28, -18, 39, -17, 25, 16, 13, 16, 2, 7, 18, 2, -5, 37, -35, 36, 4, -6, 24, -59, 76, -40, 16, -1, -8, 21, -48, 34, -27, 2, -37, 24, -17, 1, 6, -12, 46, -57, 72, -26, 21, 11, -12, 41, -36, 52, 8, 26, -1, 1, 26, 0, -1, -1, 19, -26, 29, -25, 21, -4, -20, 11, -21, 9, -11, -2, 1, -14, -18, 5, -38, 31, -7, -10, 28, -21, 35, -37, 26, 7, -1, 20, 2, 19, 0, 46, -19, 49, -6, 29, 2, -27, 46, -51, 51, -34, 15, 2, -42, 17, -25, 27, -37, -11, 2, 8, -14, -13, 18, -32, 31, -31, 29, -21, -3, 4, -36, 29, -8, 24, 18, 5, 25, 3, 0, 20, 9, 23, 12, -4, 42, 8, 34, -4, 10, 14]
3702A4j6L2j0j8oK4m8N4n7M0j9k3P6j07J04q3L9Qk9M9m0L3l7L9l1L9l7K4Jk2N9
3733E2p9O2l7ML4m5N5n3J7mpnJ0j6J7nj6K9l4M5m7J2lnJ9rMRLmMl5N1m2K2Nj9
3770a1O1p0N9l3j2L1j5J1k0K4l3K3pK3m2J4J3k3K9m4L6k1NJ8m7K2mK3j5J5l0M5
3802B5n2K5Lj8K3l9O0l5J3J5l5K9j8L0nj7J1Pk8L1l3QL2m5M5l3J8%k0K5l2MKj
3836ej4J7qL0l4rL4l5M1m7M0j1j2L0l1J6J0Qj2Rk9L6l0K4Nm4O7n6L9k1LJ8l1J8
3870A6Jk2lJ0k1K3k9K4j2MM0p5N6k7JK7k7J7mqjJ6j2L6n5M3pj3K6m8N5l5K0Rk5
3905@J6lj2nQkOk4K5j5%K3m9M2k8J4Kk3L3l5L2nlrK1l7K8jj4L0k3J4l2M2lj3K6
3942B6j5jmRopJ0J7k3nMj5L5l6J6jMkj4lNk%J3k4K9l7OK2k2M6n0L6j9kK0k2L1
$$ y = [14, -2, 30, 20, 2, -4, 20, -28, 26, -31, 9, -10, -33, 43, -64, 40, -43, -4, 4, -25, 24, -16, 17, -20, 19, -12, 27, -10, 14, 15, -7, 52, -27, 35, -2, 2, 36, -9, 46, -7, 10, 6, -1, -6, 4, -12, 5, 0, -16, 13, -21, 24, -23, -11, -14, -19, 0, -9, -5, 4, 7, 3, 7, -28, 23, -19, 3, 8, -11, 50, -20, 39, 6, -6, 25, 10, 21, 1, 25, -8, 15, 8, 31, -11, 3, 16, -7, 22, -22, 14, -7, -2, 16, -31, -9, -13, 10, -5, 10, -20, 25, -27, -2, 1, -17, 6, -33, 27, -8, 5, 20, -15, 14, -4, 26, 21, 4, 15, 22, -6, 25, -8, 0, 32, -13, 32, -1, 17, 17, -3, 22, -10, -6, -4, -5, -19, -2, -10, 20, -14, -23, 11, -24, 17, -30, 10, -1, -13, 17, -14, 2, 12, 20, 8, 17, -12, 24, -6, 18, 23, -21, 46, -10, 29, 8, 11, 29, -2, 16, 17, -5, -8, 2, -19, 4, -25, -1, -13, -9, 31, -44, 12, -15, -14, 13, -14, 3, -1, -9, -10, 6, -6, 30, -25, 18, 11, -2, 24, -24, 31, -4, 16, 25, 0, 16, 13, 1, -4, 4, 2, 8, -16, 9, -6, -6, 17, -32, 10, -18, -4, -2, -25, 8, -27, 5, 0, -3, -12, 9, -28, 0, -1, -15, 15, -8, 6, -26, 16, 13, 0, 26, 11, 10, 6, 15, 9, 2, 12, 29, 6, 1, 5, -10, 25, -11, 5, 4, 8, 6, -8, -11, -6, -8, -8, 5, -19, 10, -27, -21, 1, -21, 25, -25, 11, -8, -10, 10, -12, 19]
3980A9qJ0j6J1j7J7j6PK2l0K7m0K8j6nK4l4L1j4J1j4oK0j1k6L3k5LRj7J5oqJ2
4014a0J1qnOJ3k1J9J8l3K2j2%J4j9L3l3K8j2k1J9k4J9oPj8L0j7OqoK6k4J5l2K0
4049cmk0L5j3koMj3L4qQlJJ4k2K0j1J6roJ3k3J0OqKmj9K7l2M5k9j1J6k1LkJ1k
4088foJ7Mj4j6K1k0L0k4ROpJ7l1N0m4L0Nj6QkK6k7J4j3jJRKk2L4k9J8j8jJ4l6
4125a8K5rkLk0K1rPpKJ2oj1J8j6J1QoMJ3j3J3rj5K7l1L0j7J8%l2L0njk1NJ3j8
4163fJ1rJ8k1K4k1J1j0PMl4M2k9K3j1j9K3j7K1roOlMJ0Oj1kj7M3j5KJj4J5jqQ
4201A6j4MPj1Lj7L3j5pJ0k1J9k0K0j1pJ3j7J7rK1m3K0oK5oj6J9j2J6j1J3Nj3J5
4236B0k6K5k1KOONk2K2k0K2k1%oMJmNk0K1j0nKnRMlkJ6j6L0l6J8J1jmkJ1j0Lp
$$ y = [19, 11, 21, 5, 16, -1, 16, 0, 7, 29, -1, 26, -14, 14, -2, -7, 17, -17, 14, 0, 11, -3, -9, 11, 0, -26, 7, -18, -15, -6, -23, -8, -14, -22, -10, 1, -7, -12, -6, 7, -14, 5, 23, -10, 12, 0, 0, 14, -5, 28, -5, 23, 11, -10, 9, -15, 4, -2, 5, -13, 17, 0, 6, -2, -8, 18, -6, 9, -23, -3, -7, -27, 8, -5, -7, -13, -9, -22, 12, 4, 12, 9, 10, 24, 2, 22, 11, 27, 18, 12, 25, 2, 12, 18, 10, 12, 8, -11, 16, -16, 29, 0, -11, 5, -16, -13, -15, -4, -6, -12, 5, 9, -5, -21, 0, -20, 10, -14, -5, 1, -6, 11, -20, 30, -14, 16, 21, 5, 13, 11, 37, 10, 24, 11, 10, 11, 20, 22, 0, 34, 5, 23, 5, 4, 18, -18, 7, -2, -4, -1, -21, 0, -9, -2, -9, -7, 5, -1, -12, 6, -10, 1, 9, 3, 7, 20, 7, 20, 11, -4, 23, -8, 22, 5, 23, 23, -9, 21, 16, 15, -6, -1, 12, -6, 5, -4, 14, -7, 17, -4, 7, -3, 4, 8, -26, 16, -13, 10, -1, -20, 3, -14, 7, -2, -8, -2, -5, -1, 9, 15, 4, 2, -15, 28, 13, 15, 16, 2, 17, 16, 8, 16, 2, 6, 13, 2, 5, -12, 21, 6, -1, 9, -12, 7, -13, 7, -4, -11, 2, -15, 2, -7, 14, -29, -9, -15, 10, 4, -12, 7, -5, 11, 0, 13, 18, 5, 20, -6, 19, -2, 0, 6, 12, 17, -5, 17, -3, 19, -2, -2, -8, -4, -3, -7, -2, -22, -1, -11, -16, -14, -19, -10, -6, -9, -11, 5, -11, 19, -17, 1, 12, 11, 7, 5, 16, 6, 9, 2]
4277BKrK9l5K6J1j8Kj4K0k6K8k7RMj8M%J0pP%rJ1o%k9L1%mLnK3l2K4mOJknL0j9
4319A4%K1k6J1j3JJ5j3Pj0qkPoK3k3nj1J2J6k5L1k9J1lj9K8k0j3K8lkJ4j7L0j8
4355CjRj3K4j3J5nlj1NJ1r%oKj3J5lpLj4Qj5K9k9M%Rj1J5Jj9K0rJ2j0mORJ4k1
4396bJ5j1M%j6L5k0jKJ1k%k1J9j1J0j5KJ9k5POpkloNKL%kMLj3J0Mn%nJ1j5K2r
4439CJJKmJ2jQmrNj3J0j1NPj2pJ2pMpJ0rnqNJ7j2k0K1O%J1k0J0oNonJ5K0k5J6
4482A5nkJ4oKrOkmnmLKNRj4JQk7Rj3RkJ0krj2J3rJ0QNmj2%J7j2J7%LqNj6RPQj6
4529BJJ9npkOj1j0J6MomlNj3Oj2NmJ3j0pK3k4K2mkNqPjon%J4%j4JJ8k%%qJ3qJ
4575E%Jj1J8qj6J0OqoqJ1J0j6JLNRk4K0nqJ8l0J6j5L0j4J6nJ5j4ONj5lJ6Jk4J8
$$ y = [2, 4, -5, 24, -11, 15, 26, 8, 10, -4, 16, -10, 18, -9, 0, 4, -14, -10, -10, 0, -7, 0, 0, -9, 2, -4, -4, -33, -2, -2, -6, -3, -8, 15, -17, 7, 3, 9, 10, 8, 3, 33, 14, 14, 35, 9, 20, 7, 8, 23, 10, 17, 7, -1, -3, 4, -2, 21, -2, -7, -18, -6, 10, -15, 16, -13, -2, -5, -24, 4, -16, -29, -1, -4, -6, 8, -9, 21, 3, 2, 11, -2, 22, 9, 24, 19, 16, 5, 10, 21, 12, 12, 6, 8, -5, 10, 7, 0, 3, -11, -3, -18, 11, -18, -14, -14, -5, -16, -1, 0, -19, 1, -8, 4, -6, -10, -4, 5, 19, -2, 13, 2, 6, 6, -10, 25, 5, 4, 6, 17, 15, 15, -6, 13, 2, 12, -3, -1, 18, -7, 0, 6, -1, -3, -6, -12, -7, -5, -2, -2, -4, 0, 3, -10, 0, 4, -1, -1, -6, 5, -10, 12, 3, 4, 5, 7, 3, 15, 14, 22, 18, 9, 14, 1, 11, 0, 5, 12, 0, -7, 5, -2, 2, -5, 5, -4, -9, -17, -12, 5, -7, -27, -6, 0, 0, 11, -9, 1, -5, 0, -6, -11, 4, 24, -1, 15, 10, 8, 22, 16, 18, 9, 15, 13, 9, 4, 0, 3, 5, 10, 19, 5, 6, 14, -13, -4, -17, -8, -10, 0, -2, -11, -23, -10, -19, -9, -1, 4, 0, -12, -12, 5, -7, 10, 10, 13, 5, 10, -6, 3, 10, 18, 2, 3, 22, 17, 10, 8, 14, 3, -7, 9, 13, 7, 3, 0, 5, -8, -2, -14, -9, -13, 0, -10, -17, 6, -18, 4, 0, -2, 3, -5, 2, 1, -5, -10, -10, 4, 4, -10, -9, 9, 7, 7, 7, -1, 12, 4, 5, 5, 6, -5, 13, 5, -11, -1, 5, -3, -9, -17, -6, 4, -12, -11, -8, -3, 6, -18, 2, -3, -11, 7, -23, -7, -22, 8, -6, 10, 5, 20, 6, 12, 17, 2, -1, 15, 16, -8, 10]
4615A0oqL2k9J3j2J4Jj0mPppjpNmROj2JlOJ7p%j8J3Rj2KNoJ5MoOLj0rJ4lJ1j4
4659Hj2RkLj8K3j8J4rMj5JJ5k7K4qMMrLRoMj5PJ6k1J3J0j3J0JJ2j8lPoJ2lLj2
4700AJ2J3k5J0nk1J6qKNj4K1k6K1j0j6J2J8j5j0K2j8K3rj7J9rJ3LJj0rQRJmJ1
4737A5j6QpJ6j5J6qQMj6noJ1j8K5k3J1lPoj5%Qlj1J2QpOlJ4j5OMJ7pj8K1j0J3
4777A8j3Pj3JJ0j2K2j6J4j3j2J0Pj0Rj0LLk2K0j4J8j8j4K4j4lJ5jk0QmOJ2pK6
4813A7njl0J5J0j1J2rK4j5KJ6j4LRj6qJ5j9M3n4J5j6OK6l0J0N%k5Qj9L2pKQk1
4850b2K8k0K6j4pK4l4L4j5K0mOj5Kj2J0K2l2J8rJ9k3JJ2j8Lj4POj5OLJPj7KJ5
4887Aj7K9l5K2pMJ3j5J9l3J6OJ1j8K8k0jJ5jlk2K5Pj2Nk0J9j5MrJ6k2K3k2oK0
$$ y = [10, 4, -4, 28, -1, 12, 0, 14, 15, 5, 1, 8, 1, -6, -7, -14, -9, -13, -4, 2, -10, -9, -12, -6, 11, 4, 4, -14, -1, 8, -4, -2, 3, -3, 12, 16, 10, 16, 19, 9, 0, 14, 11, 22, 8, -4, 5, 3, 6, -12, 11, -7, 7, -2, 2, -13, -12, 3, -24, 0, -8, -4, 0, -9, -6, 3, -3, 1, -14, -7, 9, -12, 1, 11, -2, 8, 9, 21, 3, 0, 7, 1, 13, 10, 13, 1, 13, 26, 1, 11, 6, -15, 1, -7, -5, 0, -14, 7, -19, 2, -8, -24, -12, 6, -9, -19, 3, -15, 8, -1, -18, 1, -8, 5, 8, 9, -1, -10, -2, 7, 8, 4, 15, -1, 7, 0, 16, 1, 17, 9, 17, 21, 5, 0, -6, 5, -13, 12, -11, 0, -3, 4, -2, -17, -17, -9, -12, -23, -11, -3, -10, -4, -7, 7, -8, -2, 2, 19, 12, -6, 15, 5, 18, 5, 12, -1, 0, 10, -2, 20, 4, 18, 5, -7, 3, 10, 0, 9, -1, 2, 5, -17, 3, -11, 7, -11, -25, -1, -15, -18, -3, -4, -24, -16, -20, -14, -2, -9, 17, 12, 11, -19, -4, 6, -5, 7, -2, 22, 7, 9, 25, 11, 14, 23, 7, -1, 14, -5, 38, -16, -1, -17, -11, 15, -15, -5, 0, 0, -25, -17, -36, -4, -11, -9, -1, -22, 6, -14, 12, -2, -9, 15, -19, 15, 0, 20, 16, 22, 7, 9, -3, 7, 29, -3, 15, 6, 25, 2, 3, 15, -3, 0, -14, -7, -1, -16, -10, -7, -6, 1, -16, -14, 1, -16, 13, -22, 0, -7, -3, 10, -5, 14, -19, -3, 3, 14, -4, 24, 4, 3, 18, 17, 14, -8, 17, 24, 12, 17, -3, 16, 1, 5, -4, 12, -10, 13, -9, -15, 5]
4923Ek1K2k7K4J1l5K1j5Q%LMjKMmNJ3k1K4k3K1j2%KqK2k1K5j8onJ0j7J6oPkl8
4962c1O0n0J9j1MQj0Nj0lJL0n0M5j6Rlk0N3m3K5jkPj2J8l3L1j6L5m3L7l5qK1k1
4998a0K9m1L5jk4J9k7K2lj3J0nJ0j5LjNj1J2j1K1k3J8kNJ3oj1J5Rk6K4k2L4l3
5033aK6Jk7L9n5L0j0jK1j0Kk8K6k5J8k6K9j9KL2n1N4n2L7j2k5L9l5L1k2J3R%%
5067A0jKqL7k7L2m3MRnJ0k6J6mj4RlPJ0k4K2l5J0Rl7M9j7J9qj8K2Kqj3J4oL7n6
5105b3M5k8NJ7k3M2m8K2j0J0J2j6J2k5K9k3K3l4L3j6lK2m1M3m4J3Ok8M6k7Nmj2
5138b0K1nrNpK2j2pJ6j1J9Lk7J7MpL1l2K3j5j9O2p2Q0m4J%l3N0n4M2l0NJ2j4K0
5174A5k6L1m2M8n0K2%l6N8n7N9l5J5J1k5L7k3J1mNnMlQj5j7M1m1M8k0qPk3J7R
$$ y = [5, -16, 6, -21, 3, 14, -21, 0, -15, -7, -7, -4, 0, -1, 1, 5, 1, 6, 19, -2, 22, -1, 20, 8, 8, 10, 2, 24, 3, 28, 10, 4, -1, 9, -8, 8, 2, 9, 7, -31, 29, -21, -2, -13, -9, -1, -11, -6, -16, -19, -18, 12, -38, 7, -9, 0, -3, -23, 30, -13, 12, 11, 9, 16, 4, 22, -11, 20, 4, 39, -4, 33, -2, -10, 11, -10, 19, -22, 13, 12, -12, 7, -20, 2, -1, -14, -4, -9, 1, -14, -11, -12, -7, -18, -6, -17, 4, -19, -1, -3, 2, 15, 9, -2, 13, 22, -4, 20, -2, 32, -1, 25, 26, -1, 38, -17, 13, 3, 2, 23, 13, 15, -13, 13, -12, 6, -20, 9, -10, -8, 24, -27, 27, -25, 12, 0, -25, 14, -21, 10, -12, 1, 10, 10, 10, 9, 11, 3, 40, 13, 45, 2, 6, 15, 10, 20, -6, 10, 6, -8, 1, -2, 5, 15, -9, 13, -22, -12, -3, -40, 9, -8, 11, 3, -15, 7, 9, 1, -12, 2, -4, 33, -23, 22, -6, -1, 16, -7, 35, -13, 9, -1, 9, 21, 5, 17, -8, 21, -2, 21, -13, 20, 4, 1, 23, -18, 25, -19, -6, 0, -28, 18, -9, -4, -8, -20, 1, -4, -13, -8, -15, 7, -5, -12, 4, -7, 12, 15, -12, 5, 9, 2, 33, 1, 24, 9, -10, 52, -20, 60, 16, 17, 17, -16, 34, -20, 22, -8, -3, 9, -5, 15, -11, 20, -22, 26, -24, -2, -2, -38, 20, -37, 22, -13, 2, 13, -12, 25, 2, 13, 9, 14, 9, 13, 10, 18, 3, -14, 27, -14, 34, 14, 6, 13, -10, 7, 16]
5209A6k6L3m0K5J0l9M3m5L1j3k4K7k7K7k1J6RNj1J0nk0L8l5N6o1L4Lk2N9o3M9
5241C9n3K3J0l3K0qMJNj9K8m0J5Nj4L4m8M3m3K0KnJ4k7L3%j1j4K5k4L1k5L2j4
5275Fl3N5k9J2plOJ7j2Rj5j0L8n0N5n5K3%k6M3m3L2k7J5mLj4MOJJ1l8L7m0L8j
5311Dk9N4l9L0rpK%RpPOJ6l9L9l9L8k5k0K2m4M5k3J8rlLNj7J1Jj3K5n0M1l8L6
5348AJ2m9M4m3M1j8Lj0K8j4J5j2RJ8l8M9m0PK4m6N0m1K6nMPk0Lj1Nj5K4k6L6n4
5383c6L8qk3N3n5L1l4L1mPmoJ0%Mk6L2j7L0j8j2K3l3L8k6L1k3J0%%j2NKj5K0l2
5419a9L4m3J0L1l7K8l0J6Lj1NJ1oQj1KPk4M0j9%K4m0M7j5KJ1j4Mmj0J7j9J6jj5
5455bK2j4K1k3rJ6k9J2J0j5QmlJ5j7K9k8oL5m5L1j6J3jj2L7l1J1qJ2j4L0k8RN
$$ y = [16, -10, 23, -17, 8, 18, -21, 22, -23, 8, -5, -29, -2, -29, -2, -23, -7, 2, 7, -4, 6, 1, -19, 19, -16, 40, -21, 13, 16, -6, 53, -10, 39, -14, 9, 19, -14, 6, -2, 2, 3, 8, -11, 17, -23, -8, -3, -17, 17, -31, 12, -31, -11, -9, -14, 0, -27, 6, 6, -5, -19, 6, -18, 13, -12, 20, 6, -27, 28, -1, 11, 4, 1, 7, 24, 12, 21, 6, -4, 34, -16, 39, -16, 7, 7, -19, 24, -19, 13, -14, 1, -3, 0, -14, -10, -4, -3, 8, -30, 7, -33, 5, 4, -25, 29, -10, 20, 11, 4, 6, 6, 15, 8, 15, 21, 37, -2, 37, -2, 36, 11, -9, 13, -31, 14, -9, 9, 0, -3, 0, 5, -12, -1, 0, -13, 12, -38, 3, -35, 1, 13, -36, 8, -35, 6, -12, -9, -19, 9, -5, 10, -2, 7, 25, -13, 36, -4, 3, 27, -19, 31, -10, 16, 11, 15, 22, 2, 5, -6, -1, -16, 8, -18, 18, -36, 2, -6, -29, 24, -31, 0, -34, -3, -7, 0, -4, -10, 0, 0, 4, -22, 10, -7, 23, 5, -7, 16, -17, 21, -5, 26, 3, 13, 13, 13, 1, 6, 8, -7, 13, -19, 15, -28, -18, 13, -24, 4, -26, -10, -7, -18, -13, -2, -8, 0, -11, -9, -2, -26, 14, -5, -5, 19, -21, 26, 11, 13, 24, 10, 14, 10, 0, 17, -2, 14, 13, -2, 20, 6, 27, 4, -5, 11, -18, -6, 4, -11, -3, -7, -10, 5, -12, 17, -11, -17, 18, -27, 4, -12, 1, 0, -12, 25, -6, 5, -3, 9, -5, 25, -3, 6, 11]
5490A1j9M1n7O4m3J2K8n1M1k5Rj8NJ1j4mOk3J1J8k5L0k3mK4j7QnJPj0Rj6MK9k7
5526a2K4q%K6l7J9NRqj2L%Rk2J0l1K6k9K5Ml3N9m9L0j3j8K4l6K6k1K7%Rk3J7Q
5562Hj4K4j7J6k5J9Mj7K0k5L2j3J1Ll2K7k4QJ0k8pK6k3J1qJ8j4nJ6k5oL3j3j1
5596b1K3j7J9k5J1J1j8J1j1K5k2RJ0rJ6j4OOJ4l3L6k1nK9m3N1n1K9j4j5L5l0K0
5629A2l1K2j5jJ7j1Kj4K4j8%lJJ9k5Qj1J9lJK5j4j2MRJ1j8J9j0NOj0%OJ0j6lj1
5667fK0ll0L0l5K3k0J8jl4M6l1J5Qj4J8l7K3%nJ0J2j4k%nK9k5K5j0JJ8k2L8l7
5702CN%nK5k8kJ6mJ0j7j3J3j1rJ5nLNj0OpqNKJ0j2PllJ1NJ3k0J8j3lJ5pOjJ3j4
5744A1lLJ0j4j6K7k0J9j1Mj3jJ1k1KKnjJ8rkOJQk5K1nJ5%j9PRj3J4k0PL%J7qj4
$$ y = [11, -8, 33, -24, 40, -3, 9, 37, -14, 27, 2, 11, -7, -2, 9, -5, -9, -3, -26, -15, 3, -22, 8, -15, -19, 5, -12, -4, -9, -8, -1, -11, -2, -18, -14, 15, -12, 12, 4, 4, 30, -7, 12, 17, 26, 18, 6, 9, 9, 18, -4, 6, -25, 1, -28, -3, 1, -32, 27, -22, 8, -5, -23, 1, -35, -9, -30, -3, -3, 6, -17, 0, 8, -6, 18, 1, 17, -8, 11, 15, -2, 18, -7, 25, 12, 23, 26, -6, 21, -3, 5, 15, -13, -20, 6, -17, -6, -14, 4, -10, -15, 1, -24, -30, 3, -10, -21, 2, -15, 4, -21, -10, 1, -17, -6, -17, 8, -14, -5, 5, -4, 12, -2, 4, 10, 24, -9, 27, 6, 1, 30, -13, 38, -13, 16, 2, -13, 22, -8, 12, -19, 3, -12, -13, 4, -7, -5, -19, 5, -13, -13, -16, -15, 4, -21, -13, -24, -5, -8, -7, 18, 4, -8, -4, 5, 16, -2, 17, 7, 12, 18, 8, 8, 14, 24, 8, 5, -6, 14, 11, -19, 11, -24, -1, -21, -3, -4, -38, 8, -23, -8, 0, -14, 4, -33, -10, -10, -15, -5, 7, -7, -9, -9, -14, 15, -10, 15, 5, 6, 24, 2, 40, 3, 8, 8, 3, 28, 0, -2, 14, 10, 20, 3, -10, 3, -8, -17, -2, -7, -4, 1, -9, -3, -10, -18, -13, -11, -1, -13, -6, -9, -12, -1, 4, 17, -3, 15, 2, -1, 14, 7, 13, 12, 25, 11, 8, 11, 21, 7, -9, 18, -2, 17, 6, 10, -3, -4, 7, -14, -12, -10, -15, -16, 2, -7, -9, -3, -2, 6, -19, 2, -3, 12, 12, -7, 0, 9, -4, 10, -10, -3, 0, 0, 17, 9, -5]
5785eK8k7LLJ3JoQk2J5rKqpJ1%pnJ9k2NK3j3J4k5Rj6K0k1%J6pK5MmnJ6k1J1j3
5825CJ2Rk2J1j8PrJK6j5MoJj6K0k4MJMJj2PmJ4Kk0RJ6j5oJ6kmmK0mJMj7L0k3J1
5867A3Oj9QqOrlJ1Lj8K0j9K3j8jPk5K1kj8LKMoRnJ1j0PoK3Kj9J5qJ0oQPorNj3
5910dJ3Pj6J6j0Mj0jJ4rqrJ5j5J3j1Ok1K8nnmRLj2J0KjQk1J7rJJ2MqNROOk0Qj0
5953GKLqJ0j4NJ5k9J6j6NlJ7j7kmJ2j4KQKRk0%OJ9j5K1k0J8j0nQj2J7j3J0PQj3
5993A2j4J9j0J0k2MJ1RprKJJj0jKmJ1j0J1j9J6nrqJ2j2QkJ0J5j7kpKK4loNj6J3
6034ELMOj5K2l6J7J0k8J8j7Rj3J1j1K7j4lKoNj4lJ5nJ1j6K3j2J6kj7K1j2Qj3K1
6071A7oj0K2mOj8Pk5K7mqRjj3j0J7JJLk1ML%Mj0%Pj2J1qPNj5MPLNmJMK%LKK0l1
$$ y = [-5, 23, -4, -1, 2, 15, 16, 10, 18, -4, 11, 2, 4, -4, -11, 0, 0, -7, -12, 7, -15, -10, 13, 0, 14, -11, -2, -18, 2, -19, -19, -3, -10, 15, 19, 15, 10, 26, 5, 16, 3, 15, 24, 2, 13, -5, 2, -7, -6, 20, 5, 9, 3, 4, -12, 8, -16, -12, -11, -7, -6, -18, -11, -15, -1, 1, -19, -10, 6, -9, -15, 1, -1, -5, -9, 11, 7, 8, 12, -5, 25, 2, 13, 19, 0, 8, 0, 6, -3, -6, 5, 8, -10, 10, -9, 14, -4, -5, 2, -23, -2, -4, -22, -19, -17, -13, -19, -10, -15, -4, -14, -7, -13, 10, 12, -7, 8, 0, 10, 4, 12, 19, 13, 4, 9, -4, 9, 16, 0, 16, 6, 10, 0, -1, 13, 4, -4, -13, 2, -13, 0, -11, -5, -26, 2, -3, -8, -12, -3, 0, -12, -2, 0, -1, 7, -14, 3, -6, -5, 7, 11, 3, 8, 17, 23, 29, 9, 17, 7, 9, 12, 4, 14, 0, 5, 20, -9, 7, -9, -4, -7, 10, -7, -9, -13, -1, -15, -13, -5, -3, 6, -14, -14, -8, 11, -4, 17, -3, 15, 5, 0, 8, -4, 13, 0, 10, 17, 25, 12, -2, 17, 7, 17, -5, -1, 10, 19, 12, 3, 5, 6, 7, -3, -4, -2, -6, 5, -5, 6, -13, 3, -2, -11, -19, -7, -19, -11, -13, -3, 12, -5, -7, -14, -12, 12, 9, 3, 8, -8, 5, 8, 12, 18, 3, 25, -11, 6, 16, -12, 6, -11, -2, -15, -4, -15, 12, -2, -5, -3, -9, -4, -18, -21, -6, -11, 0, -16, 7, -5, 11, 9, -8, 13, 1, 9, -4, 17, 11, 1, 23, 19, 25, 7, 14, -11, 16, 12, 4, 13, 12, -1, -11, 6, 7, 8, 11, -10, -6, -3, -3, 1, -9, -9, -2, -14, -3, -11, -4, 1, -14, -10, -3, 0, 5, 1, 2, 6, 8, 8, 11, 13, 33, 2]
6117BJ2qOmnJ0j7J6j4J3k1L2k8Pj0rK4j9K1k0OJ4k3Pj1OK4j3Loj0J1lJ3JnJj7
6155a4J3K4j7J6lk1K7j5oLMJ2j5plJPk3J8qJ6%qj0%qj1L8k3L0oj8K4j9J7k5J8
6192Hk2J8Rj7J8qNLKj4J3j3MKoJ5j7J0MNj3kLKj9J4lj2J4o%jRj1MMoJ0j1lJ5K
6234IjQk5J6J2qK0j3mJ3k5K5k0K1j3Qpj2PjplQkj5J1j1J1k2K9j9j0J2rK1j4J7
6271Gj0J2jj2QOj4K4j3LRmPj0j1kJ4j4J1o%JMQk8KK3j7llJ2j3j1MkJ0oNOmJ5q
6313arMJJjnK5Jj0J4k1K6lKnj9NQNnj2mQoJ7k2J2kk2J7k1J8nj1RojJ9j7K2j0l
6355gPj8K8qnJ1nQOrj7L3j6MKMpj3K4o%qmoJ0r%Pmj7J6Jj7PlkK2j8Qj5J6rLKJ1
6400GkoPkRj0J3lPj0OJjjJj1J%J6k5kMJ3qj2Nj8K0k2L4j8J5j3knpK3j4QmJ2pJ3
$$ y = [2, 14, 6, 12, 8, 3, 13, -4, 12, -2, 11, -10, 22, -6, 1, -9, -18, 6, -13, 8, -12, -6, 8, -15, -8, -19, -13, 11, -2, 1, -5, -15, -4, -7, 6, 7, 2, 3, -14, -1, 23, 6, 22, 19, -2, 25, 10, 4, 7, 11, 23, 8, 1, -2, -1, 6, -17, 1, -7, 9, 9, 1, -9, -9, -17, -28, 10, -13, 17, 11, -7, 17, -2, 15, -10, 8, -14, 4, 13, -4, 14, 6, 11, 14, 16, 2, 15, 2, 6, 8, 2, 17, 0, 10, 14, 19, 6, 4, 7, 9, -10, 4, 1, -11, 3, -3, -3, -4, 5, -6, -2, 2, -4, 6, -5, -8, 7, 9, 8, 16, -9, 7, 19, 11, 31, 18, 14, 27, 2, 27, 7, 28, 15, 23, 16, 4, 11, 10, 3, 0, 8, 6, -9, 2, -9, 2, -20, 9, -10, -20, -8, -17, 4, -10, 7, -3, 9, 8, -4, 4, 10, -4, 20, 7, 10, 19, 15, 22, 12, 1, -1, 13, -1, 10, 4, 4, 5, 9, 17, -11, -9, 14, -3, -6, -9, 3, -10, -21, -17, -19, -9, -15, -10, -4, -8, 7, -1, -10, -6, -5, -4, -5, -10, 15, 16, 6, 20, -1, 25, 22, 24, 19, 0, 5, 13, 18, 13, 1, -3, 5, -1, 16, -6, 6, 4, -18, -1, -22, -4, -9, -20, -11, -17, -18, 1, -16, 6, -4, -7, 0, -18, 10, 2, -3, 8, 3, 11, 17, 8, -9, 24, 8, 12, 14, 18, 11, -2, 22, 16, 16, 8, 4, -2, 8, -1, -1, 6, 2, -15, 1, 2, -15, -8, -11, -13, 9, -9, -1, -16, 0, -9, -6, -4, 7, 5, -1, 6, 4, 13, 3, 16, 13, 20, 10, 16, 17, 16, 15, 16, 5, 6, 6, 22, -3, -5, -1, 12, 4, -8, -3, -21, -1, -23, 11, -7, 8, -5, -7, -12, -19, 4, -10, -2, -6, 6, -1, 12]
6443A2J%njK2l1J7Mj7K0l%j3NJ7k1kQj8J6j1Oqk0J9j3K2j1j5J4rMLpKLk3L9j3
6482gJ1nrJ5j5K5j7J1pJ2pJ7k4QMlj4J4mJ2j4Qprj2J3Mk1K4j6pjkK8kj6NMOLr
6523dj3K9k4K0KoJ4Jj2OoNrJ3j1Rnj4J4LQ%j3knolJ3rQk7K1Nj6K6k9J5mJ0rqO
6565gnJ1QMrJ0mJ5kj4J1j8J5opK1j4omoJ8j6KK0j5j3J2Mk6K3%k4J6J2j2J5j1j6
6603a8J8j5%RLK3k9J2Pk1J6lJ3j0J2qJQmnnLk0K1Jk2K6j3PplpkJ4k8J0mRPokN
6645gmLMj0K2j8K0pJKmJ6prJ0NlljKrJ8rj7J3Jj7kJ6J2l3J2lj0MK8l3J6nqK4l6
6687b6K5Jj1J2J2Rj1J1j0NKj0%LJ6l3L6j4Mj3jNpRj3kMO%j6J2j5J6j9J7j6Oj4
6725b0J0J2rkjJ0jNjlJ%ORo%rlJ4J3kj4Ojj0J6lmj4J0j0j8J5OmqJ3j9jKJ8k2R
$$ y = [12, 13, 13, 8, 7, 29, -2, 15, 19, 2, 22, 19, 19, 6, 11, 28, 7, 5, 13, -5, 11, 0, 6, -2, -22, -3, -16, 6, -5, -20, -6, -15, -11, -8, -15, -13, -10, -33, 6, -7, 4, -1, -10, 5, -10, 15, -2, 9, 2, 14, 7, 24, 0, 8, 12, 9, -5, 9, 5, 17, 3, 11, 4, -5, -17, -4, 0, -21, 3, -13, -20, -21, -23, 5, 3, -13, -8, -4, 2, 5, -4, -17, 12, -12, 8, 10, 4, 18, 19, 7, 13, 7, 12, 3, 16, 5, 14, 9, -5, 9, 12, 20, 20, 7, 5, 0, -6, -9, 4, -5, 3, -24, -3, 2, -14, 12, -17, -2, -6, 4, -5, -13, -7, -12, -1, 7, 11, 2, 12, 8, 23, 21, 7, 18, 0, 15, 9, 2, 23, 9, 3, -1, -7, 11, -5, -3, 17, 2, -11, 1, 5, -21, 2, 2, -22, -6, 6, -6, 9, -2, -18, 0, -15, -15, -6, -3, 20, -9, 3, 10, -11, 5, 2, 15, 5, 17, 9, 10, 18, 14, 9, 4, 7, -13, 8, 9, -13, 13, 0, 7, 0, -3, -10, -12, 2, -26, -16, -20, -11, -4, -10, -12, -7, -11, -8, -4, -14, 8, -10, 10, 3, 4, 6, 2, 18, 11, 2, 12, 17, 14, 11, 10, 12, 3, 21, 12, -5, 8, 9, -8, -10, 6, 18, -15, -3, -6, -16, -12, 16, -17, -1, -6, -14, 10, -26, -1, 0, -11, 1, 13, 22, 11, 22, 12, 17, 19, 9, 9, 12, 28, -5, 31, 17, 21, 8, 7, 12, 5, 14, 1, -1, 3, 9, 9, -7, 5, -10, 6, -13, 4, -12, -6, -20, -10, 2, -7, -9, -10, 0, -1, 4, 3, 0, 1, 1, 7, 16, 10, 10, 1, -2, 12, 25, 23, 9, 15, 14, 4, 20, 17, 13, -1, 9, -1, -19, -4, 2, -2, -10, 3, -16, -17, -15, 3, -19, -10]
6768a0jK0j2Jj6K2NNqPoJ0j8LQoJJ5Lj3j7K4nj2K5opPj7NkNk0J2j6KQj6J0j9L5
6809Fpj1lJ8jJKlNj5OK4j0jpQKNojJ7j5j7J2lRLj8J1q%Lj7KKpKLMNlmK%okOMJ0
6858GOj8JPNJ0mqMMRJ1l1K4k6KJ1JklqJ1j2J1lj9K5j0j8RmPrPMKJNk4JJJ8j3K
6902fK2j3mK1rmOj7K9qlJ1j2j1K3j5Ok8J9LlMj6llPnNQj2oNj2J1KJ0%j2jJ1MJ1
6944A5j0J1j5K2j0lMoKLkJ5j7KkMrJ1Kj4Mj0pK1k0kkJ3pomJ0Pj5M%R%oPQj4J7
6987A0Omk5L5k1QQkPj4K0k8J0Oj8J1j5PRJ1k8NOlj1%JOQk0mK0j7J1j0LoJ9j9K1
7027ComK1j4ljL2j5Qj0K0k2RnnMJ3k9PnJ1Ok4RqLorLJ0Jj1pJ8mpJ0K5k2NJ2j4
7069aJj1J3Ok%K1k1QJ8k7LMNj6J0oOOj3Qk2J6kpQk2J2j4RMj5J1kNj2J4K5pj2j6
$$ y = [-10, -11, 9, -3, -2, -18, 4, 9, 14, 6, 13, 7, 17, -1, 2, 10, 4, 5, 20, 23, 10, -7, 17, 12, 0, 25, 19, 12, 19, 2, 7, 5, 10, -10, 2, -14, -12, -4, -20, -10, -29, 6, -1, -12, -15, 3, 2, 3, 5, 2, 7, -8, -2, 22, 12, 11, 4, 12, 14, 19, 13, 12, 29, 14, -3, 9, 6, 15, 18, 0, 11, 3, 3, 6, -11, -9, -7, -14, -12, -9, -5, 0, -3, -7, -5, -5, -11, -13, -7, -3, 7, 13, -5, -4, 3, 8, 18, 14, 6, 10, 14, 23, 34, 3, 27, 1, 3, 14, 15, 13, 10, 2, 13, 1, 12, 9, -10, 15, 5, -13, -4, -8, -1, -10, -3, 1, 3, 4, 9, -15, -14, -13, 5, -8, -6, 16, 3, -1, 20, 11, 7, 13, -4, 25, 17, 14, 25, 13, 2, 25, 10, 16, -12, 7, 10, 7, 11, -5, -8, -11, -4, -9, -4, 4, -8, -14, -9, -21, -10, -8, 2, 2, -10, -11, 0, 4, 15, 5, 16, 1, 23, 13, 10, 14, 8, 10, 13, 11, 26, 9, 11, 9, 13, 4, 15, 17, 3, 7, -3, -10, 11, -9, -11, -13, 0, -7, -13, -17, -7, 0, -15, -11, -11, -2, -2, -8, -1, 7, -7, 10, 16, 12, -13, 22, 1, 9, 17, 15, 22, 8, 28, 0, 10, 16, -2, 9, -6, 1, 10, 21, -7, -2, 4, 1, -10, -10, -9, -3, 5, -15, -19, 1, -16, -5, -15, -12, -18, 1, -18, 3, -3, -7, 14, 0, -3, -4, 28, 13, 21, 11, 31, 9, 18, 13, 8, 12, 25, -4, 3, -2, 9, 15, -9, 0, -8, -5, -11, -20, -17, -7, -6, -17, -24, -6, -10, -17, -7, 18, -4, 1, 13, -1, 0, -11, 2, 8, 6, 6, 27, 6, 14, 32, 5, 8, 12, 17, 1, 11, 5, 11, 17, 4, 12, -10, 6, 4, -3, 5, -17, -5, -19, -10, -6, -21, -10, -12, -7, -19, -5, 20, 13, 1, -15]
7110a5J8OPj2kJ4j5RlrK7j8J4j4NjQNj6Lmk%j5J4mj3J3j7NMnjJ1j5KJ4OkkJ3j5
7152bNNj0K2j4KJ2Rl1K4Nj4pMnJNjj0MpJ1mnlj8J6KRrl%j4J8j0K1j0QmJMoJJ7
7196A9lj5J3Rj4K8j4mJ3j5nj0P%oNmLKk6K1Oj8J0%j5J4j3J1jnnkKPKlJ6kj8J9
7237IjnRK%Jj4K4j3JOKj3J0k4J9NjRk3J1qj9RMRpPk4PRkPj7RnQLmqQpJ3lRpJQ
7285A4mOjj4KMKJ8j5oRj1LmmjMLrLLoJ0o%KkJolMJ7j8K7k1JJ0J0j1Roj4K6k0R
7330A5QPlp%jpKj0MRk1MLoMj1MqNo%J4kKJ6lj0j0JPNROj7K0j2jOj1NomJ7pj6J3
7377GJ0Jj8J5oj6Qj2NmOj2J3lj2J8lrj6L7k2K3ok2K9j2lMJ1Jj2K4kJ2j4j2%Rq
7416IJ7k0qJ0Lj0%NnJ3k7MNj1nmK3mnk0J2J6j1nJ3J2j2kJ3oJ5j2RJ2qJ5k8qRO
$$ y = [-15, 3, 9, 16, 4, 2, 16, 1, 10, 7, -2, 25, 7, 21, 7, 12, 11, 19, 24, 8, 11, 7, 5, 5, -10, 4, 0, -13, 0, -17, -12, -8, -13, -14, -3, -18, -16, -2, 4, 2, 0, 13, -2, 3, 8, -2, 20, 6, 8, 20, 29, -2, 22, 27, 13, 6, 10, 5, 6, 11, 10, 0, 4, -3, 8, 4, -1, -4, -22, -6, -4, 5, -4, -7, -7, -21, -3, -13, 8, -2, 6, 2, 3, 7, 1, 2, 19, 16, 1, 14, 23, 9, 37, 23, 19, 32, 17, 12, 2, 9, 9, 3, 8, 4, 7, 9, -17, 4, 10, -8, 2, 2, -13, 1, -12, -1, -2, -7, -12, -14, -12, -5, -3, -6, 10, 8, -10, 9, 8, 3, 12, 14, 14, 15, 1, 25, 12, 13, 19, 21, 8, 18, -6, 13, 18, 17, 26, 3, 14, 6, -13, -4, 0, 9, 2, 9, -15, -8, 1, -1, 6, -11, -2, -7, 1, 4, 0, -8, 0, -7, 6, 3, 12, 5, 6, 14, 10, 16, 15, 1, 3, 7, 9, 27, 12, 6, 15, 4, 7, 3, -1, -2, 2, 5, -4, -1, 2, -4, 6, 0, 0, 2, 0, 1, -5, -8, -4, 13, -5, 22, 1, 2, 12, 22, 11, 20, 14, 0, 26, 6, 15, 23, 30, 27, 20, 20, 19, 12, 14, 4, 8, 17, -4, 0, 3, -3, 1, -10, -6, -14, -9, -15, -15, -1, -3, -1, 15, 12, 2, -8, -7, 0, 5, 14, 20, 3, 23, 11, 10, 16, 5, 10, 4, 0, 17, 10, -6, 7, 17, 18, 0, 15, 9, -7, 1, -11, -6, -10, -4, -16, -3, -6, -18, 0, -3, -12, -28, 9, -13, 10, 4, -18, 11, -1, -4, 0, 11, 12, 0, 24, 22, 34, 20, 8, 8, 17, 9, 26, 6, -2, 8, 11, 1, 1, 6, 1, 14, -13, -9, -4, -15, -20, -24, -1, -5, -10, -30, -18, -2, -13, -18, -5, 7, -5, -7, 6, 0, 15, 3, 12, 24, 16, 31, 3, -5, 4, 10]
7456A0j0kJ6lmKO%lj5J3j2Rj2j2Pj0J2JJj0%QKQJ3j7kJ5opQlM%JjKLkRppKJ9k4
7502BOMlmJkjLolkJ9k8J5q%jj0J5j5K3kjj1K3oqJ3%JpjlMN%PLj5K0qj4J7k0Qk1
7548a1OJ7j6J0j1JopJ2lOLmj2J4j4MJ1qJ1N%nJ0k0K3KqkJ8%j3jNkKj0J4k2LJ1
7589A3j2o%J3omMj1j8K6Pqj5LjJ0j0Rj6J6Mj2L2j1lOj2J6lPj2J7Pk7J3J7j9jo
7628GKNj0jNnJ0k3NoMJ3k3K7j9%JpK0j3RJJ3k4J2rOoJ1J8l0L2j3RnNjokJ3j5L
7670A3Ljj2qQnJ6j4KpLk3%L0k0Rj4NK4k9K0ljj1K2nj7M1k9OlPOp%JRJQk3K6k1
7712GjNj0Lj6KOoNj3MJ3j5QJQmj1pK1Jj4L7l8QjK1kKJ0j5OKj1L5l4RoOjkPj4l
7756CrL0j9j4QKJj2jOlPLNj9J3rJ2J2j4Kj5L0k0J1kQlNkkj%KJNQj8lLmKPk4J0
$$ y = [10, 0, -2, 14, 11, 7, 9, 15, 15, 12, -3, 10, -2, 7, -5, -17, -10, -20, -8, -7, -6, -16, -16, -8, -6, 2, 15, -2, -4, 11, 5, -2, 6, 3, 7, 7, 8, 7, 9, 12, 10, 19, 12, 5, 7, 26, 2, 8, 12, 9, 5, 6, 4, 3, 6, 0, -3, -5, 14, -14, 1, -7, -7, -8, -18, -3, -18, 5, 3, 2, -9, 14, 8, 0, 13, 13, 14, 7, 6, 3, 7, 12, 12, 19, 22, 7, 27, 19, 5, 22, 2, 10, -11, -5, 12, -4, 6, -5, -4, -10, -17, -5, -8, -2, 1, -3, -15, -1, -15, -11, 0, -8, 3, 8, 8, 3, 13, -7, 16, 18, 10, 8, 26, 26, 13, 12, 17, 15, 17, 7, 21, -1, 2, 13, 1, -5, -5, 8, 2, -2, 2, -9, -27, -1, 6, -2, -17, -14, -15, -5, -15, -6, -22, -6, -2, -14, 18, 7, 4, 10, -2, 14, 11, 18, 6, 23, 30, 3, 16, 33, 14, 13, 7, 9, 14, 4, 3, 8, 3, 13, -10, -5, -11, -7, 6, -17, 10, -9, -9, -8, -15, 5, -8, 1, 2, 15, -9, 3, -6, 0, -6, 5, 23, -7, 25, 12, 21, 16, 21, 20, 14, 12, 25, 10, 13, 16, 15, 3, -5, 3, -2, 14, 0, 2, -5, -2, -25, -25, 5, -15, -6, -20, -15, 9, -20, 0, -3, -4, -15, 7, 2, -15, 26, -3, 3, 0, 7, 13, 6, 6, 7, 16, 17, 25, 2, 28, 7, 6, 11, 1, 4, -12, -10, -4, -10, -5, -18, -14, -1, -16, -8, -7, 1, -3, -14, -21, 0, 1, -13, 24, -14, -6, -7, 14, 12, 14, 24, 9, 15, 17, 6, 41, 7, 16, 10, 16, 15, 13, 20, 6, 3, -6, 24, 5, -9, -1, 1, 2, -10, -11, -5, -8, -1, 2, 7, -12, 1, -8, 4, 16, 2, 4, -11, 19, -1, 10, 8, 16, 13, 18, 16, 14, 13, 13, 15, 16, 21, 29, 11, 8, 11, 7, 9, 16, -8, 2]
7801Bj1J4j6J3Kk0J2j1LjJ7j7ONj9J5%K3k5J0LjmqJ5PLLpMNqj2K0kpj2LJJ0j9
7842dMOj1Qjj4MKqJ4l2J1J3K7j8k5K7j4LK8k1kkJ6pJ9rMj5RJ1j4J7nJj8oJ1kN
7882A2j0Nj4K0j2kQrlk0J1j0K5j7J1J8k4J0k0J7%J2QqMj0PMJ2j4J5j3j0J5mj0
7918DJNj2Lj1J7j1krK0kk4KJ4Oj7J8k9K6nj3K0j1J7k8L0Ok0Rj1K1k2J5lrK3j9
7955aJ0NpkQoK6k1Onj2kklPpMrPJlj4J4j3LRLM%Mk7K9o%KqJ0oJ3rJ8qMnOj4QK
8003A3nJ5k5J7j7kLNloJmJ0j1kMqJ3oRj3kK2k2J0nK7j1kpK2pj3K2j5OMj1KMJ1
8044B3qrJ9j3nj2NRj7Nj1J9rj3K0k9K5j4MoLPj2MRQmPqJ8J5l1J8j9K1r%Oj1J4
8084A9k0K9j2KlmMk4Pj6J1lRj8K3jj9PrJJ3pKmJ5Qj8J9l1K7QnPlMj1J5l4L4jj8
$$ y = [2, -9, 5, -11, 2, 4, -16, -4, -15, -12, -13, 4, -13, -7, -2, -21, -6, -6, 17, -8, 2, 5, 4, 0, -8, 7, 14, 17, 20, 13, 17, 22, 14, 2, 22, 20, 13, 1, 4, 5, 15, -4, 0, 6, -5, 3, 2, -12, -8, -6, -14, 0, -32, -21, -8, 19, 1, -24, 3, -11, -8, 20, -1, -3, -5, 11, 4, 23, 14, 18, 3, 12, 23, 9, 26, 21, 22, 4, -2, 9, 7, 12, 2, 7, -7, 13, 1, -1, 7, -2, -5, -25, -14, -24, 1, -16, -5, 13, -11, -1, -21, -4, -4, 8, 16, 8, 12, 2, 9, 13, 25, 11, 26, 13, 3, 18, 14, 4, 5, 10, -2, 1, -10, 7, -4, -6, -15, 5, 3, -21, -19, -5, 1, -16, 2, -27, -1, -6, -19, 1, -10, 7, -21, 9, 15, -5, 4, -7, 14, -8, 7, 4, -5, 18, -1, 9, 14, 7, 5, 13, 7, 33, 12, 18, 13, 1, -1, -3, -6, 1, -6, -2, -11, -4, -3, -6, -20, -6, -19, -16, -7, -4, 0, 0, 4, -23, 6, 0, 0, 2, -6, 4, -2, 11, 2, 20, 12, 16, 11, 17, 3, 11, 13, 8, 23, -2, 15, -2, -4, -1, 4, 1, -5, -4, -8, 2, -9, -11, -7, -15, -2, -8, 1, -12, -14, 8, -14, -4, -9, 18, 7, 5, -2, 20, 13, 0, 22, 7, 13, 17, 6, 8, 12, 23, 15, 6, 25, 12, 7, -5, 0, 9, -8, -3, -14, 5, -4, -17, 3, -26, -1, -15, -11, -17, -14, -7, -19, -15, -6, 2, -2, 5, -3, 15, 30, -1, 17, -2, 19, 10, 10, 16, 5, 19, -1, 28, 16, 18, 15, 11, 15, -9, -2, -18, -7, -10, -1, -19, 4, 3, -16, -9, -18, -17, -4, -11, -9, -13, 2, 10, -8, 11, -20, 7, 15, 10, 17, 14, 18, 7, 22, -12, 22, 21, 3]
8125CQj1K2k3QqPOk1K8k5K1pk0J2pJ6l6K3Jj2NKRk4K8j5LjnJ6J2Kj2lJKPjJ1j6
8166FOKLNj3Ok7K1onM%qQNj6j0J3k3K8j9J9qj0K0
$$ y = [3, 11, 0, 22, -1, 7, -1, 6, 12, -9, 19, -6, 15, 8, -12, 0, -7, 9, -27, -4, -3, -15, -10, -8, 1, -23, 5, -10, -7, -8, -13, 3, 15, 17, 5, 2, 3, 5, 12, 11, 22, 6, 12, 14, 17, 22, 9, 15, -12, 9, 3, -2, 2, 2, -6, 2, 7, -9, -19, -6, -29, -1, -20, -1, -9, -19, 1]
8191A
$$ Imaginary data points
##PAGE= N=2
##DATA TABLE= (X++(I..I)), XYDATA
0@%%%%%%%qJ6k4L2m0M9n7P2q8J08j32J58j88K22k61L06l54M10m72N38o12O94p84
30d15Q84r95J115j247J389j545J716j898K094k308K541k794L068l365L686m039
46b113M427m851N315n827O394p024P730q527R435j0479J1691j3116J4818j6876
60i003J9415k2615K6749l2258L9890n1010O8382r8593J62818m51771J73159O49271
72D74434j115284J321818j278819R95416n22719j7483M88762q12170R67098r43212
82d42159P38308m04623M7839K40188m25300M99951m47101K69823l2218j70441
92a25733K80151k89655J99333o708k50056M77503n85566N44984l71905Q6162K79073
103B37583o41096Q88330r50782Q28631n53580J57942K99593p15359R86583j069906
$$ y = [0, 0, 0, 0, 0, 0, 0, 0, -8, 8, -16, 16, -24, 25, -32, 40, -48, 60, -72, 86, -102, 120, -141, 165, -189, 221, -251, 287, -325, 369, -415, 469, -526, 589, -658, 731, -814, 902, -996, 1098, -1210, 1331, -1463, 1605, -1760, 1926, -2113, 2314, -2537, 2778, -3049, 3345, -3679, 4051, -4476, 4959, -5520, 6171, -6945, 7873, -9003, 10412, -12203, 14546, -17712, 22178, -28832, 39550, -59043, 103775, -347996, -174837, 474434, -640850, 680968, -597851, 397565, -125154, -142637, 346125, -466045, 501053, -442159, 296149, -108474, -60635, 179553, -245747, 254204, -192897, 76926, 44708, -125733, 154418, -135237, 64096, 57388, -192668, 284835, -300731, 244253, -127652, -41490, 237583, -403513, 484817, -465965, 362666, -190914, -32972, 266621, -448738, 537845, -532061]
113e32061R76855p26708L43548J07503n22400Q14779r54337R38552p63515M47281
123A29497o2308k90717N43880o74741O73599n35359K93066k8107j78730K93436
133A63516l16917K52671j13595n0294J67938j98919J50842m6646r8907K58965
143A68654l79371M09417l40832J98940o719k18464M37324n88499O28100n53687
153b45137L83772j34466j65555M54594o58992P35710o81904N10585k42267p5607
163a19267L66910n63825O39789o00578M59676k41237l929K12249l43705L94324
173B00407l73007K85998j50858P148J03552j64361J78513j47955P3724K5269j11177
184g2747J52876j42425Q4447J5710j42467K58614l20411L04810k15785O9468J12017
$$ y = [-532061, 444794, -281914, 61634, 169137, -353263, 461516, -492821, 445731, -317784, 129497, 67189, -223528, 320352, -354389, 319210, -216149, 76917, 48810, -129920, 163516, -153401, 99270, -14325, -64619, 103319, -95600, 55242, 8596, -90311, 168654, -210717, 198700, -142132, 56808, 50089, -168375, 268949, -319550, 308550, -245137, 138635, 4169, -161386, 293208, -365784, 369926, -311978, 198607, -43660, -119267, 247643, -316182, 323607, -276971, 182705, -58532, -62461, 149788, -193917, 200407, -172600, 113398, -37460, -30312, 73240, -91121, 87392, -60563, 13161, 38430, -72747, 80129, -62296, 22151, 37861, -104606, 154008, -166403, 138407, -77378, -7910, 104107]
195A04107k92110M21788m63668M11131k81477R9317J05982k93659M21230m64981
205b32340M26902l21374J64684J9277j94746L25821l92316L89632l19666J91320
215E7194k9325j27896K45085l02409K93738k22112J04065K7253j33784J90086
225A01895j89702J38893n2377m5400J23961j59718J46451r2653J2892P5396j51359
236i1721J95000j95798J55264q1761j3573J15262k02740K55690k61513K17067
246I1177j26906M259J27347k37896L01054l02399K41630j30955o109J38173k34650
257a35275K75687k56814J87167q5403k4287J17547j76482J93449j70655J17061
267D1995m5769k7919Q9406j27864J37407j16869P0010o352n9555J11450j35809
$$ y = [104107, -188003, 233785, -229883, 181248, -100229, -912, 105070, -188589, 232641, -232340, 194562, -126812, 37872, 57149, -137597, 188224, -204092, 185540, -134126, 57194, 27869, -100027, 145058, -157351, 136387, -85725, 18340, 45593, -88191, 101895, -87807, 51086, -1291, -46691, 77270, -82448, 64003, -28650, -15758, 59638, -91721, 103279, -92519, 62745, -19016, -32589, 82673, -120067, 135623, -125890, 91177, -35729, -31470, 95877, -142019, 159035, -143364, 98266, -32689, -38798, 99375, -135275, 140412, -116402, 70765, -14638, -38925, 78622, -97860, 95589, -75066, 41995, -3774, -31693, 57713, -70151, 67256, -49613, 20397, 14045, -45510, 65940, -69869]
278f9869J25211q0279J0607O6459j30053J61927j52230J02302k4341o1692J33845
289H1887j74239J73739j33773O5126J5424q9611J42385j64960J55488j17808N9804
300A3462P975p3657J25754j54877J55030j24800O8506L525p6256J33092j60221
311h2467J50416j05687L7064L8067j00782J35839j35690J02401m6541j5993O8817
322D5444r9841J04091q3727M6161j561l9850O9820q3447P9525n9719K7672J1395
334A5963n0653Q2217r8214R3112o5677J9931L4826q5682J19352j25940J02096
345D1331n2679j0284P0980j14260J29981j15623P6432k3377l0373P2992r6691
356e1571R9019q2497N2913j7304j8001M7872o8092P5403o8239M7545j6840j8115
$$ y = [-69869, 55342, -24937, -14330, 52129, -77924, 84003, -68227, 34075, 9734, -51958, 81887, -92352, 81387, -52386, 12740, 28164, -61447, 80938, -84022, 71466, -46342, 13462, 21437, -52220, 73534, -81343, 73687, -51113, 17393, 20918, -55338, 77754, -82467, 67949, -37738, -674, 37393, -63389, 72450, -63240, 39161, -7380, -23373, 45444, -54397, 49694, -34033, 12128, 10567, -29283, 40537, -42910, 36615, -23104, 4568, 15963, -34690, 47527, -50687, 42425, -23252, -3321, 31505, -54177, 65175, -60765, 41331, -11348, -21632, 49348, -64912, 65069, -50554, 25878, 2501, -27872, 45120, -51571, 47448, -35049, 17864, 560, -17441, 30431, -37661, 37742, -30497, 17048, 208, -17907]
368a7907M9931p0475P3111n5695K2207J8391n5038P7366p8307N6673j8341k5595
380b3679O3006q4439Q4997o4923K9953J0195m5625O9791q0052P5993n8750L1892
392H359r39k9248N5418p4363Q1499p3023M9279j5182k2545N6671p9158Q2841o5753
405b6144L3540L816l6914N8321o2455M8110k1078q009L0107m1321M0795k8657
417i889P927J4214l0487L8649m0387L6231k4468N717J5587l5188N1643o3067O4000
430C0482m9489K1192J3300m6682P3696q7853Q2236n6347J9004J8217m8300O7785
442C7241p2568O0400l6490J1572P263k0434K9354l1937K6974j8997J3532r746
454c836L435M829r186P166k591j299O099j2272J3541l560j4830L2204m3049M7471
$$ y = [-17907, 32024, -38451, 34660, -21035, 1172, 19563, -35475, 41891, -36416, 20257, 1916, -23679, 39327, -45112, 39885, -25038, 4915, 15110, -30515, 39276, -40776, 35217, -23533, 8359, 7420, -21828, 33590, -40773, 40726, -32297, 16982, 1800, -20745, 35926, -43232, 39609, -26144, 7396, 11212, -25702, 32619, -29836, 18274, -2804, -10813, 19294, -22027, 18768, -9889, -1962, 12252, -18235, 20414, -19973, 16258, -8210, -2493, 13094, -22094, 29549, -33518, 30482, -19007, 2185, 15485, -31197, 42499, -45354, 36882, -19465, -461, 17756, -30544, 37241, -35327, 25073, -11417, 155, 7418, -13016, 16338, -15599, 11375, -7622, 5910, -3836, -401, 4428, -4758, 2408, -183, -1482, 4617, -7655, 5886, 2326, -12504, 19700, -23349, 24122]
468B4122m3350K5325N713l8240O0045o8531O6663n3826K8263L743k9973M4594
480B4548n1775N5277n1727L8244k0333N247P812k3773M0036m7252M2128l1252
492a2820K0249p047r464K1445k0700J0828k787Q72j084K678j1168K6820l8590
505b0768L6396k2814O309J1481l3207N3634o1388N3425l8705K4390p135j6479
517a4861L9496n2506N6498n8539N7116m3150J5520J4617l7621N4558o7351O8958
529C2735n2344K3972J660j8651L1157l9959L8542k5737J2275p808Q797o805K571
542D05k549N201j594r605J8826j9930J8995k2795K6928k3500J4527p946L007Q966
556H936k9145M6638n2748N0433m4241L0038l135k8786N1275n9682O0158n5603
$$ y = [24122, -19228, 6097, 11810, -26430, 33615, -34916, 31747, -22079, 6184, 9927, -20046, 24548, -27227, 28050, -23677, 14567, -5766, -519, 7293, -16480, 23556, -23696, 18432, -12820, 7429, 382, -9082, 12363, -8337, 2491, -296, 576, -508, 2170, -8998, 17822, -20768, 15628, -7186, -877, 10604, -22603, 31031, -30357, 23068, -15637, 8753, 1618, -14861, 24635, -27871, 28627, -29912, 27204, -15946, -426, 14191, -23430, 31128, -36223, 32735, -19609, 4363, 6023, -12628, 18529, -21430, 17112, -8625, 3650, -4158, 4639, -2166, 405, -2144, 3057, 1463, -8142, 10684, -9246, 9749, -13046, 13882, -9618, 4909, -3037, -30, 8936, -20209, 26429, -26319, 24114, -20127, 9911, 6776, -22010, 29265, -30417, 29741, -25862]
568b5862M1012j5994q681K3413l1225L9632m6783M4929l4320K3383j4914K520
580b890J6315l2878L8532l5937L2345k7188J5538m73q262P917o521J0115j4756
593h143J5773j6757K2731k9032K6253j3878L60R664j9854L1569l7991L3689k3742
606i358J6424j1345K438J0175j9772K4117k8449L4900l6827K8259j3079r94J2880
619I369k5659L6657l8403K9885j8893J1357m886l846J1659j4074J3816j7155K3638
632A3465k6410K2455j5788R390n99j2282K4035k8316K6134k3102K0463j4757N733
645D21J879n892J0338j8651K7240l0296K7461k2241J4884k570j3260K5705l0159
658a5141K8718k5134J9077r246j230P430r222J0974j4454J6795j5892J3824j2468
$$ y = [-25862, 15150, -844, -9525, 13888, -17337, 22295, -24488, 20441, -13879, 9504, -5410, -2890, 13425, -19453, 19079, -16858, 15487, -11701, 3837, 3364, -4898, 3019, -3502, 6613, -8143, 7630, -9127, 13604, -15428, 10825, -3053, -2693, 6971, -12883, 18686, -19305, 14384, -9358, 7066, -4279, -1841, 8334, -11438, 12679, -15770, 19130, -17697, 10562, -2517, -3511, 9369, -16290, 20367, -18036, 11849, -7044, 4313, -573, -4419, 7240, -6834, 6982, -10173, 13465, -12945, 9510, -6278, 3112, 2513, -9769, 14266, -14050, 12084, -11018, 9445, -5312, 421, 2300, -3592, 6746, -11905, 15335, -14961, 12500, -9741, 5143, 2573, -10687, 15018, -15141, 13577, -11557, 7520, -1726, -2956, 4474, -4748, 6226, -8228, 8567, -7325, 6499, -5969]
671e969R622k719o015J1790j3347J3311j2987J0824o622L548l922N446m339J25
685a254N029j0367J6596k2257K3436j8183Q911Q29r923J8135k3500K3690j9455
698h313J4037r062L460L493j0261J5178j8576K1116k1318J6981q423j422J0033
711F923j6526K0144j9415J4118o721M60L363n274N615m293K424k043L817o271
725c679P552p330O043l619n8L959o486P164p009P036p164O899o165M787k007k780
741b857Q748j3913J6571j6007J2142n365k899J0293j4666J5431j3280R234m336
754i04j50L150m498N014n534O205o691O595n652L639n78k830N417o378N693l886
770a388J716j20j74r57K693l822L363j082k506O483r573J0527q761M691M09n091
$$ y = [-5969, 3653, 934, -5081, 6709, -6638, 6673, -6314, 4510, -2112, 1436, -2486, 2960, -1379, -1254, 3775, -6592, 10004, -12253, 11183, -7000, 1911, 2740, -7183, 10952, -12548, 11142, -8313, 5724, -3338, 122, 3615, -6646, 8532, -10044, 11072, -10246, 6735, -1688, -3110, 6923, -9603, 10541, -8874, 5244, -1477, -1017, 2346, -2928, 2687, -1606, 818, -1225, 2592, -3679, 3873, -3457, 2586, -1033, -1091, 2868, -3618, 3546, -3463, 3573, -3591, 3308, -2857, 1930, -77, -2857, 5891, -8022, 8549, -7458, 4684, -681, -3580, 6713, -7953, 7478, -5802, 3432, -904, -1054, 2096, -2402, 2612, -2922, 3283, -3408, 3187, -2465, 1174, 596, -2234, 3183, -3195, 2498, -1388, 328, 208, 34, -923, 1770, -2052, 1311, 229, -2277, 4206, -5367, 5160, -3601, 1090, 1499, -3592]
786c592Q275r405Q557o344L682j332m24J782l036M433n879O930o942N419k384
801b60j503N143p477P846o154K955N86l178M008l029R43J150k312J995l35k023
817a645M104m979M304k370j50K364l703M031l576K863k317K052j804J194J17k211
833a726M690o740P477o286L286P79m792P592q390P029l995L61K695m359M454l382
849a307J859o18P2k26O75q93N30L93j538K357k426J638l62q24J307p90m48J790
867A189k567K200n13k080M665o151N906l894O81K830n629O956o500M613k112k53
883f59K007k973L291l291L372l515L345k548J014J065l320N164n914N086k848
898g24QK422l836L950k762P71J051j800J288N5j603K786l061K087j59j890L236
$$ y = [-3592, 4683, -4722, 3835, -2509, 1173, -159, -583, 1199, -1837, 2596, -3283, 3647, -3295, 2124, -260, -1763, 3380, -4097, 3749, -2405, 550, 1136, -2042, 1966, -1063, -120, 1030, -1282, 713, 378, -1645, 2459, -2520, 1784, -586, -736, 1628, -2075, 1956, -1620, 1243, -1074, 978, -826, 368, 485, -1726, 2964, -3776, 3701, -2585, 701, 1480, -3312, 4280, -4110, 2919, -1076, -715, 1980, -2379, 2075, -1307, 552, -66, 6, -220, 455, -438, 92, 485, -1053, 1304, -1122, 516, 154, -670, 637, -153, -601, 1189, -1378, 822, 309, -1771, 2894, -3257, 2649, -1245, -564, 2266, -3363, 3593, -2907, 1706, -406, -659, 1348, -1625, 1666, -1625, 1747, -1768, 1577, -971, 43, 1108, -2212, 2952, -2962, 2124, -724, -716, 1706, -2130, 1820, -942, -171, 880, -920, 368, 423, -1180, 1606, -1455, 632, 473, -1417, 1819]
915A819l673L419k601J419k99k60M11q17J867l217M280m764M497l039K36L103
931B381n731O837o425M749k062r86L245l918L299k389J603q70M83q39J626j838
947h35Q96O01j800K557l104L190k350R87j88L48o30K73N31j423K742m615O099
964C279n781L475l34k726N586p798Q148o091K821M7k087L762m947M844l688K741
980A251k570K253q64j024K315l112M012m526L474j053j013J641j477J225m52j120
996a040K299j488r83L322m557N157n255L765l59l306N403o004O254o122M635j992
1012b71k23J460k900N320p469P783o572M918k638j175N747q724Q910p438N503
1027B231k768j024M278n181M161l214L007k423J168n48J102j393Q1J855k582K275
$$ y = [1819, -1854, 1565, -1036, 383, 84, -176, 235, -582, 1285, -1932, 2348, -2416, 2081, -958, -722, 2381, -3350, 3487, -2938, 1811, -251, -1237, 2008, -1910, 1389, -1000, 603, -267, 216, -623, 1003, -835, 61, 662, -1138, 1419, -1685, 1505, -845, 142, -46, 302, -328, -55, 476, -947, 1795, -2820, 3279, -2502, 973, 639, -2087, 3499, -4299, 3849, -2242, 579, 626, -1461, 2301, -2646, 2198, -1490, 1251, -1319, 934, 70, -954, 1361, -1751, 2261, -2265, 1209, 156, -857, 784, -693, 532, 80, -1040, 1259, -229, -1212, 2110, -2447, 2710, -2545, 1220, 861, -2445, 2958, -3046, 3208, -2914, 1721, -271, -494, 966, -1934, 3386, -4083, 3700, -2872, 2046, -592, -1767, 3980, -4744, 4166, -3272, 2231, -537, -1561, 2717, -2464, 1697, -1517, 1490, -933, 235, -313, 789, -604, -523, 1332, -1250, 1025]
1043A025k324K788k322Q72j75J104k099J485J79j473K600m663O935p181M759j458
1059E2j182L586o259P872o999M497k568J585j59k068L673l960M264n551O445n196
1075a968K335K00k048M255o500P011n151K715j445Q01M76j841K056j653K356m302
1091b703N577m937L421k147L83K627n575O451n330M071l368K142m0j519J596j491
1107h42K685m496N124m406L568k835R83K096m521M940m190L687l223J874k22k01
1123B1n10N75Q66k628L560m190N171n468L795p06j924L344m414N501n597M257
1139A653k661J950j532J07K178m085N173o141O935o243L428K36l136N041o485
1154c582P064n873L326j060r0Q73k007K958l107L029l510M081l533J786Q7j402
$$ y = [1025, -1299, 1489, -833, 39, -136, 968, -1131, 354, 533, -940, 1660, -3003, 3932, -3249, 1510, 52, -1130, 2456, -3803, 4069, -2930, 1567, -1001, 584, 425, -1643, 2030, -1930, 2334, -3217, 3228, -1968, 367, 567, -1481, 2774, -3726, 3285, -1866, 849, -596, 205, 681, -1160, 896, -757, 1599, -2703, 2874, -2063, 1358, -789, -406, 2221, -3354, 3097, -2233, 1838, -1530, 612, 572, -947, 649, -842, 1843, -2653, 2471, -1935, 1633, -1202, -219, 1877, -2644, 2296, -1894, 1793, -1430, 444, 222, 21, -489, 86, 952, -1676, 1884, -2306, 2865, -2603, 1192, 486, -1438, 1906, -2508, 2993, -2604, 1653, -1008, 942, -590, -483, 1695, -2390, 2783, -3358, 3577, -2666, 762, 998, -2138, 2903, -3582, 3482, -2391, 935, -125, -215, 658, -1349, 1609, -1498, 1531, -1979, 2102, -1431, 355, 442, -960]
1170i60K515l582L875k897J481q23R64j053Q28p17N92L60k305M231n051M729l814
1187a627K318n0k440M051m402M151l907L447k478J325l78o38K239m219N603n786
1203b791M995l514J270J556m029N207n059M229l080J692l11n53P81r44J541k352
1219a362K963l257L222k676J397L61j891K688k844K625k140J434q86Q30j054J002
1235D12l52p49J989l192M078m195L242j463m79K055l103L541l262K459j647J140
1251D74p98L74L16j176K113l041L691l603K625j039o65K092k979L162k622J670
1267E94q20L39k22K63k46m8P19j681K563k996K787j943O73O90j827K410k399J976
1285H32j474J123r14P95n82J39O56j711K716l296L177k284Q55P61k118K843k821
$$ y = [-960, 1555, -2027, 1848, -1049, 432, -391, 573, -480, 348, -369, 223, 583, -1722, 2509, -2542, 2187, -1627, 691, 641, -1799, 2252, -2150, 2001, -1906, 1541, -937, 388, 10, -628, 1611, -2608, 2995, -2791, 2204, -1310, -40, 1516, -2513, 2694, -2365, 1864, -1216, 476, 165, -388, 393, -551, 990, -1362, 1601, -1656, 1566, -1110, 287, 648, -1243, 1445, -1399, 1226, -914, 520, -366, 464, -590, 412, 60, -689, 1300, -1892, 2186, -2009, 1233, -230, -709, 1346, -1757, 1784, -1478, 981, -666, 474, -324, 50, 366, -810, 1303, -1738, 1953, -1650, 975, -64, -729, 1363, -1616, 1546, -1076, 594, -226, 113, -109, 154, -92, -140, 579, -1102, 1461, -1535, 1252, -691, -18, 672, -1155, 1255, -1144, 832, -642, 481, -433, 362, -220, -81, 575, -1136, 1580, -1716, 1461, -823, 32, 793, -1325, 1518, -1303]
1302a303K232j367N39kj92J70j67L66q56J500j999K088j682Q34K22j189J750j807
1320h63J430q35L34j74L16n86P25n28o8R90j923K540k540J891p77n09J592k164
1338a149K199j800J193o41K74j04K5J84o08J198j800K121j955J287k46q64J718
1355A032k111J897j215M17K09m90L73m0k68L00K5o06J242j635J607j113K75N89
1373D88j193J421j301R76o12L83l29M18m47K26L14j084J802k177K035j369L15
1390a34Q30j723K125j996J437o78K7L31m05L19k69L64o36R81j287J322r48K47
1408i3N11j112J432j355R14l18j24K35q8j27L06l00K9N69j241J617j510R91k66
1427G0n23J209j528J375r37M86k03P4k6M6n0j80O91j256J535j418R92l74m27J194
$$ y = [-1303, 929, -438, 101, 99, -93, 77, -90, 276, -580, 920, -1079, 1009, -673, 161, 383, -806, 944, -863, 567, -268, 66, -108, 208, -378, 347, -181, -249, 741, -1182, 1358, -1182, 709, -68, -577, 1015, -1149, 1050, -750, 443, -198, 76, -28, -3, 181, -427, 771, -1029, 1092, -863, 424, 178, -686, 1032, -1079, 818, -397, 20, 229, -261, 112, 72, -196, 104, 129, -477, 765, -870, 737, -376, -101, 488, -705, 716, -585, 391, -221, 162, -167, 251, -196, 30, 344, -740, 1062, -1115, 920, -449, -134, 696, -1027, 1098, -898, 539, -139, -112, 219, -186, 133, -136, 228, -408, 573, -714, 608, -340, -93, 418, -694, 738, -617, 297, -21, -145, 90, 2, -125, 181, -119, -90, 479, -762, 855, -655, 336, 70, -453, 756, -772, 603, -334, 152, -51, 23, -3, 43, -7, -187, 504, -752, 783, -635, 357, -17, -444, 750]
1447G50j552J362r15N19k33K9M1R6k29Q4M37j056J421j513J409r21K1R30j458
1466g78J475j285J040o31J36J43r3qk15P17j079J222j284J186o78k46J074j418
1484g22J348j123P42j59m15N36k04r9R9L5j18L33p81J138r97M16J18l31N22p74
1504d36Q23n14K42m03P65q24N12j61k16Q52j653K100j820J071l40l49J137j767
1522i81J782j276P97o02L97M8m85O06p07J101j556J531r43K64K63q00J404j653
1540h10J214m71jJ79l42N16l76n2K58R2n56O58n41N60n75K13L91o82M78k69L75
1561B59n28M31l56N93q21M97K68r21J205j400J578j336N15M23r37J047j148J272
1579F41j047N19k00K70k44k03P94j097J142j264J327q82KP66j050J089j170J081
$$ y = [750, -802, 560, -355, 164, -69, -40, 1, 97, -132, -48, 389, -667, 754, -759, 650, -271, -250, 680, -778, 697, -588, 452, -179, -43, 100, 7, -1, -216, 501, -578, 644, -640, 546, -132, -378, 696, -722, 626, -497, 245, 86, -329, 207, 3, -96, 3, 38, -80, 253, -528, 610, -387, 29, 147, -184, 338, -436, 387, -127, 115, -288, 477, -347, 165, 4, -212, 640, -1013, 1087, -733, 338, -2, -351, 786, -981, 801, -475, 322, -280, 117, 165, -320, 286, -421, 680, -876, 655, -288, -24, 239, -561, 843, -810, 404, -67, -68, 111, -231, 285, -91, -143, 115, 207, -349, 309, -232, 328, -247, -34, 357, -325, 153, -116, 259, -269, 162, -194, 399, -422, 75, 343, -578, 627, -773, 805, -531, -16, 407, -530, 517, -631, 641, -406, 113, -87, 183, -61, -264, 530, -567, 575, -689, 638, -244, -242, 524, -526, 563, -607, 474]
1597D74n83mJ64J7j7k72M90m90N76r03J043o61kM30n68P35r07P32k75m7jK05k03
1620f7N8n0M3K95q40J099q70N31l12L5L95p32P06m50L88n61O45m83L17k41j9O22
1642E09j225J423j244R36n77k6P48j205J197r60P97o55L39K3k00K63m84Q66j098
1661e73J008p48M42m3m73R58j069Q13m93K76l4k12K67p5j07N3J65l51M59n79O44
1682C28n06J45K14l79M06m55M87m20L32l64M75m38J29K56n94Q94j136J149q11
1701b88K40L03o48Q63r62Q57n57K76j31P6N5k54M03n53P11q23P58m34J5L51o11
1722c53P50p15N22k54O1l6O0k4k3Q3k57N22p46P71o15L09M0l73O19p14O28m42
1744a87K92j81R5m2rJ19k83N28p12P33n89L27J9l64N94o34N35l71K18j00L5n2
$$ y = [474, -109, -113, 51, 68, 51, -221, 269, -221, 355, -548, 495, -166, -168, 262, -306, 429, -478, 254, -21, -68, -69, 136, -67, -9, -59, -16, 279, -561, 538, -332, 199, -113, -78, 317, -415, 291, -159, 229, -332, 313, -170, 147, -94, -113, 509, -716, 707, -537, 399, -178, -204, 544, -661, 536, -424, 373, -282, 57, 80, -120, 143, -341, 525, -573, 435, -313, 129, 86, -387, 571, -498, 315, -178, 98, 64, -148, 119, 44, -63, -10, 155, -196, 263, -316, 328, -178, -33, 181, -198, 208, -247, 240, -180, 152, -212, 263, -175, -46, 210, -384, 510, -626, 523, -288, -48, 255, -393, 470, -492, 365, -192, 84, -47, 29, 84, -170, 233, -320, 391, -432, 326, -108, -93, 258, -353, 397, -318, 204, -50, 11, -25, 35, 11, -12, 71, -186, 336, -410, 361, -254, 55, 95, -278, 341, -373, 255, -187, 105, -76, 19, -23, -32, 87, -196, 332, -380, 353, -236, 91, 110, -254, 340, -294, 241, -130, 88, -12, 23, -29]
1766b9P9k3j20L34n60O68o56M81j72j72M62o07N98m98L59k37J41q7L3O6k36M30
1788B54o15P18o62M66j39k37N65p22O98n34L14r8m4R2q0P8j29K24l38M49m85L85
1810A60j82q3L14m62M84m01K69j55P8p3Q0q3L0J34l51N36o34N78l63P7K29m98
1832c16O42o07M71k89J14J1o5J15j68K54l63M76n12M40k49m8L31n12N68m84K98
1853A07j02o1J21r9O2j6J2j29K75l88M30l71J87N5k86M37m65M13l12J67p2M3j8
1876a0j0R3k30L95n12N32m34K28Q1l77N66o08N09l28J27K9j21J31j35J63j95K73
1898A67l67L84l02J49O6k93M19m66L96k56R4K7q0Q3l9L6q7K00l34M43m37K96q3
1921A6j75M02n11M91l65K12n2l8R4j15J00j47K46l29L71l38K28p3j61L79m82M33
$$ y = [-29, 50, 27, -93, 241, -319, 349, -307, 174, 2, -170, 292, -315, 283, -215, 144, -93, 48, -39, -6, 60, -176, 254, -361, 357, -305, 161, 22, -215, 350, -372, 326, -208, 106, 8, -36, 56, -24, 54, -75, 149, -189, 260, -225, 160, -22, -105, 209, -253, 231, -170, 99, -56, 22, -51, 29, -54, -24, 110, -241, 295, -339, 239, -124, -47, 182, -316, 326, -281, 190, -99, 15, 26, -39, 76, -92, 162, -201, 275, -237, 203, -46, -94, 237, -275, 293, -191, 107, 5, -56, 65, -34, 28, 12, 24, -105, 170, -218, 212, -159, 28, 83, -203, 234, -231, 182, -130, 37, -35, 8, -10, -20, 73, -157, 238, -274, 258, -176, 52, 133, -244, 322, -286, 223, -105, 22, 51, -70, 61, -74, 89, -106, 167, -200, 184, -118, 31, 97, -196, 223, -243, 153, -103, -9, 18, -62, 21, -18, 18, -69, 131, -203, 240, -197, 99, 16, -159, 243, -268, 223, -142, 70, 18, -20, 74, -41, 59, -88, 158, -171, 200, -138, 90, 17, -144, 235, -247, 186]
1943A86l15J61k3q5J14o7J5k1J04k20L28l82L69k54J8K33l96M55m23L56k11N8
1965@K2m1O5j38K70l81M55m99M41k34q8L83n49N92n61M08j57r9K20k09J91j92
1987a01J72j53J62k20K14r1n8J70k58L20l00J79j5p6N8L4o3N5n9%J87m11N02m19
2011a71K86j28j05L80n23M90l82K80k14Q5N6j38K02k97M59n77N04l48J57R0l79
2032b73O38o91N21l07J32M2k13K98k42J43j37K37k55J78j14J04l9j80L80l70K39
2053I1j41R9j5q8P8N2j15K0J34k25K70l70M11k69j9K19k95L43l95L78k22M2j4
2076c1O9l4j15K50l06L93n13N14k85l7K49l65M77n34M47k18M9j0NR1k13K60k79
2099a36L83m91M20j91n2K12l76N23n60L81j38RM6r9J82j88R7r5K32l57K92j37
$$ y = [186, -129, 32, 9, -76, 38, -29, -14, -35, 69, -151, 177, -205, 164, -90, -72, 161, -235, 220, -203, 153, -58, 0, 22, -19, 46, -92, 178, -203, 252, -247, 194, -40, -128, 255, -294, 298, -263, 145, -12, -111, 109, -100, 91, -101, 71, -82, 80, -140, 74, -17, -75, 95, -163, 157, -143, 36, 21, -55, 3, 37, -26, 29, -30, -30, 157, -254, 248, -171, 115, -13, -118, 262, -261, 229, -153, 127, -87, -2, 54, -84, 118, -179, 280, -297, 207, -141, 16, 106, -273, 365, -326, 195, -112, 20, 62, -151, 147, -95, 48, -89, 148, -107, 71, -43, 61, 22, -158, 222, -148, 91, -50, 49, 34, -54, 24, 76, -39, -19, 115, -110, 160, -210, 201, -68, -87, 132, -163, 180, -215, 163, -59, -17, -31, 38, 4, -111, 139, -167, 226, -287, 227, -58, -95, 154, -211, 266, -268, 179, -39, 10, 0, 5, 96, -117, 143, -136, 247, -244, 176, -15, -67, 145, -231, 292, -268, 113, -25, -16, 30, -69, 113, -75, 22, -73, 159, -198, 94, -43]
2121d3L1M8j77L41l54K17p9N1o8L3mO4j19K2K27l95M29m16L76k41j6K86m37M35
2145B11l94L74l16J57m7J6L8k22M43n47N39n03M04j46k22N11o03N44m52L18r9
2166Dj03J97j62J44j92K39k52K43k37K09m3j54K56k71K71k39J53k3o5jJ05j38
2188e9P9Jr1K63m41M72l79J92nj72L41m36L95k88K13j74J34m3n3J42k81M51n53
2211b92N33l50J17R7l08M69n07M27k68J30m9j5P5q8Q0j44K60l37L45k79J67k7
2233C6j68L14l44K89j99J21q8N2m9O1l8m9K03l54M24m02K96j22q7K74l77L79l05
2256a33K28j30O2k6L7l5m2J65k90L77m04L56k17K3J73l11L36l05K25j43P5o2P5
2279C4q4L5Q6k39L80m52M21k87R5J19k82L61l73K97j92J26o7L6j9j1J04k08L13
$$ y = [-43, -12, 36, -141, 200, -154, 63, -16, 35, -33, 0, -4, 60, -59, -37, 190, -205, 224, -192, 184, -57, -73, 213, -224, 211, -183, 191, -125, 32, -15, 1, 39, -183, 260, -287, 252, -251, 153, 7, -215, 296, -307, 237, -215, 103, 4, -99, 98, -64, 80, -112, 127, -125, 118, -119, 90, 47, -107, 149, -122, 149, -90, 63, 40, -25, -26, 79, -59, 20, 21, -70, 193, -248, 224, -155, 37, 32, -140, 201, -235, 160, -128, 85, -89, 45, 2, -51, 91, -190, 261, -292, 241, -109, 8, 105, -203, 266, -241, 186, -82, 48, -1, -16, 59, -29, 51, -93, 167, -170, 175, -104, 63, 36, -132, 182, -162, 127, -72, 49, -39, 13, -36, 25, -13, -62, 141, -213, 211, -191, 105, -17, -104, 170, -207, 172, -133, 95, -35, 27, 1, 38, 3, -39, 126, -164, 213, -191, 165, -52, -29, 144, -167, 169, -136, 89, -54, 21, -41, 34, -50, -15, 71, -168, 212, -240, 181, -106, -11, 108, -174, 187, -186, 111, -81, 45, -22, 14, -5, -16, 88, -120, 193]
2302A93l89L84k94J14R4k59L53l53K75j62O7j8J3m3N6mr1J91l01L55l49K44q0
2325dr3K34k92K83k28J43j05J13j08R0l4p7K41l66M37m23L18j12r5K67l69L74
2347A94k97J75q1K9oK1l0n1J50k43L25l45K51j18l7J81k75K83k22J45p9L6k6N6
2371C6j04P7K7j56K88l61L65k69J07P2k12K91k87K30j65J24q3O3n7L5M3j87L05
2394A82l78L72k67R4P9k38L35l27K42j50O6rJl1K2Qp5J90k75L18k88J61J5j69
2418a22K57k70K61j81Q1k5K1n5N9k7m5J63k66L43l37K43q6q9K25k91K74k20J38
2441E1m6J1m4O8p1J0P8j88L03l41K65j34j8J51k22K60k35J43o1O0q9J03q6N3N3
2466G4j98L32m02L54k37Q0J03k70L60l12K13j34P0k9j3L2l4Q4k09K86l04K59j78
$$ y = [193, -196, 188, -106, 8, 102, -157, 196, -157, 118, -44, 23, 5, 18, -25, 31, 27, -64, 127, -174, 181, -168, 76, -4, -97, 137, -155, 128, -100, 43, -62, 51, -57, 33, -1, -78, 163, -203, 234, -189, 129, 17, -78, 189, -180, 194, -103, 72, -9, 20, 14, 35, 5, -46, 104, -139, 186, -159, 92, -26, -63, 118, -157, 126, -96, 49, -30, 6, -20, 36, -68, 9, 36, -120, 168, -193, 172, -97, 10, 82, -130, 161, -126, 104, -61, 63, -20, 43, -14, 21, 64, -123, 182, -196, 176, -91, 3, 82, -156, 179, -148, 94, -56, 10, 1, 2, -29, -7, 1, -74, 116, -159, 159, -129, 32, 47, -122, 135, -135, 126, -55, 26, 1, 22, -33, 26, -1, -46, 117, -149, 194, -143, 100, 14, -75, 150, -141, 133, -87, 51, 5, 16, -28, 40, -31, -21, 57, -131, 172, -169, 96, -38, -56, 95, -127, 133, -102, 41, -20, 40, -49, 54, -32, 21, 74, -124, 208, -194, 160, -77, 3, 106, -164, 196, -116, 97, -37, 33, 4, -9, 23, -11, 73, -136, 150, -154, 105, -73]
2489g3N6J20k70L14k41J25m5k1Q4q0j1J08r8J8Q9j72K39k83K53r6q4J55j26J16
2513G7j37J30r3J06j87K21j35k8J67k78L98m70L61j41q5K38l18L64l41K34j08
2534b5K0k6J9O0j39J93k38L20l56K39qj54K26k74L08k40N8R4j09N4j1K0J4o5j0
2559c0J68k60K17j18O0rq1J62j54L7LN1j26J42j46J82j37k8K32l60L68l25K43
2582I1j14r0K47k55K16k05K24j73R9p4R8l4j56L34l80L47l04K23m5k03L49l14
2604a19K41k10J29Jr1L8M5k3r1J72j88K00k30J67nj55J95j47J21q4K8N5j02pJ53
2629I3j51Q3k8n2J70k69K85j70N8j3l1J06j59J26p2J12k05K42j80Q8k8r7L00m52
2653b44M28k98J42Oj66K85l23K59j49J28j22N4%k0P0j72K82l33K71j34M0O0j76
$$ y = [-73, -17, 103, -167, 147, -94, 31, -14, -35, 49, -31, -42, 66, -32, -14, 75, -97, 142, -141, 112, 16, -68, 87, -39, 77, -60, 70, -23, 83, -104, 117, -18, -46, 121, -157, 241, -229, 132, -9, -94, 144, -174, 190, -151, 83, -25, -5, -31, -12, 48, -91, 102, -136, 184, -172, 67, 59, -95, 131, -143, 165, -75, -17, 77, -32, 22, 11, 31, 45, -20, -30, 138, -122, 95, -23, 37, 28, -53, 109, -45, -8, -5, 46, -80, 62, -84, 98, -39, -67, 165, -195, 173, -152, 91, -23, -113, 134, -121, 95, -110, 114, -59, 40, -34, 64, 30, -126, 208, -172, 175, -129, 94, 49, -154, 195, -119, 122, -88, 41, 42, -49, -11, 34, 11, -80, 92, -96, 104, -126, 41, 36, -119, 76, -71, 50, -34, -6, 49, -53, -60, 93, -58, 25, -3, -55, 115, -154, 131, -39, 19, 6, -25, 81, -78, 48, -24, 88, -117, 125, -55, 33, 5, -92, 208, -244, 184, -114, 28, 34, -132, 153, -170, 89, -60, 68, -54, 0, 0, -20, 50, -122, 160, -173, 98, -36, 4, 64, -112]
2676a12K57k21J13j0j8Qj0j9Q9j32O0P4j61J78j75J55r5j6P9p6M1m9O5p1J11j80
2702a15K22j93Q4O8k02K88l53L47k12L5J04j62J87j93K00j52J09j29J34r3J3J08
2724I5k08K77l05K58j37LJ13j90J94j49Q1l1J9o9R4q0N8k5o5J70k42K40j85R3
2748IK4j06J39j22Q4m7M6q3J43j52J26p3l1J51k36K76k40J56l8o7J44j44J04r0
2772b7P7r0J08j44J39r7kJ28k36K87k75J87r0j9J19j28J10r5P7o8R2j29J42j00
2796c4L5O5j67K28k56K14j13J0Q7j39J35q5O1o5O4q9J43j48Q1J9j24K01k48K23
2820I8j52O0K8j09J21r2P2o3O1r7J54j74J33m1o2J77k69K67j96J31l7p0J24j14
2844e0J03q8R5j14J24j37J24m3o3J59k31K69k35J45l4o9J12j32R4m3M0n7R7j45
$$ y = [-112, 145, -76, 37, 27, 9, 17, 7, -12, 77, -55, 5, 79, -82, 96, -79, 76, -19, -35, 44, -32, 9, -40, 25, -46, 65, -115, 107, -86, -2, 66, -136, 152, -201, 146, -66, -31, 73, -89, 98, -95, 105, -47, 62, -67, 67, -26, -13, 95, -113, 164, -141, 117, -20, -17, 96, -94, 100, -49, 32, 1, 20, -49, 45, -35, 23, -2, -67, 103, -139, 101, -84, 9, 33, -73, 66, -56, 28, -19, 27, -56, 87, -65, 61, -12, -43, 108, -128, 148, -92, 64, 26, -41, 103, -41, 63, -27, 50, -40, 68, -76, 63, -34, -36, 92, -144, 143, -132, 55, -35, -54, 65, -63, 47, -48, 29, -39, 53, -76, 66, -34, 1, 66, -101, 127, -129, 85, -28, -18, 69, -70, 65, -20, 41, -24, 40, -49, 94, -54, 27, 46, -78, 123, -125, 98, -54, 6, 34, -75, 46, -46, 26, -37, 24, -73, 81, -93, 40, -1, -63, 114, -155, 112, -84, 47, 10, -60, 64, -50, 53, -35, 60, -54, 70, -67, 57, 14, -49, 110, -121, 148, -87, 58, 24, -45, 67, -65, 29, -14, 26, -31, 66, -79]
2868g9J49j16L5N6j54K13k25J98j10J5L9o5P5n2N9o7R5j41J64j39P9L9j58K35
2892A45k62K18j38K9O0j20J29j08Q6o6O6j14J49j44R5oj04J94k53K31j54O2M4
2915C9j05J13p6L8j4K7p5J15j33J35o0l8J25j94K24j88J06j2n8P9p7N2l9M8o0
2940b8R6j52J65j07NQ7j76K19k14J52p1j9O9p5N4k6L1n0Q3j30J72j51O7N0j36
2965h5K13k57K19j22N0J7n7P8q6P6p4J12j62J86j40L8M7j57K44k69K16j08jP0
2989D8j33J48j20N5rK2o0P6o7N2k4l5J23j57J31q4N3pk5L8Oo7P9j8p4J35j88K39
3017A37k13R1O9j88K26k25K07j46N3Rl2K0m7J08j62J85k08K13j43j8J66k53K77
3040A26k61K09r0n1J29j35J42j11Q0n9K1k8Q4o2j1N9o8R9j27R2Nq5R1m4KK0o3
$$ y = [-79, 70, -46, -11, 45, -109, 104, -121, 77, -33, -18, 21, -44, 31, -21, 38, -29, 66, -75, 89, -50, 29, 68, -90, 145, -117, 101, -37, -8, 52, -68, 61, -47, 39, -27, 39, -75, 74, -70, 25, 19, -85, 109, -144, 87, -67, -5, 39, -66, 47, -29, 9, -5, 22, -53, 62, -71, 64, 4, -34, 91, -103, 121, -67, 39, 27, -31, 48, -29, 23, -16, 32, -28, 68, -84, 81, -26, -21, 66, -110, 109, -105, 47, -24, -43, 26, -49, 5, -21, 10, -40, 43, -87, 85, -66, 1, 51, -85, 128, -129, 90, -32, 18, 35, -22, 56, -30, 46, -28, 84, -78, 108, -32, 6, 53, -104, 140, -129, 87, -21, -22, 48, -85, 63, -57, -2, -11, 11, -49, 27, -40, 12, -12, -47, 76, -81, 50, -34, 19, 12, -13, 25, 31, -36, 43, 25, -49, 86, -102, 137, -76, 15, 84, -104, 122, -103, 104, -42, 11, 20, -12, 8, -39, 69, -93, 92, -116, 97, -46, -64, 102, -151, 126, -135, 74, -16, -67, 62, -73, 69, -42, 38, -21, 0, -28, 56, -6, -17, 42, -26, 73, -54, 38, 43, -42, 49, 5, 7, 27, -36]
3067c6P7l3p4J65j85J50r6K9M7j65K03j33Q1p4O5k6j0kJ1N4j57K38k34J85j28
3092d8L3J37k55K65k01J39r0J2Q8j34Q0m4Q0j35J33r0O4n7pJ36k34K02j39R5m7
3117a7n7J41j04K6J7oj0J2k1O7j11P2J5p2P6q2J01n5pL4Ro5J04o5J8J0q8K05k62
3146a15K01j01%O0j41K18k07J28o9M2m7PK0l9P1j37K12k06J38m1n6J50k09K37
3170A16j89P8Rm4O9j07J02k5Ll2P5p7M3j5kM1j01J26p2J5j2oK1%o1J15j11K9N6
3199D4j14J47j89J55p1mP3r1J01r8O4m4M4n2Q6l8m2R5j53K01k09J57n6n6J48j69
3225g1J75j45P0j0m0K6NNl1M7p0R3j13J08p1j2Q4j16R6o9M1Mk4j5L9l7O2n9J1
3254a7N9j14J54j04L7%n8J09j06N1oJ3k1M3m7M5m5k8R4j35J44j28R0j0m8R1j19
$$ y = [-36, 41, 8, -66, 99, -86, 64, -32, -3, 44, -121, 82, -51, 30, -44, 21, -5, -15, -17, -6, 48, -109, 129, -105, 80, -48, -15, 122, -133, 132, -69, 70, -20, -8, 80, -54, 26, -18, 62, -73, 60, -30, 34, -23, -30, 106, -128, 74, -65, 30, -17, -74, 67, -37, -11, 6, 0, -10, 2, -19, 48, -63, 9, 24, -48, 28, -54, 47, -8, -15, 19, 28, -37, 67, 2, 20, 30, -58, 147, -115, 86, -15, -15, 45, -96, 122, -85, 43, -26, 16, -31, -24, -4, -43, 28, -109, 103, -103, 35, -6, -62, 88, -121, 116, -73, 5, 14, -30, 39, -68, 34, 9, 12, -20, 55, -22, 21, 6, 4, 45, -56, 70, -2, 13, 1, -5, 16, 16, -45, 70, -41, -12, 44, -70, 77, -112, 43, -28, -32, 41, -50, 51, -47, 17, -27, 17, -35, 51, 13, -29, 66, -87, 114, -95, 62, 6, -50, 98, -71, 104, -41, 29, 19, -21, 5, 10, 15, -16, 31, -39, 54, -59, 49, -22, -34, 50, -66, 30, -39, 2, 6, -18, -33, 6, -31, 31, -28, -17, 42, -72, 82, -22, 15, 15, -43, 66, -40, 11, 5, 18, -3, 40, -7, 38, -7, -35, 59, -76, 68, -60, 30, 20, -28, 63, -56]
3281e6R9o5J4jK2m6N3l8J2M4j02J35j32J03n3lO1r5J05p4N1l2PoL8n6K6K8q0J22
3311H1j40J33q7J7M2j02J15q2L4K%l1K7m0N8l3l1Q1j13J12r6P7k4l1O3o9N4l0
3339a3L6l5M0n4P1n3LO5j01J16j22J10m8l7P6q9N9l7L0l2M0o6O7n4K5J5p5J28
3367F5j31R8n0j2O5p9N2j1MpJ6l9O1q2P5j1m3Q8j13J23j05N6nl4L9k4M3k8J6n9
3397c2Q4r7P8k8l2P9j36J44j18P1mm2O4o6N5k5Ok0L0n4N2k9J3N2j00Q8q3R3m0
3426Cj7N5n7L5r%%L2p4R3p5M1jo3R2r6Q7o2J7Qj3J2qmqK3m8Q2q7N3k6kN6r1Q8
3461C6p9N5j6oK4k3K1pJ0k6N8r5R0l3j3N8r1J13j04M7ok7M3m6L8k8K0l7M7m2L7
3492A8k8lM4q5R3p1M1j3k5N4l5kK2j8RLk0N7o5P1n0pM4o1P7p1M8l1K2k7K0Kk9
$$ y = [-56, 43, -22, -8, -9, 13, -33, 20, -18, -6, 38, -64, 71, -61, 42, -11, -14, 47, -48, 57, -17, 34, 2, 9, 3, 41, -15, 11, 39, -41, 81, -59, 74, -13, 4, 46, -56, 59, -23, 11, 13, 13, -18, 9, -31, 27, -6, -37, 44, -69, 43, -53, 24, 0, -31, 32, -37, 17, -13, 23, -12, 28, -26, 45, -8, -5, 60, -41, 75, -47, 63, 15, -22, 54, -35, 24, -13, 17, -15, 25, -41, 26, -28, -3, 12, -63, 65, -66, 32, -18, -30, 35, -44, 8, -3, 1, -6, 10, -29, 32, -50, 25, 14, -29, 59, -54, 69, -36, 20, 15, -19, 20, -4, 39, 11, 27, -32, 52, -45, 33, 5, -27, 52, -84, 60, -58, 13, 9, -33, 31, -35, 20, -5, 1, -19, 11, -43, 9, -20, -7, 45, -55, 33, -50, 43, 3, -14, 41, -16, 19, 10, 10, 10, 42, -32, 61, -14, 27, 26, -37, 55, -41, 46, -16, 1, 9, -4, 8, 0, -4, -12, 11, -37, 45, -42, 11, -15, -17, 39, -52, 36, -43, 12, -4, -10, 14, -9, 12, 5, 15, -11, 47, -48, 42, 9, -4, 54, -37, 76, -28, 19, 13, -14, 29, -17, 21, -7, 13, -24, 23, -19, 18, -10, -13, 31, -54, 39, -32, 9, -4, -29, 25, -10, -12, 10, -8, 1, 4, -16, 41, -24, 47, -3, -10, 34, -27, 50, -21, 27, -4, 18, -9, 11, 13, -16]
3525a6O1q2J11j28Q1l8j3O0j05J41j18N0J0l9M1n0N8m4L1m7P4p4M4J9n0M9o5Q9
3553E0n9JK3j2L9m0K2Om2J9J8m4O3n3L1k4j7N5l7K4l4OqnJ2K0l1qN2p3Q7r6Q9
3586C4l5l2O6p7R5r1P8l3nK5j1J4m0M8m7O1o8M4J0p6J05j03Q1n7K6K8n1J8l1L6
3616A2j8K2l1K7l2J9lk5M9n2M0j6QPj7K8jk7L2k3J1K0n1O6m1K3j9j2M5o2M3j9
3648CK5k3J3j2j2Rl3O7r2R7p4N5j2o3J20j19Q4m8J9ll2M3l7L0j8N9m5K1k1jK3
3679B3n1O8m7L8l5J0K6n3M4pk9L6rqNk2M1n4K1K2k5J1j6K1j2kj6K6k9K5j1qM9
3712C2o3O4l0J1J5o1P3o5N7j9J0mMRl2K3l2N9n2M5k9k3L2l7O0p2M8k9oJ8k0J3
3744aJ0j5LMk5L7k6K8pk3L7n0M0j5RJ2qK6k8qQK4k4L0n3O3m7j2N4o1L6l6L6jj0
$$ y = [-16, 45, -37, 74, -54, 27, -11, -24, 36, -69, 72, -46, 4, 14, -25, 16, -34, 24, -20, 11, -36, 38, -36, 8, 27, -23, 26, -39, 50, -9, -8, 15, 3, 42, 2, 24, 30, -12, 7, 25, -19, 44, -9, 22, -2, -19, 36, -1, 23, -11, -5, -13, -18, -6, 14, -17, -25, 27, -46, 41, -55, 34, -1, -33, 33, -44, 51, -40, 38, 5, 0, 25, 14, 28, -12, 36, -11, 50, -18, 26, 36, -40, 65, -38, 43, -14, 12, 40, -11, 7, -24, 12, -6, 16, -15, 12, -20, -1, -4, -29, 20, -32, 8, -8, 0, 7, -10, 18, 17, -10, 22, -1, 10, 30, -21, 45, 4, 27, 8, -4, 41, -21, 22, 3, 28, 5, 18, 6, -6, 3, -30, 37, -55, 42, -32, 23, 11, -52, 68, -51, 33, -15, 4, 1, -31, 12, -25, 5, -13, 46, 1, 22, 1, 0, 23, -28, 40, -7, 31, -4, 6, 32, -21, 23, 16, -13, 23, 14, 6, 11, -11, 30, -24, -3, 19, -6, 5, -11, 10, -2, -4, -20, 6, -23, 2, -9, -17, 32, -31, 33, 3, 14, 29, -32, 41, -24, 33, 14, 24, 20, 24, 33, 1, 24, -8, 51, -1, 44, 15, -8, 24, -13, 47, -25, 23, -6, -12, 6, -14, -1, 9, -6, -3, 1, -24, 13, -13, 15, 8, -15, 22, -28, 12, -3, 6, 18, 10, 36, 8, 0, 8, 32, 8, 38, -15, 48, 1, -11, 43, -18, 18, -18, 18, 17, 7]
3779GnRj4%J9l6N4o4L6j9j3M8m3M7n1K2Q%lkOjQj6K3l3M6l7K3J4l8N0n8L2qk1
3815a0L2j2%nLj4J4m1M8k5L5j2l0L6l3J2j6L8k7lJ6JljK3m4L7m7P0l5j0L3o9P3
3849C4l6L3k1K1k1%Pj5K5m8O0o6O6l1JK4m1L4k3Koj6PJ4k6K3Mj9M0n1L4j1NJ9
3883B2m4M8l4J1PmJ1J5j8J0j1j9M4n2M3k2jK4l4M0o4L8j9jNQj6J4rj2L4l7L4j7
3917fOJ7m3L7k9L0Nj2Qj5mOJ0jJ9l2M4m3L3k2lK6k8J8k2NkMqJ2Lj6Qk1L4l8K7
3954Gj5Qnk7L7j6J1kJ0kj3OJJ4j3J9l2M4k1J9Jl7L2k9K0Nj1orK9j6lj7K1m0M6
3990A6k1oK7l6L7l6K8k0QKmlJ4qjJ1j6K3j1Rpk3M2k9J3qPJ1rj3M2l1mK2l6M0m7
4027a7L4j4%J5k9J6j6K3k2jJ4rjk4L6j5K7k8J2J1k7L7n6M7mJ6j4j2MJ1J9k1Ro
$$ y = [7, 2, 11, -3, -3, 16, -20, 34, -30, 6, -13, -26, 22, -21, 26, -25, -3, 5, 5, 2, 0, 6, 5, 13, -3, 20, -13, 33, -4, 19, 33, -5, 45, -13, 19, 11, -10, 22, 10, 10, 5, 8, -6, 8, -33, 15, -10, 25, 13, -17, 19, -14, -2, -18, 20, -7, -10, 6, 7, 4, 3, 26, -18, 19, -28, 42, 7, -3, 30, -39, 34, -2, 31, 10, 31, 10, 10, 17, 2, 27, -21, 39, -27, 39, 8, 9, 33, -8, 26, 3, 5, -1, -17, -10, 4, -22, 1, 5, -14, 26, -25, 9, -2, 3, 22, -22, 26, -8, 3, 10, 6, 17, 32, 14, 24, 13, -6, 38, -14, 29, 7, 6, 30, -4, 36, -28, 10, -9, -10, -5, 3, -13, 1, -8, -20, 14, -23, 11, -6, 0, 17, -26, 11, -18, 12, 17, 5, 13, -2, -6, 0, 10, 9, 28, -4, 40, -3, 30, 8, 5, 31, 3, 21, -1, 4, 2, 6, -2, 10, 13, -3, 5, -16, 18, -20, 7, -8, 0, -5, -32, 5, -11, 0, -2, 8, 6, -7, -1, 0, 14, 1, 20, -12, 32, 11, 30, 31, -6, 26, -3, 17, 22, 11, 5, -4, 25, 9, 6, -11, 10, -30, 16, -5, -11, 16, -20, 17, -19, 9, -11, -3, -1, -5, -8, 6, -2, -3, 8, -8, 15, 4, 13, 6, -17, 25, -4, 9, 1, 8, 19, 10, -3, 39, 8, 4, 26, -10, 30, -17, 17, 3, 3, 18, -11, 5, -11, 12, -10, -11, 3, -6, -7, -31, 5, -10, 17, -11, 1, 12, -15, 22, -34, 13, 9, 25, 11, -1, 3, 14, 33, 12, 21, 15]
4061A5JpJ2Lj9K1k5j0K4k2J2j4NJ3KpllJ3k8M5l3jrJ5Qk0mK1NPPj3Oj8%K6l4L5
4100B6j7J3Ok6L6k7Ok1jL8j8rNJ1k7L1m0K2j8NK2n8N2j7kJ4k1L4l0J2LkMkQpJ
4137FOlnJ9j3j0Qj7RJ7j9J2j0PLl1N8n2K2qrK2j8K0k1Pj0Pj4QJ5k5K8l2L5k8M0
4174B4k6nL5n9N2k0RLj8K4j1LLj2MmkJMlkKkNj6J3nlJ2j3NoOJ2j7K0k4K4rj9K6
4215A1j4KNJ0oLnJ0j8J0J7k9K2k9J8J4j3Pl4K3J7k9ljJ7nrqJ5j7K4k6J5nj3J9
4251ekj0K7j6kKJ0lnQLKLrJ3J9k0KJOrk5K8j0j1J1Mj5J7j5Ol4L6Kr%j6Rj8K9l
4292Aj0J9k8K3lPpK2k4MJ0j2K0j2Qj9J6jkjJ4o%Kkj0qKk0L1rmP%lj6nOjQN%Np
4336@j1J9k0K2Kj5J3rJ8j2PloJK2j7l%kJ6l3K3jj4K1k9K0j2Rkj4J4%j6PKj5J3
$$ y = [15, 16, 9, 21, 24, 5, 26, 1, -9, 15, -7, 5, -9, -4, 9, 11, 4, 1, -2, 11, -17, 28, -5, -6, -15, 0, 8, -12, -16, 5, 10, 17, 24, 11, 17, -1, -1, 25, -9, 26, 9, 22, 28, 2, 38, 11, 17, -4, -5, 33, 15, 6, 11, 22, -5, 26, -14, 8, -10, -5, 17, -41, 11, -6, -8, 6, -15, 19, -11, 1, 4, 2, 6, 4, 12, 5, 6, 12, 9, 4, 23, 10, 0, 8, -9, 0, 17, -2, 10, 0, 7, 10, -21, 37, -15, 7, -1, -10, 12, -6, 14, -7, 0, -10, -3, -17, -9, 6, -19, 9, -23, 12, -16, 24, -2, -7, 28, -31, 21, 1, 10, 13, -5, 19, 8, 11, 14, 2, 6, 2, 0, 1, 5, 2, 0, 2, 0, 5, -11, 2, -3, -6, 6, -7, -2, -8, -2, 10, -7, 13, -11, 13, 4, -15, 11, -3, -1, 4, 14, 8, 11, 6, 16, -2, 8, 25, -4, 18, -11, 7, 21, 8, 15, -19, 4, 21, -8, -11, -12, 5, 0, -9, -17, -2, -19, 5, -21, -6, -11, -24, -5, -7, -17, 10, -6, -8, -6, 4, 1, -4, 4, 7, 9, 12, 3, 16, 35, 15, 17, 18, 24, 15, -10, 18, 8, -3, 8, 12, -3, 14, -1, 5, -29, 7, 9, 0, 0, -16, -7, -25, 4, 1, -9, 10, -18, 5, 2, 9, 2, 24, 0, 4, 14, 2, 22, 10, 18, -1, 15, 14, 12, 11, 25, 19, 19, 21, 19, 9, 1, 3, -17, 14, 5, 1, 8, 8, 5, -11, -16, -10, -11, -3, 2, 2, 7, 0, -11, 8, -12, 10, 12, -3, 10, 1, 19, 7, 14, 11, 5, 6, 28, 11, 8, 8, 6, 22, -11, 12, 11, -3, 18, -11, 9, -3, 6, 4, -10, 4, 4, -12, -5, -3, -18, -5]
4374ek6L5rkPlJ3j3KLrJ7j8QKJ4j4K9l1J9j3JJ8k6J6j9K0j2J1jj4jK2k7qJ5j4
4411a3J4koNnJ5njnpqJ2%ROjmQnJN%j0J9Kmk3J8qO%Pq%Mj8QlLj4JJ4k3J7J1j5
4457cJ3j7MlpK2j2kRj1K6lj2J2kJ2k7ORkJRj8Mjj0J1kqJ6j7Oj0NlOJ6l7K0kj2
4498a4KJ8MknlRk5NmJ2LMJ1oJ1kkrlRQnk0J0J7Jlj4Oj3Rj7J3JolplKKJ3j1mJ5
4543Dkj3OoJ1lp%MJ0Rj4J8%j3LnJ5Jjj3nJ5j2J7j8mJ0lkqJ0%j1nOkJJ1j9OPMr
4587gNjLJLnQqlJ2r%J8j8jJ4j1JKKMj4K3k0MJqJKnNJnoK2k0ojJ8j4K2k8K1pk0
4632b4L9j0j2J0qJ9j5K4qqJ3%rnJ0Okk5J0%mjJ0mqKj0mlJ9j9J6k8K0n%QQLj8J1
4673bKoJ5j2LOKNolJ4%pK4l1QlJ3qrK0l9J0Qk4K3jj0Pj3QkJ4j3rJ4pj1J1J3j0
$$ y = [-5, -31, 4, -5, -7, 0, -3, 10, -3, -1, 2, -7, 10, -8, 0, 2, 16, 2, 31, 0, 19, 6, 7, 25, -1, 15, -4, 16, 4, 15, 14, 0, -1, 21, -6, -14, 1, -13, 1, -1, -7, -2, -7, 8, 3, 2, -3, -10, -18, -6, -6, 3, 9, 8, 4, 12, 7, 8, 13, 13, 3, 22, 24, 20, -3, 15, 7, 13, 13, 20, 12, 12, 16, -2, 6, 3, 6, -8, -7, 7, -16, 1, 12, -3, 10, -7, -3, -6, -13, 9, -3, -5, 4, -7, 19, 16, 4, 16, 14, 26, -1, 5, 14, 12, 13, 22, 4, 8, 7, -3, 8, 6, -2, 14, -3, 3, -7, -2, -5, 1, 17, -20, 0, -2, -14, -12, 6, 10, 8, 3, 0, 9, -16, -11, -15, -3, 0, 4, 15, 9, 20, 18, 16, 7, 4, 13, 21, 16, -4, 6, 23, 24, 21, 7, 13, 0, 9, -8, 5, 6, 0, -3, -10, -13, -11, -9, 4, -7, -11, 4, 2, -11, -5, -11, 0, -3, -10, -10, -6, 4, 13, -1, 17, 17, 4, 7, 2, 17, 18, 17, 4, -1, 14, 2, 19, 1, -3, 7, 4, 2, -6, 4, 4, -7, -12, -6, -8, -7, 4, -15, -9, -2, 2, -7, -2, -3, 0, 1, 4, -1, 7, -1, -4, 8, -1, -1, 17, -1, -2, 12, 1, 2, 4, 6, 10, -4, 19, -1, 3, 4, -4, -3, -1, -6, -1, 0, -5, -11, 11, -9, -15, -16, 2, -12, 10, -18, 3, -4, -24, 15, 5, -7, 3, -5, 14, -1, 23, 15, 7, 20, 20, 11, 6, 16, 22, 20, -5, 5, 5, 1, 0, 10, 6, -2, 0, -10, -14, -17, 2, -17, -1, -29, -9, -14, -14, -6, 2, 5, -13, -2, 0, -6, 9, -3, 0, 6, 8, 13, 7, 4, 18, 18, 11, 35, 4, 12, 9, 22, 14, 5, 25, -14, -4, 4, -20, 3, 2, -8, -1, -14, -6, -8, 6, -7, -16, -2, -9, -20, -9, 4, -6]
4714fJ5roJ4j2K2pJ3j3jQk2K1j0j0J0rJ2j7PRjj9L6l0PKk3J2jJ5k0MJ4j7K4j3
4751amnK0j3J1noPJ0Kl9L5j2J3j1OJ3j2NJ3j1j7J2j2LNj0J6oPk2J2j3J9j8%K1
4788A3j8mKK1l0MPrL0k6K5j8RqJ2Qj9J8j8J2j5K1k2K1nj1J9k7K4k5K8k7KJ3k8
4823b1K0Pj1kjk2L8k8K0nj0J6l3L3nRLk7K4ooJ2jmK8j9K0j1k6M5m2K6k0K3j8l
4859CK1k3K2l2J2j2J2rK2l3LJ2j3L4m2K3j0QqPMj8J8oJ1j6J1MqL1m7M4k4K4l8
4894a3K2klRj1J1j1Nj7K6j8LkjPk8L0l0J2J4plnJ1O%j6L2m6M1j8kK6k4J8k7L4
4931B3k8kJ1KJ0Npj5M1p0L9lqK6m0K6j9J9j1NllJ1j4oMJ2j3J1j3KJ1j8J9j4J0
4967@kJ3nnoK1j0j8M6l4K8l4L0k8PK3k8L2l1K1k1J3j2j3K3l0M1m5L9l7J3Qj7L2
$$ y = [-6, 9, 0, -6, 8, -4, 18, 11, 24, 11, 10, 18, -4, 17, 7, -3, 7, -2, 10, -7, 0, 9, 8, -11, 25, -5, 2, 4, -19, -7, -8, 7, -13, -9, 5, -12, 12, -1, -5, -10, 10, -3, 8, 3, -3, 4, 14, 16, -23, 12, 0, 13, 2, 8, 21, 9, 14, 27, 16, -1, 11, -1, 2, 7, -3, 13, 7, 14, -8, 4, -9, 10, -8, -8, 13, -5, -9, -7, 14, -16, -12, -5, -14, 16, -10, 15, -3, 6, -2, 10, 18, -1, 17, -1, 11, -4, 17, -5, 16, 11, 0, 19, -8, 16, -9, 19, -8, -6, 7, -21, -1, 6, -5, -7, -8, -30, 8, -20, 0, -5, -15, 1, -32, 1, -4, 5, 8, -19, 5, -1, -7, 5, 4, 0, 28, 9, 29, 18, -8, 37, -5, 21, 1, 24, 6, 3, 24, 1, 23, -9, 3, -9, 3, -6, 16, -17, -14, -2, -15, 19, -23, 0, -10, -2, -10, -3, 1, -17, 1, -5, 6, -10, 1, 5, -3, 28, -19, 25, 1, 25, -13, 9, 7, 4, 13, 2, 13, 2, 7, -10, 16, -2, 1, -1, -2, 5, -23, 7, -23, -11, 3, -4, -7, -12, -1, 5, 5, -11, 21, -25, 16, -2, -4, 22, -2, 16, -11, 23, -5, -7, 4, 6, 16, 21, 14, -1, 40, -30, 9, 6, -2, 24, -16, 10, -9, 10, -1, 4, 1, -2, 9, -5, -11, -7, 5, -8, 3, -10, -8, 3, -15, 4, -10, 0, -2, 11, 6, 1, -5, 16, 6, -12, 34, 0, 28, -6, 24, -4, 3, 26, -2, 30, -1, 20, -1, 12, 0, -13, 10, -20, 21, -24, 15, -22, -9, -1, -18, 14]
5001A4l7K4pK0j0j0J9j1kJ3qj2J6oK5j8Kkj6J2lK4k7J0JJ0k8L5l2LPl2L9m0L3
5036Fj7PPl5L7j3Pj9L5l6K0Jk2L3k3K3l6L4lj6L3m8N0l3L6j5j6L2j5prL7l7L5
5070C3m1NRk0L5l3J3qJ9jl0J7%j2L0l2J8Pk5K8k3RnJPpJ9j3JmL2m3M3j7rK3n2
5107b6O5m8L2lk5L0m3N1n2L0j8jJPMpJ9k9L1k8j1L2m1O1n6L6nqJ3pQrmRJ4k2K9
5144B9mjmk6L5k6oJ6k0K2kj9L5n3M2m5J5J8l3N1o7N2j0j5J1l1N7l3K9k2K1k3R
5177BJ5m0N5m9N5m7J1L4m8O1o7N2k6j4K1rJoqMJ4j8K3l3NJ2k2K0j7Q%kJ1JmL5
5213C0l8J2joK3m2M3j5Pj8qL3j7K0k4L5l1K0k7M2k7k3O1p1N6l8J0Jj7M3n1POl
5247hMOj6K0pk2M3m7L8l2K6Pl8N1l1J8j3J1Pj4kJ8k1J2J7j4K5n8K4LjJ6l9K4o
$$ y = [14, -23, 1, -6, 14, 4, -6, 13, 2, 0, 13, 5, -7, 9, 3, 28, 10, 12, 10, -6, 6, 3, 27, 0, 10, 11, 21, -7, 28, -4, -1, 6, -26, 13, -27, 6, -11, -4, 3, -32, 5, -8, -1, -20, 15, -21, -1, 0, -22, 11, -12, 11, -25, 9, 6, -10, 23, -25, 25, -8, 28, 13, -3, 29, 14, 7, -2, 35, -2, 33, -8, -3, 6, -14, 21, -12, 1, -7, 12, 11, -19, -2, -2, -14, 16, -16, 2, 9, -16, 12, -11, -2, -7, -6, 1, -6, 13, 0, 1, -3, 29, -14, 29, 12, 3, 26, -26, 39, -9, 23, 20, -5, 25, -18, 33, -19, 11, -7, -8, -7, 0, 4, -3, 16, -13, 18, -10, -21, 11, -30, 31, -25, 11, 6, -2, 11, 4, 12, 3, -1, 8, 22, 0, 29, 25, 24, 20, -6, 29, 3, -3, 13, -7, 15, 13, -6, 29, -24, 18, -27, -12, 6, -27, 24, -43, 9, -1, -16, -5, -36, 21, -12, 17, -5, 16, -7, 2, 17, -23, 32, -17, 38, -9, 2, 36, -12, 49, -18, 34, 8, -6, 15, 6, 7, 1, -7, -3, 11, -7, 16, -17, -12, 0, -22, -2, -19, -11, -11, -13, -2, -1, -5, 30, -8, 4, 3, -3, 20, -22, 21, 6, 13, -5, -13, 20, 3, 23, -1, 34, 3, 23, -4, 38, 11, -12, 49, -22, 34, -4, 6, 7, -10, 33, -18, -11, -5, -8, -4, 2, -14, 6, -1, -23, 20, -27, 11, -21, 5, 12, -26, 25, -6, 12, -1, 10, 17, 3, 1, 19, -2, 10, 27, 13, 38, -20, 4, 7, 6, 22, -17, 7, 1]
5282AoMlk0L0k3J1jj3M7o6N0k5J8Nk6K2k8L3k9L9l5K3j3J9j2j7N0n1N0l9J1L2
5315C8n2L9k5jONj0J3j7J4k9QJ3nJ7k5K0rj2J0j2K3pmj5L3k6K1k0J5L5m9L5l9
5349a2M1l7J4J2j2jJ6j8JRk1L5k1ROk4L0n1L7k2KK4l2K5k2lJ0Lj9L9l6J8Lk0O0
5384D3o9N3k8J7Nk5K7j1j1pL7l6M2m7L8l1j6M6l4M1m0J1j2JJ6lkk8J1MOj6L0k7
$$ y = [1, -5, -1, -4, -24, 6, -17, -6, -7, -20, 27, -39, 11, -14, 4, 9, -17, 5, -23, 10, -19, 20, -15, 8, -5, 14, 2, -15, 35, -16, 34, -5, 6, 38, -14, 25, 0, -1, 5, 10, 0, 13, -4, 10, -19, -11, 2, -3, 14, -11, 9, 0, -12, -2, -14, 9, 2, -2, -17, 16, -10, 11, -9, 6, 41, -8, 27, -12, 29, -8, 6, 18, 6, 5, 21, 3, 4, 13, -8, 27, 6, 15, 21, -3, 27, -24, 13, -9, -7, 17, -15, 10, -12, -15, -5, -2, -21, 18, -18, 0, 3, -17, 43, -26, 27, -1, 16, 21, -4, 23, 12, 1, -6, 31, -5, 37, -10, 28, -3, -19, 27, -7, 34, -6, 5, -7, -6, 10, 7, 5, -23, -12, -8, -2, -18, 12, -15]
$$ [...]
8191C
##END NTUPLES=NMR FID
##END=
