##TITLE=1H_DE-80H_X3
 200.13MHz, d2o
 8 sc
 
 19ns.26.2.2025
##JCAMPDX= 6.0         $$ Bruker NMR JCAMP-DX V2.0
##DATA TYPE= NMR FID
##DATA CLASS= NTUPLES
##ORIGIN= UXNMR, Bruker Analytische Messtechnik GmbH
##OWNER= pz
$$ XWIN-NMR		Version 3.5
$$ Wed Dec  3 11:09:30 2025 Russian Standard Time (UT+4h)  Yarkov@DPX200
##.OBSERVE FREQUENCY= 200.1313
##.OBSERVE NUCLEUS= ^1H
##.DELAY= (6, 6)
##.ACQUISITION MODE= SIMULTANEOUS
##.ACQUISITION SCHEME= undefined
##.AVERAGES= 8
##.DIGITISER RES= 18
##SPECTROMETER/DATA SYSTEM= spect
##.PULSE SEQUENCE= zg30
##.SOLVENT NAME= CDCl3
##.SHIFT REFERENCE= (INTERNAL, CDCl3, 0, 14.3821)
##AUDIT TRAIL= $$ (NUMBER, WHEN, WHO, WHERE, WHAT)
$$ ##TITLE= Audit trail, XWIN-NMR		Version 3.5
$$ ##JCAMPDX= 5.01
$$ ##ORIGIN= Bruker BioSpin GmbH
$$ ##OWNER= Yarkov
$$ C:/Bruker/XWIN-NMR/data/yarkov2/nmr/H-C/1/audita.txt
$$ ##AUDIT TRAIL=  $$ (NUMBER, WHEN, WHO, WHERE, WHAT)
(   1,<2025-12-03 11:08:12.35 +0400>,<Yarkov>,<DPX200>,
      <created by zg, POWCHK disabled, PULCHK disabled
       configuration hash MD5:
       00 E9 B6 7A A2 85 ED C7 34 08 36 98 17 FE 4E 26
       data hash MD5: 16K
       69 FB 63 47 0D C8 99 6E CE 8F E8 5C D7 D0 1B E4>)
$$ ##END=
$$ 
$$ hash MD5
$$ 6E A0 1E 6E 93 D7 D5 FE 1E 35 18 37 D9 E6 FD 2E
##$RELAX= 
##$RELAX= 
##$RELAX= 
##$RELAX= 
##$RELAX= 
##$RELAX= 
$$ Bruker specific parameters
$$ --------------------------
##$DU= <C:/Bruker/XWIN-NMR>
##$EXPNO= 1
##$NAME= <H-C>
##$PROCNO= 1
##$TYPE= <nmr>
##$USER= <yarkov2>
##$AMP= (0..31)
100 100 100 100 100 100 100 100 100 100 100 100 100 100 100 100 100 100 
100 100 100 100 100 100 100 100 100 100 100 100 100 100 
##$AQSEQ= 0
##$AQ_mod= 1
##$AUNM= <au_zg>
##$AUTOPOS= <>
##$BF1= 200.13
##$BF2= 200.13
##$BF3= 200.13
##$BF4= 200.13
##$BF5= 200.13
##$BF6= 200.13
##$BF7= 200.13
##$BF8= 200.13
##$BYTORDA= 1
##$CFDGTYP= 0
##$CFRGTYP= 5
##$CHEMSTR= <none>
##$CNST= (0..31)
1 1 145 1 1 1 1 1 1 1 1 1 1 1 1 1 1 1 1 1 1 1 1 1 1 1 1 1 1 1 1 1 
##$CPDPRG= <>
##$CPDPRG1= <>
##$CPDPRG2= <>
##$CPDPRG3= <>
##$CPDPRG4= <mlev>
##$CPDPRG5= <mlev>
##$CPDPRG6= <mlev>
##$CPDPRG7= <mlev>
##$CPDPRG8= <mlev>
##$CPDPRGB= <>
##$CPDPRGT= <>
##$D= (0..31)
0 0.7 0 0 0 0 0 0 0 0 0 0.03 0 0 0 0 0 0 0 0 0 0 0 0 0 0 0 0 0 0 0 0 
##$DATE= 1764745691
##$DBL= (0..7)
120 120 120 120 120 120 120 120 
##$DBP= (0..7)
150 150 150 150 150 150 150 150 
##$DBP07= 0
##$DBPNAM0= <>
##$DBPNAM1= <>
##$DBPNAM2= <>
##$DBPNAM3= <>
##$DBPNAM4= <>
##$DBPNAM5= <>
##$DBPNAM6= <>
##$DBPNAM7= <>
##$DBPOAL= (0..7)
0.5 0.5 0.5 0.5 0.5 0.5 0.5 0.5 
##$DBPOFFS= (0..7)
0 0 0 0 0 0 0 0 
##$DE= 6
##$DECBNUC= <off>
##$DECIM= 32
##$DECNUC= <off>
##$DECSTAT= 4
##$DIGMOD= 1
##$DIGTYP= 9
##$DL= (0..7)
0 120 120 120 120 120 120 120 
##$DP= (0..7)
150 150 150 150 150 150 150 150 
##$DP07= 0
##$DPNAME0= <>
##$DPNAME1= <>
##$DPNAME2= <>
##$DPNAME3= <>
##$DPNAME4= <>
##$DPNAME5= <>
##$DPNAME6= <>
##$DPNAME7= <>
##$DPOAL= (0..7)
0.5 0.5 0.5 0.5 0.5 0.5 0.5 0.5 
##$DPOFFS= (0..7)
0 0 0 0 0 0 0 0 
##$DQDMODE= 0
##$DR= 18
##$DS= 0
$$ [...]
##$SUBNAM2= <"">
##$SUBNAM3= <"">
##$SUBNAM4= <"">
##$SUBNAM5= <"">
##$SUBNAM6= <"">
##$SUBNAM7= <"">
##$SUBNAM8= <"">
##$SUBNAM9= <"">
##$SW= 18.0517328524113
##$SWIBOX= (0..15)
0 0 2 0 0 0 0 0 0 0 0 0 0 0 0 0 
##$SW_h= 3612.71676300578
##$TD= 16384
##$TD0= 1
##$TE= 0
##$TE2= 300
##$TE3= 300
##$TEG= 300
##$TL= (0..7)
0 120 120 120 120 120 120 120 
##$TP= (0..7)
150 150 150 150 150 150 150 150 
##$TP07= 0
##$TPNAME0= <>
##$TPNAME1= <>
##$TPNAME2= <>
##$TPNAME3= <>
##$TPNAME4= <>
##$TPNAME5= <>
##$TPNAME6= <>
##$TPNAME7= <>
##$TPOAL= (0..7)
0.5 0.5 0.5 0.5 0.5 0.5 0.5 0.5 
##$TPOFFS= (0..7)
0 0 0 0 0 0 0 0 
##$TUNHIN= 0
##$TUNHOUT= 0
##$TUNXOUT= 0
##$USERA1= <user>
##$USERA2= <user>
##$USERA3= <user>
##$USERA4= <user>
##$USERA5= <user>
##$V9= 5
##$VALIST= <valist>
##$VCLIST= <CCCCCCCCCCCCCCC>
##$VD= 0
##$VDLIST= <DDDDDDDDDDDDDDD>
##$VPLIST= <PPPPPPPPPPPPPPP>
##$VTLIST= <TTTTTTTTTTTTTTT>
##$WBST= 1024
##$WBSW= 4
##$XGAIN= (0..3)
0 0 0 0 
##$XL= 0
##$YL= 0
##$YMAX_a= 143332
##$YMIN_a= -126367
##$ZGOPTNS= <>
##$ZL1= 120
##$ZL2= 120
##$ZL3= 120
##$ZL4= 120
##$ABSF1= 10
##$ABSF2= 0
##$ABSG= 5
##$ABSL= 3
##$ALPHA= 0
##$AQORDER= 0
##$ASSFAC= 0
##$ASSFACI= 0
##$ASSFACX= 0
##$ASSWID= 0
##$AUNMP= <proc_1d>
##$AZFE= 0.1
##$AZFW= 0.1
##$BCFW= 1
##$BC_mod= 2
##$BYTORDP= 1
##$COROFFS= 0
##$CY= 83.5205535888672
##$DATMOD= 1
##$DC= 2
##$DFILT= <>
##$DTYPP= 0
##$F1P= 10.8118882576601
##$F2P= -7.23987719738617
##$FCOR= 0.5
##$FTSIZE= 0
##$FT_mod= 4
##$GAMMA= 1
##$GB= 0.15
##$INTBC= 1
##$INTSCL= 1
##$ISEN= 128
##$LB= 0.25
##$LEV0= 0
##$LPBIN= 0
##$MAXI= 10000
##$MC2= 0
##$MEAN= 0
##$ME_mod= 0
##$MI= 1.114404
##$NCOEF= 0
##$NC_proc= 0
##$NLEV= 6
##$NOISF1= 3.799351
##$NOISF2= 2.8
##$NSP= 1
##$NTH_PI= 0
##$NZP= 0
##$OFFSET= 14.38212
##$PC= 1
##$PHC0= -5307.264
##$PHC1= 27.62191
##$PH_mod= 1
##$PKNL= yes
##$PPARMOD= 0
##$PSCAL= 0
##$PSIGN= 0
##$REVERSE= no
##$SF= 200.129724274929
##$SI= 16384
##$SIGF1= 3
##$SIGF2= 2
##$SINO= 400
##$SIOLD= 16384
##$SREGLST= <1H.CDCl3>
##$SSB= 0
##$STSI= 0
##$STSR= 0
##$SW_p= 3205.1282051282
##$SYMM= 0
##$S_DEV= 0
##$TDeff= 0
##$TDoff= 0
##$TI= <>
##$TILT= no
##$TM1= 0
##$TM2= 0
##$TOPLEV= 0
##$USERP1= <user>
##$USERP2= <user>
##$USERP3= <user>
##$USERP4= <user>
##$USERP5= <user>
##$WDW= 1
##$XDIM= 8192
##$YMAX_p= 0
##$YMIN_p= 0
$$ End of Bruker specific parameters
$$ ---------------------------------
##NTUPLES= NMR FID
##VAR_NAME=  TIME,          FID/REAL,        FID/IMAG
##SYMBOL=    X,             R,               I
##VAR_TYPE=  INDEPENDENT,   DEPENDENT,       DEPENDENT
##VAR_FORM=  AFFN,          ASDF,            ASDF
##VAR_DIM=   8192,          8192,            8192
##UNITS=     SECONDS,       ARBITRARY UNITS, ARBITRARY UNITS
##FACTOR=    0.0002768,     1,               1
##FIRST=     0,             0,               0
##LAST=      2.2672688,     0,               0
##MIN=       0,             -126367,         0
##MAX=       2.2672688,     143332,          0
$$ Real data points
##PAGE= N=1
##DATA TABLE= (X++(R..R)), XYDATA
0 0 0 0 0 0 0 0 0 0 0 0 0 0 0 0 0 0 0 0 0 0 8 -8 8 -8 8 -8 14 -16 16 -19 24 -24 30 -32 39 -42 48 -54 61 -68 75
41 75 -84 93 -103 113 -127 141 -153 169 -187 206 -226 251 -277 304 -335 373 -413 460 -514 580 -657
62 -657 752 -874 1030 -1246 1557 -2052 2972 -9170 61467 41358 -79849 -126367 -82607 7831
76 7831 10817 -62637 -95778 -36270 34218 8705 -71279 -66365 -5999 33953 23457 -30634 -36440
89 -36440 26623 54410 29256 -9428 -11644 32726 40665 1698 -19577 -20055 4411 20800 -5478
102 -5478 -17455 4198 20423 12980 -18616 -21507 12396 26327 20628 -6270 -30408 8477 49465
115 49465 35933 15037 5588 19120 45355 35480 5492 -9916 5373 37242 23488 -14405
127 -14405 -17569 -3289 19704 24253 -12684 -26686 -4940 9955 6854 -20507 -30778 -2740 14075
140 14075 14276 2857 -13752 1953 23851 21336 14667 4130 4326 15305 12348 11730 9094 2339
154 2339 14995 14706 -1121 -834 -5025 -8119 -2783 -12159 -19528 -18853 -17306 -11043 -16414 -18374 -7073
169 -7073 -9453 -9485 -6788 -15226 -7387 779 -7297 -7172 -4900 1255 9757 1800 -1047 3175 3579 11541
185 11541 5700 -8771 -4145 1266 5377 7461 -3720 -4326 3610 7946 12765 119 -10474 296
199 296 3819 2926 -1439 -14596 -7457 10171 12312 3638 -10689 -6755 14342 16600 4875 -10299
213 -10299 -14567 8278 16948 -1835 -10654 -4158 12464 17745 -4528 -17455 -7184 7095 9131
226 9131 -14336 -29510 -11369 2833 -261 -12884 -21451 -3938 11310 236 -14692 -18876 -2778
239 -2778 11815 -2522 -14775 -7567 4624 14112 3354 -11255 1235 17887 17778 89 -18326
252 -18326 -7003 12545 11162 -862 -13642 -6392 15080 10930 -6039 -9001 702 14626 7898
265 7898 -13588 -16434 -4013 10585 9717 -9844 -12223 4368 12340 8539 -6576 -11939 5000 14081
279 14081 5314 -9221 -14295 2548 13868 4296 -3506 -4574 3419 10271 -3234 -14639 -8087 1963
293 1963 5296 -8061 -20387 -10601 1959 5896 -302 -11162 -3512 9279 4830 -3505 -6751 1187
307 1187 13960 9555 -1084 -2529 3910 15620 12056 -2165 -1117 5616 8470 3726 -9975 -10156
321 -10156 2740 7771 3345 -7764 -9622 2697 5766 667 -3335 -5649 1713 4757 -4354 -7141
335 -7141 -2939 4570 8861 703 -3938 -180 3012 6413 1718 -4245 1171 3957 1484 -217 -2854
350 -2854 1607 5956 2668 1212 -1179 -1224 1969 -2351 -3664 176 -1144 -874 -1789 -3884 375 1270
366 1270 182 1171 -1095 615 865 -3609 30 3298 1712 2632 -303 115 4690 2252 -229 -1020
382 -1020 -1080 2520 -1524 -6329 -2589 -441 1789 1398 -4156 -1090 4187 3252 1012 -2710 659 7487
398 7487 4188 250 -22 2676 10324 8201 -369 636 4871 7788 4555 -4023 -2348 4564 6075
413 6075 3699 -3732 -2468 8775 8875 1724 -3593 -3230 5784 6639 -3740 -8512 -5260 3862 5521
428 5521 -6750 -10650 -2615 3720 3506 -8108 -14443 -4213 3749 847 -8825 -13334 -1232 7622
442 7622 1106 -7497 -9983 -209 9233 -595 -12872 -11425 -1724 6011 -2071 -12961 -8093 1746 6183
457 6183 -885 -12719 -7171 4937 4332 -4444 -12924 -8174 5555 5427 -3809 -8493 -2998 8866 6751
472 6751 -5834 -7014 74 7932 6730 -5767 -6925 4491 11064 8189 -1771 -2565 9807 12454
486 12454 4265 -4354 -5509 6834 11528 -249 -7863 -5132 4886 9253 -1152 -7428 -1983 4328
500 4328 6072 -3718 -10595 -524 7949 6695 -497 -6190 2263 12077 8427 499 -4250 1204 9545
515 9545 3015 -6008 -6323 -2059 4913 1813 -7583 -6663 -1078 2034 -552 -8519 -6434 1642 2017 -1078
531 -1078 -6356 -4841 6183 7991 2289 -1285 -1279 5212 6485 7 -1314 -65 2731 4375 -2424 -3716
547 -3716 2013 3238 2750 -1674 -5051 -106 1190 -1304 -3313 -5425 -697 2598 -1448 -1194 -794 -141
563 -141 3733 2036 1107 3176 1705 2498 3478 3375 6899 5418 3685 6070 4397 4277 4428 1144 2835
580 2835 3149 -852 -1934 -3253 -644 2718 -2297 -4928 -3462 -2235 1309 -2124 -7250 -3941 -491
595 -491 1185 -830 -5488 -1852 2811 1739 68 -4038 -2960 2938 -498 -5901 -6453 -4310 1536 -440
611 -440 -7872 -7461 -3245 1743 440 -8264 -7599 -376 1445 -534 -6491 -6185 4004 6207 623 -4538
627 -4538 -3676 6550 9022 -1061 -6104 -3050 5911 9534 -1500 -7421 -170 8333 9701 -950
641 -950 -8172 547 7885 5762 -3281 -10244 -1497 8231 3151 -5680 -8637 -1033 8635 2805 -6974
656 -6974 -7597 -455 7735 2972 -7047 -4290 4123 8523 5333 -4055 -2067 7511 8570 2731 -5421
671 -5421 -4534 5793 6281 -1647 -6563 -5018 4557 6305 -3511 -6874 -2341 4377 4652 -5674 -8199
686 -8199 265 6046 4889 -3978 -7792 3090 9775 4579 -3782 -7105 2085 9180 2044 -6138 -6632
701 -6632 1750 9108 1471 -6680 -3373 3302 7258 677 -8495 -3872 4208 5131 -1121 -8727 -4291
716 -4291 5300 5110 -248 -5608 -4109 4424 4044 -1716 -3427 -1498 3836 3830 -2070 -1236 2308 4804 4607
733 4607 -1617 -2890 2442 3281 1553 -2720 -5188 -189 1829 -511 -2791 -5036 -1304 1756 -1930
748 -1930 -2773 -2155 -1089 1701 -1027 -2771 678 2545 3781 1347 -2294 850 3502 3239 2024 -2372
764 -2372 -1792 2094 1393 804 -307 -1162 1902 1606 383 1194 -29 1330 2565 317 1335 1503 1084
781 1084 3404 2085 693 1273 858 3140 3207 -899 -949 -389 1568 4354 334 -2456 -453 1582 3769
798 3769 944 -3530 -1347 784 703 -1431 -5596 -2876 1258 -1258 -4054 -6035 -4048 1337 -962 -5907
814 -5907 -6401 -3589 1870 729 -5359 -4667 -652 2881 2547 -3558 -3786 1651 2870 525 -4255 -4492
830 -4492 2153 2775 -1694 -4698 -4417 2309 4364 -2269 -5499 -3062 2278 4884 -1545 -5279 -800 3993
846 3993 5253 -290 -4573 1591 6195 3968 -1105 -4690 1018 6707 2653 -2735 -4098 1189 7356
861 7356 3001 -3788 -2715 2007 6273 2500 -5365 -3391 2805 4638 920 -5719 -3371 4230 4287 -332
877 -332 -5354 -3647 4132 4256 -2081 -4941 -2318 4409 4959 -2039 -3919 -7 4631 4563 -2922 -5573
893 -5573 55 3025 1418 -4292 -7165 -1073 2583 -349 -4510 -6318 -867 3643 -533 -4228 -3784
908 -3784 512 4871 918 -3292 -487 3562 5862 2209 -2652 556 4706 4628 1523 -2950 -619 4681
924 4681 3343 459 -1339 256 4872 3656 -347 -72 1869 4808 3903 -993 155 3611 4677 3705
940 3705 -410 -150 4094 4073 2102 -602 -1065 3191 3140 183 -491 -543 1978 2671 -1225 -1653 159 928
958 928 769 -2750 -3683 -962 -798 -1186 -2704 -4434 -1900 -1190 -2440 -2130 -2834 -1934 -683 -2038 -1334 -563
976 -563 -1065 195 -490 -688 997 -579 -959 -553 -1267 -341 -1372 -2680 -978 -1252 -2083 -2310 -3560 -926
994 -926 714 -1861 -2681 -2763 -727 2214 21 -2155 -1057 621 2941 1014 -2388 -268 2135 2193 533
1011 533 -3293 -1326 2706 1822 -384 -2715 -1350 3225 2324 -1311 -2280 -1195 2826 3032 -1722 -2502
1027 -2502 -449 2179 2938 -1368 -2476 842 2355 1956 -1623 -3028 1621 3216 1190 -1166 -2441
1042 -2441 1634 4216 962 -1296 -1396 994 3367 -688 -3943 -2085 123 1404 -1880 -5814 -2616
1057 -2616 825 601 -1954 -5010 -1707 3015 1279 -1775 -3085 -65 5281 3451 -1227 -1313 1619 5661
1073 5661 3788 -2100 -1844 1935 4071 2158 -3535 -3221 2467 3574 978 -3024 -3123 2651 3941 119
1089 119 -2519 -2240 2777 4518 -450 -2699 -759 2653 4424 -383 -3417 -102 2761 2852 -1022 -3987
1105 -3987 14 3014 1527 -1291 -3192 139 3601 898 -2113 -2537 -174 3077 173 -3394 -2224
1120 -2224 -52 1960 115 -3623 -1643 1387 1702 362 -2509 -1177 2823 2340 693 -726 -348 3288
1136 3288 3042 302 -25 12 1870 2330 -1079 -1409 -360 212 899 -1471 -2268 -349 -589 -277 -696 -1973
1154 -1973 -105 483 -442 150 -812 -150 1289 371 674 462 -601 854 470 -44 788 -379 -310 355
1172 355 -537 59 -92 -662 883 -129 -743 -142 -1061 36 390 -1340 -795 -812 -806 56 -1564 -1728 -200
1191 -200 -254 147 -752 -1904 264 1164 691 651 -344 1144 2710 500 -191 -228 783 2482 21 -2341
1209 -2341 -1739 -790 959 -389 -3427 -2402 -334 391 -473 -3226 -2030 1639 1709 605 -1379 -804 3350
1226 3350 3390 852 224 771 3599 3592 -383 -1284 486 2562 2819 -1445 -3011 -83 1395 1091 -1830
1243 -1830 -3375 -34 1428 -718 -2614 -3212 59 2343 -841 -3043 -2535 214 2657 -483 -3599
1258 -3599 -1794 805 2183 -510 -4158 -1892 1646 1865 -452 -3825 -2135 1961 1116 -1633 -3527
1273 -3527 -2263 1715 936 -2861 -3657 -1908 1914 2255 -2268 -2882 -172 2409 3215 -243 -1326 2237
1289 2237 3901 3428 1016 -349 3031 4576 2400 384 -476 1629 3343 187 -1716 -1098 552 2072
1305 2072 -641 -2632 -702 1181 1680 45 -1834 665 2740 1472 144 -705 1413 3744 1468
1320 1468 -443 -497 967 3071 1153 -1700 -895 546 1653 698 -2115 -1321 1023 1309 382 -1747 -1452
1337 -1452 1167 1128 -18 -1262 -1546 676 1066 -666 -1223 -1574 -351 762 -879 -1465 -1111 -866 415
1354 415 -543 -1596 -844 -610 -128 197 -1363 -950 -458 -408 239 -846 -1098 -139 -360 174 -103 -1221 -137
1373 -137 368 463 819 -252 -196 1136 1035 1110 620 81 1479 1490 275 115 -103 927 1452 -470 -849
1392 -849 -557 264 1154 -384 -1314 73 417 719 -142 -1359 216 1075 280 -539 -1436 -341 839 -762
1410 -762 -1682 -1853 -983 212 -1216 -2885 -2063 -907 270 -220 -2187 -1430 108 692 714 -729 -427 1404
1428 1404 1013 211 -704 -753 1199 1346 -499 -1381 -1417 376 1042 -863 -1720 -1027 302 1076 -632 -2062
1446 -2062 -348 1121 1556 225 -1520 385 2087 1442 97 -1097 1002 2937 1137 -896 -991 909
1462 909 3309 1470 -1459 -826 1009 2426 1132 -1629 -683 1589 1784 -13 -2191 -949 1825 1435
1478 1435 -733 -1940 -851 1800 1207 -1212 -1536 5 2225 1850 -981 -1050 833 2088 1904 -306
1494 -306 -912 1058 1478 497 -980 -1482 466 1031 -754 -1844 -1960 -435 746 -867 -1652 -1287 -90
1511 -90 1037 -20 -1102 7 1110 1453 715 -633 478 1608 968 247 -774 -102 1140 162 -1048
1528 -1048 -1166 -611 770 -9 -1428 -1094 -523 229 290 -984 -627 240 196 166 -691 -468 513 383 -14 -224
1548 -224 -622 428 607 33 147 -201 291 932 278 74 237 26 873 371 -253 -143 -358 -17 40 -903
1568 -903 -835 -464 -683 -242 -917 -1146 -212 -287 -73 -178 -364 462 769 202 488 207 618 1085 252 393 562
1589 562 205 436 63 -229 411 -207 -60 31 -389 -136 -49 -290 413 54 -483 -61 -39 440 424 -492 70
1610 70 375 273 96 -923 -349 813 323 -300 -838 -419 1054 507 -882 -734 25 901 571 -1214 -1023
1629 -1023 13 483 117 -1588 -1647 -91 -9 -790 -1835 -1774 157 255 -1181 -1633 -1130 850 1447 -145
1647 -145 -411 285 1362 1702 451 -77 1073 1481 1047 34 -895 357 1000 132 -711 -1103 -222 586
1665 586 -398 -1178 -888 60 1020 89 -855 -174 674 1414 918 -292 450 1396 1334 672 -377 353 1747
1684 1747 1182 195 -451 -86 1364 935 -443 -633 -147 509 192 -1275 -1298 -295 -37 -229 -1681 -1663 -267
1703 -267 96 -325 -859 -1061 401 844 -21 -215 -70 1099 1780 743 188 426 856 1385 627 -405 27
1722 27 222 140 -327 -1401 -857 -386 -537 -646 -1459 -1161 -5 -45 -139 -390 -174 995 822 267 421 664
1742 664 1379 1412 502 418 747 793 870 -88 -257 365 -98 -492 -590 -873 -247 -206 -661 -335 -366 -130 202 -288
1764 -288 63 451 -48 325 39 95 557 231 89 300 178 436 138 -209 312 170 -106 -203 -502 -255 -126
1785 -126 -951 -888 -830 -929 -656 -1363 -1706 -1072 -935 -886 -1333 -1386 -345 -239 -489 -462 -355 448 940 135 79 373
1807 373 766 1334 335 -278 333 487 654 30 -962 -168 403 167 -317 -973 -405 609 261 -231 -583 -175
1827 -175 1014 853 -295 -156 283 1080 985 -443 -264 447 826 658 -679 -832 371 789 133 -466 -726
1846 -726 488 705 -87 -563 -451 649 1065 -303 -715 -189 428 955 -107 -760 95 568 531 -76 -764
1865 -764 296 963 548 64 -343 330 1355 734 -148 -83 425 1108 362 -770 -519 126 545 -89 -1329
1884 -1329 -1061 -34 0 -339 -1186 -1029 340 410 -282 -756 -514 876 947 -165 -449 -99 929 1211 -144
1903 -144 -473 187 606 709 -271 -818 21 593 596 -64 -852 178 852 371 -6 -503 148 765 74 -494
1923 -494 -480 -326 366 131 -859 -563 -172 226 238 -684 -396 238 222 190 -262 -342 501 341 26 -125 -419 288
1945 288 177 -544 -429 -450 -174 -106 -672 -710 -340 -278 83 -211 -409 106 216 85 375 43 381 498 251
1966 251 360 156 154 617 47 210 51 -337 92 252 -312 -156 -375 4 197 -266 -350 -192 -52 255 81
1987 81 -289 38 -22 129 16 -334 -189 76 -11 -4 -358 -236 250 88 -59 -123 -294 220 455 9 30 -130
2009 -130 199 373 -142 -328 -320 -56 191 -226 -773 -353 22 200 -53 -574 -115 469 350 306 -207 168 895
2030 895 577 77 57 -21 841 492 -417 -365 20 341 167 -691 -487 172 181 143 -543 -539 396 371 56 -201 -322
2053 -322 530 606 115 -293 -202 302 600 -141 -543 -126 201 459 -289 -604 -105 302 383 -3 -472 25 458
2074 458 286 8 -415 -180 472 212 -186 -399 -185 376 89 -630 -707 -90 136 191 -571 -472 177 270 245 -415
2096 -415 -368 396 459 98 5 -240 323 473 -193 -234 -165 257 459 -158 -385 50 270 420 13 -213 286 339
2118 339 384 274 20 301 521 131 73 -24 70 459 45 -109 -65 13 319 245 -106 -25 200 391 560 -47 -10
2141 -10 200 208 274 -90 -191 -12 -82 -224 -262 -591 -286 -105 -433 -457 -632 -288 105 -321 -225 -141 -101 226 14
2164 14 -158 -21 121 260 49 -214 -184 -5 -165 -61 -298 -328 -259 -174 -186 -218 -394 -70 127 -190 -49 -165
2186 -165 -46 287 104 -138 -25 -108 338 155 -167 -77 -118 205 191 -209 -104 127 414 438 -67 -181 311 389
2208 389 278 3 -139 287 416 16 -124 -138 -105 160 -103 -285 -134 43 209 -56 -76 85 70 250 156 21
2230 21 310 334 259 94 -87 -19 191 -24 -234 -365 -379 12 -259 -520 -351 -283 51 8 -458 -261 367 302 261
2253 261 -117 -28 424 326 149 -77 -113 363 260 -41 -185 -127 204 294 -228 -275 19 243 363 -154 -165 166
2275 166 345 362 -24 -233 101 338 -31 -129 -222 3 291 15 -188 -130 -67 430 143 -149 114 67 373 309
2297 309 -8 87 138 252 180 -88 -152 125 6 -98 -279 -372 -36 -34 -306 -287 -268 -9 177 -237 -259 7 179
2320 179 206 -3 -200 121 207 54 -109 -294 -12 85 -227 -262 -197 -118 86 -267 -100 -115 -17 -1 -14 -53 154 -69
2344 -69 130 15 -131 76 116 11 45 -120 -119 38 -29 -63 -73 -76 132 36 -190 222 66 159 280 79 58 -14 -7
2369 -7 172 -35 -136 -70 -139 -175 -56 -286 -152 -25 -74 47 -172 -155 138 45 210 109 17 291 259 143 173 -23
2393 -23 -91 280 -111 -139 -145 -97 26 -65 -259 -39 43 79 98 -153 85 74 169 145 -201 51 232 47 146 -209 -70
2418 -70 115 94 -221 -96 -135 131 114 -191 -54 62 113 196 -38 -128 199 151 129 -12 -361 179 55 -101 -225
2441 -225 -230 21 95 -169 -139 -250 -70 333 -84 -106 26 20 222 81 -124 59 187 235 153 -280 -80 143 -17
2464 -17 11 -319 -431 105 48 -201 -186 -259 114 298 43 -66 11 231 448 99 -158 -15 110 260 -231 -301
2486 -301 80 35 19 -67 -222 -11 259 -77 -49 -116 45 309 -63 -149 86 92 260 9 -323 -89 215 -27 1
2509 1 -329 -134 268 116 -114 -227 -78 213 197 -17 56 38 196 267 -268 -120 -57 -50 141 -252 -322 -200 -102 59
2533 59 -166 -455 -67 -24 -116 -23 -147 -50 226 52 94 -51 -82 253 3 -62 26 -126 93 -86 -256 -208 -209 -146
2557 -146 100 -283 -169 -36 -55 -9 36 -139 -8 185 74 132 -136 24 177 75 25 -113 -115 292 89 -145
2579 -145 -24 68 257 91 -124 35 49 108 193 -138 -71 229 21 -118 -282 -210 56 21 -65 -112 -360 -50 91
2602 91 -150 -24 61 82 353 114 -1 172 164 356 154 -58 88 80 -25 -1 -307 -163 -72 -137 -53 -286 -98 139
2626 139 -11 -195 -10 75 240 211 -164 56 195 233 304 -15 20 176 147 281 -167 -229 109 135 -70 -257 -444
2649 -444 113 269 -101 -145 -110 15 272 97 -160 100 48 277 154 -201 89 99 170 99 -91 -10 337 257 134
2672 134 -107 -89 346 292 -55 -24 -26 209 191 -314 -240 -308 -52 -57 -352 -320 -75 -91 -116 -179 -289 -11 132 61 -7
2697 -7 -204 155 309 117 59 -27 -54 262 22 -166 -109 -143 -31 -80 -395 -119 30 -148 -24 -375 -70 76 38
2720 38 -121 -39 -7 96 171 21 -43 -80 240 146 -138 -136 -23 165 130 -223 -143 44 -50 7 30 -342 -24 31 -37
2745 -37 83 -279 -101 114 -109 -145 -71 -95 326 89 -85 -24 -107 158 133 6 41 184 77 291 127 5 194
2768 194 32 214 63 -139 -44 -101 -201 -100 -266 -63 66 -276 -132 -118 -158 -67 13 -96 72 145 99 173 -51
2791 -51 132 150 -49 186 -100 -58 270 91 109 -116 -57 133 101 -119 -44 -68 109 175 -47 -55 30 -80 210 -2
2815 -2 -148 2 -37 82 50 -320 79 47 -68 -107 -122 -5 209 62 17 -62 20 302 82 87 -70 -67 7 53 -52
2840 -52 -60 -176 -134 158 -71 -136 -114 -124 -11 86 -162 96 109 114 132 -254 169 290 104 179 84 97 285 8 -81
2865 -81 -23 -75 31 35 -252 -7 -24 11 2 -226 -116 100 -1 2 -208 -77 164 89 36 14 -128 132 179 -16 -44
2890 -44 86 45 278 68 11 132 41 273 0 -222 -19 -13 -10 -62 -331 -228 38 -307 -191 -118 -280 -4 -104
2913 -104 -106 26 -166 41 197 -50 188 250 182 403 51 55 262 92 102 -154 -250 117 -181 -233 -86 -234 -163
2936 -163 -47 -308 -97 -124 -115 103 -27 -27 75 95 268 307 -61 127 307 216 241 20 -28 238 169 74 94 -299
2960 -299 28 116 -77 -128 -131 -2 116 -114 -9 -62 -43 97 -49 -174 36 16 65 -41 -131 127 210 40 17 -77
2984 -77 69 248 -131 -120 -28 -39 89 -82 -277 22 -69 -141 -173 -336 -79 18 -115 -100 -173 -81 158 37 103 101 -45
3009 -45 329 176 111 269 114 133 316 111 -9 77 -38 235 52 -63 22 -175 72 68 -316 -24 168 -4
3031 -4 3 -160 123 282 120 56 57 -42 152 106 -135 -121 -102 -75 21 -191 -59 33 -33 -48 -99 -42 135 -16 79 96 -5
3058 -5 261 93 -61 153 73 33 134 -40 -74 -9 -148 107 -126 -215 135 -173 -61 -179 -426 7 -72 -114 -20
3081 -20 -167 -190 50 -104 -100 -124 -206 138 81 -93 -94 77 191 100 -120 -84 130 -55 51 -70 -164 38 -133 -8
3105 -8 -15 -142 49 13 -77 236 16 -99 114 -43 142 103 -104 211 216 -22 134 -19 145 304 -82 -168 -2
3128 -2 -163 85 -141 -298 -201 -158 -64 -231 -400 -129 131 -176 -9 -167 1 337 -31 59 67 176 424 246 -58
3151 -58 148 261 126 276 -189 84 187 29 -67 -130 -183 111 -90 -164 -63 -193 32 36 -193 -80 -118 27 78
3174 78 -180 -55 70 -213 150 -34 -96 98 175 196 68 4 188 295 112 123 -90 1 181 -79 -59 -137 -40
3197 -40 -26 -55 -287 -108 -169 -15 26 -293 -48 253 105 124 39 8 371 130 -2 45 -63 250 115 -45 58
3220 58 -35 -3 46 -211 -205 -201 -173 26 -149 -246 77 -67 29 1 -175 -150 139 30 102 7 -84 331 111 81 161 -25
3246 -25 198 206 -80 4 -26 -10 181 -37 -62 -31 -42 -105 -166 -95 64 -152 -13 -27 -241 -60 -91 -229 22 -81 -108
3271 -108 -93 -126 23 26 38 216 126 107 136 -77 46 134 -4 108 32 -140 -1 -180 -145 -83 -65 -61 -145 -191 -156 -120
3297 -120 -64 97 -84 -189 236 -14 41 75 -13 345 190 -65 75 67 70 210 -120 -57 122 93 47 -45 -49 -92 55
3322 55 -76 -164 -233 54 -10 -120 -70 -175 -124 74 -22 -207 -39 -28 178 81 -84 98 201 210 188 -8 150 168
3346 168 242 188 -81 -92 103 -123 -82 -127 -219 122 -2 -247 -181 -246 39 68 -316 -208 74 5 245 76 30 322
3370 322 231 220 92 -1 335 202 59 -12 -150 41 186 -206 -148 -62 -112 -33 -191 -378 -105 -114 -49 -11 -233 28
3394 28 136 50 101 -28 -95 225 249 166 95 115 342 331 -21 42 148 144 166 -112 -74 34 -68 -50 -142 -191 41 -141
3420 -141 -200 -235 -288 -53 -38 -308 -18 15 114 113 -85 68 348 168 115 137 4 146 210 -3 -81 -90 74 101 -175
3445 -175 -100 -162 -123 168 -210 -201 -128 -43 167 78 -46 47 91 57 216 116 71 206 112 118 -13 -53 127 -35 22 -26
3471 -26 -75 -82 -75 -57 21 -178 -178 22 -180 -37 -63 -173 -22 80 28 70 59 52 142 248 152 77 -40 89 175 39 62
3498 62 -43 8 306 -43 60 -28 -158 69 6 -144 -43 -200 -127 -76 -175 -194 -118 -100 -38 -105 -227 87 -46 8
3522 8 3 60 249 31 29 68 26 225 58 -61 -24 84 -34 -8 -47 -81 174 142 -64 68 43 144 168 -35 121
3547 121 40 43 141 -55 -35 188 -13 68 9 -73 199 54 -70 28 -53 84 103 -89 -17 -57 107 167 -130 -62 84
3572 84 -24 2 -87 -144 166 61 69 18 -180 59 222 -104 43 1 -43 137 62 -170 17 125 156 -4 -139 76
3596 76 -8 116 134 -120 24 156 -40 146 -203 -77 142 80 -79 -23 -182 52 97 -47 -86 46 -92 85
3618 85 -142 -180 110 -2 116 -71 -43 210 44 38 -42 -36 112 129 -79 99 103 19 130 -78 -18 49 -50 0 -92 -78
3644 -78 40 15 -108 4 -179 -53 30 -22 -45 -72 -27 75 108 -56 12 -106 -20 106 -67 -14 -19 -110 -19 24 -82
3669 -82 44 -79 14 -36 -64 76 -66 5 43 -99 78 30 -259 105 23 22 96 -66 -29 214 11 -67 -35 76 105
3694 105 -6 -163 15 19 62 -15 -159 -43 -37 -74 -117 -56 -137 63 -23 -89 16 -126 122 38 -72 32 101 46 22
3719 22 -20 108 101 127 59 6 58 101 -16 -110 2 -52 51 -19 -222 -26 66 -36 107 -158 -110 91 40 82 -44
3744 -44 37 84 106 64 -74 -9 157 163 -26 -109 50 -28 217 -151 -183 25 45 53 31 -84 190 43 20 104 -3 31
3770 31 191 106 -14 34 99 136 -37 -117 72 48 49 -42 -187 55 103 -97 31 -10 191 154 -12 56 12 -1 230
3795 230 -57 -113 13 -54 79 28 -65 -156 16 -73 76 -89 -156 -105 -24 19 0 -57 79 36 -129 43 -80 -5 240
3820 240 -90 -52 28 -13 168 -125 -98 128 19 1 15 -85 55 28 -132 11 -3 71 97 -123 -150 -40 -45 137
3844 137 -240 -143 62 31 12 -10 -158 95 157 57 33 -10 -42 142 -24 -4 139 57 135 -104 -103 74 -77 -23 -79
3869 -79 -167 -14 88 -114 -26 -23 -134 112 72 -91 67 -24 136 83 -50 6 -50 45 37 -268 15 81 -61 -38 -139
3894 -139 -160 151 154 -15 -118 -25 149 3 -135 -57 66 101 87 -97 -17 21 -62 138 20 -173 247 24 -32 119
3918 119 -54 51 67 -35 -13 -38 76 62 -142 -3 113 -25 18 -140 26 117 -4 3 26 -11 -55 44 -118 21
3942 21 52 -20 107 -44 -10 -8 -12 79 -79 -10 79 -66 -97 -34 -107 -47 0 -129 -81 -14 -35 117 -57 -133 -30 80 22
3969 22 46 -207 -144 192 -22 16 -15 28 123 -106 75 -62 -116 155 154 -140 29 46 11 92 -102 36 19 -54 135
3994 135 46 14 94 81 -99 -46 11 67 33 -127 29 11 -34 67 0 3 145 -22 145 26 -62 149 33 14 -44
4019 -44 -52 36 40 -103 -28 -158 42 81 -99 -230 81 28 28 -15 -24 80 -70 72 -32 -90 46 116 -94 25 -93
4044 -93 -43 2 -102 -126 83 -19 43 -77 -85 98 -41 -55 -110 -20 59 95 -53 -31 -62 79 66 -55 -166 81 96
4069 96 98 -170 -167 3 105 82 63 -109 82 224 132 39 -213 -10 147 -169 -26 23 72 53 -47 -95 -48 -22 -63
4094 -63 104 -57 -3 61 -39 61 -23 56 90 -94 -4 25 -116 64 -13 -41 -1 50 -104 -9 -42 -34 134 49 58 49 -170
4121 -170 49 23 -34 -20 -24 39 52 -63 9 -15 -26 -1 -93 -43 44 27 132 -77 -29 54 78 110 14 55 134 144 -50 -101
4149 -101 -12 79 47 -149 -111 35 100 86 -57 -29 17 17 -47 -62 -97 -40 186 -128 -64 -12 120 214 -154 -82 38 92
4175 92 117 1 -108 15 127 124 -101 -73 -92 85 6 -189 -77 57 126 -20 -7 4 110 35 41 -154 3 181
4199 181 67 -74 -45 -68 232 9 -180 -54 37 53 26 -106 120 -101 -47 -60 -178 -2 123 8 27 46 -74
4222 -74 144 -34 -40 -19 68 206 86 26 -46 16 64 111 -44 20 115 64 156 17 -119 -1 71 -189 -63 -38 30 -61
4248 -61 -189 -25 -40 86 82 -174 -131 25 -79 79 -92 -18 144 102 17 -90 -106 123 183 -41 -94 -171 2 119
4272 119 19 -192 -31 31 100 -68 -181 -15 144 -48 -18 -130 104 182 -20 -3 -7 64 116 -3 -36 133 36 50
4296 50 -20 -233 -18 129 -15 -85 -104 -63 59 17 -102 -154 -213 51 6 -248 -121 -29 131 129 -166 -46 -27 105
4320 105 48 -76 61 203 33 150 -124 -28 90 28 -30 -127 -74 67 82 -79 -59 -82 -34 100 -27 -123 54 1
4344 1 -60 133 -42 108 87 92 63 67 50 148 -35 -56 10 -71 114 -31 -113 -135 27 33 59 -145 0 127 80 46 45 98
4372 98 103 -47 -22 93 93 61 -76 -58 114 176 70 -30 -157 95 43 -37 -77 -70 -47 134 25 -83 -44 -5 1 35 -159
4399 -159 -156 69 135 -14 -209 -103 -8 60 36 -42 -128 59 -44 -28 -18 67 99 153 -89 13 -74 44 28 -101 -1
4424 -1 0 -45 -134 -162 -122 -103 -117 52 -115 -42 64 214 -4 25 76 87 56 -47 -80 110 142 73 -29 -54 -12 9 -58
4451 -58 -108 -11 140 107 -36 -141 -43 33 276 37 -106 38 -16 118 -9 -207 -8 180 -24 30 -35 -15 201
4474 201 59 47 -4 -2 35 146 -95 -152 -74 68 -29 3 17 51 88 19 -91 -128 -7 43 -100 -42 -144 58 115 -40
4500 -40 -87 -50 217 210 -5 103 -22 82 152 -33 -82 -7 115 0 -38 -128 37 1 -24 -117 -134 -18 53 -35 -207
4525 -207 65 194 160 -62 -113 -60 116 -17 6 -77 9 129 -112 -39 -188 -35 170 -46 67 23 13 236 43
4548 43 -155 71 -20 134 -55 -47 -31 34 67 -78 -131 -15 58 19 -50 25 -101 82 69 -75 23 133 210 116 -66
4573 -66 -18 67 55 -24 -115 -136 99 12 -117 -89 -93 141 -120 -121 -91 -19 -39 88 -14 73 39 0 -66 -16 23 118 38 20
4601 20 48 29 52 42 -12 34 -29 -84 50 -119 -37 94 58 9 -77 -90 132 24 30 -60 -102 -86 159 56 0 48 46 62
4629 62 -8 -9 117 126 -5 38 -146 103 174 8 -145 -103 53 92 -16 -115 -55 -104 48 -129 -188 -49 -23 69 57 -66
4655 -66 79 61 171 32 -147 8 212 64 -132 -38 14 132 46 -200 9 9 27 33 -196 53 173 81 9 -175
4679 -175 -40 144 4 -63 -31 43 190 109 -120 -67 -88 27 106 -38 52 4 32 -22 -78 -98 33 75 -12 -10 -22 147
4705 147 78 40 -31 52 185 272 -1 -188 46 23 155 -43 -244 23 38 142 23 -210 60 144 -45 -6 -61
4728 -61 -56 117 -69 -100 -27 -152 14 -131 -126 57 -57 -9 -13 -113 58 110 -143 75 -45 -89 48 74 -11 69 14
4753 14 130 62 50 -36 85 -29 27 -85 -59 57 -28 57 -22 -40 125 -89 80 35 -27 47 4 1 12 -14 29 181
4779 181 11 52 75 -68 -90 -120 -96 -63 -95 -24 -62 -69 -52 44 -77 -12 29 -31 74 106 115 120 -44 -131 68 -21 77 18
4807 18 -26 92 49 38 16 -132 81 34 0 4 -11 -60 12 7 -42 28 -94 159 200 -11 -48 -12 5 60 -121 -62 99
4834 99 -17 -2 -53 -98 -30 -25 45 -49 -158 88 182 -81 -116 -202 14 -31 54 -26 -107 -55 141 6 -151 -20 99 61
4860 61 95 -83 -16 191 51 8 8 5 190 69 -40 -117 -10 1 -20 -149 -23 9 -25 126 -207 -202 125 178 105 -19
4886 -19 -147 133 48 -58 -75 -112 127 52 3 -38 65 -69 -12 56 -123 -63 3 101 37 -10 4 15 142 48 -71 -98
4912 -98 60 -86 -90 -52 -123 127 -44 -115 -22 9 131 -42 -82 10 16 169 -113 -31 -8 80 -65 3 -39 42 -12 28 -231
4939 -231 -37 -58 -138 76 -229 -87 -61 -62 20 -89 6 62 -50 24 -79 -38 42 19 -43 187 -94 17 -46 29 -79
4964 -79 -106 -89 24 -4 -43 97 -152 -80 -66 -140 64 120 -48 54 -35 -144 24 -120 -21 19 82 -57 -47 -43 19 30
4990 30 -35 58 65 55 115 -76 -35 145 15 82 -122 -3 -4 66 8 36 -15 75 -73 -76 -7 -103 141 101 -30 21 -29 47
5018 47 135 37 92 50 -2 39 -9 -128 131 119 -33 -107 -45 -1 -57 -59 -75 -133 -42 71 -47 -197 50 139 106 8 -119
5045 -119 82 94 31 27 45 -24 96 84 32 21 -28 57 -42 5 -64 -77 -72 24 22 -10 -45 1 -10 -74 -33 140 99 -27 -47
5074 -47 -22 225 38 -76 -109 -77 167 164 -69 -5 -54 92 135 -105 -24 138 40 -36 -143 -96 -16 66 -71 -65 -147 85
5100 85 64 4 -76 1 94 272 9 42 39 160 114 60 21 66 68 -66 -52 -138 -51 125 -82 -71 -21 -107 57 -64 -1
5127 -1 -33 99 -50 70 -80 -59 79 47 -29 -4 -50 57 89 61 40 -49 110 -19 -88 -87 -60 -9 29 -99 -22 110
5153 110 4 138 -75 -40 113 -26 -52 84 74 44 -50 -59 -51 -35 11 -207 53 60 51 45 1 -151 -65 15 -18 -94 19
5180 19 22 59 119 -103 36 -59 -9 8 -128 -139 -173 -66 -128 -59 -38 110 -2 -4 50 -73 54 37 26 30 18 152 -89
5207 -89 -19 -101 22 -24 42 -118 -97 2 96 30 28 27 113 66 15 -146 194 -261 -208 486 -408 -494 714 6 -47 -52 100
5234 100 362 -121 -132 -179 46 283 123 -90 14 34 144 57 -17 88 21 125 57 -229 -49 62 23 -136 -139
5257 -139 -74 101 112 -86 -127 88 142 72 -67 -69 -12 21 91 -95 -119 -29 65 114 -160 -64 117 110 -41 -102 -78 134
5283 134 32 -32 -6 57 65 158 70 -89 -12 89 157 -118 -322 112 129 191 -56 -153 73 10 25 27 -84 -30 152 -17
5309 -17 -23 25 -90 157 33 -19 2 -87 44 -45 -205 -45 127 -273 -62 -154 -31 151 43 -36 -51 -101 211 42
5333 42 -4 -17 79 150 126 -30 -90 -31 -21 -116 -96 -154 90 67 -44 64 -15 184 38 79 19 80 40 30 -51 -12 -99
5360 -99 -53 25 6 -62 55 -67 -129 -8 -51 36 -31 -71 -59 -77 19 156 43 -65 -20 38 -10 97 -83 157 1
5385 1 112 0 -119 146 46 -138 -68 11 -23 130 -60 -35 78 31 -70 -63 1 68 -73 -66 -111 -129 2 -58 -170
5410 -170 89 51 9 -32 -67 -38 -8 154 28 -43 -57 -25 62 -4 -22 2 97 84 -51 -71 -31 86 50 -71 -49 -67 45
5437 45 21 -75 31 -27 181 91 -82 -70 39 56 67 -22 10 -22 75 9 -171 -40 -61 -65 84 -196 41 -20 -9 57
5463 57 -122 -15 47 77 -91 -31 -44 196 55 -85 97 78 71 0 -31 -84 1 -19 5 -26 -80 212 -116 28 -144
5488 -144 -57 46 24 51 -91 -80 71 156 -24 -53 -79 28 44 64 -261 4 23 2 122 -38 237 227 -9 -48
5512 -48 -77 17 65 47 -127 -12 -36 72 -38 -167 3 22 97 55 -88 -46 46 45 -34 -99 30 109 105 59 49 20 119
5539 119 -5 -135 -106 61 97 58 -132 31 10 -39 79 92 -90 93 14 -63 -102 -23 69 87 -38 41 44 44 65 -90
5565 -90 -89 -41 29 7 -20 -176 -9 41 10 32 -15 81 65 -35 68 -10 -50 36 -66 -43 83 -137 -20 -39 -116 -7
5591 -7 40 -40 72 -41 -67 87 -86 -76 -82 -3 40 -73 -13 74 28 31 -101 -17 87 70 -43 -89 -11 49 97 -75 -45
5618 -45 -4 9 112 29 -104 34 93 -16 11 -108 -22 81 23 -59 -88 -80 49 27 -71 6 33 67 -88 -97 111 10
5644 10 -13 -133 -171 -50 179 21 -38 -23 -93 149 -1 -33 -82 42 26 11 -59 5 6 18 83 -56 -85 42 -83 122
5670 122 -40 17 120 35 -16 -46 32 50 32 -79 -78 47 27 -4 -53 -16 58 -31 41 -51 -25 55 16 119 17 -129 84
5697 84 190 -14 -72 28 -56 201 -41 -109 2 -86 140 120 20 12 44 24 -10 -144 -48 226 166 40 -148 -32
5721 -32 81 61 -104 1 32 1 101 -103 -11 28 111 32 -162 -36 22 -11 -21 -8 -47 61 172 52 -107 -10 29
5746 29 -41 100 -112 22 1 32 13 -24 60 58 63 22 37 113 11 -4 -11 -168 25 69 -8 -116 -71 -34 -66 62 -167
5773 -167 20 -23 -16 89 38 -40 82 146 52 -46 -11 148 5 40 -60 33 -23 -101 -85 43 -2 -22 -7 17 170 40
5799 40 -109 -2 19 60 -61 -113 6 18 92 61 -142 -125 128 95 80 111 5 24 -51 -32 -51 87 66 181 -59
5824 -59 -39 18 -135 47 -20 -37 -29 43 1 -19 -77 -16 -41 34 -81 -6 -116 8 52 21 -40 73 0 118 -45 -33 4
5851 4 181 79 -78 -20 -18 -1 30 -59 -25 66 124 15 -113 -110 -2 140 -106 -125 -32 44 40 -74 95 -36 157 44
5877 44 -99 -108 78 46 -137 -138 -74 19 176 -92 -113 -67 1 63 -72 -197 -37 34 40 -50 -298 -9 2 -88 -79 -74 -148 -29
5905 -29 13 -37 -38 86 -23 -8 -174 -21 80 112 94 -127 78 58 -77 26 -39 -127 -82 51 -65 -92 -111 25 27
5930 27 -91 4 -111 174 9 95 -39 -45 -38 145 58 -80 112 11 20 36 -25 -18 5 -91 -1 27 -127 46 -4 -82 53
5957 53 -65 -135 -130 -19 29 2 16 22 31 -51 126 139 64 -96 -3 61 54 19 23 -44 158 22 74 -30 -15 89 26 -69 -117
5986 -117 122 -44 -36 -176 -105 95 -2 -138 46 -25 94 57 -14 54 -32 53 96 -30 7 117 94 3 -85 -37 -7 -46
6012 -46 -123 -18 -59 27 -77 -70 15 -70 -71 -24 -85 -38 121 79 -47 -30 34 76 -90 -24 15 32 15 12 -142 -97 42 22
6040 22 83 -130 34 32 -57 -80 30 -78 12 59 -41 79 -33 35 30 -39 -45 27 14 11 -51 -101 78 96 17 -12 -90 13
6068 13 17 -22 11 -12 -82 -32 -108 -83 -38 20 46 -50 6 87 76 -12 25 -32 -83 130 -75 46 -106 15 118 50 -83
6095 -83 -91 82 44 19 68 102 89 43 -110 -36 -61 13 38 14 -52 -72 179 53 -16 35 112 79 112 56 -118 -29 -42 -34 -129
6124 -129 60 -75 -10 61 -7 -237 -61 94 83 -61 -47 78 68 70 -58 -22 129 34 -4 37 73 56 11 -62 54
6149 54 48 35 73 -139 -74 53 -1 -125 31 -89 -9 77 -13 56 -92 52 79 27 -49 -35 104 -88 -18 -88 -90 45
6175 45 65 38 -68 -15 127 71 44 109 -82 -72 50 -58 -52 -69 21 102 4 2 0 -76 34 -53 -12 -40 4 -44 67 63 -49
6204 -49 7 2 -19 12 76 -5 44 -86 21 15 -60 30 6 31 14 63 32 28 -11 74 18 37 56 154 16 5 -75 102 77 29
6234 29 -25 -75 86 -105 18 -118 27 6 -30 41 22 122 136 18 38 17 10 27 123 -59 21 103 131 10 -112 -96
6260 -96 86 52 -79 14 1 76 70 -72 -9 -3 -16 -26 -20 -54 86 17 9 -51 -51 77 55 -51 -46 -5 5 38 -12 -108 42 43
6290 43 -56 77 -133 89 108 -2 -46 -123 -2 108 -14 -28 -52 18 -27 100 -117 99 -99 -52 18 41 -168 11
6314 11 105 90 -10 -105 66 65 -71 -169 -104 66 -21 -68 -30 -34 1 29 -41 -51 42 -28 57 52 -96 34 202 163 -5 -77
6342 -77 -27 99 -74 -57 -6 -123 117 65 -153 -171 -63 29 40 0 84 -15 4 81 -38 -101 82 9 76 -29 70 -15
6368 -15 -74 25 -81 40 -58 -57 -92 -2 18 -70 -57 -29 -91 -21 32 -2 2 6 95 -34 -50 29 27 62 -41 120 -68 -20 -39
6397 -39 38 -2 -93 119 -39 -41 26 -56 100 42 -62 12 -89 -15 -65 -100 -46 53 -22 -24 -28 -96 -39 63 -30 -57 -126 118
6425 118 -35 -50 6 -2 123 53 -94 -49 69 72 43 -53 -38 7 49 -92 -84 75 14 20 -74 38 -62 31 28 -26 -45 -8
6453 -8 -6 117 -36 54 81 51 -57 -81 -28 39 3 -97 -27 -49 -39 70 -49 16 14 -76 -80 35 43 68 52 116 -68 -75 -77 56
6483 56 -63 -6 -65 -2 -21 11 34 -78 34 -86 -41 -84 -16 -30 133 -101 66 -48 71 26 -16 -26 -103 118 -19
6508 -19 11 -95 -94 74 71 12 -97 -53 33 77 -11 30 48 10 88 20 54 7 17 -85 -24 -87 -63 178 24 -84 36
6535 36 5 45 -84 -71 -146 59 -139 126 75 -39 -28 -47 -31 -38 26 -90 117 -141 58 -90 121 34 -27 -42 -8
6560 -8 6 -48 19 129 107 -81 70 -12 -76 75 6 -35 41 -27 -4 33 -130 11 77 -83 -134 11 -1 -11 -71 -76 -125
6587 -125 -10 16 1 54 86 -62 -3 -7 -78 21 -82 -52 -87 -13 53 11 -7 -84 89 83 57 51 -92 116 60 -31 68 49
6615 49 86 -52 -83 61 -101 -24 -102 84 -15 97 -97 7 -18 -23 80 -32 12 5 38 1 132 7 42 -54 -108 99
6641 99 -18 -43 -97 -26 21 -81 -49 -23 4 159 33 20 -8 -56 24 -4 59 -49 62 65 52 -50 -109 56 -67 -40
6667 -40 -103 31 -37 106 2 -79 20 29 86 105 52 -1 85 -17 -32 -67 -38 41 -190 -7 -78 -43 42 35 0 60 -59 -115
6695 -115 34 187 -7 2 1 44 28 14 -94 -31 18 -93 30 -87 8 167 -18 19 -58 -3 -104 -22 56 101 86 42
6721 42 -20 -67 19 31 48 -79 14 -136 49 70 -132 -47 94 -94 35 -31 -12 47 -31 28 -35 -34 74 65 -35 18 -26
6748 -26 -6 -23 -19 -90 -49 98 -46 -63 -74 68 92 49 -4 -83 -1 85 37 81 -52 -93 -8 -16 -60 -1 -125 -31 -57 17 -35
6777 -35 -119 32 105 -46 9 46 -4 -20 -20 114 70 15 3 59 33 -40 110 -39 -106 59 -72 56 41 30 24 66 104
6804 104 64 78 152 77 -46 56 -20 2 41 -123 -25 41 -2 -67 -23 -79 -66 10 24 -3 -47 -21 -27 -14 54 24 110 63 52
6833 52 106 9 -55 -32 -47 -33 200 -38 24 26 -21 -58 33 -20 16 -25 -90 117 -56 76 105 -133 59 -89 -80 -76 44
6860 44 64 -91 -66 -15 -3 -37 57 27 48 20 -20 46 -145 -51 18 -52 -8 84 -22 -10 27 66 -23 109 -14 36 -111
6887 -111 -110 -35 -145 -6 -60 -25 -89 35 -6 140 60 36 117 -79 63 -21 39 42 -15 -22 71 -16 3 -55 -48 -57 -32 -98 54
6916 54 -22 -65 93 62 -42 70 -38 90 -37 39 -28 -4 -95 -125 -3 21 104 -103 5 48 -43 -7 43 -80 84
6941 84 79 -21 3 -61 -48 92 -4 -92 -58 6 -40 -4 -91 -26 -99 -120 -125 -44 -35 -69 87 74 7 90 -46 88 77 -53 -48
6970 -48 44 -76 -18 49 -75 1 -109 26 -109 73 -63 57 -34 83 72 94 37 71 94 104 42 -36 58 -2 38 -18
6996 -18 126 121 14 -52 170 -34 -3 -91 -24 32 -23 -4 -74 60 -77 136 -10 38 27 -67 -10 -46 123 56 33 -78
7022 -78 -7 20 -104 -38 -24 -3 -27 47 30 62 -15 68 -38 91 25 -24 -32 27 -2 -74 1 -92 6 -14 -47 -24 -124 -52 52
7051 52 31 83 -12 98 123 21 135 -24 37 63 34 -22 -47 20 -5 -54 -105 -58 43 70 -81 -97 -89 28 98 -37 117
7078 117 -18 -180 127 46 -34 -108 23 -21 -20 29 -151 -88 -70 -75 -1 32 -41 -101 40 -46 -16 -16 57 34 26 -64 -3 -10 -121
7107 -121 37 33 -76 -65 -66 50 -10 56 8 -2 -46 50 11 -5 42 49 69 -30 50 -10 -20 8 -22 21 -107 -116 -18 51 -62
7136 -62 -69 -143 25 43 182 6 -172 -52 12 32 64 97 156 -7 37 -2 36 16 -91 -38 -60 -148 -38 78 2 -99
7162 -99 -179 13 -48 -6 -11 -17 -86 86 9 -68 12 1 112 66 19 -62 -31 49 23 -54 -45 -41 -74 -7 102 -49 41 -41 -56 10
7192 10 18 137 8 -17 -67 -2 -30 1 11 -60 36 -39 -12 44 78 -27 34 24 -2 -62 -39 83 38 35 -43 -2 -72 55 -107
7221 -107 -78 -18 -13 76 -8 -10 -5 -38 -5 50 -29 5 24 80 83 -80 -72 -28 -3 31 -43 -21 16 -23 115 -17 -42 -90 -40 32 -138
7252 -138 -67 -16 -21 -105 77 -33 43 1 -37 -92 -45 -29 -31 -33 -73 26 -13 -38 -26 -29 -8 16 3 40 101 -81 39 -1 45 32
7282 32 -51 139 -64 23 62 -2 -102 -30 51 -92 -11 23 -13 -112 -131 -73 -42 64 -29 35 76 70 74 75 -12 -45 35 -42 -129
7311 -129 29 10 111 -93 12 -45 18 -10 102 40 3 -77 35 -42 76 71 55 -57 11 -21 -70 -80 -24 -4 -55 30
7337 30 -52 44 -54 115 -54 -14 -81 29 22 -9 83 83 88 -62 35 -73 -35 36 -93 -47 -125 -36 -74 -56 -131 37 115 28
7365 28 -29 140 20 -12 -78 -15 64 30 53 22 12 -8 -7 51 14 34 -54 -73 -8 87 -16 -128 -73 -12 37 -102 -16 -65
7393 -65 50 -114 42 -38 50 42 -41 -55 -47 53 -92 -15 -159 -4 0 41 -5 -6 8 -22 70 -85 -49 3 117 84 -47
7420 -47 24 21 45 -39 -87 -120 73 72 -28 -70 -53 39 -108 -27 61 109 67 -26 54 -69 -83 -35 44 -25 -86 -3 2 60 89 -22
7450 -22 -54 -9 -56 -83 101 1 39 -23 -13 -56 49 -7 17 103 -10 -63 23 15 50 16 15 9 27 -4 -158 -50 -87 97
7478 97 -84 22 60 81 -35 49 -56 -83 -95 28 49 42 -39 -12 -47 -33 93 6 44 -22 -63 72 -21 -80 15 65 -91
7505 -91 33 -45 44 70 -98 29 12 1 16 26 75 -11 -13 74 9 53 -30 21 28 38 -14 -25 66 118 58 9 -15 -26 -26 7
7535 7 39 -57 28 -63 115 -15 2 19 -14 97 -15 -18 36 47 83 -38 -19 15 57 41 -10 -18 -60 11 -56 107 -110 -46
7563 -46 0 -25 91 51 27 26 59 49 -53 30 57 30 91 -54 -103 -52 3 -73 13 -89 -147 -6 -11 -19 -10 -11 88 11 27 10
7593 10 39 -9 -47 -39 -72 -117 78 20 62 43 -60 -2 -98 91 50 -27 -93 112 10 -6 20 50 -31 67 -70 -43 14 -85
7621 -85 -14 26 -68 -30 -3 -65 -37 -63 -91 12 63 34 -17 25 22 73 32 -12 -28 -80 -63 22 135 23 -21 1 -76 -44 -151
7650 -151 -102 -70 21 -36 -45 -28 7 6 77 10 23 49 15 -162 0 -47 18 -7 91 79 -62 -93 -32 -140 -93 80 92 -92
7678 -92 163 210 -14 -10 -24 53 44 64 52 134 75 79 -31 -54 54 34 5 -42 63 -23 19 73 -33 -25 107 2 -87 -16
7706 -16 -22 60 22 30 71 -38 -55 -36 38 -24 51 66 -7 55 19 69 -62 58 151 96 28 -20 38 20 -1 68 -29 -42 -13 -36
7736 -36 -110 33 -20 6 4 4 -25 109 30 -40 -5 28 -10 31 78 72 -27 63 28 33 -74 -56 118 7 -79 39 -85 -79 14
7765 14 -39 10 -19 78 91 51 16 25 152 99 1 39 65 64 -119 -11 2 2 7 -67 5 21 12 79 16 -42 100 -50 47 17
7795 17 -10 25 -29 -21 23 -20 -75 -4 -38 118 -99 -29 -35 -29 -28 -24 -108 54 -1 25 61 6 -51 22 -51 107 79 30 -21 -9 78
7826 78 -35 59 23 -60 -85 -12 8 -96 195 31 33 51 86 36 25 -22 3 -67 -16 19 63 71 -139 -27 -72 1 -12 68
7854 68 16 10 -37 4 -30 66 49 131 72 41 73 27 107 -15 26 -15 -56 -3 6 -48 -27 66 60 79 70 9 -48 -54 -35 -62 -1 -52
7886 -52 71 5 103 -98 26 48 -81 -65 0 24 -22 -56 -2 -11 55 -14 59 54 32 37 -18 22 11 42 -56 122 -119 25
7914 25 -8 10 53 -16 34 59 -62 41 77 -67 9 -44 -7 -38 46 -16 48 25 -32 122 -48 48 16 -111 29 -104
7940 -104 -42 -58 25 -9 22 -72 -1 -33 -35 42 -46 116 -43 60 7 73 35 5 58 -4 -35 -93 17 28 8 42 11 -129
7968 -129 -51 74 7 -5 -25 -72 0 -32 -32 -90 -11 -24 -109 -46 -62 -13 -10 -61 -79 -68 -155 -43 -68 28 -9 44 -3 105 28
7997 28 -38 -17 -20 49 -14 17 -59 27 -18 -33 42 -93 88 -160 -131 4 -20 139 -59 -1 1 76 25 30 19 93 95 -51 -38
8026 -38 -44 69 -86 133 88 -6 29 -23 91 -76 23 -103 19 27 104 13 5 -31 40 48 107 80 4 9 16 -68 5 25 78 -59
8056 -59 30 -51 -2 38 25 91 -68 30 116 -36 82 7 -14 37 -103 167 -21 -66 -45 -81 -52 23 -94 22 -27 -2
8082 -2 -48 14 13 -43 -26 103 26 1 12 -34 23 -11 16 17 53 -22 -162 36 20 -13 58 45 15 -128 -6 88 -26 36 -10
8111 -10 0 93 -43 56 24 -3 98 53 5 30 1 6 77 -12 5 77 -31 12 71 -89 -44 -21 85 102 -10 -60 -60 -87
8139 -87 68 -39 7 -30 -82 -31 -84 -19 -51 -69 -29 -54 9 3 8 0 57 26 59 29 -96 116 -3 22 -7 46 27 8 -18
8168 -18 1 -13 -76 -104 -29 -1 82 -130 2 -32 -35 6 100 76 -66 44 10 -22 -12 -49 89 79 34
8191C4
$$ Imaginary data points
##PAGE= N=2
##DATA TABLE= (X++(I..I)), XYDATA
0 0 0 0 0 0 0 0 0 0 0 0 0 0 0 8 -8 8 -8 8 -16 16 -16 24 -24 32 -40 41 -48 56 -65 75 -88 98 -113 129 -145
35 -145 162 -181 203 -227 253 -284 315 -349 386 -428 470 -519 574 -632 696 -767 844 -932 1029
54 1029 -1136 1258 -1396 1557 -1743 1963 -2228 2553 -2965 3502 -4245 5330 -7082 10388 -18825
69 -18825 89140 143332 -22196 -30774 23581 93697 55842 -32968 -62955 5931 52657 13029
81 13029 -70960 -54021 14309 29562 -11576 -62150 -64977 1843 22492 -14786 -40117 -20802
93 -20802 29119 42142 -1394 -15474 718 19950 26341 -3963 -22995 1048 12630 -397
105 -397 -22833 -19870 15784 22178 -4110 -27968 -42690 -9995 25447 -2487 -31411 -24294 -2126
118 -2126 24626 18098 -7128 -5609 18012 42302 25624 -15039 -10281 16142 28603 25303 -7131
131 -7131 -17592 13621 25549 10152 -14917 -24742 1215 11519 -7001 -22169 -32520 -16312
143 -16312 8684 1421 -10029 -12322 -8877 5175 4541 -951 1898 -810 9620 16812 3476 7741
157 7741 16129 14131 19814 13394 2460 4437 3272 2204 -4287 -12180 -4148 -5501 -12226 -8265 -13599
172 -13599 -11653 -3224 -14254 -19281 -14528 -13280 -8277 -14485 -18633 -8074 -4275 219 -686 -13140
186 -13140 -7067 2696 -23 -2308 -12068 -13701 -1446 2382 3175 -2878 -10339 3996 11444 3395 -1357
201 -1357 -10470 -6610 8925 4130 -8959 -15814 -7773 14613 15273 -1010 -8533 -5710 13724 20327
215 20327 -3344 -12168 1229 14488 16615 -1608 -8698 11581 25898 21800 1010 -11456 8019
228 8019 20154 5889 -9030 -13756 1343 14762 -249 -14669 -10289 4801 14493 -2818 -19347
241 -19347 -9071 1269 2372 -8033 -19616 -4280 14389 9185 -6055 -14608 732 21017 12545
254 12545 -5184 -12863 -5052 13419 8121 -11081 -7805 6795 16355 8805 -11021 -9559 7340
267 7340 13985 6321 -13441 -15506 4331 9732 727 -9284 -9511 8628 16450 1705 -10747 -10076
281 -10076 5582 14754 546 -8460 -2930 5799 12116 2291 -6475 4789 14381 10809 -3486 -14623
295 -14623 -4168 7424 2940 -6656 -15025 -8255 5117 -1165 -11217 -10012 -2176 6505 -270 -12795
309 -12795 -9862 -107 8458 6048 -6059 -1824 10387 11259 6027 -3277 -1946 11554 12418 2228
323 2228 -6792 -6701 6503 9843 939 -1902 -1046 4055 6836 -2991 -6508 56 4440 4899 -3214 -7809
339 -7809 -154 4400 5155 2379 -3384 1761 5998 715 -1149 -1601 1518 6393 2550 385 1707 2081
355 2081 5818 3488 196 4020 2564 -776 -769 -3238 -303 1919 -1122 -459 -1274 -1116 353 -3534 -1955
372 -1955 1811 -1944 -2890 -3415 -3293 2093 1291 -1791 379 1097 3118 367 -5672 -2130 156 -1982
388 -1982 -3528 -8275 -6445 -190 -2484 -5682 -6735 -4452 1167 -2946 -9095 -6875 -3769 980 -371
403 -371 -7980 -4870 2704 4225 1333 -4895 -2944 4909 3562 -1744 -6480 -4916 5646 5906 -2702
418 -2702 -3784 635 8811 9708 -960 -3995 2653 8542 7523 -4227 -7276 3982 9134 5293 -3737
433 -3737 -7542 3868 10520 2225 -7072 -9138 1514 8769 -1239 -9215 -5852 4114 11705 1620
447 1620 -9585 -3477 6960 9435 -306 -11586 -5142 5530 5283 -2427 -10626 -3425 9788 5970
461 5970 -5077 -9486 -3827 7493 4397 -8390 -10673 -3050 6102 3283 -9236 -8024 2498 6629
475 6629 2465 -8950 -9628 2889 6381 -364 -7705 -6033 7347 10484 673 -3579 432 11381
489 11381 14502 1048 -5834 1251 9674 11148 432 -5397 3292 9241 7026 -1545 -7372 2488
503 2488 9723 2437 -5699 -8064 452 10128 4741 -2856 -2068 5201 13149 7153 -2510 631 6598
518 6598 9751 5701 -4217 -2498 5308 5618 1583 -5039 -3536 4070 1530 -5124 -8635 -7298 1693
533 1693 2237 -6352 -7827 -4350 1705 3955 -2769 -3864 41 1519 1772 -3375 -5497 1652 2890 -78
549 -78 -2339 -4217 915 3222 -1481 -3560 -4712 -2420 134 -5492 -7254 -4969 -4942 -2417 -3255 -6105
565 -6105 -3924 -4493 -5126 -3300 -4146 -2173 -2126 -4154 -580 675 691 3452 2452 3863 5999 2383 1803
582 1803 2810 3896 6179 1605 -1893 1943 3330 4276 1713 -3639 -317 3564 1649 -1105 -4833
597 -4833 -1962 3805 1728 -419 -949 640 6774 4598 -1617 67 3017 5575 3158 -4876 -3737
612 -3737 2300 4200 1693 -5790 -5178 3041 2792 -2343 -6737 -6629 2007 2883 -5279 -7952 -4316 4379
628 4379 6249 -4285 -7643 -683 6121 6525 -4271 -9691 320 7785 5380 -3579 -7756 3249
642 3249 11285 5537 -2485 -5447 3111 11931 3612 -6325 -5255 2592 9633 2569 -8087 -5316 2882
657 2882 7062 696 -10011 -6110 3456 3994 -1225 -7987 -4605 6671 6736 -476 -4286 -999 8913
672 8913 8438 -1838 -4630 -487 6634 6934 -3528 -5950 1352 5967 3999 -5192 -7492 2446 5783
687 5783 484 -6957 -8722 2372 8309 192 -6641 -5313 3915 9768 756 -7314 -4039 3905 8125
702 8125 -400 -8635 -2323 5519 6041 -106 -7142 -1307 7662 4934 -2526 -7646 -2417 7045 4270
717 4270 -3621 -6053 -2746 5126 4147 -3780 -4320 -1042 2301 1425 -4640 -3930 1732 2679 1822 -2322 -2465
734 -2465 4610 5554 2008 -527 -1629 3151 5192 728 -1545 -1878 742 3663 -604 -2973 -932 -1142
750 -1142 -122 -2322 -5200 -1754 -86 -1025 -2505 -4844 -1170 2958 1253 -315 -2529 -1995 2517 1364
766 1364 -1278 -1644 -2428 -44 607 -1893 -826 -1034 -1063 751 -1658 -1843 -276 -1275 62 -176 -1888
783 -1888 11 568 1714 2378 -1199 -1226 1239 1891 3129 -443 -3385 198 2785 3355 1494 -1955 1198
800 1198 4695 3434 1508 -1201 1017 5232 1934 -1839 -1720 323 4179 1279 -4580 -3648 -256 2259
816 2259 165 -6620 -5933 -433 906 -800 -5391 -5001 1701 2726 -1097 -3646 -2892 3071 3267 -2870
832 -2870 -4593 -2285 2519 3580 -3683 -6457 -1516 2695 2744 -3556 -7178 -1224 3112 1440 -3404 -6292
848 -6292 413 5565 1505 -2910 -3378 2120 7279 1980 -3920 -2373 2961 7146 2082 -4644 -1148
863 -1148 4951 6779 2862 -3777 -493 6845 6361 1382 -3291 -249 7414 5945 -371 -2731 176
878 176 6902 5907 -1952 -3415 871 5595 4954 -2373 -3520 2687 6241 4897 -1250 -2625 4733 7351
894 7351 3501 -1187 -2635 3254 6292 1004 -3367 -3430 1113 4363 -1366 -5681 -3808 -367 1638 -2616
910 -2616 -7461 -3620 697 699 -2484 -6128 -2069 3137 1266 -2038 -4506 -2262 3169 899 -3496 -3867
926 -3867 -1832 1781 283 -4289 -3166 -370 1139 -53 -4372 -3310 1383 1279 -701 -2919 -2165 2729
942 2729 2749 -511 -1560 -882 2665 2989 -979 -1102 230 1770 2687 -639 -857 2477 2737 2276 -84
959 -84 -1074 2431 2588 469 -392 -1815 105 1361 -1213 -1391 -1430 -1708 -334 -2028 -2615 -1301 -2227 -1626
977 -1626 -1387 -2021 -160 -518 -1269 471 335 655 729 -901 572 1004 -919 -1017 -1479 -204 1343 -1907
995 -1907 -3319 -1695 -539 1135 -1228 -4118 -1851 15 729 -544 -3523 -772 2535 1397 -199
1010 -199 -2166 -262 3923 2170 -1210 -1800 -235 3640 2443 -2005 -1619 732 3413 3224 -1615 -2005
1026 -2005 1561 3163 2759 -1104 -2152 2249 3142 1396 -867 -1711 2675 4312 479 -1407 -962 2265
1042 2265 4761 1021 -1215 877 3342 5087 1817 -1370 1979 4374 3755 847 -2737 364 3942
1057 3942 1449 -1897 -3808 -1222 2755 -277 -4551 -4194 -1502 2343 57 -5220 -3599 621 3131
1072 3131 1149 -3703 -2191 3107 3789 1033 -3252 -2439 3459 3627 -774 -3496 -2611 2587 3536 -1905
1088 -1905 -3820 -1738 2113 3098 -2301 -4231 -309 2564 2785 -1527 -4015 711 3539 1797 -1420
1103 -1420 -3297 658 3676 482 -2251 -2499 614 3928 524 -2661 -1265 1097 3299 430 -3241
1118 -3241 -1284 1517 1648 -339 -3786 -1905 1866 588 -1499 -3349 -2280 1533 605 -2311 -2525 -1567
1134 -1567 1598 1685 -1576 -942 819 2140 2788 -119 -602 1921 2131 1809 143 -1057 1132 1210 24
1151 24 -33 -1201 -72 827 -958 -905 -1046 -1099 539 -295 -871 -59 -645 364 992 -122 838 290 -398
1170 -398 886 -77 -68 458 -361 667 510 -608 293 259 467 1332 -444 -339 592 -178 222 -660 -1631 241
1190 241 -80 -798 -1217 -2645 -812 227 -1347 -1510 -1791 -864 842 -875 -1530 27 1080 2439 650
1207 650 -1717 331 1858 2116 837 -2286 -1180 1241 247 -1157 -3319 -2606 682 -51 -2736 -3579
1223 -3579 -2751 749 875 -2514 -2343 -276 2003 2233 -1149 -1211 2178 3619 3033 -143 -1320 2522 3877
1240 3877 2150 42 -971 2133 3741 422 -1308 -534 1964 3404 -182 -2454 -401 1831 2949
1255 2949 130 -2943 -144 2750 2484 -173 -2974 -356 3600 2223 -512 -2411 -596 3672 2222
1270 2222 -1269 -1719 -36 3025 1770 -2801 -2846 -236 1992 1047 -3505 -4335 -820 616 -138 -3239
1286 -3239 -4233 -372 1287 -552 -2106 -2329 1365 3287 620 -740 139 2420 3966 1234 -894 943
1302 943 2301 2731 117 -2179 207 1817 695 -1082 -2616 -510 1676 -383 -1822 -1589 214 2289
1318 2289 266 -1886 -387 1591 2740 1005 -1863 -136 1967 1909 714 -1770 -899 1894 1379 -210
1334 -210 -1402 -990 1611 1312 -743 -1024 -929 1085 1496 -695 -1122 -672 287 1259 -665 -1645 -508 -164
1352 -164 163 -584 -1950 -1080 -445 -565 -380 -1510 -1549 -302 -586 -454 -1065 -1836 -624 -580 -1073 -1004 -2057
1371 -2057 -1510 -469 -1102 -1213 -1593 -1787 -389 -529 -902 -728 -1171 11 580 -661 -74 245 965 1649
1389 1649 -33 -448 881 1298 1449 126 -873 800 1288 681 266 -391 1014 2145 939 260 371
1406 371 1318 2625 1175 66 916 1555 1972 746 -1132 -17 1124 1040 -75 -2044 -1291 407 361
1423 361 -284 -1439 -1155 946 653 -505 -575 68 1715 1882 -271 -548 281 1457 1819 -256 -1220 89
1441 89 832 903 -916 -2384 -355 1000 434 -1103 -2446 -545 1354 116 -1151 -1319 172 1916 73
1458 73 -2074 -1070 985 2451 493 -2265 -806 1549 1998 413 -1775 -372 2145 1397 -463 -1578
1474 -1578 -250 2675 1539 -1238 -1627 -132 1858 853 -2126 -1818 40 1219 407 -2260 -2116 530
1490 530 1436 624 -1167 -1199 1167 1791 453 -397 -221 1687 2047 -164 -1070 -224 802 1372 -621 -1922
1508 -1922 -1043 -234 62 -1142 -2417 -1137 81 -300 -880 -1584 -399 1206 503 -251 -335 393 1594 610
1526 610 -652 -33 640 1266 457 -1146 -609 388 359 181 -1048 -983 361 -40 -353 -795 -668 455 311
1545 311 -573 -406 -495 -24 375 -584 -511 -320 -320 402 87 -381 158 256 759 696 -17 507 725 654 952 100
1567 100 0 630 272 200 -125 -807 17 -228 -763 -653 -1049 -548 -206 -945 -725 -483 -364 301 -329 -252 518
1588 518 190 372 400 13 646 373 2 467 -15 -49 270 -61 303 100 -324 90 -34 236 311 -423 -37
1609 -37 672 173 108 -336 -32 1158 527 -495 -470 150 1072 670 -861 -491 603 1112 644 -788 -388
1628 -388 1188 1261 645 -621 -384 1392 1291 -346 -954 -602 687 584 -1511 -1853 -936 168 88 -1793
1646 -1793 -2005 -619 -80 69 -893 -1135 477 1085 395 58 -288 1072 1908 685 -36 -25 690 1339 36
1665 36 -802 -312 238 561 -482 -1588 -782 238 383 -191 -1086 -384 930 417 -332 -491 223 1656 1007
1684 1007 -259 -50 539 1814 1571 -32 32 1115 1460 1082 -117 -119 1337 1014 427 -565 -705 494
1702 494 619 -629 -1175 -1216 -324 -54 -1371 -1496 -938 -217 376 -674 -1131 -213 491 890 482 -302 490
1721 490 1142 775 485 -207 98 920 353 -379 -975 -904 -138 -381 -1299 -1544 -1490 -913 -849 -1681 -1262 -638 -214
1742 -214 71 -671 -577 373 501 500 202 19 789 753 48 205 -132 374 393 -503 -430 -183 -416 -261 -649 -628
1764 -628 -157 -390 -404 -345 -335 252 21 -222 299 105 126 476 95 595 981 415 517 684 774 1127 531 494
1786 494 978 775 755 212 -223 520 233 -431 -593 -871 -404 -191 -1020 -1244 -936 -646 -205 -1029 -1087 -267 85
1807 85 356 -96 -620 462 876 673 355 -216 420 1086 619 -130 -226 66 888 300 -525 -525 -67 656 249
1828 249 -746 -462 317 822 534 -545 -276 920 945 545 -346 -217 1079 1175 154 -374 -451 702 1037
1847 1037 -329 -606 -137 631 739 -285 -830 138 636 605 -329 -972 42 627 122 -375 -1053 -154 644
1866 644 -190 -668 -628 -151 808 239 -609 -160 472 1028 523 -687 228 992 1012 547 -514 -183 745 552
1886 552 -281 -1046 -875 243 -39 -1036 -1279 -1098 116 62 -1214 -1223 -327 407 429 -813 -1055 122 498 188
1906 188 -498 -973 257 633 52 -460 -800 55 666 -42 -407 -311 159 880 233 -524 -92 362 693 268
1926 268 -581 -255 284 266 114 -567 -508 214 36 -53 -359 -258 326 286 -229 89 -46 522 536 -110 -31 173
1948 173 287 228 -219 -443 75 -89 -167 -326 -777 -263 -67 -366 -289 -442 -251 99 -209 -95 5 43 527
1969 527 272 39 397 168 371 554 33 92 200 120 330 -203 -270 74 93 99 -50 -327 25 181 195 211 -274
1992 -274 -174 445 62 -29 -197 -231 325 135 -258 -236 -239 92 287 -311 -248 -10 182 457 25 -209 254 282
2014 282 491 13 -578 -9 181 -17 -304 -823 -399 133 -212 -469 -573 -197 463 149 -500 -82 179 641
2034 641 536 -305 78 551 626 474 -328 -170 554 347 -166 -516 -503 313 344 -449 -356 -273 287 649 -249 -196
2056 -196 123 415 624 -59 -274 147 480 350 -106 -535 -6 468 180 -184 -407 -39 608 160 -131 -182
2076 -182 107 723 398 -274 -71 262 680 364 -412 -295 122 374 149 -658 -443 170 116 -205 -663 -548
2096 -548 264 216 -302 -346 -234 292 315 -444 -339 -86 177 230 -309 -567 -166 10 -145 -427 -616 -197 85
2117 85 -143 -272 -347 -12 339 23 -146 -33 60 273 109 -299 16 -34 178 154 -291 -145 80 37 197 -66
2139 -66 -177 150 214 291 319 36 387 426 249 283 104 262 356 -131 -169 -243 -140 18 -202 -549 -378 -255 -43
2162 -43 -126 -455 -154 74 83 40 -25 -10 359 -47 147 20 -165 156 172 -156 -74 -187 -138 76 -271 -402 -338 -199
2186 -199 98 0 -323 -222 -128 207 182 -249 -117 37 116 40 -294 -210 126 202 87 -252 -289 245 290 45 26
2209 26 -113 364 557 84 114 175 258 475 232 -124 107 111 144 27 -322 37 210 60 -29 -183 -96 432 329
2232 329 166 -17 173 525 378 153 208 255 328 98 -284 -83 -57 53 -37 -379 -290 9 -99 -319 -462 -389
2254 -389 234 135 -182 -318 -15 272 253 -173 -321 -36 296 146 -308 -312 23 130 20 -365 -510 159 203 -29
2276 -29 -200 -231 65 302 -113 -157 0 31 252 -147 -300 -172 -96 145 -73 -422 -124 -82 129 76 -112 -115 214
2299 214 129 206 48 90 427 357 148 29 45 252 142 -74 -168 -65 -14 135 -288 -289 -88 -2 12 -205 -228 64
2323 64 281 138 10 -109 240 309 50 -15 -28 18 178 -232 -250 -3 -38 -48 -117 -264 -88 -44 -82 -76 -35 67 151
2348 151 -44 -15 16 26 215 42 18 33 15 140 9 -90 -33 22 -15 255 -48 -25 154 44 259 142 -54 172
2372 172 179 125 121 -83 55 108 -174 -195 -150 -321 -130 -211 -149 -43 -121 38 241 89 204 110 120 339 55 -6 44
2397 44 85 201 133 -213 14 38 14 -70 -361 -225 66 -73 -39 -167 -154 221 120 10 -8 18 213 288 -151 33
2421 33 43 51 86 -170 -118 96 63 -47 -41 -122 147 113 16 5 -14 262 254 10 -81 11 136 336 17 -230 -176 -102 137
2448 137 88 -343 -114 8 100 44 -283 -65 234 68 162 30 -123 363 358 -154 -117 -219 99 93 -203 -219 -237 20
2472 20 18 -243 -349 -94 49 109 -142 -128 121 210 156 31 -246 169 310 -41 -102 -176 -59 128 -113 -308 -105
2495 -105 37 120 -63 -173 99 269 172 91 -131 77 306 74 -118 -259 -62 231 10 -297 -185 -130 194
2516 194 126 -325 -155 -52 162 255 -133 60 210 262 185 -42 -4 178 175 74 -11 -166 -26 148 -259 -170 -240
2539 -240 -162 54 -233 -200 -130 -144 182 69 -21 -37 84 46 216 -61 -68 149 -40 181 -135 -269 -8 -123 -135
2562 -135 -104 -304 -188 80 -145 35 -221 -71 255 82 -85 35 -66 142 113 -178 72 137 43 142 -112 -102
2584 -102 187 17 229 -4 59 278 270 22 9 10 225 274 -136 -58 -68 63 266 -155 -144 -28 41 151 -49 -208
2608 -208 71 74 75 162 -25 174 242 40 125 62 127 362 39 -96 -19 -38 46 192 -280 -220 -214 13 -29 -274 -218 46
2634 46 51 130 -19 -213 233 160 -99 39 -157 180 232 -80 -139 -219 1 203 -170 -320 -154 -182 74 -80 -465
2657 -465 -158 51 83 -39 -367 -164 101 -64 -181 -345 -255 204 62 -147 -246 -181 309 359 -214 27 69 211
2679 211 284 -8 27 211 275 139 -97 -169 27 48 -172 -282 -390 -66 77 -264 -365 -218 -61 122 -29 -271
2701 -271 99 78 291 121 -201 81 211 245 98 -103 -34 220 62 4 -164 -129 49 -21 -170 -125 -92 66 18
2724 18 -248 -133 -93 -7 183 -99 -46 50 109 189 38 -195 153 140 3 -56 -270 42 83 74 59 -72 30 138
2748 138 -32 -63 13 -198 28 69 -255 -27 -98 21 80 -162 -82 24 91 121 -26 -18 199 281 162 238 113 157
2772 157 254 153 154 87 38 204 -56 -125 32 -170 -81 -119 -293 -210 -127 -220 -76 -186 -120 -68 -23 -6 10 -51 140 76
2798 76 -50 63 -40 188 187 -90 -2 39 79 239 -224 -107 48 67 154 -95 -194 107 137 20 -39 -159 -43 141
2822 141 48 -118 -214 -105 36 -138 -183 23 -223 169 165 -105 3 -20 140 262 -30 115 50 21 226 65 -231
2845 -231 -73 -68 -90 -110 -377 -146 145 -111 -100 -196 -222 62 -161 -119 -107 -60 270 177 -114 110 233 102 59 -33
2869 -33 87 228 51 -20 -107 -184 128 47 -105 -147 -167 25 131 -259 -202 -168 -183 88 -119 -227 53 34 112 -26
2893 -26 -235 153 112 125 252 26 108 295 241 198 8 8 186 140 24 -55 -201 77 -68 -318 -205 -241 -139 -87
2917 -87 -262 -244 -13 -123 -31 -8 -54 172 109 110 252 -32 253 214 63 165 -16 -85 -4 -89 -164 -247 -150 -59 -151 -386
2943 -386 -160 -189 -104 -26 -218 -96 188 24 123 82 -27 227 355 68 -5 -1 238 225 -61 56 0 85 300 -69
2967 -69 -263 108 61 129 26 -271 -44 17 59 68 -134 110 237 63 15 86 38 286 3 31 166 109 172 -32
2991 -32 -266 305 103 62 -60 -189 -52 86 -188 -184 -147 -286 -10 -161 -404 -121 -112 -59 -67 -297 -8 78 34 177
3015 177 -14 -21 277 115 179 189 -132 162 90 -14 -41 -331 -113 149 -129 -63 -64 -239 202 -14 -147 -18 -20 215
3039 215 203 -128 70 139 147 102 -26 -93 120 -63 -146 -127 -262 85 -62 -192 -86 -55 -3 137 -248 49 77 28
3063 28 238 53 112 293 189 32 90 -99 108 279 54 55 -118 -2 163 -78 -15 -134 -41 119 -74 -184
3085 -184 -13 -212 -10 29 -219 -90 17 -30 0 -308 -143 111 9 54 -63 -43 244 57 59 175 -107 -29 110
3108 110 -61 -106 -17 -38 51 -14 29 -24 -71 62 240 -77 118 -21 132 345 114 58 274 222 300 138 -69 285
3132 285 254 231 94 -238 70 233 -234 -270 -198 -140 41 -251 -286 -5 -70 -9 -56 -281 117 172 1 110 -132
3155 -132 67 275 128 17 124 30 273 104 -73 149 -44 156 84 -157 -158 14 -184 129 -129 -192 -65 -17
3177 -17 -88 -146 -317 -53 103 -234 -66 -198 -39 158 -21 -35 -59 -50 225 93 -284 51 81 127 120 -75 -37 58
3201 58 -32 -61 -212 -176 91 12 -164 -217 -103 130 76 -136 -109 6 236 246 -84 190 138 78 261 45 -14 79
3225 79 -19 8 42 -181 21 -8 -104 -10 -220 -158 54 -113 -131 -98 -207 110 10 -53 -26 1 177 122 -140 37 94
3250 94 197 195 32 -96 106 157 177 68 -46 137 62 25 18 29 -13 96 -83 -61 -86 -138 77 -204 -194 -53 -201
3275 -201 -70 49 -142 77 78 -80 192 179 21 195 55 235 219 -109 228 115 83 8 -138 -104 145 -141
3297 -141 -66 -228 -221 11 -95 -223 -41 -196 29 61 -278 -94 -68 66 74 -185 52 125 -5 86 -33 -39 185 158
3321 158 58 134 -9 184 158 57 69 12 -68 58 -54 -272 28 -80 -30 -67 -309 -149 -70 62 163 -20 36
3344 36 158 42 119 75 106 256 164 -124 83 92 250 112 -103 -39 5 -30 3 -366 -254 -8 -134 -174 -217 -238 -14
3369 -14 -4 -237 -53 -182 26 206 -39 49 131 319 323 93 -14 178 157 138 -27 -244 -16 58 -194 -155 -288
3392 -288 -213 137 -137 -212 -140 -291 21 -26 -101 -29 -32 81 161 -217 11 202 209 261 -32 168 231 205 147 87 177 257
3418 257 130 -81 79 -163 -60 -85 -234 -186 -92 -156 -32 -245 -158 233 -39 -59 -4 -75 204 146 87 54 116 174
3442 174 333 -11 18 153 61 164 -40 -332 -24 -42 -34 -71 -303 -107 -63 2 -176 -192 -203 149 -31 38 62 -155
3466 -155 206 114 61 249 100 60 139 -18 -40 45 -30 9 -69 -39 -59 -124 -126 38 -81 -99 -189 -287 32 53 -83 41
3492 41 -32 93 116 -79 -77 -42 149 237 172 7 14 52 183 207 50 74 148 109 150 -92 30 99 -67 2 -23 -221
3518 -221 60 -97 -173 -52 -200 67 77 -174 14 80 -49 60 55 -109 168 -33 42 30 -99 86 -9 -185 -72
3541 -72 3 -14 32 -245 -75 44 37 81 -91 -146 125 17 17 63 9 75 121 -37 52 6 49 163 -158 -14 106 -24
3567 -24 105 -62 -258 61 -46 7 -105 -63 19 172 -104 -35 -157 -109 110 -222 -148 -38 -4 -40 16 -154 -41
3590 -41 -42 88 116 -149 -148 104 -36 143 -91 -25 162 -36 -5 1 -125 135 29 -142 67 -167 184 190 -179 -78
3614 -78 71 41 18 -153 -111 53 -42 -77 -90 -157 49 -31 -163 -4 -59 -63 18 -206 -20 132 -64 -80 -122 -121 169 56
3640 56 0 111 -116 107 33 -36 -101 20 -91 124 -35 -29 46 -112 -81 13 -205 3 -64 4 141 -125 -27 63 80
3665 80 -33 -87 -89 -9 74 -93 42 -38 -57 61 -141 -11 -22 10 23 -13 26 121 35 -48 -36 -51 167 10 -225 -38
3691 -38 75 161 89 -203 178 90 96 49 -116 59 78 45 -50 100 -143 100 -12 -108 48 -34 -16 -101 -63 62 82
3716 82 -97 -13 -158 -79 152 -48 41 10 61 58 18 -123 74 38 33 72 -173 -32 94 -83 -85 45 -189 141 29
3741 29 -138 -100 -179 171 -44 -73 -4 -87 174 68 -57 -59 82 182 239 -49 -183 73 -51 41 -198 -121 67 151
3765 151 -63 -92 -58 109 61 -41 -32 16 -31 62 46 -37 86 120 -29 12 -162 -29 164 -71 -136 -108 6 171 -190
3790 -190 -111 8 -47 100 112 -140 -39 150 -17 32 39 -28 166 61 113 -52 -43 -3 38 -111 -50 -148 -57 150 -53
3815 -53 -70 -64 -82 106 -45 -97 21 15 60 -5 -172 138 164 30 -33 -111 95 180 -67 -63 -13 103 148 -68 -6 62 33
3842 33 -9 -122 -79 54 119 5 -88 -250 -41 191 -51 -91 72 -4 181 -17 -139 85 79 60 -56 -20 86 121
3866 121 13 59 -61 54 129 -39 -73 -6 -116 35 -98 -165 -52 -51 47 8 -104 -34 187 7 67 -90 51 134
3890 134 -34 -63 -59 -9 198 12 -102 -21 18 30 18 -94 -82 77 60 62 -36 10 192 1 -132 -108 -191 39 41 -133
3916 -133 -132 -30 30 156 -97 -1 108 21 97 -71 -52 108 12 -3 35 -12 -7 -41 58 66 -71 43 133 -34 -28 -33 5 52
3944 52 -31 -98 82 46 11 -56 26 77 119 4 9 73 53 -9 -15 -134 17 14 -52 13 -113 15 -71 -32 9 -213 -39 13
3972 13 -116 -113 -25 -158 93 10 -59 46 -39 55 46 -66 -117 21 34 7 -136 -77 79 -10 0 -28 27 184 -129 -45
3998 -45 48 124 70 -9 -154 135 68 14 -48 -221 -1 44 -33 -107 -112 -74 212 171 -113 -16 57 161 194 -83 -3 133
4024 133 50 66 -87 -37 46 92 -27 -93 -127 97 60 -60 -70 61 64 73 2 -1 1 53 35 -26 -201 41 92 45 25 -3
4052 -3 180 134 -81 -86 -39 38 220 -52 -64 -44 -51 86 -124 -21 38 129 -31 -18 -64 -7 51 -70 24 -103 -2 154
4078 154 109 -92 13 -57 74 75 -74 -25 26 178 -44 -13 -1 75 83 -62 -4 -67 -6 -87 -33 42 -108 19 162 -22
4104 -22 -43 58 130 86 -82 88 112 11 -18 -89 -2 -15 -32 -24 -124 -82 103 44 -71 34 -16 -53 143 23 -112
4129 -112 38 70 127 38 -7 156 44 11 -77 -176 -20 103 -32 19 -52 -34 118 -145 15 43 104 105 23 -135 33
4154 33 4 57 -77 -78 60 101 -38 -77 18 -212 118 -12 -117 -51 -3 103 27 -188 19 190 35 84 -37 19
4178 19 104 30 -57 -123 107 71 14 -61 31 -112 78 -79 -23 46 78 41 82 -38 -38 171 -37 -71 1 76 85 22 -138
4205 -138 31 31 9 71 -191 -59 11 92 -65 -78 -19 68 50 102 -134 -96 63 50 -143 -5 60 175 62 -111 -10
4230 -10 43 -94 36 -40 -125 101 109 83 36 -19 115 223 142 44 68 99 80 -133 -160 1 1 10 -127 -96 31 -24 -15 -104
4258 -104 -249 106 97 -188 -111 -20 10 187 -63 -14 9 72 152 43 -149 -79 -31 150 -66 -156 -132 74 -131 -131 -42
4283 -42 -19 101 -47 -102 -66 -180 -23 157 -159 53 8 65 154 -144 49 200 17 -1 -34 9 83 32 -87 -116
4307 -116 51 192 -5 -134 -4 -23 -23 -63 -93 -199 17 92 -7 -15 -101 -44 74 -58 -95 -11 25 146 163 -67 40
4332 40 80 123 15 -82 7 -69 55 30 -149 62 7 55 -18 -197 7 -23 -4 -2 -35 169 66 95 -61 101 46 -23
4358 -23 196 -119 -100 20 119 -44 -99 -75 125 -12 -58 -30 -89 5 7 -122 -64 184 20 -114 -197 17 -4 51 56 -48
4384 -48 94 108 16 -77 -28 14 81 96 -30 48 7 205 192 -88 -45 61 -89 48 4 -135 71 4 -84 73 9
4409 9 -26 66 -15 -72 14 77 90 57 -75 35 45 53 -109 53 121 137 15 -36 -91 51 -54 -184 -29 -37 38 57 -101
4436 -101 -188 32 37 -8 -113 -98 199 -6 64 133 -19 3 175 -18 -179 -127 110 132 -148 -163 49 73 202 -14
4460 -14 -311 -46 191 133 -75 -199 -52 87 75 43 -111 -40 76 115 -51 -115 -38 118 55 -115 -51 23 14 148
4484 148 44 -64 181 141 21 -97 20 143 134 -113 4 -94 35 136 -174 -67 85 -19 38 -130 -94 84
4506 84 136 22 -109 -39 63 167 -39 -144 -163 28 23 -14 -54 -8 130 135 -3 -140 79 88 116 -71 -192 0 162
4531 162 172 -63 -23 31 140 9 -81 0 68 59 -98 -76 -7 -76 58 42 -83 -3 63 157 -9 -94 0 125 7 -74
4557 -74 -39 79 -22 16 -83 -79 10 78 -34 -125 4 -51 -102 98 17 63 177 -3 110 89 85 115 107 63 -10 -66 -7 -7
4585 -7 -126 -98 -25 1 -34 -136 -71 105 -82 -87 -59 -10 30 -8 -46 36 -39 127 135 -122 23 136 -2 65 -55 -116 121
4612 121 -64 -179 -76 -43 63 79 -141 -51 -24 73 11 -49 -103 155 -120 1 -37 -122 92 -64 -34 -14 -55 133
4636 133 176 -39 -59 14 30 106 0 -64 8 45 74 -62 -222 -51 64 -26 -21 -153 -16 46 -58 -81 -91 0 199
4661 199 161 -119 9 129 10 149 -82 -39 20 -36 60 -82 -64 111 -30 -146 -41 -139 171 58 -180 -163 -4
4684 -4 46 19 -87 -126 68 62 104 -125 -159 106 175 44 -85 -22 52 65 60 9 -190 17 80 -158 -135 12 12 26 -49
4711 -49 -64 73 -33 105 -11 42 -90 29 43 -15 -99 43 157 31 -57 -33 105 127 34 -30 83 61 80 -39
4735 -39 -72 -26 103 88 26 -99 -118 130 -8 20 -91 -16 48 79 -94 6 101 188 66 -118 -34 95 1 -32 -39 -123
4761 -123 108 106 -9 -11 -39 -27 69 -144 -110 -157 21 -35 -121 2 180 32 97 80 -86 49 116 -41 3 -84 44
4786 44 -21 21 56 10 -74 26 -15 -31 70 40 -6 -116 -160 184 -29 -139 84 42 85 226 -85 -5 -52 -48 57 -41
4812 -41 -151 72 168 5 51 -31 71 94 -40 -129 -54 1 67 -105 -9 85 49 101 -167 -230 -6 121 34 48 -134
4837 -134 43 90 -33 -19 -42 6 150 93 71 80 63 108 -25 -126 48 -18 5 -151 -254 5 -54 -69 -2 -71 56
4862 56 149 85 -119 142 32 21 -37 -98 35 86 145 73 3 -62 102 180 138 -141 -124 90 -64 12 -179 -108 16
4887 16 58 11 -83 -30 95 192 -130 -118 72 59 127 -116 -108 15 9 86 -44 -70 16 157 -39 -38 48 15 -71 -72 -184 -28
4915 -28 3 78 -211 -82 -11 69 74 -35 -58 -50 23 51 3 -103 -42 135 37 -182 -12 20 116 -91 -77 -31 -24 96 -157
4942 -157 -121 -85 -81 105 -26 -135 -57 7 -32 96 19 1 29 122 -106 140 -37 48 113 -66 -62 101 -26 32 69 -108
4968 -108 51 -6 -62 105 25 -43 70 -95 134 86 -9 120 -7 57 62 -49 -49 -61 -58 -36 30 -66 -85 -70 -41 46 -31
4995 -31 20 -2 -123 117 -75 -1 61 9 -54 94 48 -82 69 -115 -84 -31 -22 -38 -167 34 25 38 6 -41 -118 39
5021 39 52 -36 11 85 168 138 -5 -81 30 116 170 -109 65 107 5 64 -202 -139 21 73 159 -51 -88 17 50 -42
5047 -42 -151 -69 52 174 38 -3 -100 56 111 15 -183 84 95 31 68 -6 104 186 -2 -111 -37 -112 80 -30
5071 -30 -50 -100 -40 -14 82 -140 -235 65 11 175 -101 -179 -10 -6 89 -27 -87 94 195 20 41 100 -35 143 -20
5096 -20 -96 27 90 33 -93 -251 -140 -44 -2 -127 -179 61 -1 -29 -3 -65 -57 109 49 12 -34 10 154 88 -24 -138
5122 -138 -15 -10 -52 -51 -63 59 -82 -20 -90 49 23 -15 51 -27 15 22 46 -226 -123 -15 165 25 71 -96 -5 -69
5148 -69 63 -5 -18 4 136 93 -93 -2 15 89 79 -56 -65 -27 39 -16 39 69 -25 13 -105 -108 78 35 49 -90 29
5175 29 73 56 -42 40 10 87 206 -131 12 78 -45 64 21 -9 74 -84 -11 13 -78 62 9 -159 -155 48 21 82
5201 82 -7 -119 66 110 151 9 -7 103 21 -8 -62 -15 84 80 -52 -9 0 215 46 -54 -94 67 -347 -305 -114 -1099
5227 -1099 405 167 -532 -256 -880 -322 62 -458 -7 3 -1 188 -75 -180 -97 113 28 -104 -52 -4 83 159
5249 159 34 -79 -3 104 0 -107 1 38 182 -48 -147 -251 -32 138 64 -151 -6 88 121 100 -187 -140 40
5272 40 70 7 -149 -50 58 35 -57 -11 -49 71 105 -62 -176 -36 91 65 -118 -172 26 -9 -12 -86 -145 65 93 108
5298 108 24 -88 28 157 -48 -100 -134 59 63 -40 -34 -97 22 173 -26 -64 104 -50 88 -1 -83 6 115 -73
5322 -73 37 -7 -107 75 -36 -216 47 -65 2 40 -138 -45 -14 -31 -23 -47 -181 68 27 -10 -40 -61 68 62 -28 -3
5348 -3 -77 -84 32 -42 51 -25 -107 -15 43 39 -18 85 72 -50 4 -29 86 57 -97 -119 151 66 -86 -134 17 -53 -37 -81
5376 -81 -121 -29 -104 73 98 -148 8 33 -95 99 -49 -65 -12 -145 53 106 -30 42 15 -33 121 -81 -5 -18 -64
5401 -64 38 96 -82 38 115 28 46 -36 58 53 -12 -28 -51 -88 36 28 -19 41 -17 -2 11 -69 -55 -16 26 141 -52 -182
5429 -182 19 69 130 1 -130 91 63 66 24 -87 -156 126 -76 -90 -168 66 124 36 -67 15 -34 156 106 -91 37
5454 37 50 91 -9 -137 -49 81 -162 72 -103 66 5 -11 -173 -53 20 150 206 -38 10 25 108 197 -11 -138
5478 -138 55 1 -144 -11 -69 14 75 20 -5 -50 8 120 -101 -20 -28 -10 42 -87 -124 -35 59 48 -34 -69 26 26 -23 -78
5506 -78 -125 4 158 -4 -26 57 44 126 154 -39 -73 -41 52 107 -147 -116 122 83 1 -4 -166 76 -7 -31 22 -100
5532 -100 75 78 11 -65 -36 103 105 -74 21 67 95 17 3 -105 -4 -27 -52 0 -40 -96 -68 -72 -68 -5 140 -11 -71 53
5560 53 204 52 21 -5 -109 107 -93 -39 -25 -85 33 -34 58 -65 -123 -111 102 -8 -106 19 -80 119 113 -89 64
5585 64 16 -79 18 -14 -23 39 -93 -72 11 100 -19 -82 -30 -51 -8 37 22 -126 33 20 -137 124 43 68 109 -64 61
5612 61 35 -48 111 -134 -96 9 11 44 7 -192 -4 87 -131 -69 -199 -41 9 30 -41 6 -26 86 9 -144 72
5637 72 -3 33 51 -161 -15 71 68 -21 -176 66 136 -87 -16 -111 47 74 129 -71 -34 17 90 -30 -106 61 186 -23
5663 -23 -10 -87 -48 49 23 -13 -100 -34 103 228 -6 32 -22 44 1 -102 -30 25 -22 128 -39 -135 45 68 -2 -46 1
5690 1 -1 165 -1 27 79 11 161 -24 -18 11 79 132 -51 -236 -33 51 101 -40 -158 33 3 -12 -71 -113 21 61
5716 61 -69 59 -153 -55 -31 125 58 -10 39 110 97 -6 35 1 82 67 -61 12 29 -83 -131 7 -99 66 128
5741 128 34 90 -32 9 64 -53 -79 15 -2 -78 -53 -108 93 47 55 -121 -106 89 104 -84 -12 115 -59 84 31 106
5767 106 79 -8 -80 19 -84 13 -109 9 15 -56 42 2 73 -53 -46 -55 117 -2 63 124 -10 70 -70 -50 43 130 -55
5794 -55 76 -76 75 -18 97 -33 -3 85 2 23 23 71 41 46 0 -36 46 38 49 50 14 28 88 -88 2 99 -38 79
5822 79 -83 -65 141 11 17 113 -64 -26 24 -58 27 -55 -62 104 -17 -74 52 -69 54 -63 -58 -27 -58 -4 27 -52 35
5849 35 129 98 -15 -110 -107 120 46 -79 -121 61 145 122 54 -170 -75 84 112 -74 -141 102 103 11 10 59 182 153 -26
5876 -26 -48 -39 95 -37 90 -72 -128 -85 33 -162 -178 -38 -14 79 -5 -44 120 76 134 7 -17 -31 73 66 -17 -39
5902 -39 -88 90 -70 55 -55 15 -13 33 -29 -28 -36 35 61 -9 -88 55 66 -18 -87 32 -3 2 -48 25 -21 121 -49 -127
5930 -127 2 73 -50 40 33 -64 104 -50 85 65 25 104 60 57 65 -32 40 46 -73 -53 -61 26 -26 58 14 58 15 38 72
5959 72 15 99 54 -49 -61 -47 -47 -37 54 37 22 -14 30 28 -27 -103 -40 69 11 15 -71 51 61 -12 25 -78 70 42 -34
5988 -34 75 17 -15 80 52 -104 -106 -3 -4 55 -23 29 -57 67 -33 64 -5 24 168 121 66 -51 30 -124 103 8 97
6015 97 26 -113 124 34 -48 -54 -81 -63 44 -74 -33 59 19 12 -48 -127 86 145 -112 -14 -105 -10 97 29 -22 -109 -13 20
6043 20 -7 -40 23 -64 2 60 -15 47 23 -31 -118 -24 -24 50 116 -42 45 -27 129 37 -6 -114 16 -13 69 -117 65 -8
6071 -8 122 56 -43 -86 -27 51 -46 -33 0 0 7 -99 -101 -40 0 14 31 -42 -192 4 6 61 -181 -61 148 67 42 -1 74
6100 74 76 38 107 -24 10 33 10 -73 -140 -76 62 -30 -47 54 -6 73 -22 -119 -57 35 80 119 -8 -115 20 3 0 -18
6128 -18 -90 -10 -61 -47 -106 78 -179 39 -26 -31 -24 32 -48 -39 -105 149 1 71 77 -6 113 -5 -26 -8 -66 -37 -11 -102 -76
6157 -76 -46 31 15 28 -63 -87 -117 -11 137 4 -47 6 28 -32 3 -58 93 -86 34 27 -27 120 32 66 59 40 71 -10
6185 -10 -9 16 -47 -81 -32 8 -65 65 44 -46 -42 -42 -75 35 4 112 -66 -33 34 44 -65 -54 -76 49 -128 -75 37 -25
6213 -25 19 44 98 118 13 47 -59 13 -28 1 -58 -37 89 -100 -70 -58 22 -13 65 -37 137 2 4 -38 -71 -62 -28 35
6241 35 -93 -70 -54 -7 34 2 -46 -89 -32 13 -57 -37 -10 70 16 36 -81 0 -58 -62 -60 -27 7 46 149 -41 -53 -46 2 -76
6271 -76 12 27 12 96 -23 99 100 110 125 73 21 -31 -63 50 -69 -45 -85 46 88 -68 -14 -131 142 -71 76 -100
6297 -100 3 -9 -49 -34 -52 96 -43 47 -85 7 11 107 40 -104 -52 -53 11 53 -40 -58 66 127 -41 -80 -37 25 47
6324 47 -37 -1 7 78 -37 -100 -77 -31 -72 -104 21 -27 -51 51 28 -31 -10 2 57 -37 131 82 14 20 85 -29 -135 61
6352 61 -80 62 -37 -42 50 17 -46 -64 -15 78 -123 49 -84 -49 -37 -5 73 34 9 9 0 -82 14 -21 -40 80 -62 -17
6380 -17 -63 16 -71 -53 -131 -77 -88 -100 36 77 -88 -41 38 16 -15 -121 -15 7 9 -84 -39 -56 31 -79 62 135 14
6407 14 -17 -109 -97 100 57 -20 -48 40 -12 23 7 2 2 18 42 78 -13 -94 56 15 -36 17 -59 -132 1 40 48 48 -45 41 -31
6438 -31 -33 -42 48 -60 192 -48 18 -72 20 -43 -43 -52 -60 83 77 64 -87 -16 1 130 10 -47 57 136 26 -63 129 58
6466 58 -47 80 18 -153 -135 -26 -24 -59 -77 247 -7 -141 -17 -29 190 59 28 17 22 104 68 -22 -48 -50 22 87 112
6493 112 32 -59 13 -17 -126 -74 5 -37 -22 -121 -11 -105 -47 35 -6 -108 -194 -34 -112 -54 -110 -25 30 -5 -50 -152 -48
6520 -48 30 -38 -60 -126 72 116 -17 105 -89 -34 60 -121 -177 12 69 -31 79 -164 -48 -45 42 18 -21 0 4 91
6546 91 32 5 -24 15 -33 56 4 -52 -60 12 -58 13 -53 63 -14 -57 -101 68 -48 92 55 30 102 238 85 7 -11 86
6574 86 107 93 -54 -8 31 80 25 55 84 62 -82 43 24 -9 -21 34 81 46 19 -45 52 40 12 -59 67 -7 119 -33
6602 -33 -108 -89 -47 29 135 12 -39 31 -22 77 36 87 119 101 253 -31 53 114 75 -27 -49 7 -100 -21 10 -88 -63
6629 -63 34 70 58 -47 21 -20 126 8 43 -31 23 2 -108 43 -163 88 19 -29 6 55 -17 77 -36 -92 -12 62
6655 62 86 -11 -71 68 24 113 66 23 30 75 -3 -84 -63 -6 36 -96 62 -51 -95 -127 95 -69 -1 58 -31 13 -109
6682 -109 47 0 -84 150 -9 -49 -26 55 -121 143 -108 -32 -70 11 53 42 -26 -50 -24 20 -25 82 134 72 -91 7
6708 7 -4 35 -7 -31 40 -68 -39 -24 -6 14 28 -3 -18 -30 12 27 24 -48 -37 108 -45 -1 67 7 38 68 -3 -26 74
6737 74 59 -8 -142 26 -73 -69 -23 -35 -83 -42 24 -57 -20 -24 -78 148 59 -77 -84 23 -36 -29 10 -66 34 -12 62 -104 67
6766 67 49 -95 54 -35 25 -53 -69 63 -105 -159 136 -43 -46 -18 11 36 -34 16 27 48 -35 -11 12 10 20 32 85 5
6794 5 -9 21 48 -84 34 -121 18 -39 -16 -58 -37 -63 -2 -52 -67 36 -32 112 -24 5 -72 12 43 30 56 -23 77
6821 77 23 82 64 120 -104 -33 18 -48 -45 71 3 -45 -29 -129 -10 -56 46 6 -30 -40 20 27 7 6 -67 -120 27 66 -67
6850 -67 25 -56 -129 -104 -77 29 37 -32 127 85 40 27 29 9 1 -44 61 23 -50 -11 6 110 55 -118 34 50 -41 -11 -98
6879 -98 29 -4 57 14 92 95 90 -31 -61 -96 -66 104 -103 -50 -5 -88 -32 -29 7 -55 -55 109 20 7 28 -56 100 -16 -12
6908 -12 16 -62 10 27 -128 105 17 -80 75 -42 -159 -94 92 -5 -24 -70 8 54 -44 103 -65 110 67 -4 -112
6933 -112 -8 101 -22 -1 -155 -152 -61 22 -51 44 -83 -104 -39 -73 -46 -55 -9 1 -12 -52 61 67 113 118 -155 27 -11 2
6961 2 -96 9 -19 44 58 66 5 1 11 44 -10 -48 106 -15 81 -43 42 -69 -52 -78 29 -64 64 67 -47 -10 -34 10
6989 10 -28 135 -54 -121 -39 145 39 -11 80 35 -11 -8 -75 -46 161 -2 9 14 -67 82 -73 169 -95 -47 0 38
7015 38 3 -5 -8 84 4 73 -32 -118 -125 -36 -2 23 -63 -15 68 -74 -106 -30 -14 -51 25 -24 -46 -1 117 31 -95 7 96
7044 96 57 -54 -71 -67 0 -20 54 -85 -78 -43 100 -203 23 -37 27 90 28 3 -43 -11 -36 111 -17 35 72 -41 34
7071 34 34 -51 12 -70 -83 4 -116 -75 -38 3 -18 -71 55 19 43 -27 44 -20 38 7 -44 -90 -94 -98 -73 -72 59 -16 -31 43 100
7102 100 -63 2 -31 85 19 -9 29 86 -48 54 9 20 17 -31 -18 -9 33 21 11 -95 31 104 -28 74 74 29 42
7129 42 49 -7 -48 -101 43 -8 -55 31 26 8 -41 12 -46 -13 -125 -73 0 -131 58 5 -48 98 -19 9 -70 54 -20 -6
7157 -6 -75 55 -41 117 -69 7 -35 -45 -2 -32 -13 -46 -132 42 19 -13 75 77 56 -26 10 -46 -88 21 104 6 -90 -100 12
7186 12 4 -43 84 -133 4 58 8 21 -135 52 110 -32 -8 -88 -44 59 14 29 24 -55 2 49 -6 -30 83 54 44
7213 44 -43 -80 80 41 -4 63 16 136 -72 32 99 18 -113 -2 30 -22 -72 46 -72 -91 -38 -83 24 -34 -36 37
7239 37 -21 11 56 7 112 26 -55 -114 17 1 53 15 9 -41 141 -73 -5 -63 -111 -12 79 -92 80 59 -8 69 -13 70
7267 70 25 34 6 -254 -21 -54 -52 26 112 55 -73 -26 25 -71 -36 -28 122 12 -20 50 9 39 -80 10 18 -9 29 -32 -17
7296 -17 18 133 -17 -53 11 -19 -105 -139 60 31 -36 -28 102 -60 4 85 -26 -42 39 -70 10 -71 45 9 -43 -16 -19
7323 -19 -25 -25 -22 -5 -72 -18 -13 -23 60 19 18 9 -20 -1 -55 19 37 56 11 -132 -8 63 21 101 48 -39 143 123 11 -37 -31 37
7355 37 27 -41 -36 18 42 -4 -98 8 -102 20 185 26 -108 53 45 -36 -90 -25 50 70 10 -17 -16 -68 106 -8 20
7382 20 -32 18 -15 -43 19 -65 56 3 -76 69 5 -2 12 102 -34 -27 72 57 -21 -36 -57 -81 -15 -34 -25 -108 -94 -53 -20 -34
7412 -34 -80 -79 -13 -114 49 -38 -41 -39 -45 30 52 -31 20 -23 -107 12 68 -39 41 -98 -84 -29 52 26 52 20 120 60 89
7441 89 41 -101 -7 -13 36 -81 28 -46 -19 -168 -34 77 -87 8 -38 -171 -75 26 -18 -133 -110 21 -37 64 -92
7466 -92 -76 2 -32 -28 62 50 -12 14 -11 -31 -66 10 -43 -58 24 -94 -52 24 -54 76 -13 81 -1 54 55 82 -14 -57 -46 29
7496 29 -6 -89 -8 28 32 -153 -160 -57 53 -76 -28 27 -51 77 -19 151 61 104 -54 -29 -130 -148 -18 -2 8 -31 71
7523 71 -13 3 37 31 31 45 50 85 109 -39 2 17 -33 17 -13 -8 11 -33 -26 -77 -157 -85 -16 9 -37 -100 60 25 23 -10 -40 105
7555 105 -74 106 -70 -33 20 -37 -10 -58 -48 26 0 -96 -63 -175 -163 -23 -3 -59 -68 -21 2 60 -54 -96 12 -39 30
7582 30 -28 -6 70 6 -4 4 2 -34 -20 2 -57 26 -81 10 -64 32 22 -27 -11 -79 55 34 69 -79 11 21 -58 -36 -5 -40
7612 -40 -52 -35 46 83 -52 22 30 73 179 23 -46 29 -23 -77 -7 31 62 -25 7 -105 14 -145 30 100 -123 -33 67
7639 67 23 -54 -22 38 51 63 66 -6 120 -62 18 40 -5 -63 112 56 78 66 -56 -128 -44 36 -91 49 62 -41 -90
7666 -90 -28 -27 -34 -25 -28 -22 36 5 19 -72 -61 -62 42 -34 64 18 -97 -29 88 -47 -12 60 -10 40 -52 80 -28 131 -62
7695 -62 36 -9 34 -98 50 69 -36 48 -11 -1 -59 -89 -82 52 39 51 39 -35 -45 -2 -14 8 -32 4 9 -43 49 25 92
7724 92 20 -28 -97 -102 -70 37 56 -11 156 74 -6 113 11 -49 -163 -112 -1 41 -60 63 -77 -70 -18 -51 -3 97
7750 97 -17 -27 85 -77 34 12 49 160 89 27 -95 62 -77 -131 5 -9 -14 -129 -70 -6 -13 -15 2 46 -42 -8 -54
7777 -54 -82 -89 3 -1 7 51 18 51 -75 21 61 68 -59 84 125 4 83 41 52 -95 -40 28 -127 -5 -7 27 -4 57 17
7806 17 -72 13 -49 -123 -26 -76 -48 -47 -7 37 -138 -74 133 -44 102 6 -3 13 49 32 -101 -9 -16 -1 6 59 -151 0 -83
7835 -83 -16 22 -134 -32 5 18 -40 -14 -76 115 59 21 -48 17 17 -18 41 10 -64 -10 -2 -26 -3 -39 75 -63 -34 91
7863 91 18 41 41 -77 -12 -62 32 -11 -71 98 -71 -37 7 19 91 -68 -19 -13 14 48 27 37 66 -9 29 -31 -28 -71 55
7892 55 28 -96 -91 -81 -39 -14 43 10 -59 -62 -50 -8 -33 46 9 38 -94 97 -125 -26 -27 108 61 -41 41 -87 -140 68
7920 68 -8 2 85 56 -101 43 32 -90 -102 -30 -3 36 17 34 56 8 -3 80 81 -60 -14 -26 35 35 -54 -11 87 19 -51
7949 -51 97 -10 -59 1 -8 -67 -32 16 -72 -85 15 -73 -75 0 -28 24 48 -13 22 -13 -7 -4 -65 3 118 -44 33 9 -53 3
7979 3 -114 84 24 -10 -15 17 -38 -10 47 9 6 -13 -66 -65 -41 52 -21 -2 -30 44 16 -61 115 -52 76 66 30 15 -76 -109
8009 -109 75 6 -140 -90 120 -24 -57 -25 10 -8 -22 25 -22 95 20 92 -58 23 -30 73 -42 42 145 -9 -49
8034 -49 98 -20 -110 -103 3 32 63 6 -43 65 62 -54 -51 71 27 49 -81 -71 7 -24 34 -22 -15 81 16 -25 144 -43
8062 -43 -35 8 -12 -8 97 -84 -20 -37 47 -60 35 -71 -66 -46 -12 -29 59 32 -3 50 -71 -87 -21 -117 5 57 68 24 141
8091 141 122 -34 -61 2 98 0 -157 60 87 -75 24 13 12 -7 15 14 14 -8 12 48 77 59 53 -16 -20 35 -45 88 118 7
8121 7 -25 -138 33 -2 -44 -39 75 25 -9 90 -8 36 103 -71 2 38 53 -19 -42 -70 -56 128 -115 -75 8 -91 -32 8
8149 8 -123 41 -84 -72 -57 42 165 11 16 -9 94 89 -11 -63 1 -86 15 8 8 -80 -2 69 -41 -73 -64 32 -56 9 -61
8178 -61 -72 20 36 -16 -48 43 50 -53 -48 56 21 14 -53
8191e3
##END NTUPLES=NMR FID
##END=
