##TITLE=1H_DE-80H_X3
 200.13MHz, d2o
 8 sc
 
 19ns.26.2.2025
##JCAMPDX= 6.0         $$ Bruker NMR JCAMP-DX V2.0
##DATA TYPE= NMR SPECTRUM
##DATA CLASS= NTUPLES
##ORIGIN= UXNMR, Bruker Analytische Messtechnik GmbH
##OWNER= pz
$$ XWIN-NMR		Version 3.5
$$ Fri Jan 23 11:16:56 2026 Russian Standard Time (UT+4h)  Yarkov@DPX200
##.OBSERVE FREQUENCY= 200.1313
##.OBSERVE NUCLEUS= ^1H
##.ACQUISITION MODE= SIMULTANEOUS
##.ACQUISITION SCHEME= undefined
##.AVERAGES= 8
##.DIGITISER RES= 18
##SPECTROMETER/DATA SYSTEM= spect
##.PULSE SEQUENCE= zg30
##.SOLVENT NAME= CDCl3
##.SHIFT REFERENCE= (INTERNAL, CDCl3, 0, 15.4913)
##AUDIT TRAIL= $$ (NUMBER, WHEN, WHO, WHERE, WHAT)
$$ ##TITLE= Audit trail, XWIN-NMR		Version 3.5
$$ ##JCAMPDX= 5.01
$$ ##ORIGIN= Bruker BioSpin GmbH
$$ ##OWNER= Yarkov
$$ C:/Bruker/XWIN-NMR/data/yarkov2/nmr/H-C/1/pdata/1/auditp.txt
$$ ##AUDIT TRAIL=  $$ (NUMBER, WHEN, WHO, WHERE, WHAT)
(   1,<2026-01-23 11:16:09.89 +0400>,<Yarkov>,<DPX200>,
      <created by zg, POWCHK disabled, PULCHK disabled
       configuration hash MD5:
       00 E9 B6 7A A2 85 ED C7 34 08 36 98 17 FE 4E 26
       data hash MD5: 16K
       88 F9 6C C2 BD 88 E6 EF 8A 46 83 BB 11 7F 37 AE>)
(   2,<2026-01-23 11:16:15.32 +0400>,<Yarkov>,<DPX200>,
      <Start of raw data processing
       efp BC_mod = 2 LB = 0.25 FT_mod = 6 PKNL = 1 PHC0 = -5297.497 PHC1 = 7.62193 SI = 16K 
       data hash MD5: 16K
       A1 6D 85 85 08 04 C5 7A A0 D1 60 D7 13 94 26 AC>)
$$ ##END=
$$ 
$$ hash MD5
$$ 59 3B 4B 3F 34 0D 14 D5 64 F4 D4 CF 7A AF EC 66
##$RELAX= 
##$RELAX= 
##$RELAX= 
##$RELAX= 
##$RELAX= 
##$RELAX= 
$$ Bruker specific parameters
$$ --------------------------
##$DU= <C:/Bruker/XWIN-NMR>
##$EXPNO= 1
##$NAME= <H-C>
##$PROCNO= 1
##$TYPE= <nmr>
##$USER= <yarkov2>
##$AMP= (0..31)
100 100 100 100 100 100 100 100 100 100 100 100 100 100 100 100 100 100 
100 100 100 100 100 100 100 100 100 100 100 100 100 100 
##$AQSEQ= 0
##$AQ_mod= 1
##$AUNM= <au_zg>
##$AUTOPOS= <>
##$BF1= 200.13
##$BF2= 200.13
##$BF3= 200.13
##$BF4= 200.13
##$BF5= 200.13
##$BF6= 200.13
##$BF7= 200.13
##$BF8= 200.13
##$BYTORDA= 1
##$CFDGTYP= 0
##$CFRGTYP= 5
##$CHEMSTR= <none>
##$CNST= (0..31)
1 1 145 1 1 1 1 1 1 1 1 1 1 1 1 1 1 1 1 1 1 1 1 1 1 1 1 1 1 1 1 1 
##$CPDPRG= <>
##$CPDPRG1= <>
##$CPDPRG2= <>
##$CPDPRG3= <>
##$CPDPRG4= <mlev>
##$CPDPRG5= <mlev>
##$CPDPRG6= <mlev>
##$CPDPRG7= <mlev>
##$CPDPRG8= <mlev>
##$CPDPRGB= <>
##$CPDPRGT= <>
##$D= (0..31)
0 0.7 0 0 0 0 0 0 0 0 0 0.03 0 0 0 0 0 0 0 0 0 0 0 0 0 0 0 0 0 0 0 0 
##$DATE= 1769152569
##$DBL= (0..7)
120 120 120 120 120 120 120 120 
##$DBP= (0..7)
150 150 150 150 150 150 150 150 
##$DBP07= 0
##$DBPNAM0= <>
##$DBPNAM1= <>
##$DBPNAM2= <>
##$DBPNAM3= <>
##$DBPNAM4= <>
##$DBPNAM5= <>
##$DBPNAM6= <>
##$DBPNAM7= <>
##$DBPOAL= (0..7)
0.5 0.5 0.5 0.5 0.5 0.5 0.5 0.5 
##$DBPOFFS= (0..7)
0 0 0 0 0 0 0 0 
##$DE= 6
##$DECBNUC= <off>
##$DECIM= 32
##$DECNUC= <off>
##$DECSTAT= 4
##$DIGMOD= 1
##$DIGTYP= 9
##$DL= (0..7)
0 120 120 120 120 120 120 120 
##$DP= (0..7)
$$ [...]
##$SUBNAM2= <"">
##$SUBNAM3= <"">
##$SUBNAM4= <"">
##$SUBNAM5= <"">
##$SUBNAM6= <"">
##$SUBNAM7= <"">
##$SUBNAM8= <"">
##$SUBNAM9= <"">
##$SW= 18.0517328524113
##$SWIBOX= (0..15)
0 0 2 0 0 0 0 0 0 0 0 0 0 0 0 0 
##$SW_h= 3612.71676300578
##$TD= 16384
##$TD0= 1
##$TE= 0
##$TE2= 300
##$TE3= 300
##$TEG= 300
##$TL= (0..7)
0 120 120 120 120 120 120 120 
##$TP= (0..7)
150 150 150 150 150 150 150 150 
##$TP07= 0
##$TPNAME0= <>
##$TPNAME1= <>
##$TPNAME2= <>
##$TPNAME3= <>
##$TPNAME4= <>
##$TPNAME5= <>
##$TPNAME6= <>
##$TPNAME7= <>
##$TPOAL= (0..7)
0.5 0.5 0.5 0.5 0.5 0.5 0.5 0.5 
##$TPOFFS= (0..7)
0 0 0 0 0 0 0 0 
##$TUNHIN= 0
##$TUNHOUT= 0
##$TUNXOUT= 0
##$USERA1= <user>
##$USERA2= <user>
##$USERA3= <user>
##$USERA4= <user>
##$USERA5= <user>
##$V9= 5
##$VALIST= <valist>
##$VCLIST= <CCCCCCCCCCCCCCC>
##$VD= 0
##$VDLIST= <DDDDDDDDDDDDDDD>
##$VPLIST= <PPPPPPPPPPPPPPP>
##$VTLIST= <TTTTTTTTTTTTTTT>
##$WBST= 1024
##$WBSW= 4
##$XGAIN= (0..3)
0 0 0 0 
##$XL= 0
##$YL= 0
##$YMAX_a= 166996
##$YMIN_a= -126990
##$ZGOPTNS= <>
##$ZL1= 120
##$ZL2= 120
##$ZL3= 120
##$ZL4= 120
##$ABSF1= 0
##$ABSF2= 0
##$ABSG= 0
##$ABSL= 0
##$ALPHA= 0
##$AQORDER= 0
##$ASSFAC= 0
##$ASSFACI= 0
##$ASSFACX= 0
##$ASSWID= 0
##$AUNMP= <proc_1d>
##$AZFE= 0.1
##$AZFW= 0.1
##$BCFW= 0
##$BC_mod= 2
##$BYTORDP= 0
##$COROFFS= 0
##$CY= -3
##$DATMOD= 1
##$DC= 0
##$DFILT= <>
##$DTYPP= 0
##$F1P= 0
##$F2P= 0
##$FCOR= 1
##$FTSIZE= 16384
##$FT_mod= 6
##$GAMMA= 0
##$GB= 0
##$INTBC= 1
##$INTSCL= 3.241238e-09
##$ISEN= 128
##$LB= 0.25
##$LEV0= 0
##$LPBIN= 0
##$MAXI= 10000
##$MC2= 0
##$MEAN= 0
##$ME_mod= 0
##$MI= 1.114404
##$NCOEF= 0
##$NC_proc= -8
##$NLEV= 6
##$NOISF1= 3.799351
##$NOISF2= 2.8
##$NSP= 0
##$NTH_PI= 0
##$NZP= 0
##$OFFSET= 15.49127
##$PC= 1
##$PHC0= -5297.497
##$PHC1= 7.62193
##$PH_mod= 1
##$PKNL= yes
##$PPARMOD= 0
##$PSCAL= 0
##$PSIGN= 0
##$REVERSE= no
##$SF= 200.13000608956
##$SI= 16384
##$SIGF1= 3
##$SIGF2= 2
##$SINO= 0.751879
##$SIOLD= 32768
##$SREGLST= <19F.Aceton>
##$SSB= 0
##$STSI= 16384
##$STSR= 0
##$SW_p= 3612.71676300578
##$SYMM= 0
##$S_DEV= 0
##$TDeff= 16384
##$TDoff= 0
##$TI= <>
##$TILT= no
##$TM1= 0
##$TM2= 0
##$TOPLEV= 0
##$USERP1= <user>
##$USERP2= <user>
##$USERP3= <user>
##$USERP4= <user>
##$USERP5= <user>
##$WDW= 1
##$XDIM= 16384
##$YMAX_p= 375646529
##$YMIN_p= -2373961
$$ End of Bruker specific parameters
$$ ---------------------------------
##NTUPLES= NMR SPECTRUM
##VAR_NAME=  FREQUENCY,     SPECTRUM/REAL,   SPECTRUM/IMAG
##SYMBOL=    X,             R,               I
##VAR_TYPE=  INDEPENDENT,   DEPENDENT,       DEPENDENT
##VAR_FORM=  AFFN,          ASDF,            ASDF
##VAR_DIM=   16384,         16384,           16384
##UNITS=     HZ,            ARBITRARY UNITS, ARBITRARY UNITS
##FACTOR=    0.220516191357247, 1,           1
##FIRST=     3100.26797250503, 0,            0
##LAST=      -512.448790500748, 0,           0
##MIN=       -512.448790500748, -2373961,    0
##MAX=       3100.26797250503, 375646529,    0
$$ Real data points
##PAGE= N=1
##DATA TABLE= (X++(R..R)), XYDATA
$$ [...]
7333 761208 528454 1251268 1405959 1690410 1126468 815073 1110338 528158 1094614 1745671
7323 1745671 2035297 1314234 1879259 1179762 912555 134118 271025 -392011 340890 615005
7313 615005 -386027 165365 628272 1082533 925798 1838302 856317 983245 1167851 655138
7303 655138 636492 1223779 589511 -163531 1621932 1161063 1545994 1299411 1138521 502020
7293 502020 1732623 960220 372779 1735152 1069194 807684 537947 392287 134288
7284 134288 1362791 985551 1326747 878290 921807 -24542 395773 280200 358447 1126143
7274 1126143 374394 59637 -264195 207779 459019 915852 604338 674199 475903 84873
7264 84873 375592 649570 1561801 2341380 2520868 1655658 1010550 531345 770288 1323903
7254 1323903 1575920 1780743 1824366 1533152 1301957 1977540 1541603 1437434 635438 -359261
7244 -359261 336646 1082582 1134136 1503461 1681120 1572344 848295 1335813 905750 782604
7234 782604 1442887 703197 1264344 1471920 999634 22912 130696 -18681 321814 396507
7224 396507 266325 586734 664141 952230 1330960 1477294 1881432 1504144 1990817 2138049
7214 2138049 1662114 1560720 1291691 1321385 1345238 1277684 515961 1129844 832658 1999167
7204 1999167 1811637 2186537 2382164 1294991 1696389 1836396 1724741 1187192 965015
7195 965015 745751 1206851 1814852 1694890 1392492 641674 281805 199319 691175 623695
7185 623695 378743 545312 1208014 1539328 1129190 852727 673091 839918 655961 769640
7175 769640 1583943 1474381 1824613 1279406 608259 840398 383874 603130 102605 -89701
7165 -89701 -1080736 -354212 627173 1157764 1116700 1254062 988435 548929 1165500 1077414
7155 1077414 1052409 1071629 553587 266172 721503 549114 -310369 814678 1818595 1735616
7145 1735616 2585732 1794331 1765328 1783202 2132477 1057504 2258932 1496464 621389 1795454
7135 1795454 731780 857514 419751 674379 527807 1044025 1008100 512701 1036772 1052000
7125 1052000 1249103 972956 1663182 1013948 572360 706948 618703 901765 444835 113315
7115 113315 411852 602235 1056335 1809151 1522496 1184439 166734 18358 375207 1010407
7105 1010407 475877 799726 1175956 621311 610518 1061890 630628 1350934 758754 242942
7095 242942 1310122 2012639 1344018 416616 707909 536843 844604 1193714 923845 275853
7085 275853 497954 615605 1009361 1502155 371045 -559893 470090 546265 454585 867470
7075 867470 525978 -219446 -220532 -545434 357514 1046755 938903 1440710 1153667 1966495
7065 1966495 1762045 475504 955075 1364586 357269 505068 1091688 946211 1071554
7056 1071554 1514726 506624 254238 1116760 165946 307454 93174 386278 340740 655358
7046 655358 676450 -928153 -198322 -185999 577755 811098 1661876 1443899 1580711 1644568
7036 1644568 1492474 1348195 442038 514655 -42921 1125115 1213326 661526 -369878 227035
7026 227035 -397144 -589586 -102750 187344 -259580 -490282 -323468 -574109 297494 -431465
7016 -431465 -571927 -96870 995170 -166726 99299 924337 190281 -128997 805006
7007 805006 1498805 633789 1874404 1307309 1400421 2286590 1741490 387157 1345361 1958552
6997 1958552 1483817 1296814 45945 -163383 -153366 682575 107861 -274603 438811 -54490
6987 -54490 -84875 346808 -1394 141640 971018 1445135 1342417 1576234 1515251 2162056
6977 2162056 1405570 1433112 1883982 1609797 1396729 246204 131108 -161320 682320 804093
6967 804093 995233 291061 -533183 -278395 -120445 1055586 330806 395847 929568 -104178
6957 -104178 -314566 -145548 346200 124688 -91155 -612701 256321 890562 165048 264933
6947 264933 -258151 763204 727582 657666 379295 1201776 1242031 738662 1339125 268712
6937 268712 1407539 438671 375596 746963 967411 1067421 1034388 975748 14394 319443
6927 319443 169235 765152 -122501 -97464 -362490 -725552 -424544 -431913 818614 1223395
6917 1223395 1255345 542661 546609 835707 884313 717752 343038 809014 685841 513956
6907 513956 401744 343476 611904 917785 576452 634614 1266557 1518982 1067527 1969901
6897 1969901 1585852 1551307 1701100 2102173 1616172 1145324 1323326 800303 773396 858169
6887 858169 925969 -156679 531583 411025 907885 1867262 1331149 423969 1281919 926021
6877 926021 938225 1246072 1211738 1393349 879334 1093738 552596 569154 587870 455768
6867 455768 338344 467985 654129 104682 257913 -766394 -377345 1082078 1420736
6858 1420736 1640521 1069417 827148 1106113 1225839 1245100 646872 941877 449218 69940
6848 69940 546789 1074108 1270029 1104179 680964 -199248 649072 227056 669284 1669377
6838 1669377 2074945 1766720 2099537 1552876 1233168 1589335 1889511 1486159 1517620 1346908
6828 1346908 634721 747199 530562 559095 810552 1711240 1242741 941497 1344342 994242
6818 994242 983078 899287 432046 451743 558376 588174 330445 1103116 1148362 743296 872749
6807 872749 31057 -27201 596335 1433195 1912526 2201190 1301670 718362 986243 518640
6797 518640 907224 1244842 1775878 561122 439455 633273 1059263 2067704 1121616
6788 1121616 499480 541702 421726 555111 1187266 1166988 689658 417984 917071 83992
6778 83992 649516 608798 994942 1242717 2104331 1543748 925567 1265628 356751 626704
6768 626704 772395 1236776 -11483 391935 -393636 -877185 339049 357465 238625 785936
6758 785936 709573 153221 1059362 821631 1273038 1313865 1558741 1711543 1039545 1211869
6748 1211869 720080 378519 1469017 1389361 325799 824643 -5539 559393 1741126
6739 1741126 1817683 433548 -199724 -524575 491905 1468448 1523604 1076596 883571 655864
6729 655864 -320577 -924006 -426469 603034 -30958 916340 1090061 1293503 951527 -191370
6719 -191370 -735667 -146031 23632 -434236 345537 -15124 933376 852095 1594286 1314809
6709 1314809 773951 585929 272102 1346560 1503915 1581219 1285171 1871298 1008564 1120733
6699 1120733 985226 1052866 1900741 1983271 1072044 1012759 1207380 250304 725058 412973
6689 412973 94911 1188253 1014543 433656 1088285 696489 298346 1495392 619327
6680 619327 -238703 331794 447470 1203656 1686967 1158022 909231 1552945 1235472 1207986
6670 1207986 865169 1662810 1621584 1156790 1670993 1656003 1917160 1498755 79065 174281
6660 174281 1244178 1569218 692576 -292581 -682353 -515978 624012 1257211 1081975
6651 1081975 835500 1399261 728145 1267847 1455635 1088724 501326 683761 372270 1052318
6641 1052318 1848299 1005129 724848 704834 873004 743032 650228 979036 76608 717475
6631 717475 755378 1242416 1619047 1176707 1074852 1591077 1862718 1442141 913893 -96040
6621 -96040 776234 827929 1198683 1101879 1431780 1265279 1266052 1375007 1064901 1199358 1198350
6610 1198350 1092782 1225952 1272142 878916 1277855 1235651 687376 642853 403930 946509
6600 946509 582005 374031 101793 1259555 1585186 1009377 458913 514174 1223266 2161173
6590 2161173 2794073 2346590 3199316 2104487 1684278 2100483 2316747 1265601 1232105
6581 1232105 1216433 1656301 2926940 2257008 2381335 2452792 2843457 3438554 3246381 3777352
6571 3777352 3225007 3071272 2715936 3324733 3375436 3023909 2583494 1798349 2439251 2805437
6561 2805437 2739309 2829723 3393038 2312339 2512635 1985045 1553949 1279345 1300495 1134208
6551 1134208 850564 657365 888267 421322 742763 796508 911386 1706292 1136956 845141
6541 845141 1418355 2193254 2742710 1910654 1830510 919752 863245 568937 656020 1602703
6531 1602703 2065962 2265364 1990588 2060112 1356624 946619 470039 1807279 1457162 1937427
6521 1937427 2194695 2327090 1705406 1853594 1773390 1553267 1255920 1295498 972969 1449626
6511 1449626 2049084 1869261 1957543 1730864 1436461 1253347 2401330 2112688 2328713 2257405
6501 2257405 2011671 1492560 963629 548731 106025 929794 1582273 1876236 1390408 1164872
6491 1164872 434038 36329 685627 1236097 1606481 758083 1843853 1027536 2105502
6482 2105502 2425278 2856214 2941263 2132689 1848327 1255390 2004219 920624 1749872 2113609
6472 2113609 3049613 1937710 1944263 1588384 2096838 3212281 2926637 2732934 2441667 3640229
6462 3640229 2709373 2568035 2682136 2035472 2296036 2801174 2390413 2388996 2459350 1851744
6452 1851744 2355921 2523797 3189549 2659530 3624085 3263438 2769337 2613422 2953201 3055887
6442 3055887 2709563 3316746 2622740 2907348 2494510 2756891 2140689 2375367 2091895 2492956
6432 2492956 3323149 3595072 3020145 2393509 2010179 2418696 2523787 3449170 3419161 3486072
6422 3486072 2852789 2036324 2795837 3122213 3475861 2732312 2923358 3075986 3572076 3893160
6412 3893160 3346422 2796593 2382343 2597573 2765791 2700721 2250267 2406703 2057805 2156893
6402 2156893 1970685 1058525 1657292 813752 760060 1246813 2317025 1851997 2285953 1745274
6392 1745274 1156034 1621405 1538019 1587690 2408614 3054380 3498767 3260867 2879108 2847538
6382 2847538 2562778 2992453 3026944 2145301 1953395 2390575 2579708 3098814 2487447 2614889
6372 2614889 2351359 2576024 2265218 2453395 2688495 2414430 2623723 2362495 1988897 2170238
6362 2170238 1769022 2630010 3393906 3592051 3696571 3163900 2939124 2867138 2109782 2453079
6352 2453079 2453459 2907492 2826006 2467474 2423634 2429462 2083270 2229077 2155434 1456358 1634210
6341 1634210 1123912 1517565 2025426 2982359 2643730 2568055 2938367 2412413 2606477 2828015
6331 2828015 3071847 3543323 4303399 3911460 3888082 4734802 3946168 3971299 3434183 3442179
6321 3442179 2650293 3324664 2759344 2922445 4719930 4473629 3082767 2683363 2731288
6312 2731288 3114538 3837715 3850953 4177776 4221287 3909057 3800228 3752887 3910268 3584250
6302 3584250 3270864 4004140 4729619 4213943 3346377 3494131 3751793 3342593 4063469 4482033
6292 4482033 3991554 4585490 3730384 5087075 5712932 4938423 3997212 3658966 3308815
6283 3308815 4714078 4428519 5434041 5773391 5606443 5532930 5515610 6884859 6137646
6274 6137646 6650261 5638168 5948267 5112302 5228214 4964540 5869266 6072443 5077701
6265 5077701 5149237 5034339 5171238 4706210 5076882 4985587 5576681 5839995 5406740 5521014
6255 5521014 6510802 6465920 6802831 6939175 6791429 7105862 8248926 8808459 8467031 10531922
6245 10531922 12020643 14087222 14536074 14100777 13118549 11810079 11510794 9635591 9244495
6236 9244495 9062447 8786790 7961928 8888288 9247849 8528168 9378586 9104526 9377495 9926773
6226 9926773 9315451 9207547 9747072 9553960 8849685 9714256 10787464 10921272 11063039
6217 11063039 11519008 11348743 12616521 13936222 15041140 18236296 19912301 19348736 18990505
6208 18990505 18328585 17637834 17114199 17180060 17923388 19909873 21763219 23090706 26184963
6199 26184963 29123154 31811305 34034112 35510024 35301432 33771674 30954370 28737661
6191 28737661 26987334 24127451 22589006 20854267 19647259 19102477 18476644 18126643 18442887
6182 18442887 19448151 19925869 20843845 20715359 20096001 19648184 19719319 20125709 20261956
6173 20261956 21679818 23521332 25187530 26986368 30773681 34259493 39229898 44131651
6165 44131651 47380698 49705802 50364955 50139272 47362397 44630407 41158013 36514581
6157 36514581 32041440 28857562 25297354 23586600 21963577 20071769 18747666 18577685
6149 18577685 17594295 17650230 17706951 16453289 16817413 17513382 17597226 16672578 16914312 17444646
6139 17444646 17587025 18702727 19874078 21608157 23967570 27086699 29300563 32857214
6131 32857214 34986082 35373425 34216632 31807697 29191513 25816496 23621275 20753385
6123 20753385 20239572 18799958 17522142 15938652 15155204 14384287 14027421 12353660 12610586
6114 12610586 12752095 12895418 13155151 12263668 11657487 11812968 12545803 12393527 13126678
6105 13126678 12779747 12641635 12170103 12897873 12555511 12382802 11986283 11428942 11517743 11558279
6095 11558279 11536539 10463746 11339791 11275003 11160586 11745053 10677188 10597891 10756773 11079836
6085 11079836 10600823 11147389 10726102 11154878 11832608 11119239 10536933 10372715 10788229
6076 10788229 10812243 10950195 11360581 11196984 11458484 10886794 9607066 10088914 9527289
6067 9527289 10087533 10082941 9759182 9633388 10105759 9378101 9196236 9516213 8872016 9817304
6057 9817304 9389214 9259614 8792435 8988152 9262636 9389953 9400756 9596927 10332525 9359185
6047 9359185 9179184 8632411 9161000 9520582 9764810 9270460 9487560 8977841 8768512 9313225
6037 9313225 9160066 8850461 8258181 8159492 9154518 8654481 8782854 8782165 8082638 9594664
6027 9594664 9934597 10377229 10330466 9550767 9935533 10748776 10612513 11281143 10207708 10211089
6017 10211089 11135026 10963485 10809951 10539593 10431904 11343491 11126177 10691396 10596352 10735058
6007 10735058 10565925 10468418 11331316 10562615 11481127 11869654 12349415 12251270 11477862 12167236
5997 12167236 12764577 13413289 12981603 13815201 14054164 14937235 14608110 14806529 14925967
5988 14925967 15323748 16522625 17228987 17739487 18625958 19170051 19255683 21360071 21470470
5979 21470470 22027246 23005581 23003782 24217550 24733530 25304642 26330630 27348736 27797277
5970 27797277 27750236 28548490 29313403 29467833 29950848 30466843 29682724 29193739 29522744 29677671
5960 29677671 30888956 32532636 33055815 34000995 33842542 34254748 34597411 35458512 35485212
5951 35485212 36526356 37916619 38983766 39203275 38906301 39373189 39262159 39045755 38037643
5942 38037643 38253928 37907786 36517966 35554524 34847557 34702104 34466890 34190276 32375073
5933 32375073 31802035 31753951 30149958 29641596 29849080 29902118 29566910 30193265 29004245
5924 29004245 28302801 27981971 27887667 27885859 27574022 25531705 24727478 24225485 23945023 22804324
5914 22804324 21509064 21923815 20572858 20731026 19565523 18719881 17272190 17175727 16676266
5905 16676266 15485164 15707951 14622735 13614749 12527408 12294411 11147115 11638961 11642529
5896 11642529 10470576 10136524 10089376 9485501 8823155 9524015 8951658 9338012 9888083
5887 9888083 9188829 8988344 8617637 7743678 7473627 7531376 7406210 7163625 7353426 8179611
5877 8179611 7820276 7477647 7386594 7526554 7787720 8478236 8988757 11262167 14553281
5868 14553281 14066708 12923875 12089050 11216631 9466788 8236701 7517573 7622862 7306673
5859 7306673 7449586 5853435 5875316 5360754 4860537 5753879 4747027 4715700 4468219 4838768
5849 4838768 5423099 6005293 5035377 4175053 4571318 4718698 4364769 4029788 3995140 3772589
5839 3772589 3749479 3724941 2707694 3793533 3160054 3270887 4647871 4007896 4094074 4215021
5829 4215021 4344849 3617781 4229633 4317567 4109487 4218923 4054317 3625336 3084612 3608751
5819 3608751 3068743 4038759 3817791 3332835 3356692 3832652 3463723 4577593 4740308 4428419
5809 4428419 4668065 4270174 3282882 3681007 4073536 3643711 4417154 4415409 4912743 3818444
5799 3818444 3520296 3615261 4134531 4353119 4230251 2803973 3784164 4413440 3961042 3962632
5789 3962632 4940507 4800361 4625631 4419796 3794978 3375653 3574235 4193126 4176545 4211367
5779 4211367 3841516 3346763 3108671 3079141 3150999 3858865 3941283 4360515 3734349 4312172
5769 4312172 4613849 4138783 3405572 3294976 3487583 4311714 3799779 3589221 3104171 3054228
5759 3054228 2103291 2580198 3015095 3259329 3680153 4265194 4388915 3806526 4430585 3635402
5749 3635402 4623302 4938005 4648770 4649931 4524898 4282239 4180622 4226401 4362310 4529333
5739 4529333 4215186 3626519 4158545 3060067 3583717 4481446 5181388 4934161 4610856
5730 4610856 4456002 4580628 5394162 5438571 5173325 5194123 5048528 4959074 5046069 5142336
5720 5142336 4993042 4518882 4796523 4444140 4933183 5064207 5292582 6122095 6392543 6128770
5710 6128770 5122128 5103038 4551163 4376484 4992833 5471714 4902898 4410194 4803888 5026599
5700 5026599 5479376 4797024 5241918 5605925 6050275 6516780 7310841 8035473 8534961 8447837
5690 8447837 8269592 8283625 8218741 8771883 8007467 7997229 7961491 7385834 6956898 7052456
5680 7052456 6778900 7234497 7829784 8069309 8750700 8999003 9100003 8869161 9064315 8782193
5670 8782193 9038112 10347425 11101311 11063794 12839545 14021087 15303873 16181310 18395199
5661 18395199 23631103 32589915 46107375 60681008 67245938 62804692 54629612 43232336
5653 43232336 33790318 25601807 20159017 16943304 14256323 11778644 9265001 8435659
5645 8435659 7956247 7752968 6682189 6963184 5980223 6200477 5101438 4839617 5166048
5636 5166048 5501410 5619952 5588329 6401838 6363451 6467864 5770886 6546517 6264433 6004371
5626 6004371 5572738 5742360 5786275 5504562 4943715 4777808 5551394 5432434 5636548 6003197
5616 6003197 5945164 4949992 4977117 5703025 5080814 5730962 5303718 5425901 6089996 6802816
5606 6802816 7119120 5814607 6174252 6612752 6039700 6486369 6033938 5766774 5988317
5597 5988317 6365319 5903743 5868466 5914376 5562739 5596304 6060993 6425351 6191038 7914577
5587 7914577 7238935 7235989 7180096 7772992 7501646 7665918 8332111 7996757 8310184 8548198
5577 8548198 9033290 8298440 7982180 7528880 7118115 7528891 8398456 9317780 9789799 8999580
5567 8999580 7984367 7090456 7891797 7700041 7260378 7226726 6659051 6917112 6516542 7481453
5557 7481453 6503824 7366426 7374981 7254348 7403514 8554767 8763514 7610465 8204735 7345818
5547 7345818 7184251 7312915 8618268 8172835 8091264 7190498 7225851 6671739 6704157 5832293
5537 5832293 5976521 6142400 6135091 6361392 6753762 7066007 6774348 7015236 6504113 7002188
5527 7002188 6870461 7089416 6787562 6700890 7005724 7043810 7411416 7506438 7618564 7285501
5517 7285501 6666744 6777954 6682835 6295909 6083673 5694882 6484539 6707285 6961706 7156319
5507 7156319 5989674 6176785 4938897 5981934 6002866 6490295 6188400 7084327 6988125
5498 6988125 7876151 9356487 9205706 9315557 7232859 7124380 7092366 8560373 9207222
5489 9207222 9991499 9691951 9720863 9597275 9670975 9589226 9567775 10473856 10326645 10378320
5479 10378320 10181939 9697884 10350466 10798305 11306728 12339241 12764846 13623156 13798131
5470 13798131 13244520 13445310 13976104 13826033 14462624 15091501 16467347 17017284 17556044
5461 17556044 18096761 19244940 19725216 18809678 19419993 19429368 21030413 22136947 23610341
5452 23610341 24322665 25298249 26613772 27157753 28523525 29319298 31766718 33880075 38308671
5443 38308671 43428811 50936496 60553476 67796531 69712178 66442857 60648493 53387666
5435 53387666 48021234 44727675 41641688 39627351 37760305 36652974 36274050 36524241
5427 36524241 37279930 36629312 37181233 36078951 35598491 35605661 36325595 36934770 36784516 36703362
5417 36703362 36665672 37907611 36935672 36985245 36233295 35580726 36441034 36538123 36244129 36140935
5407 36140935 35119247 34536991 34319918 33427223 32890579 32138172 30925076 29199529 29218919
5398 29218919 28472484 28494881 27124966 27264720 26060100 25521288 25964889 25039460 25270305
5389 25270305 24618147 24302396 23623629 23554622 21583848 20922359 19914020 19776058 19655844
5380 19655844 19211761 18694590 17351007 17111039 16583965 16257937 14943761 15084773 14508826
5371 14508826 14413101 14326681 14412051 13501241 13164278 13688172 13760923 13714803 13662333 12969704
5361 12969704 12021106 11560198 11459641 12304126 12304949 12207276 12064031 13364282 14957916 16514506
5351 16514506 19664117 23944934 27116538 30257285 29291688 26064616 23005055 19231842
5343 19231842 16854566 14895545 13729287 13207460 11490343 10556382 9756515 9164612 9320698
5334 9320698 9338889 8598326 8508362 7636152 8078371 8191243 8612370 8718597 8604987 8462236
5324 8462236 7878347 6918839 6714556 7294083 6515936 7457379 8158690 8716384 8804911 8630903
5314 8630903 8273881 8667614 8629892 8613146 8447969 9199257 9385064 9928499 9759932 8848989
5304 8848989 8573819 8130361 6810756 6465376 6383419 6594510 6276875 6737223 7470564 7138244
5294 7138244 7218664 5969290 6406765 6813448 7286251 7268757 7506813 6263118 5988158 6944197
5284 6944197 6709093 8233734 8353973 8822967 8536709 9447839 9661452 10050680 10182944
5275 10182944 9247223 9573397 9105424 8441411 8178057 8865596 7186205 7612739 7333490
5266 7333490 6999098 6821929 6583767 6405399 6629415 6898508 6944176 6858202 7433292 8190338
5256 8190338 8179453 9338794 8180018 8772205 8504214 8204095 8684869 9813402 10374927
5247 10374927 10275065 10986277 11664167 12362727 11103347 10411837 9403522 8951220 8812589
5238 8812589 8182765 8565745 8448277 8731973 8734363 8312914 8396365 8383928 7804337 7652435
5228 7652435 7696926 8332413 8588763 8574258 8635917 8753176 8397699 8757341 9304475 10694612
5218 10694612 12001350 12035704 12940582 12478139 11898769 11310766 11403971 12056553 11578864 11430626
5208 11430626 11001819 10334209 10050545 10203493 9801436 9946052 10265621 9589178 9678943 8807861
5198 8807861 9281068 8845462 9425967 9918500 9319556 9013539 7538966 7401631 8084141
5189 8084141 8527683 7572599 8559249 9096611 8868850 9844743 9737782 10086652 10457398 11190538
5179 11190538 11380227 11514291 11143800 11220338 11120457 11593608 11272439 12248887 12325637 11676953
5169 11676953 11378788 10764908 10689535 10626085 10072651 10451334 10979406 10095334 9651559 9172273
5159 9172273 9548539 9702537 10337760 10020443 9480211 10710473 10484788 9975139 11335945
5150 11335945 11253550 11334337 12238896 12354484 12480052 13134407 11850194 12735872 12590739 13276088
5140 13276088 12866809 12923571 12903992 12850581 12697955 11953351 11661900 10580758 11213331 11351694
5130 11351694 11643468 10605798 11030325 11064204 11277042 12474387 11957004 11169335 11617316
5121 11617316 11751195 11662446 12570271 12351363 11845899 11631368 10864922 11704233 13193688
5112 13193688 13559235 12551493 12036033 12018416 12453689 13211140 12534469 10888872 11257370
5103 11257370 11055670 11615941 11652483 11252661 11657674 11219772 10681142 9561025 11112048
5094 11112048 11765578 11885565 12058745 11645816 11780500 12969689 13099319 12515948 12751009
5085 12751009 12248612 12838224 12903258 13620840 13539237 14274451 15226799 14587571 14763569 15006860
5075 15006860 15394049 15918255 16232748 15143830 15565447 15753482 16240938 14508922 14953551
5066 14953551 16458163 16757461 17874691 18054668 19256674 20615500 21926566 22738726 24985227
5057 24985227 27458322 31838164 36960131 42312401 50776451 55803890 56134475 51466753
5049 51466753 45266561 39464208 35121449 32011550 29229816 27852435 26476232 26217765
5041 26217765 25552835 26905640 26247739 26888110 28019170 27739193 28641649 29583950 30520688
5032 30520688 31660069 32517144 33731006 35533715 36927570 38191449 40262973 42788037
5024 42788037 44667409 47283932 49857721 52789794 55327281 59331638 63018970 67999796
5016 67999796 73106982 78546613 86218826 92896929 102411085 111862074 123417161 136248385
5008 136248385 151722841 166562766 180869635 195076234 204244964 210766139 211234908 206521256
5000 206521256 197331738 185654834 170596232 155722622 141188009 127493716 115079254
4993 115079254 104316633 94282688 84867677 78076375 70991043 65230246 60565438 56461237
4985 56461237 53169639 50756051 48111509 47256822 46653027 46284428 45295018 43378466 41696492
4976 41696492 39339178 36890949 34877926 32756539 30433661 29490917 28228602 27796134
4968 27796134 27020121 26678333 24892610 23559075 22751906 21701277 20781152 19470441 18502680
4959 18502680 16969142 17633222 17082554 17811853 17700568 17168183 17231338 17306554 17211082 16964159
4949 16964159 17063147 16785305 16882679 17258461 18010735 18319747 18247811 18298754 18748032 19201786
4939 19201786 20529155 21844749 23915757 25406855 29433681 33506729 36907869 39215524
4931 39215524 38153012 36179419 33013882 30321990 27466616 25677261 23579918 21824415
4923 21824415 20235793 19866775 19075173 18763487 18988177 18551139 18504312 19722697 19455334
4914 19455334 18582163 19603216 19650823 20156425 20300335 20986486 22229804 23681128 26073535
4905 26073535 28692320 32138297 36864324 40353390 44225955 49270193 51972882 52491485
4897 52491485 51330873 46702572 42594489 37521928 32992872 29811658 27254421 26308486
4889 26308486 25316254 24891682 24562304 23355184 21584947 20100396 19487949 18435704 17918966
4880 17918966 16836624 15681839 14766202 15228619 15650636 15951228 16003553 16047796 16974007
4871 16974007 18388414 20689242 24057112 27765465 29477088 30609212 30052229 28595788
4863 28595788 25317672 21829545 18908589 16916625 15549142 13759591 11854388 10703606
4855 10703606 9030820 9003164 9137803 8328210 8822373 8081189 7483383 7784254 7935865
4846 7935865 7780052 8127509 7788479 7500462 7044393 6035728 5549711 5516016 5305359 4884030
4836 4884030 6066838 7041821 6852220 6666628 6401345 6674207 6294412 6380114 6290063 6061575
4826 6061575 5756508 5388250 5247894 5757912 6101000 6842949 6703141 6898193 7599185 7515383
4816 7515383 8049467 8533037 8618153 8537872 8936412 9445747 10264456 10530982 10314111 10104165
4806 10104165 10794979 10539785 10661303 10840591 10666157 10728355 11140303 10496492 10001494 9901912
4796 9901912 10019920 9560204 8669631 8356379 9150809 9216282 9108552 9357112 10730802 10556174
4786 10556174 10799795 10319625 10755196 11617333 11646268 11978458 12708162 14012980 14498619
4777 14498619 14981526 14552856 14594231 14630605 14955478 14718598 13870284 13454280 12562392 12171329
4767 12171329 12811530 12781582 13152449 13049912 12975155 12895819 13212470 12756823 14094527 14298764
4757 14298764 14895428 15928999 16401270 17670854 18133649 18607344 19157621 19985208 21210178
4748 21210178 21834264 21569744 21937580 22185493 23352317 23791884 24021707 25168422 26261908
4739 26261908 27551754 27655898 28985105 28821719 28788145 29031238 28066403 27153309 25647890
4730 25647890 24327105 23663675 23405232 21749269 20655666 19178127 18412059 17517191 16085537
4721 16085537 15875229 16089334 15929762 14548109 14047565 13251359 13027098 12395234 11166793
4712 11166793 11011764 11495472 10952285 10591272 10322702 9406234 9823371 10127068 10036741 8947333
4702 8947333 8916024 8958106 8580209 8154345 8088623 8032162 8457810 7865021 6346235 5319977
4692 5319977 5529396 5238504 4881098 5026867 4462065 5403476 4977199 4863525 4627550 5079210
4682 5079210 5398526 5556137 5100665 5442234 5696938 4951867 5366510 4634387 4920454 4773034
4672 4773034 5538523 3831027 3593769 3669229 3537208 4570760 3976470 4157931 4188658 4712182
4662 4712182 3531349 4235725 4372623 5097159 4148511 3867975 3604606 2745223 3186009
4653 3186009 2586888 3061632 3395888 2860340 2287036 3587426 3121927 3248309 2663206
4644 2663206 2431759 3675870 3861742 3711100 3700139 3234365 2650346 2547300 1559267 1486325
4634 1486325 1612651 1136696 1460131 1152609 966307 1163316 1850570 1845574 602473 1192163
4624 1192163 2165511 2699582 2766311 2629573 3578987 4406330 3840541 3310853 3172941 3599638
4614 3599638 3435867 2383707 1917466 1256114 1232808 1449832 1460152 1742463 2197164 2452992
4604 2452992 2531476 2723789 2173831 1695565 1651049 1598109 1452968 1746739 2065867 1997688
4594 1997688 1418582 909488 1107899 1446572 1264337 1165850 1555484 1700321 1666740 1385519
4584 1385519 1888569 2347254 2408301 1645334 2832485 2533331 2504499 1782986 1222707 1300329
4574 1300329 1492783 1758161 1502537 1772603 1374044 1115728 1020499 1656782 1441070 2739106
4564 2739106 2619392 2771898 2990107 3115381 2631999 2586088 1990876 777546 1797350
4555 1797350 1923091 1904309 1060810 1611156 1266470 1521058 1252205 1360162 1788925 1200978
4545 1200978 1629251 531085 2307245 2821163 2836818 2492256 2528706 2288164 1919122 2155350
4535 2155350 2192778 1670463 1697101 2274200 447035 -297738 -778192 -740813 328062 1872780
4525 1872780 2028072 1942281 1657062 372004 273387 1273722 1163326 1556355 1829257 1952477
4515 1952477 2486357 1778476 1550071 1307030 2132480 2745347 2998012 2989236 3574541 2565205
4505 2565205 1785217 2058740 2305335 2304460 1711878 2055760 665663 1116748 181153 415250
4495 415250 450972 138832 908509 509900 1081091 306270 885870 1073445 1956727 1798978
4485 1798978 2106488 2975613 2943654 3093035 2551857 2724513 2825749 2636735 2414880 2467415
4475 2467415 1487113 1871480 1697521 1913881 2792267 1795710 1506660 2073134 2206082 2166746
4465 2166746 2576131 2165854 2531121 2487142 2218183 2926687 2799428 3349559 2578545 2916683
4455 2916683 3302108 2830303 2574654 2135242 2591018 2291451 2543820 2167345 2229065 2392024
4445 2392024 2674588 2288935 1421210 1097047 1363146 1594823 1237785 1185980 1519926 1805553
4435 1805553 2443092 2042995 1307239 1773682 1890803 2295665 2575940 3228282 3200493 3650025
4425 3650025 2350496 1923944 2322025 2365161 2973487 2770426 2906929 3008399 2766786 2603305
4415 2603305 3503455 2666137 2988901 2676697 3215926 3321514 2861025 4009638 3600911
4406 3600911 4117342 3825301 3870875 3731210 4839081 4749708 5060020 4968658 3786369 3733663
4396 3733663 3829311 3409843 3201361 3628628 3475488 3702656 3366896 2935773 2810788 3747897
4386 3747897 3322397 2862048 3524903 3839198 4091936 4730523 4565866 6395715 9144336
4377 9144336 10402420 11517275 10674874 8549914 7670530 7270529 7289774 6504614 6117035
4368 6117035 5365715 4816038 4656275 4542278 5210596 5027087 5136779 4459693 4874440 4592397
4358 4592397 3900308 4148821 3455054 4179833 4927680 4669579 4278983 4245124 3474072 4313527
4348 4313527 4984352 5157487 5665279 4351208 5197733 5458828 4529180 4728868 4839497
4339 4839497 4262689 4496821 4044004 3747461 5392393 5049542 4227665 4528843 4973935
4330 4973935 5631991 5516913 5831904 5132995 5674878 5785782 5954715 6397574 6171320 6234623
4320 6234623 5776876 5978937 6049168 6049245 6456661 6650991 6948179 7428011 7882379 7747216
4310 7747216 8581473 8979040 9623021 10831082 10990761 12495812 12955265 13846815 15400200
4301 15400200 16684241 17793875 20361277 21985253 25576577 31191593 39165388 53186654
4293 53186654 78661479 120136185 163121498 177571651 161596971 134206652 103047267
4286 103047267 76907288 57144132 42780539 32627103 24908978 19950051 16544252
4279 16544252 13931095 11396055 10560669 9511726 9181232 8179869 6268579 6540580 6039592
4270 6039592 6411137 6246683 5718776 5665095 6006485 5815398 5929896 5825882 5039037 4984313
4260 4984313 3994135 3397969 3595825 3969065 4324335 3947661 4015656 4245663 4635526 4148083
4250 4148083 4231491 3155726 4316158 4661188 3486209 3833406 3362215 3845200 3260933
4241 3260933 2918273 2498582 3213303 3357412 2798228 2692451 3015039 2749487 2298142 2984478
4231 2984478 2297523 2358348 2649305 2087651 3488854 3307615 2951945 3190834 3337895 2801610
4221 2801610 2937141 3550090 3013726 3665863 2441930 2466814 2390616 1831598 1564732 1013738
4211 1013738 1797647 1446646 1939374 2145722 2332427 2099411 2401542 2759463 2373575 1737641
4201 1737641 1002588 1891713 1572968 1787881 1767830 1473947 1675380 2100849 2214345 2488007
4191 2488007 2777401 2538652 2635981 2523970 2041658 1689958 1845073 2223075 2244548 1786571
4181 1786571 1389558 1216247 1582118 1676804 2086955 2375433 2482769 2352430 1187595 905406
4171 905406 1550392 1634894 2049887 1967511 1914039 1350025 1143566 1108731 1327675 1004888
4161 1004888 1186537 2109652 1672992 2328788 1858653 2094236 2000545 1154879 778267 911785
4151 911785 1731908 2104655 2085928 1223100 1185906 871444 862403 1112067 946423 1676280
4141 1676280 879004 363821 261318 773164 1244604 984383 1042085 252169 1172135 847925
4131 847925 786884 1019883 1617824 1870551 1846377 1818951 315314 1280996 1722741 1656331
4121 1656331 1608585 1368452 1199424 992132 981404 1167108 849444 1355902 1751592 1348376
4111 1348376 2255975 1841712 618470 624728 369308 975439 1522026 1131679 1195690 1365187
4101 1365187 1476706 1360216 1452161 1387920 1014060 1197306 1301323 1618577 1814060 2106222
4091 2106222 1881701 1520006 1172305 997472 1593627 2310067 2066613 1248926 1424824 842346
4081 842346 1691002 2723060 2601623 2522372 2454598 1775077 2043923 2432227 2202142 2518658
4071 2518658 2932709 3623182 4727335 4430758 4632361 3831710 3043112 3843972 3593556
4062 3593556 3813464 3709844 2181763 2092462 2151485 2437911 2658930 2368026 611787 418387
4052 418387 1027421 1207959 2021211 1260001 1609927 1436289 1469810 184097 1281713 1976429
4042 1976429 2103359 2838630 1934882 1074963 504108 378979 997182 1415356 1790586 1719589
4032 1719589 2173703 2026082 1422903 994207 1406268 1767015 2500159 2654556 2222192 2383223
4022 2383223 1961706 2141523 1787859 1579653 979733 1324721 932396 807708 697635 920670
4012 920670 976262 1598039 1114775 1198822 1642391 1572904 2461201 2447148 2466515 1921445 2496104
4001 2496104 1951042 2454314 2456673 2450567 3093504 2717095 2446806 1821885 1996787 2101867
3991 2101867 2408320 1849259 2846945 2089716 2630812 2383286 1475969 2228220 1240884 1050534
3981 1050534 343909 1018471 1429229 1147638 1100942 1141568 1057044 2120786 2074017 2050258
3971 2050258 1697070 1989221 1944965 1868664 2019765 2605887 2051069 1695150 2140425 893614
3961 893614 2064637 1463836 1920350 1576531 926711 978762 1233708 1070157 632059 766038
3951 766038 505933 1717487 1908752 2263108 2205091 1915425 2477326 2539513 2209620 2398294
3941 2398294 2190969 1685792 1628547 1480439 1652527 1522921 1448550 1132204 1589510 2174420
3931 2174420 2167502 2282230 2764686 2282291 2748444 2443590 2311315 2094517 1543131 1636246
3921 1636246 1771397 2121789 1814610 1565234 1377981 1686159 1594634 2833172 2634308 3345662
3911 3345662 3398615 3701827 3834017 3200433 2205506 1854508 1842288 1307620 1181573 520909
3901 520909 976912 1304628 2062990 2168881 2856973 2455321 2211947 1874664 2107208 2905782
3891 2905782 2518306 2871385 2462441 2309356 2815250 3028862 2994693 3230449 2673359 1861507
3881 1861507 2143008 1594431 1648399 2442590 2186512 1880867 2172004 1711199 1845526 2660985
3871 2660985 2414063 2671842 3342654 2968286 2555811 2047918 2426505 2981040 3034979 2494058
3861 2494058 1847265 2668566 2436686 1875860 2232070 3350202 3104631 3170792 3097698 2998257
3851 2998257 4522365 5294799 4495606 4086089 3405229 2393752 2461906 1696584 2358943
3842 2358943 2651115 3071831 3304548 3100954 2803338 3046568 2709083 3169793 3467821 3092345
3832 3092345 3986581 3702530 3224018 2748590 3159089 2601154 3005709 2751951 2249598 2077177
3822 2077177 2226330 2283583 1626782 2069112 1940777 2272612 2948456 3345969 3185437 3232589
3812 3232589 2963868 2363458 2204304 2418075 2560798 2823291 2878845 3401016 3112275 3029295
3802 3029295 3394658 3029365 3320445 2340522 2778320 2429523 4167903 4159274 4194672 3832244
3792 3832244 4114270 3464674 3576521 4162257 3720617 5091100 3582848 3311997 2895780
3783 2895780 3436538 2784081 2345369 3217913 3552529 4167271 4425438 4176282 4288884 4587208
3773 4587208 4115523 3342005 3674998 4253319 4406509 3506281 3674781 2835564 3005911 3945153
3763 3945153 3809870 3982483 4966406 5192047 4547965 4807586 4294843 4157636 4337598 4170245
3753 4170245 4439679 4107558 4577958 3971490 3782227 3362057 3084727 3244938 3947880 4035857
3743 4035857 4272180 4806001 4350012 4679658 3478158 3169624 3381470 4293361 4526537
3734 4526537 5247966 4653199 5094282 5423471 4529172 4473321 4637686 4115428 4745138 5103742
3724 5103742 4494350 4570849 4348782 4399623 4702961 4191809 4573645 4674661 4741767 4752182
3714 4752182 4517826 4855539 4710448 3394409 2012355 2381110 3202599 4708492 5706511
3705 5706511 5672995 4629485 4564228 4304040 4086363 4315938 5309792 5411048 6008393 5360157
3695 5360157 4994635 3838580 4685335 4365111 4309160 4539024 4280363 4033226 3963857 4070175
3685 4070175 3959972 5385343 4844635 5150715 4824129 4537904 5021818 4594181 5201075
3676 5201075 5359795 4917450 4463938 5385071 5643828 6437631 6625366 5798754 5783661 5575576
3666 5575576 6543257 5740262 6555312 5672760 5689642 5148824 5512997 5442924 4956488 4273599
3656 4273599 4157269 4466027 4919226 5714598 5113929 5128594 5250661 5328007 5140899 4813999
3646 4813999 5675640 5495214 6906911 8159347 8914710 11301851 13082346 13113218 13017252
3637 13017252 11993787 9753620 10299902 9165068 8233129 7657449 6388990 5268564 5419184
3628 5419184 5484976 5702696 7282365 7235590 6487308 5644340 5468099 5020173 5049941 5120606
3618 5120606 5081282 6408378 7524535 8082520 7612667 7939974 9759422 11464834 13990867
3609 13990867 17819434 20664691 22199143 21578931 19044724 15845508 13707974 11392067
3601 11392067 10256560 9056783 7961635 6900603 6934854 7271759 6740207 6652817 5617525
3592 5617525 5762954 6213094 6245262 5652512 5602704 6147501 6064048 6235804 5008173 5572884
3582 5572884 5947676 6464490 6987137 7679231 9543829 11391347 13499376 13338376 13613618
3573 13613618 12569897 12611490 10770958 10080346 9073084 8371385 8062735 6977524 7396337
3564 7396337 7640166 7794026 7375451 7086593 6517198 7208878 7524598 7684632 7348426 7192141
3554 7192141 7054365 7176098 7430954 7630340 7689874 7244185 7276400 5972053 7143128 7780249
3544 7780249 8130716 7740159 7670947 7347405 6758616 8093298 7660051 8051195 7778484 9227534
3534 9227534 8869575 9046560 9124877 9163037 9666350 10949214 10442428 10779423 10635429 9186314
3524 9186314 9163282 9574826 9880936 11145280 11125131 10815662 10912739 11072330 11363992 11396910
3514 11396910 11841292 11177635 11404167 11411294 11462671 11440716 12097653 12060645 12920749 13137944
3504 13137944 12627455 12618725 13218728 13280765 13242704 13725063 14269499 14465716 15175140 14454762
3494 14454762 14534339 15217195 15784359 16090232 17795803 18439709 17911250 18055381 17677548
3485 17677548 18568508 19367934 20576797 21183799 21953846 23814307 24085485 24467216 24872650
3476 24872650 25682722 27578450 30031218 30870490 32463233 34736190 36435110 39990225
3468 39990225 42387454 45509868 48605998 52122345 53670126 55194106 54966231 53503491
3460 53503491 51699083 49398836 46819692 44388695 42159259 39537489 39291515 38675165
3452 38675165 38751359 39699468 39779008 38916079 36995628 34529987 31049260 28653641 26293536
3443 26293536 24568646 23294754 22462739 21238468 20081896 19771925 18277473 18009852 17336643
3434 17336643 17105309 15778066 16058509 15551927 15082547 15753372 15350287 14820240 15530851
3425 15530851 15964238 15265221 14451523 15013188 15251464 16219049 17703980 18014407 18369400
3416 18369400 17637932 16439848 14925519 14638588 13880252 13863020 13057533 11795870 11959911
3407 11959911 11839039 12192766 11534122 11097771 10569950 10909868 11063559 11370705 11355155 10967358
3397 10967358 11137888 11338399 11880332 11811477 11866770 10875983 10235906 9592859 8950084 8757510
3387 8757510 9972498 10481210 11108797 10661202 9779340 10062674 9769097 9804875 9484916 8755899
3377 8755899 8664677 8330771 9160301 9370587 8660097 8461984 8415101 8568861 8458051 7650784
3367 7650784 7878239 8156368 7849257 8233870 6951721 6815995 7126214 7075703 6968368 7526733
3357 7526733 6840610 6290613 6373203 5748896 5503274 5420495 5978112 4996783 6709724 6613136
3347 6613136 6705657 7316695 7016136 6388859 6481835 6899308 5465444 6242411 5615755 5962900
3337 5962900 6267255 5510354 5299837 5040790 5066829 4876330 4444208 4634125 4373436 4305175
3327 4305175 4500408 4677412 3970436 4037876 4220351 5459473 5903399 5511524 5264420 5020756
3317 5020756 6151581 6097839 5940901 6043983 6159805 5970631 6040349 5604315 5015665 4617345
3307 4617345 4343493 4728072 5545729 4702740 4180630 3875205 3131926 3214779 3838626 3950283
3297 3950283 4415902 3786047 2718873 3201815 3001263 2551911 3242859 3978575 3799775
3288 3799775 4234793 3828167 3685262 4346045 4032555 3754279 3834836 4121687 3798878 3776223
3278 3776223 3386769 3199553 3288070 4299044 4522156 4015234 2924756 2781289 2670697
3269 2670697 3609459 3898833 3645106 3809350 3010359 2487495 2559448 3038420 3285992 3717755
3259 3717755 2529588 3489196 3130757 3085383 2817082 3019389 3175979 3024039 2929277 3099952
3249 3099952 2898994 3094653 3184182 2730703 3100516 2720220 2237403 2692533 2666258 2571315
3239 2571315 3451356 3584005 3924132 3150227 3203736 2961647 3284538 3759530 2865442 2730633
3229 2730633 3497207 3273958 3663014 4210254 3479583 3636193 3284916 2777478 2680446 2186874
3219 2186874 1873155 2029465 2528685 2586989 2803525 2709760 3528849 3290642 3646540 3830590
3209 3830590 3850340 3584774 2603169 3423921 3268384 2990678 3480018 4096467 4057228 4195327
3199 4195327 3168396 2975783 3586896 4156277 4915403 4984713 4475162 4006238 4146446 4436339
3189 4436339 3678448 3741035 3047276 3727999 3973131 3293361 3059887 3349412 3351355 4344450
3179 4344450 4551542 3579502 4439346 4513920 5206999 5558282 5179205 4856553 5374695 5322557
3169 5322557 4858873 4840624 4833812 5052396 5733114 5674476 5858185 5729935 6152801 5808676
3159 5808676 6702097 7616539 7463343 7862002 7768277 8100108 8386098 8425854 8144090 8564448
3149 8564448 8972955 8743486 8615505 8984585 9102240 9225971 9778204 10115086 10100025 9638014
3139 9638014 9481206 9393570 9338163 9351201 9758384 10130176 10231061 10355709 10271248 10258249
3129 10258249 10723100 11218038 11261040 11824145 12476750 12650565 13102347 14556115 14714688
3120 14714688 14532063 13937469 13420170 12139531 11667148 11528321 11805086 12028349 11885852
3111 11885852 11280496 10146750 10305094 9869508 10153936 10635191 10544555 10457368 11478361
3102 11478361 11423088 11389901 11169491 10741596 10274805 10907213 10998455 10766247 10942346 10820365
3092 10820365 9792701 10008987 9897184 9661110 9093078 8138068 8026223 8344142 8561430
3083 8561430 8973622 8681995 8417463 7664529 7624686 8289595 8089705 8611134 8254711 8973113
3073 8973113 8383121 7794009 6767471 6488487 5640680 5493730 5873992 5414003 5506539 5343487
3063 5343487 4186032 3540888 4168027 4227355 3976429 3958645 3604085 3206184 3641949 3492864
3053 3492864 3096744 2977374 3582716 3181703 3560958 3607039 3020321 3744434 3978379 4632032
3043 4632032 4395442 4612245 3672859 3493586 2434773 3359162 3836753 2938752 2684577
3034 2684577 1944957 2332544 2120893 2256750 783765 1237729 1295983 1382988 1516705 2411882
3024 2411882 2345826 3006533 3805093 2967729 2876960 2870470 2683696 2823957 2583057 1656895
3014 1656895 2113708 2509931 2428160 1897469 1776487 1713519 1963624 1248241 1692416 1582793
3004 1582793 2190013 2195205 1995202 2285718 2182097 2244871 1258099 2049040 2684286 2818918
2994 2818918 2453271 2412340 1422017 1386216 2141155 1935532 2480382 2833267 3044869 2048660
2984 2048660 2575425 2138903 1334702 2134519 1877569 1290641 1265551 1488489 253398 981908
2974 981908 1469239 50059 381571 491289 910226 1339993 1041940 897548 1022753 1439518
2964 1439518 2336099 1702810 1482646 1863477 1272546 2044880 2340503 1703672 1091488 987237
2954 987237 1108760 912812 372684 617004 613546 719598 1375553 831125 1319511 629315
2944 629315 -479177 -814774 -167187 1007367 1712127 1571206 673592 240307 -511064
2935 -511064 445587 602762 402329 507474 -79680 -163021 708779 1198254 527608 485996
2925 485996 345338 -84169 754716 763028 -359841 -181182 462935 -35748 286962 144258
2915 144258 -566104 -334097 205661 273556 747547 685799 834150 -359444 76857 602968
2905 602968 494611 584095 758228 859208 918915 832984 -365080 84813 507403 783149
2895 783149 -97753 -579678 -964481 -793841 -865993 -272914 265582 819703 707372 557823
2885 557823 172981 -345641 852028 430039 888548 503350 828159 111837 677695 1368766
2875 1368766 932215 1996724 747644 534403 -143405 1047648 329126 397229 -131409
2866 -131409 -528907 -347805 -119499 -1145443 -1496613 -1041698 -598997 1008950 840556
2857 840556 -65188 -1301941 -1157427 -1138773 60842 -155110 524490 831622 595156 173854
2847 173854 361644 294549 550687 717739 634810 419216 1497615 781071 -68006 190808
2837 190808 -194470 -288587 -219252 -719812 -983450 -127401 -216544 -52917 475345 281494
2827 281494 248095 618556 453827 -208423 309941 664611 464247 475070 -338345 -199741
2817 -199741 -289598 67795 359262 336686 299597 831842 424182 22911 464356 941078
2807 941078 601737 721743 109509 360092 118083 -61104 -820825 -1054951 -847903 -833384
2797 -833384 -608465 -280501 -108876 149374 240074 -179300 -30217 191593 168038 243674
2787 243674 -127586 29803 101148 -475810 -342126 -887963 -1003954 -285755 223538 155186
2777 155186 411373 -256549 -329979 -254974 -350162 -130077 153385 690006 1785265 361317
2767 361317 937818 1268414 725972 1136099 898999 287705 141772 1320 -732159 -1675275
2757 -1675275 -1518328 -927990 -997845 -310389 -464570 -1437426 -850644 -502902 -142125 903798
2747 903798 138317 -22236 501310 279022 564681 78920 -398919 -174705 -135629 706980
2737 706980 -136488 -272150 -251672 382341 1183944 1600321 604378 356907 77839 299584
2727 299584 1213159 730162 371402 -330253 -1028673 -1038860 -1180718 -879334 -552840 -90175
2717 -90175 -394729 -495383 -218827 651967 770746 363609 749694 542129 1547635 1011306
2707 1011306 1362084 1165025 1412245 962353 691574 487192 73529 -120383 336198 958599
2697 958599 362579 716840 183159 -772651 -508060 -788208 -508532 742546 979341 394569
2687 394569 953218 610430 357397 690715 556798 573075 1269891 1344917 475566 -278843
2677 -278843 -159037 80798 832216 1607626 363109 639468 -46626 -203236 127756 625743
2667 625743 953006 988878 762578 485527 642282 207644 189919 -649078 -262219 726491
2657 726491 496820 602161 763902 195236 13715 222597 -271339 65760 81841 -205887
2647 -205887 -173203 393088 -208230 -218649 -316788 -203558 -520116 -369214 -466196 -476212 583167
2636 583167 -62286 418063 183478 13274 -553201 -487312 -807697 171928 621429 -108962
2626 -108962 -12142 -1196554 -1049510 -1075440 -393318 -360915 -363184 30417 662123 890863
2616 890863 574737 52157 -974370 -818393 -178674 850075 497997 -811769 -1181317
2607 -1181317 -1018260 -481896 -255063 -387698 -110813 543434 550676 1571902 1849036 1580853
2597 1580853 1940152 808109 811832 797457 1615610 1784514 1958029 1556638 1088423 718734
2587 718734 772220 475443 156120 61521 402974 774398 504222 195724 -8255 149764
2577 149764 -80595 681051 1093432 1400004 1501782 474440 -363776 212754 445824 -330671
2567 -330671 432446 295927 974205 1302328 271523 988356 806293 1196913 388588 483806
2557 483806 16583 282840 885329 672185 560110 898886 1000237 577732 -91726 -383733
2547 -383733 -97009 -157706 -847035 50545 990320 1116624 1651931 654787 1051142 1450041
2537 1450041 2154223 1456506 988460 988449 215716 981265 1102126 1607572 517316 -26140
2527 -26140 -660662 -619110 -415256 -382540 -148219 172761 1163028 410478 1074025 1591738
2517 1591738 1003370 375816 552807 57206 426043 126059 -328309 -395575 79637 215692
2507 215692 128276 237435 448062 1194321 1644711 1700153 1105942 1122317 -228098 -778916
2497 -778916 -188337 286361 1376350 742600 431052 789247 577568 639604 181921 -142932
2487 -142932 -772923 -242934 89094 -90324 453214 1173716 1321957 941511 1219562 57516
2477 57516 471952 358604 1119269 1213691 1539507 2094439 1009481 1331465 1117649 635699
2467 635699 908877 1782446 337798 844139 1097095 828873 1648067 1383118 1593763 1549929
2457 1549929 2267343 1821631 1822223 1949041 2145674 1270032 788432 1488714 1419596 1914423
2447 1914423 1533852 1160187 1207113 1576694 2191221 2103587 1665441 1858945 956866 961737
2437 961737 945847 1513414 1227337 2565330 2416808 2256134 1963489 909903 1259806 1719019
2427 1719019 3035167 2303996 2507075 2063311 2041655 2072108 2486997 2496145 2224676 2254736
2417 2254736 1461559 1842521 2249214 2780502 2723045 2855061 2765351 2752048 2355720 2329122
2407 2329122 2706751 2503296 3226100 3482936 3031764 3205413 3379066 2255780 3114506
2398 3114506 3825939 4525677 4127925 4133457 3390536 2836347 3551036 3478175 3817148 4428328
2388 4428328 4372977 2738974 4047167 3975007 3745813 4299658 3621692 3746241 3962972 3535148
2378 3535148 3410126 3330010 4246042 4149447 4092772 4324702 4279683 3887277 4928315 4727145
2368 4727145 4398049 5203173 5194012 6019948 5682474 5921407 6306644 6743316 7080454 7238640
2358 7238640 8236899 7964985 8302018 9062391 8950871 9394580 9902422 9792764 10509277 11414336
2348 11414336 11707708 13296126 14177154 14670996 15863964 17646465 19673946 22454299 25575061
2339 25575061 29282278 30152685 31518090 31417210 32600384 34644340 38444353 42700121
2331 42700121 49666894 58705704 73348256 95716621 141327933 221424432 323032884
2324 323032884 375646529 354433851 302121149 232438884 172891103 128730798 98787633
2317 98787633 76344870 58189113 44635953 36423002 30904387 28874061 28670303 29306754
2309 29306754 29488876 27271562 24004811 20851255 17250591 15626193 14561349 13026258
2301 13026258 12088392 11067014 10167831 9965226 9381075 8856791 8634802 7694663 7104653
2292 7104653 6674259 6175971 7110846 6465563 6436755 5400507 4662745 5928095 5597249
2283 5597249 5394855 5145608 5252086 5935029 5362831 5767278 5931239 5769595 6144800 5216653
2273 5216653 4386428 4408200 4921980 4380008 4407730 3516083 3710865 3772348 3849971 3386278
2263 3386278 2875714 3666270 3920514 2839942 3757612 3595144 3531083 3617371 3585355 3222924
2253 3222924 3826557 3658311 3304067 2886992 2827200 3384860 2454479 2249159 1443720 1761223
2243 1761223 1699520 1039613 1226383 1261870 1554037 1591636 1317667 771599 950621 1087643
2233 1087643 1583157 1570647 1010777 1375331 1531054 2013842 1877323 1433715 845566 887373
2223 887373 400717 276137 408482 770336 1600325 1735776 1965905 1935890 1210957 684722
2213 684722 -79520 431793 969258 1256880 774538 -192014 -327474 48827 670534 957935
2203 957935 1054657 877512 845903 939016 -255052 199528 599041 638522 736294 257733
2193 257733 237424 666775 774168 261538 537598 166594 -44645 -713275 -1082397 -876781
2183 -876781 -937649 -249783 401295 -310405 -505141 -872987 -1108540 -426076 -385207 -1267223
2173 -1267223 -522211 -397189 -516997 80300 -390743 -759943 -487436 -551297 -849196 253962
2163 253962 520562 -635406 -218391 246149 818155 523386 -303541 -128875 -87359 833916
2153 833916 1054262 351324 130532 -451522 -751514 -23060 702657 120316 295634 -308052
2143 -308052 242166 473070 247292 488729 88809 538013 151944 495566 261090 1301653
2133 1301653 693025 563294 -522479 -469189 -109198 -298928 -6374 -650471 -675367 -280082
2123 -280082 359477 -115135 512417 61026 -379436 -805615 -692167 -382642 15189 -275838
2113 -275838 -238476 574050 198307 -283430 -583800 119104 776442 1276439 494962 352675
2103 352675 -7395 679392 427713 174164 240552 68797 451625 133039 311835 -59510
2093 -59510 345477 -186835 634379 -110677 -950360 -1076442 -1489397 -1311167 -209932 631094
2083 631094 731266 -190494 -658873 -816420 -785719 -51499 -709328 -512326 -63742 -105698
2073 -105698 189152 783195 238434 -358171 -218260 -717313 -1155687 -584340 -298487 -28691
2063 -28691 -221750 -165837 -11142 606993 536254 640755 955911 2181169 2573399 2310297
2053 2310297 2404093 1593090 808977 229933 -28817 -298614 98983 404793 -108459 73715
2043 73715 175505 -175302 -1425536 -1129484 -876223 -1272495 -439207 -941340 -1537265 -1174152
2033 -1174152 -761171 -1298525 -469725 -735098 -733672 -63429 -85174 490327 533698 1539589
2023 1539589 1257788 464940 672232 199294 -280679 299744 1049097 641979 932087 -481232
2013 -481232 -1077149 -524167 -448728 -187503 -763648 -1445686 -1058088 -1533721 -966312 -855822
2003 -855822 -474571 -194826 655016 164148 -67981 370560 477013 935595 1007319 334055
1993 334055 -246436 374254 13905 572646 632857 948114 -81435 -516040 -852249 -597289
1983 -597289 -531415 141458 506276 -199501 -373767 -643201 -414112 -158752 122843 -321294
1973 -321294 484872 125700 -26227 51976 -262066 417587 553351 1267450 1123667 1303724
1963 1303724 862547 833780 493397 1156786 1056584 857870 413447 -106975 -637831 -311494
1953 -311494 -181976 420837 -170909 -1270590 -484763 -325554 -203028 -426485 -62520 478177
1943 478177 842906 -203726 -232232 -222343 1008253 1075783 915715 435999 400042 -9577
1933 -9577 -600327 -705416 -786563 -428418 -790561 -526548 -793988 -411642 -858348 -1611847
1923 -1611847 -1301012 -1513007 -1211354 -665261 36258 -450062 -561355 -300679 -354107 -490806
1913 -490806 22632 206851 -230532 -113559 10378 15368 563410 -495022 -1088478 -761012
1903 -761012 -961207 -623264 -800127 -820037 -1322068 -891574 -779700 -535125 -1330640 -1040602
1893 -1040602 -972559 -512387 57531 -121098 -671371 -582472 -420653 -707169 -428344 -486554
1883 -486554 -103303 -830943 -27422 579417 488528 140547 -1513687 -1243164 -452307 -173642
1873 -173642 -529189 -224804 -642508 -1152216 -963180 -332978 422035 -337387 -978551 -1709857
1863 -1709857 -931497 -836562 -383028 -1262153 -708213 -422520 -134191 188687 187664 112319
1853 112319 23814 179065 161412 840106 452173 624294 601087 722237 580757 961941
1843 961941 62853 -27679 -323500 -397653 -202888 532724 861066 -489258 93495 -420856
1833 -420856 -420680 393361 264917 -412721 304226 -202927 -199331 580665 220882 532062 501670
1822 501670 -120269 -447972 -165429 -583096 198551 263718 503256 430312 306220 43641
1812 43641 628518 862751 1613050 877205 557611 189678 82074 627390 -192785 -235400
1802 -235400 -25709 69559 31526 529246 -62410 -674869 -1027549 -703217 -949415 -52023
1792 -52023 -567867 -651111 531302 775317 739110 513351 321148 -352198 -593606 -493955
1782 -493955 -73687 316643 233426 -91025 -579005 -134301 15675 -852539 -720944 -916263
1772 -916263 -750935 -343338 316383 -213355 123218 -134482 -115162 693092 491985 369753
1762 369753 -800758 -577369 -1240047 -744518 -125450 -182722 -309140 -776471 -205026 -567595
1752 -567595 -243290 -707310 36464 439548 -197024 352925 -317558 -754449 -378424 -492927
1742 -492927 -887708 -219763 -949940 -890136 -474848 -119256 598301 938759 426304 1078535
1732 1078535 1615753 1262195 631215 1043211 344941 703384 669537 73060 -459337 -481028
1722 -481028 -466157 -376621 326349 -399692 482546 -366942 -1190939 -1705030 -1475932 -944880
1712 -944880 -1006342 -9963 393302 726396 1051346 677055 -758701 154535 631539 488604
1702 488604 1500560 683169 683613 370536 276851 422439 836659 530943 746341 848511
1692 848511 734233 -303463 -429857 26959 13349 -882020 -886649 -900446 -870607 -240745
1682 -240745 -1544989 -1276753 -1906340 -2250031 -1423372 -1221092 -121149 -332815 -11915
1673 -11915 578687 495031 173139 72634 143469 455193 -29727 -380703 -328798 144828
1663 144828 673661 70164 -501099 -521624 -150171 -887675 -552096 -29709 156503 -37134
1653 -37134 -230844 -542986 -448477 -365891 -1386814 -1285634 -959581 -819592 -307307 -597742
1643 -597742 -1371071 -1396804 -831475 66679 39129 -834087 -657994 -668083 -300151 -215192
1633 -215192 -398907 -196013 -600110 -587707 -694581 -171649 309057 -359281 -1605969 -1234928
1623 -1234928 -323812 3071 120447 -1456069 -1608285 -1354443 -666485 -533021 -24554
1614 -24554 -487880 -518989 461085 -273350 -506824 -822403 -567907 -343387 -530324 -485998
1604 -485998 -354186 -292257 790262 904261 508956 182581 124751 -369891 985091 1048720
1594 1048720 1127610 1807902 832904 642782 231342 -95465 -376862 625272 1217371 1011208
1584 1011208 387894 -296518 -1021054 -756632 -161067 -738962 105465 587613 -423370
1575 -423370 -131836 -479110 -687524 -12167 510581 -329848 -193652 -30552 -556614 23142
1565 23142 741057 1002479 688638 -208433 -427835 332891 1370049 582897 291630 438694
1555 438694 551657 1126246 489295 90 -70104 53144 238104 -643291 -134155 -742674
1545 -742674 -1012851 -980041 -1621649 -919276 -838101 -1183474 -785229 -491907 -783294 -307826
1535 -307826 -1014284 -502491 -553954 131707 713950 70720 -1001938 -1534995 -1101326 -844797
1525 -844797 385133 -176016 -247008 26965 -336282 72051 -70386 598250 -399229 352947
1515 352947 203655 155727 -85932 -541830 -1315687 -461341 294441 -681450 765591 9079
1505 9079 78972 -401175 -69263 -437858 -550229 -226961 -778899 -432067 492027 449289
1495 449289 -258075 110700 -332248 573130 1289937 166338 -718276 -733476 -697437 -341081
1485 -341081 -846630 -1244935 -1143393 -1727850 -941020 -1246357 -81993 -219808 -373275 -1273425
1475 -1273425 -1132308 -483399 196055 -272154 -949206 -486417 -985615 -43749 -721961 -246809
1465 -246809 -873189 -598189 -1297637 -781033 79498 -16802 -294042 -66262 -64213 -140277
1455 -140277 673120 1077715 1179204 757585 336001 -412795 -146723 -830258 -990521 -1047296
1445 -1047296 -1015634 -66486 -899511 153697 -573719 -263865 -733284 -554357 -372038 -360730
1435 -360730 219441 -883835 106235 -329368 -161608 -410601 -108447 -53692 -225918 7764
1425 7764 -220762 -451062 226943 666684 -144599 180932 -299523 -593449 402934 771399
1415 771399 907274 776970 742486 305279 157636 920626 793298 -2468 141436 -353352
1405 -353352 165143 -222747 -800126 -1045758 -449567 -48242 218712 253968 894393 990474
1395 990474 585309 587278 1049809 1055216 675391 434732 -179575 658758 -35536 120566
1385 120566 416975 174477 380436 -51557 185458 -587601 -633095 -84040 371292 916039
1375 916039 477121 474685 444794 -152003 -500725 -611155 -623584 -489920 -736303 -1174152
1365 -1174152 -1317559 -334882 -428182 -419562 304284 1034545 578278 4824 -933221 -995395
1355 -995395 263011 47916 -173486 -332794 -533401 -809789 -351156 -215618 -894295 -811932
1345 -811932 -715863 -1084278 -1766190 -1310230 -1235429 -1062535 -589415 -1183816 -841877 -355665
1335 -355665 -621724 -737949 -604060 -462601 -187289 104868 912968 806261 728039 227390
1325 227390 229472 -266242 289588 -54856 -176619 218751 460514 1150528 299986 780227
1315 780227 -293355 -370938 289102 -306733 -818609 -1182881 -1610889 -776559 611790 -33331
1305 -33331 222128 -437259 -364939 -140925 -186569 -234511 -1332826 -333370 -417500 31
1295 31 -421637 -135894 -113883 77050 284071 -228937 156077 270866 94367 -236383 -26746
1284 -26746 25592 -162793 125526 -307194 702500 799405 40195 -459161 -494787 -151820
1274 -151820 -633604 -24108 237609 1059826 1106840 566949 733558 -52094 -294075 -392302
1264 -392302 -56850 -453457 -775911 -834818 -1118730 -8497 -203566 -242055 -861656 -712219
1254 -712219 -395418 10354 303791 305902 252435 91126 -51106 703870 996429 19505
1244 19505 178106 -657586 -280370 -162560 -469980 49860 -532332 -728158 -396763 -251026
1234 -251026 484758 742867 61012 -65510 -604700 -247334 117195 687137 881935 98326
1224 98326 -797685 -394064 -703227 -530521 -903257 -2225234 -1076457 -1433022 -752836 145549
1214 145549 87930 223962 -67559 -257776 -772197 -1121232 -1213263 -1311940 -1277839 -1723244
1204 -1723244 -2102031 -2373961 -1816625 -1823264 -1338060 -492138 -589398 51832 -197161 -22037
1194 -22037 181458 355972 426963 505413 180688 -16643 210492 -364809 35358 -656468
1184 -656468 -359673 -258627 307516 567237 -381641 -231956 -1063338 -2195 -98663 -713362
1174 -713362 -828349 -696952 -1546794 -1108145 -1114749 -1462205 -337126 -859774 -873048 -954019
1164 -954019 -699989 -1125032 -1032316 -1269051 -1444810 -657806 -361582 -615884 -182252 667056
1154 667056 200878 -456014 -805411 -370607 -139895 409643 -743371 -837896 -280122 -313386
1144 -313386 -172575 -461700 -413586 -1217873 -622404 -814497 -1219795 79812 326206 453016
1134 453016 367444 15453 -852163 -769271 -233534 -514239 -119365 -121296 -449562 -603916
1124 -603916 -46108 -639789 214272 279903 -466795 -85125 344710 -111794 -274234 158308
1114 158308 -70115 79544 -382402 -1395076 -1200784 -141528 375914 18347 -570381
1105 -570381 -751793 -454560 -80769 -526473 -289151 -587453 -850261 -1280076 -924128 -241761
1095 -241761 -1049402 -414030 -774634 -406356 205940 454354 339946 978807 1196510 1167867
1085 1167867 1698510 317186 217972 -363814 403587 134843 -261614 -7793 -567717 -787396
1075 -787396 -1107978 -1037145 -1241583 -282934 -915804 -811520 -422443 -608398 -569934 -985512
1065 -985512 -922728 -344677 328048 -236932 -773834 -178919 -401169 -1252541 -302888 -675194
1055 -675194 -80441 50544 -666077 -712537 -223814 837724 -42854 660731 148596 -656159
1045 -656159 -509427 -479212 -819701 -269713 -196692 -744565 771933 -914604 -1006888 -2045626
1035 -2045626 -1299658 -251384 -896529 -491678 -1284749 -684894 -35923 543376 -421054
1026 -421054 -224766 -607109 -482388 789810 374416 238324 -868952 -1080023 -244323
1017 -244323 203394 182623 -551831 -902295 -437529 -123534 -110161 297948 -742634 -814875
1007 -814875 -164726 -64835 92155 -522357 -30464 138663 786586 479579 -545488 -673337
997 -673337 -1233037 -1581856 -2328657 -1166157 -1451618 -1251416 -654809 -223852 -230303 78978
987 78978 565735 518952 1651277 791671 582176 1060001 1055304 1919037 1559831 -6050
977 -6050 -418508 -456411 -678640 -586450 -745892 -1154074 -450423 -707379 -680879 50815 -91830
966 -91830 -177267 141185 95191 95380 553352 783329 284423 195974 487264 -529808 -938241
955 -938241 396853 702461 886203 1265616 115215 588888 907142 -582248 428728
946 428728 435160 849475 2019598 2073523 1148714 -141614 -734484 -1020647 -320558 -207599
936 -207599 -470238 -1209946 -964453 -747988 -449575 640264 308006 -109241 -108708 425661
926 425661 971281 1985299 1549517 1249276 2019586 1136381 1925542 698526 602927 368286
916 368286 -141671 -464665 -109703 3130 -1329479 -1072153 -1302344 -940846 -315483 -151424
906 -151424 -559597 -433783 -761109 -906085 -1134174 -1525427 -1015088 -1529346 -1513898 -744677
896 -744677 -455964 -735659 -198474 -202185 343534 1073770 -461487 -358049 -809294 -658893
886 -658893 -112108 273032 -462624 -21549 121459 -29029 -863580 -655724 -676626 -984792
876 -984792 125666 -237492 -235886 -330266 -915688 -1238785 -81153 -898261 -510845 -699468
866 -699468 -1241722 -1102218 -617904 -211751 -673018 -827615 -1964552 -1162462 -747070 -189470
856 -189470 422689 754575 307903 -478856 -460053 -667549 2840 -626277 -1035190 -1280954
846 -1280954 204656 489435 -30139 -691796 -951372 -1056935 -497061 -448851 -498784 -16285
836 -16285 -373501 -52177 -264358 -246093 -834893 -604995 -757774 -984295 -1234000 -1020607
826 -1020607 -1415900 -1235309 -792825 1461 633702 253539 346235 -540351 -31652 740448
816 740448 676603 391459 558800 48492 293605 385247 254394 240238 24696 120228 -470146
805 -470146 -1142950 -2179064 -1903030 -447073 520101 -206889 -42490 -447069 -110315 573286
795 573286 29753 730400 389359 -332694 -562824 -911719 -352214 -27924 -198785 -343319
785 -343319 -697523 -1091713 -345857 -721274 -653440 -559929 -926497 624662 349839 405970
775 405970 735051 1124095 837393 971572 699663 105095 150625 -341806 -581647 -430499
765 -430499 743652 -172002 -570765 -513140 -499959 1113395 1170808 -65985 -944505 -811793
755 -811793 -580059 -575345 -961644 -1509630 -1342610 -1026286 -1124716 -1652446 -1547454 -1448723 -1620744
744 -1620744 -940944 -1366085 -407938 -307988 -733005 -11860 79805 674972 288688 192050
734 192050 -653275 -397245 -229486 -297613 442998 431808 503780 -372055 -554647 -865658
724 -865658 -1069771 -836241 -125625 -451798 -555303 -713396 -1206841 -126692 -35041 -70661
714 -70661 39284 894626 277260 -75380 -574828 -381891 -297602 233282 -105882 -373365
704 -373365 -788427 -1036478 -846520 -569290 -314513 -801080 -382689 -417857 -155838 -831336
694 -831336 -675861 -947722 -4321 -120290 -987058 -1072353 -1417104 -850864 -991023 -397251
684 -397251 -532483 -584575 -889966 -449346 519215 449291 84489 -112958 12631 8800 1052358
673 1052358 233047 14371 -354441 -378729 -193727 293918 219090 -377007 -604538 15551
663 15551 -1005345 -187199 -104321 -1152269 252896 128100 -318996 -767671 -199693 -613032
653 -613032 -158113 -349685 32670 593882 892195 1477226 202147 626410 871754 602555
643 602555 641830 448585 339623 581041 620227 -316398 8873 411643 164182 -849013
633 -849013 -1260642 -723279 -753761 -682115 -450487 -1668985 -957939 -618689 -140630 -907881
623 -907881 64511 -146647 -754429 -204902 -942670 150550 679008 787564 263290 458508
613 458508 -203834 341687 -88249 300776 307872 148137 45289 -556093 -871452 -984240
603 -984240 107378 -186422 -697778 -193510 -375463 -889110 -153441 -54053 -250659 466398
593 466398 -105925 -897494 -352446 285564 -541354 238887 479597 -401739 -383389 186126
583 186126 -1013188 -697738 -108436 -1141874 -417190 -310808 -447588 -869576 -44836 -989734
573 -989734 -1629572 -907333 -219139 -601790 -762254 -933458 -419266 774446 1115053 374771
563 374771 169090 710381 852849 1535228 1202901 795098 143231 1088836 1234296 946689
553 946689 1022138 899921 716341 411525 370783 -73571 661124 -495416 132784 257112
543 257112 673652 556419 -599897 -270421 -545078 -200127 -577793 296096 213752 496460
533 496460 17790 -395520 68878 573501 1072768 406263 -575079 -751253 -916275 -623144
523 -623144 427804 338290 79213 461384 -432281 -157627 487734 1009251 1656601 295973
513 295973 -43014 -438177 218218 157753 -69191 -415224 -156255 -158334 -484947 96962
503 96962 532691 686673 484570 52019 186699 648015 140786 -3191 -87936 -191466
493 -191466 -249949 407057 -154243 -761055 -1184264 -504119 -148816 113632 -265095 -843724
483 -843724 321260 251669 -403228 -407230 19370 -681074 -1077652 -1053713 -884422 464998
473 464998 1181033 324087 -324422 450844 537301 55679 180890 -125651 219788 1073250
463 1073250 428612 99226 -360245 -110647 -322200 -142827 -200613 -943082 -6619 -650742
453 -650742 -943750 -1191371 155598 -629751 -785048 -1505491 -1741640 -969145 -491439 -361598
443 -361598 -855058 -959604 -1220550 -410837 11869 279426 -747946 -462306 -261397 57188
433 57188 116493 -375811 -375808 -294295 -812505 -179442 -155171 -707816 -243001 -227517 88068 -67110
421 -67110 -356925 -1069119 -399387 -41346 -572650 -1000992 -187261 -228359 -570184 253516
411 253516 -133231 242444 -235652 -656325 -928638 375840 -697463 -1435923 -671052 -605216
401 -605216 682086 594213 -298638 -442397 -355346 -256703 -23589 247172 465583 71167
391 71167 -163171 -116341 -468792 -339413 -220588 349026 741054 1300575 886961 947790
381 947790 422939 -271811 -438703 -417890 -432567 -788972 -255777 -964700 -817944 -792032
371 -792032 154945 -313918 273487 -413698 -279221 -665507 -934866 474111 211947 819483
361 819483 -439398 223933 -37410 346371 -97954 -152564 142139 532432 994312 128069
351 128069 307202 -623935 -396988 -519269 -488880 -268605 46984 -606964 -392325 -593513
341 -593513 -508949 -345474 -164109 457369 -214519 -314779 -920379 -806386 -871995 -539525
331 -539525 -484422 -538895 -635294 -791231 -537279 -789072 -482129 -607586 -166962 -281770
321 -281770 -653939 -921362 -953983 -1170025 -1194216 -962759 -865113 -928558 -1161665 -1108931 -1669343
310 -1669343 -606598 -547101 -366893 -318134 -121895 -641627 353724 707722 -64369 -224957
300 -224957 -1097518 -462408 -583586 -343386 -813132 -837346 -896190 -490286 -371522 -57497
290 -57497 192702 -635749 -714937 -605358 -604211 -855434 -92243 -482579 -77046 462470 158660
279 158660 775317 823945 1083032 282068 337110 -70530 -343133 -646924 -526104 -770558
269 -770558 -1492894 -362486 -181278 -3378 317865 2088 -301659 -1054893 -524677 -938350
259 -938350 -730534 181445 138761 -220568 702448 678268 -373715 1423461 1222390 647152
249 647152 1008899 450592 357008 1303054 1304132 348252 352288 31772 -1157968 -265947 60740
238 60740 -26509 -287286 -63640 -758504 -1338909 -771405 -828654 -452527 -311226 -339195 -711963
227 -711963 -534716 -456822 -923544 -496374 -1855 252588 334280 38784 125848 371255
217 371255 -11571 512977 -558007 -335445 -572472 -1351006 -796362 114385 120739 -475548
207 -475548 615420 103008 142137 -18038 412516 136916 360616 -305123 -443780 -48488
197 -48488 103951 -413202 -542616 -404039 -681901 -524213 -383433 -111223 -770684 -403290
187 -403290 -140860 447891 154483 403625 -192103 -448433 -286962 -1459303 -746680 -76890
177 -76890 46763 13722 -282249 -345370 -350104 -180013 -814741 -787584 -394150 -707140 -500323
166 -500323 -739782 -467965 -1113202 -1417273 -1691147 -1468298 -618974 -563295 -1040102 -1191044
156 -1191044 -443546 -952213 -945447 -1397563 -1675339 -1220675 -749832 -914691 -575688 -701264
146 -701264 -612029 -366477 -191238 -270535 -279962 342509 49975 138655 186064 -1239260 -1276412
135 -1276412 -1571294 -1942464 -1673861 -1234385 -628436 -235486 153331 -130226 -146132 -137446
125 -137446 -392312 -991739 -751172 -772479 -666754 -441521 -859477 -320973 -580834 -184071
115 -184071 114293 -100460 198653 133616 -350490 -684744 -106475 -570024 293911 39409
105 39409 147053 34373 -451167 -336166 -388188 -441856 -126631 -151523 187702 527397 -472593
94 -472593 -6885 269547 -169098 113075 129960 298453 145154 474012 308317 785711
84 785711 1153194 1030649 798343 1027502 725906 687800 750898 597837 536195 -6916 -95050
73 -95050 -271218 -233562 -279498 80556 -33018 339054 -157193 -543992 -825999 -491091 -1125080
62 -1125080 -1122028 -757641 -671838 -942785 -904804 -1025346 -1107767 -892029 -760793 -492586 26646
51 26646 151379 -487011 -71157 -54712 -730400 -538909 -155773 -554742 -590642 -562895 -772581
40 -772581 25983 -74302 -598643 -960940 -392512 -295016 -378197 -143643 -667525 -849762
30 -849762 -1448529 -1309722 -1293038 -678869 -832462 -424466 -386151 -1055927 -927905 -710666
20 -710666 -913353 -989601 -1682076 -1826071 -1570805 -1532147 -1518771 -1466849 -1235203 -976212 -910108
9 -910108 -522838 -802880 -495806 -414420 -80260 289707 -100425 -86392 -896499
0 -896499
$$ Imaginary data points
##PAGE= N=2
##DATA TABLE= (X++(I..I)), XYDATA
16383 -799508 -663697 -329465 -75169 -106577 -83221 406323 296707 -13252 -309986 -242251
16373 -242251 -13339 -110820 -114939 -320114 361514 303080 771222 631341 568818 32206
16363 32206 391359 839609 1042645 855448 602982 632751 429510 269245 -304616 678461
16353 678461 763437 659172 284201 222787 529853 820502 826016 921950 838046 588263 514662
16342 514662 1002497 1380257 1618491 1713931 1905535 1877101 1974696 1919533 1648806 1718971
16332 1718971 1662539 1618079 1706672 1448346 -21967 -496762 -8523 316580 916660 661688
16322 661688 675380 1072322 1479258 1697481 1620086 2058070 1907631 1793605 1789448 2268683
16312 2268683 2336490 1918621 1676699 2001557 2155867 1820680 1722125 1371571 1702112 1827718
16302 1827718 2056030 1545273 1619442 1596002 1815542 1889759 1712963 1490984 1262784 1462967
16292 1462967 1486848 2000835 2705570 2432098 1864039 2124791 2135927 2143865 1840807 2005304
16282 2005304 2511713 3141600 3227444 3287961 3416313 3856380 3825507 3245537 3004918 2654241
16272 2654241 2827775 2498546 2403971 2503896 2322344 2436541 2260202 2612287 2969482 2553801
16262 2553801 3218847 3085396 3210839 3434130 4029518 4247253 4241560 3684109 3395251 4090919
16252 4090919 3727801 3977449 3329094 4012533 3712199 2307277 2812296 3146953 3288822
16243 3288822 4183744 4556221 4591284 5050663 4408439 3932787 3896847 4279776 4150102 4335697
16233 4335697 3992714 4164335 4158274 3916531 4401000 4680400 4647057 4315617 4485514 3508615
16223 3508615 3850456 3966048 4113953 4306721 4551398 4304655 4532949 5018888 4046619
16214 4046619 3933030 3752323 3737749 3445511 3881696 3232663 3271528 3762993 3101537 4671844
16204 4671844 4815998 4029254 3394758 4103105 4450120 5678518 5598343 4918315 4691862
16195 4691862 4459585 4277177 4622371 4941985 4481379 3598929 2902228 3229040 3466221
16186 3466221 3402455 3751857 4536567 4663372 5254512 4932653 5028278 4407045 4602219 4413599
16176 4413599 4004795 4466876 3712862 4225723 4108293 4147141 4557009 5285277 5000209 4379806
16166 4379806 4337575 3647150 4366345 4090514 5134122 5056934 5268574 4871854 4987306 4987195
16156 4987195 4497673 4895312 4443437 4952830 4413536 4180007 3603893 3802698 4150247
16147 4150247 4462589 4325220 4558690 4940694 5172866 5282889 5172054 5010952 4702672
16138 4702672 4664078 4670725 5210979 4919778 5547296 4960614 4383710 4676184 4299100 4797432
16128 4797432 4674421 3584571 3659884 5076272 5033269 5481683 5007934 4518893 5489059
16119 5489059 5722771 5097966 4180967 4012403 4576085 5208824 4825109 4704576 4396969
16110 4396969 4259617 3980195 4062033 4076915 4742282 4728122 4316935 4182927 4502009 4589537
16100 4589537 4543567 5026931 4718293 4378304 4406764 4136510 3947874 4641322 4472888 4993771
16090 4993771 5521731 3863565 4227969 4873447 5467659 6058492 6156425 5991641 5575768
16081 5575768 5023855 4498590 4691243 4793123 5101490 5492561 5723576 5762434 5788282 4994437
16071 4994437 5274722 5413414 5121437 5282381 4854050 3743913 3991159 4478894 5239121
16062 5239121 5798705 5860866 4876439 4487250 4549116 4608552 5203657 5158116 5510457 4981507
16052 4981507 5021408 4767933 4865037 4931390 5105364 4861491 4411061 4232694 4060914 4703418
16042 4703418 5032272 4806959 4571368 4575243 5304387 5682774 6112852 6348916 5787486 5837311
16032 5837311 4978636 4971500 4619652 5364355 5282984 5399208 5359936 5150288 5276228 4831190
16022 4831190 4807369 4473510 4758477 4982171 4241422 4450650 4370392 4926299 5235971 5425025
16012 5425025 5405495 5597389 5539281 5308985 5114827 4911284 5955844 5951332 6188489 5456319
16002 5456319 4833597 4661008 4735613 5080060 6011289 6033321 5859558 5598420 4948852 5579476
15992 5579476 5681761 5987941 5585777 5102618 5775720 5383937 4747818 4110175 4212533
15983 4212533 4964891 5716586 5373277 5502217 5628398 5978984 6045511 6572376 5283799
15974 5283799 4949683 5105994 4768654 5161317 5243216 5280246 5470070 5691907 4865241 4929788
15964 4929788 5071419 5312170 5306726 5034389 5972833 6024386 6426223 6397000 5848047 6026943
15954 6026943 5765166 5687652 5660496 6077931 5582513 5603291 5021609 4871316 4911763 5260134
15944 5260134 5439592 5223758 5098355 4753883 4590577 4462975 3814796 4120624 4757253
15935 4757253 4639217 4767712 4416282 4404776 5142986 5040262 5491525 5396853 5395223 5094357
15925 5094357 5080055 5362570 5300328 5324165 5244712 5635605 6008612 5414287 4652987 4900452
15915 4900452 4646992 5222710 5439387 4833910 4274406 4089873 3327782 4575386 5135041
15906 5135041 4962535 4479204 4629067 4570734 4636895 4935112 4640131 5725568 5792814 5251436
15896 5251436 4233333 3702815 3979142 4572537 5421325 5622830 5699943 4913813 4384676
15887 4384676 4713071 4641494 5412458 6265502 5754961 5399641 4949690 4234256 4431652 4943952
15877 4943952 4834135 5245994 5650749 4985577 5265060 5083549 5014950 5056807 5256634 5069723
15867 5069723 5070828 5858304 4779947 4973968 5263442 5029339 5857610 5877407 5957554 4682345
15857 4682345 4973408 4237922 5021205 5523344 4662089 4493866 4524654 4320245 4134732 4286553
15847 4286553 4124320 5458329 5502426 4121172 4570468 4586580 4574776 5552485 4412689
15838 4412689 4252016 4349963 4707578 4721421 5532358 4861445 4746722 4860488 4660670 4955480
15828 4955480 5708143 6552108 6151319 5741668 4942388 4699289 5514153 6146063 6192846 5898040
15818 5898040 4644212 4059802 4573903 4301623 4639192 4895559 5138256 5100331 5184689 5071847
15808 5071847 4571800 4962070 3966890 4808799 5070734 5410087 5594971 4601057 4030933
15799 4030933 4148389 5608012 5434283 5810734 5336726 5155657 5081457 4609356 5100745
15790 5100745 4765396 5080258 4242974 4041091 3663546 3986786 4598088 4886232 5150511
15781 5150511 4535490 4003804 4293533 4662357 5494853 5480194 5162201 4548798 4651337 4136727
15771 4136727 4962987 5338202 5170244 6047956 6253875 7018035 7174773 7543380 6159401
15762 6159401 6244531 5872435 5517270 5144062 4995785 4171877 4155758 5138297 4284457 4770940
15752 4770940 4513669 4521399 4976473 5319282 5053434 4856255 5004504 4506781 4435384 4128787
15742 4128787 4563336 4674536 5402642 4350646 4745218 5039060 5273021 5765486 6285619
15733 6285619 6127578 6167971 6670366 6751485 7172410 6716137 5940068 5742436 5849445 5134146
15723 5134146 4610821 4659962 4857634 5464036 5412388 4403321 4304952 3781928 4501049 5195446
15713 5195446 5868258 5514976 5105915 5262137 4833892 5007627 4675994 3900205 4614448
15704 4614448 5184775 4244051 4487759 4006054 3237604 4238298 4759337 5383398 5083152
15695 5083152 4263724 3820860 4336426 4817261 5852188 6239755 6198385 5936609 5848136 6120429
15685 6120429 6619790 6745928 6078800 5732252 5326369 3986678 4114307 5233926 5864090
15676 5864090 5926012 6012562 6273105 6610557 6497180 6166060 5774080 5328354 5300500 4656654
15666 4656654 4882539 4652505 3736786 4158773 4612614 5087947 5339992 4608722 4678676 5260186
15656 5260186 5258109 5375474 5778596 5811911 6641358 6106972 6592723 6594521 6471557 5678642
15646 5678642 5509466 5356400 5357956 5120819 4704293 5512134 5263685 5882313 5916527 6250889
15636 6250889 5326394 5207923 5018608 5419011 5037025 5155789 5548447 5206435 6451474
15627 6451474 5625616 5999807 6155071 5783765 4894011 4493782 4197111 4842364 5427439
15618 5427439 5254070 4992386 5160873 4689250 4483285 5435149 4374722 5132587 5672454
15609 5672454 5127302 4275796 5288323 4664683 6363232 6741131 5532097 5189855 5643617
15600 5643617 6086793 5838517 6267834 6296046 6243931 5699747 5879321 5686967 6646643 6242196
15590 6242196 6209855 5410307 4617880 4349193 3645838 3830025 4110130 4239100 4831904 4566769
15580 4566769 5231267 4756407 4987878 4980426 5282366 5402137 5232626 4997265 4992658 5558130
15570 5558130 4982541 5864362 6540213 6850764 7290819 6363265 6250528 5213439 5564783
15561 5564783 5554629 4217178 4022446 4020188 5137308 5397328 5909310 5067184 4781502 4471490
15551 4471490 3681495 4391507 5096909 5288938 4882717 5392807 4982437 4516597 5408220
15542 5408220 4855353 5386654 5128550 5187692 5471552 5909209 5706189 5907324 5985257 6059843
15532 6059843 5515827 5018957 4787906 4789478 5557097 5076360 5427862 5384625 5032253 4959068
15522 4959068 4699180 4950174 6217380 6724704 5606317 5800612 5373106 5094582 6038524
15513 6038524 6032669 5686755 5157240 5935679 4979254 4689033 4746874 4350380 5471824 5284741
15503 5284741 4824522 5110197 5146892 5027481 4874937 4840178 4927643 5199120 4670958 4922619
15493 4922619 5536936 5633829 5706702 5321253 4955377 4817467 5912393 5375949 4624272 5265058
15483 5265058 5615601 5899812 5862432 5014345 4562538 5121561 5514902 5751977 5583696 6342285
15473 6342285 6055229 5476295 4642313 4820223 5148414 5389128 5778226 4854047 4492154
15464 4492154 4165396 5522868 5815609 5963577 5431326 5092119 5772755 5996470 5601864
15455 5601864 5109576 4942071 5014121 5446749 5150405 4777674 4862259 4234762 5106570 6424861
15445 6424861 6331188 6951857 5981006 5725833 5898960 5447027 5625259 5687379 5531887 4918300
15435 4918300 4882113 4937204 6084314 5875150 6064016 5698676 6000474 5649056 4800546 5426173
15425 5426173 5857634 6018817 5653683 6304003 6076204 6274422 5563874 4592160 4559866 5113832
15415 5113832 4826862 5540083 6236090 6069371 6259921 5963998 5446107 6058657 5487351
15406 5487351 5974707 5819671 5525272 5461273 5164880 5368318 5910843 5924689 5389155 5928267
15396 5928267 5662278 6089321 6342108 6078717 6172462 4957246 5621735 5858887 5765699 5711337
15386 5711337 5545876 6410469 5837335 6368484 5830484 5831781 5675391 5319581 4557299 4861724
15376 4861724 5453321 5450783 5274582 4964143 4646809 4970968 4894322 4625421 4847097 5617078
15366 5617078 6590287 6387095 6292797 5286343 5691586 6018269 5213455 5092288 4071755
15357 4071755 4745281 5384351 5486161 5516446 6515708 6213201 5864523 6025755 5485770 5082998
15347 5082998 4649935 4874853 4611806 5248693 5030168 4453725 4520787 5457935 4329212
15338 4329212 5536603 5671832 5680678 4812857 4488914 4838717 5074513 5895851 5160137 5362980
15328 5362980 5126273 5261765 5160443 6212748 6349449 5016199 4686438 5062990 5508264
15319 5508264 6087076 6260485 6248172 6512516 5996987 6019136 5349315 5937486 5892961 4910325
15309 4910325 5303940 5580652 5040762 4857150 6198070 5698917 6710451 6130195 5468677
15300 5468677 5203640 5724381 5747632 6131589 6383272 5895143 5572885 4998495 5169727 4814562
15290 4814562 5356260 6078657 5743973 5277947 5446663 5434452 5944896 6328170 6142707 6242512
15280 6242512 6266692 5854233 5065669 5791408 5622321 6130468 5687344 5729592 6062863 5171851
15270 5171851 5428836 5912405 7048959 5935080 5661637 4848794 5352198 5680586 6282868
15261 6282868 6391236 6493171 6859727 5753121 5922458 5440246 4496149 4256863 4549212
15252 4549212 4496231 5582155 6152070 5716057 5348847 5277305 5664780 5921451 6260440 5500524
15242 5500524 5735954 5848202 6285546 6400068 6160155 5623052 5895342 5602197 5487864
15233 5487864 5794657 5696014 6014345 5300956 6002838 5724442 5370267 5201844 4740423 4646242
15223 4646242 5563349 6226669 6753262 6784755 6077704 5636278 5711430 6244523 5735087 6226575
15213 6226575 6029944 5559314 5373417 5352000 5218787 5125947 6004252 5891505 6707620 7312259
15203 7312259 6917679 5869019 6361055 6173778 6026325 6285379 5315471 4532271 4132256
15194 4132256 3740262 3954418 5310661 5396103 4671061 4605185 4764385 5081769 4779321 5298996
15184 5298996 5212127 5838493 6818946 6660836 6335041 6003244 6248151 5522744 4997507 5344878
15174 5344878 4946975 5072667 5817375 4807759 5462323 6595850 6231393 6088833 6349368
15165 6349368 5425642 4764336 5299626 5283341 5018126 5399778 5669669 5318158 5042585 4912865
15155 4912865 4463952 5312196 5679855 5413218 5939222 6206501 5580934 5288191 4497629
15146 4497629 5373151 6003315 6173757 6344042 6899847 6881286 7434007 6894235 5711792
15137 5711792 5728600 6044950 6297609 6899386 7588638 5789851 5863435 5760932 5198795 5988545
15127 5988545 6312925 5664010 6070388 6065852 5882365 6070951 6319389 6218480 5636288 4866951
15117 4866951 5496357 4665440 4514880 5103805 4361863 5590274 6400951 6048906 6628373
15108 6628373 6407529 5948622 6203272 6312013 5655214 5797841 5612733 6332252 5851221
15099 5851221 6232892 6716202 6573025 6963473 5970632 5294404 5452244 6658994 5846101
15090 5846101 6362966 5771407 6035039 7144363 7196006 6527319 6179891 6060670 6076811 6054100
15080 6054100 5670750 5452676 5739920 5085587 4647348 5029451 5559381 6743406 6222694
15071 6222694 5960908 5835035 5235280 5592977 5765486 5406659 5442800 5629272 5068253 5736738
15061 5736738 5262253 4967417 5151349 5045704 5797965 5453415 5711909 6161454 6515715
15052 6515715 6492086 6515883 6216432 7336852 6583040 5336816 5325006 6555698 6337422
15043 6337422 5882532 5023636 4609030 4749656 4729823 5203578 5421285 6389751 6450429 6370818
15033 6370818 6222136 6091336 5909968 6358871 6663334 6805367 6261621 5799646 5445935
15024 5445935 5799201 6053509 5605839 5420998 6506656 6639040 6052834 6456136 6062792
15015 6062792 5939629 5194585 5469675 5252481 5281255 5614853 5617192 6355043 6776416 6621840
15005 6621840 6120832 6343248 5986666 6034907 5824134 6445141 6081546 5933197 6452028 6683554
14995 6683554 7023009 7221890 6967690 6322285 6598357 6556649 6506244 6399471 6378117 5940348
14985 5940348 6709800 6040787 5489509 5439319 5111189 4675575 4649895 4991769 5178423 6375102
14975 6375102 6564000 6276728 6138312 6805414 6310335 6501125 5652554 5581758 5528989 6160457
14965 6160457 6861000 6364896 6535015 6338698 6059580 6079076 6072376 6541315 6671020 6888989
14955 6888989 6841024 6685108 6736732 6691633 6902838 6049194 6645848 6564447 6270969 6306057
14945 6306057 6544592 6478775 6628885 6157598 5544531 5859326 6161950 5907392 6271276 7009078
14935 7009078 6693953 6249649 5612958 4926368 5291884 6082620 6326205 6721688 7106213
14926 7106213 6772231 6257916 6117013 5523451 5360096 5274907 4997788 5302480 5548033 5403918
14916 5403918 5658252 6669738 6158022 6428071 6126243 5615223 5868664 5750020 6033377
14907 6033377 5897950 6702015 5982759 6238408 5599899 5800177 5647894 5414344 5506288 5186747
14897 5186747 6006241 5929899 6251088 5523048 5332293 5602903 5822682 6313305 5881892 5821715
14887 5821715 5984878 6334259 6014860 5191788 5170246 5496605 5688571 6120121 5709057 6377612
14877 6377612 5859239 5382055 5349166 5245053 6220619 5464693 6025381 5605512 5382565 5597060
14867 5597060 6133232 5994049 6360325 5800320 5499590 6250816 5635752 5440439 6308466
14858 6308466 6262886 6845017 6156043 6246108 6065138 5416108 5710630 5667782 5617125 5972126
14848 5972126 5855239 5376775 6098126 5636610 5169547 5935076 5459720 5687422 5946519
14839 5946519 6050975 6200625 5920947 5905045 6034465 6756383 6219218 6200071 6445036 6661428
14829 6661428 6802084 7100342 6401366 6823752 6851424 6577640 6018417 6231237 6063898 5821032
14819 5821032 6330939 6473785 6411356 5911536 5243950 5529220 5684281 5531292 5417546 6224687
14809 6224687 6072292 6751761 6925494 6332587 6526212 6150894 5318963 5440795 6855986
14800 6855986 5913731 6425931 6077923 5557010 5874035 5469788 5200246 5930530 6096312
14791 6096312 6836960 6962657 6810779 6544928 5154057 5644355 5339444 5663529 6065490
14782 6065490 6870298 7171549 7303622 6488618 5831352 6656978 6137701 7398534 7231441
14773 7231441 6831394 6441268 7135496 7741699 7463104 7565643 6222692 5670569 6202227
14764 6202227 6007449 5561399 6143187 6254009 6434286 6246412 6082063 5892594 6097678
14755 6097678 6017011 6403706 6192284 6402012 6340976 6186060 6222245 6016066 5734231 5339980
14745 5339980 5604119 6132154 6130966 6805433 7469415 6698534 6598368 6266652 6337334 6373168
14735 6373168 6824758 7058262 6698470 6541334 6108891 5354292 6476602 7078867 6377684
14726 6377684 6089943 5690503 4996194 4986641 5420527 6000192 5989938 6135262 5788164 4703045
14716 4703045 5195183 5458244 5210166 5973699 6097018 5251060 5608984 5137039 5163568 5125344
14706 5125344 5347601 4765187 5322601 6254841 5899844 6619510 6770203 7045434 6848798
14697 6848798 7453686 6369928 6442892 7306560 6649771 6799056 6435304 6413870 5573147 5736467
14687 5736467 5223744 4990358 5949534 5753931 6342887 6420506 6786739 6872372 6759107 6425471
14677 6425471 7218830 6902773 6634415 7483981 6992638 6761590 7337670 7046458 6681477
14668 6681477 6400397 5700212 5695901 6812442 6983057 7026219 7110461 7168512 7029276 6879863
14658 6879863 6461221 7101203 6952497 5928748 5547580 5100063 6114165 6244356 6957222
14649 6957222 6091470 6301576 7479267 7119075 6902204 6877059 6824992 6610155 7571619 6853793
14639 6853793 6420306 7391368 7361369 7907882 7732927 6976999 6159391 6504075 5966528 5656181
14629 5656181 5672605 5565991 6128099 6062603 5418376 6027783 6580849 7510302 7295957 7641992
14619 7641992 7635001 7066782 7816846 6589934 6392963 7394251 7264553 6791611 6899212
14610 6899212 6165796 5759408 5360041 5658179 5891864 6932530 6983755 5909658 6419929
14601 6419929 6789601 6537422 6820722 7467719 6170400 6399118 6388143 6252610 6999324
14592 6999324 6902297 6949557 6774614 8129170 7014450 6873068 7332812 7331083 7416102 7638588
14582 7638588 6740904 5540110 6604666 5475454 5769023 6008082 6399618 6537471 6075084
14573 6075084 5906515 5691741 6134528 6235195 6045623 6350002 6346005 7109603 6984044 6282080
14563 6282080 6632339 6977231 6461365 6624728 6211801 5760079 6867520 6847403 7043964
14554 7043964 7105855 6407237 6089448 6155710 6713020 6342292 6067632 5851320 5136036 5232253
14544 5232253 5678456 6480077 6169505 6383683 6349305 6391734 6387049 6443238 5686213 5211406
14534 5211406 5460837 5070361 4835880 5351348 6216136 5975733 6262513 6387085 6067678
14525 6067678 6395992 5885871 5257559 6021453 6500222 5982595 6193158 5403300 5598555
14516 5598555 5574522 5425623 5832497 7001672 7295829 7103057 7223512 6092823 5984792
14507 5984792 5834300 5450431 5610722 5656051 5735272 6182096 5886875 5387895 5360599 5873531
14497 5873531 5525220 5178771 5499672 5382232 5010529 5996794 5609083 6016399 7224559
14488 7224559 6139125 5962156 6511602 6764259 6150086 6401918 6089630 7124345 7507360
14479 7507360 6672182 6422119 6513480 7083817 7427115 6856916 5687536 5812353 5095813
14470 5095813 5181534 5681418 5719342 5839790 6404855 6647358 6527288 6941718 6268721 6207923
14460 6207923 6138842 6297234 6767607 7241352 7480107 6898148 7064550 7366437 7529650 7723407
14450 7723407 7846580 7507554 8064792 7666514 7932812 7582339 7377117 7162952 7362200
14441 7362200 7486564 7498612 6627088 6139315 5503298 4510383 5036871 5083689 5876864 6249041
14431 6249041 6111485 5964485 6151255 6310806 5882930 6036092 6041105 6120886 6593027 6587812
14421 6587812 7111818 7440102 7220103 7309076 6772309 6258314 6513630 6940077 7063583 6764450
14411 6764450 6597851 5765204 6150840 6448311 6783805 7160063 8415833 8471922 7432807
14402 7432807 6690323 5927843 6084398 6265597 5510469 5399251 5968215 5983378 7236070
14393 7236070 7722253 7105546 7251174 6818298 5895857 5199028 5333184 5868066 6401749
14384 6401749 6862940 6752215 6217840 6027962 6695233 5256552 5680599 5785258 6603961
14375 6603961 6525504 6356927 5884865 5908012 7012594 6488278 7371381 7366450 7500514 7085362
14365 7085362 7369155 7296130 6819599 6602503 6772364 6540226 7059029 6850988 5909831 5929396
14355 5929396 6315682 6220743 6101958 6109520 5651817 6232753 5996449 5685175 5616322 5118277
14345 5118277 5678821 6183832 6789393 6062684 6379197 5760634 6391698 6278536 5824632
14336 5824632 7075952 7019760 6868760 6603571 6621153 7419107 7004100 5698083 5470783
14327 5470783 5960007 6712783 5954174 5949477 6066951 6141614 5569996 5802685 5522411 6226509
14317 6226509 6745209 5982977 6238120 6697353 7182249 7175917 6971904 7030398 7064382 7059657
14307 7059657 7087171 6751018 6607546 7624288 7620643 6798874 6327257 5835315 5967962 6685383
14297 6685383 6773732 6374156 6834064 7105476 5719869 5584298 5343526 5164627 6586546
14288 6586546 6626796 6603552 6346788 6000663 5965369 6581661 6736169 6810985 7180778 6338392
14278 6338392 6534456 7527772 8137257 7750648 6812250 6627982 6653845 7126919 7022189 6454278
14268 6454278 6566802 6030234 5506585 4994073 5201805 5868101 6616707 6012936 6157943
14259 6157943 6919697 6339565 6702308 6883833 6941456 7741486 7550856 6157692 7164324
14250 7164324 7139005 7650911 7976656 7981010 7139656 6729736 7195948 6993819 7403581 6946969
14240 6946969 6969236 6855256 6210313 5545514 6011593 5882051 5871787 6367396 5979525 5620138
14230 5620138 6184154 6506643 6262087 6797934 6365388 5515255 5636814 5693634 5983925 7034038
14220 7034038 6883313 7078946 6875418 7080070 6682922 6482257 6928002 7082378 7716962
14211 7716962 7127922 7244308 6651992 7086731 7044368 7308973 6002837 6095504 5690248 5575088
14201 5575088 6130467 6737436 7430135 7439505 8221187 7125970 6554086 5980261 6103558 6829677
14191 6829677 6793818 7789616 6962244 6220029 7015987 6564302 6765714 6612180 6098819 5804729
14181 5804729 5675127 5747992 5398393 5721844 5705572 5045189 4854152 4787736 4882887 5149452
14171 5149452 5739628 5545054 6601715 6669767 6685085 6026282 5796612 5948690 6629110 6807241
14161 6807241 6345219 6729047 7554807 6192857 5644848 5810268 6577796 7022696 7139216
14152 7139216 7125101 6625886 7542273 7071533 6818484 6187725 6078011 5601217 5175753 5697604
14142 5697604 5653047 6270143 7004597 6946534 6451534 6367452 6331369 5361620 5954277 5527550
14132 5527550 5949179 6489985 6401496 6383230 6850693 7227552 7531640 7467901 6823778 6579380
14122 6579380 6580036 6203277 6208701 5693976 5552876 5492736 5672507 5951717 5928313 6206066 6344460
14111 6344460 6152518 6526375 6492113 6354021 7165515 6981026 8065404 7559386 7487917 6864075
14101 6864075 6588640 6485417 6829772 6892925 6474833 6582052 6457171 6992248 6840273 7473480
14091 7473480 6941148 6676633 7055225 6821260 7407653 6606803 6684075 6087611 6570824 6783591
14081 6783591 6261976 5934509 6411587 6527851 6205622 6617881 6198755 5298431 6268002
14072 6268002 6386118 6122631 6999785 6416014 6301553 6112317 6576245 6253204 6847781
14063 6847781 6832675 6250020 5357867 6305402 5759140 6305980 6792053 6407037 5859076 5990206
14053 5990206 5411997 5719277 7119975 6829866 6689467 6581025 7284681 6546126 6834325
14044 6834325 6775139 7353745 7464897 7343964 6154218 5414155 5836128 5431742 6475189
14035 6475189 6633240 7068775 7042361 7430764 7137200 6365367 6380137 6186222 6045587 5851387
14025 5851387 5883547 5902109 6196337 5842217 5686040 5459726 5750220 6301705 6323176 6592012
14015 6592012 7057607 6464012 6733212 6631654 6206920 6589601 6607337 7453304 7040140 7155888
14005 7155888 7705616 7816986 7848813 7541226 6882757 6514659 7173582 6459563 6249427 6373515
13995 6373515 6899601 6711370 6197871 6016822 5471133 5694407 5589337 5171397 5155685 5629067
13985 5629067 6030849 5732001 6038450 6158685 6140766 6135437 6508296 6496748 6533324 7052455
13975 7052455 6331518 5963851 6303505 5592108 5820174 6322571 6933398 7318099 6934459
13966 6934459 7249149 6800728 6621814 7146715 7151224 7103292 7160131 6379403 6296950 5990733
13956 5990733 6411957 6751815 6736057 6576790 6275445 6883843 7064513 6496130 6397550 6344535
13946 6344535 7000084 7605823 7364562 7038861 7473966 6297181 6116827 6940941 7015486
13937 7015486 7116751 6516951 7037446 7237440 7587432 7039477 6795383 6617834 6917965
13928 6917965 6252088 6268183 6408827 5567399 5778370 5767028 6011048 6667070 6244691 5271657
13918 5271657 5466445 6146964 6047271 6277241 5956624 6233807 6613664 7269229 7279678 7384511
13908 7384511 6965148 6917095 6566963 7243496 7848153 7393006 6895143 6630073 7096425 7749982
13898 7749982 8578469 7752831 7190051 6061226 6630931 6135082 6899208 6547408 5803722
13889 5803722 5851713 6361094 6344446 6642928 6886277 5763403 5365510 5703573 5304534 5565445
13879 5565445 5574265 5408192 5111294 5750277 6313869 7595545 6945753 6449770 7806243
13870 7806243 7405070 7092521 6999162 6131120 5904295 7176831 6600594 6730704 7286835
13861 7286835 7268534 6259052 6528244 6472758 6473623 6529338 6320571 5459952 6309138 7037517
13851 7037517 6165940 6229995 6114913 6170942 6187340 6306516 5279749 4850976 5614633 5939140
13841 5939140 6505852 6032889 6117465 5120085 5742679 5687982 5327207 6106654 6041359 5883596
13831 5883596 6517953 6848745 6352417 6978479 7266304 7110118 6934920 7723881 6882621
13822 6882621 6630617 6542686 6210406 6695369 7480577 7554632 6883320 6910745 6304157 6484352
13812 6484352 6747368 6711114 6562866 6329847 6250725 5465743 5646373 6041512 6109314 6105474
13802 6105474 6631431 6144710 6619121 6096598 5890622 6814711 6456175 6978765 6766300
13793 6766300 6850904 7117154 7521960 8023576 8555010 7976021 7386702 6664915 7068728 8057197
13783 8057197 8184032 7708776 5997110 5349023 5720139 5894574 5595578 5742589 5215610
13774 5215610 5399587 5437010 5893801 6231623 6448938 7001682 6706401 6728156 7187059 7069321
13764 7069321 6035995 6707602 6256725 6765615 7129001 5900485 5501505 5566502 5954607
13755 5954607 6553522 7725450 7122087 6674128 6533847 6509214 6305834 6256995 6286909 6290920
13745 6290920 6486773 5715869 5420841 6051953 6410214 5608510 6200390 6396175 6856259
13736 6856259 7166172 6874707 6708203 7069996 7537343 7150565 7042146 7357579 7420300 6902728
13726 6902728 6629178 7185267 7048453 6897553 6524085 6521603 6535280 6653579 6535394 5380572
13716 5380572 6142842 6396851 6825175 7193290 7070833 6501218 6183751 5639729 6596374
13707 6596374 6544164 7030281 6502160 5866338 6260531 6338351 6339278 6632499 7029048 5924407
13697 5924407 6640118 6051429 6249227 6578868 7079969 7930140 7545960 8141776 7391944
13688 7391944 6980789 6822019 6614102 6674822 6431765 6015611 5951747 6074349 6614369 6844977
13678 6844977 6831038 6786388 6582343 6559810 6737599 6945369 6707752 7425371 6252412 6696045
13668 6696045 5449416 5731631 6078585 5805095 5780320 5830993 6077377 6262933 6672744 5929366
13658 5929366 6734793 7019448 7467704 6826036 6745484 6335273 6602854 6712231 6305045 6374703
13648 6374703 6686615 6613982 6835103 7631744 6792790 6779685 6999764 7675639 7887072 7346417
$$ [...]
##END NTUPLES=NMR SPECTRUM
##END=
