##TITLE=1H_DE-80H_X3
 200.13MHz, d2o
 8 sc
 
 19ns.26.2.2025
##JCAMPDX= 6.0         $$ Bruker NMR JCAMP-DX V2.0
##DATA TYPE= NMR SPECTRUM
##DATA CLASS= NTUPLES
##ORIGIN= UXNMR, Bruker Analytische Messtechnik GmbH
##OWNER= pz
$$ XWIN-NMR		Version 3.5
$$ Fri Jan 23 11:21:56 2026 Russian Standard Time (UT+4h)  Yarkov@DPX200
##.OBSERVE FREQUENCY= 200.1313
##.OBSERVE NUCLEUS= ^1H
##.ACQUISITION MODE= SIMULTANEOUS
##.ACQUISITION SCHEME= undefined
##.AVERAGES= 8
##.DIGITISER RES= 18
##SPECTROMETER/DATA SYSTEM= spect
##.PULSE SEQUENCE= zg30
##.SOLVENT NAME= CDCl3
##.SHIFT REFERENCE= (INTERNAL, CDCl3, 0, 15.4736)
##AUDIT TRAIL= $$ (NUMBER, WHEN, WHO, WHERE, WHAT)
$$ ##TITLE= Audit trail, XWIN-NMR		Version 3.5
$$ ##JCAMPDX= 5.01
$$ ##ORIGIN= Bruker BioSpin GmbH
$$ ##OWNER= Yarkov
$$ C:/Bruker/XWIN-NMR/data/yarkov2/nmr/H-C/1/pdata/1/auditp.txt
$$ ##AUDIT TRAIL=  $$ (NUMBER, WHEN, WHO, WHERE, WHAT)
(   1,<2026-01-23 11:21:12.53 +0400>,<Yarkov>,<DPX200>,
      <created by zg, POWCHK disabled, PULCHK disabled
       configuration hash MD5:
       00 E9 B6 7A A2 85 ED C7 34 08 36 98 17 FE 4E 26
       data hash MD5: 16K
       79 A0 58 40 39 F4 FE E4 86 D5 FA 1F F5 61 E6 83>)
(   2,<2026-01-23 11:21:17.54 +0400>,<Yarkov>,<DPX200>,
      <Start of raw data processing
       efp BC_mod = 2 LB = 0.25 FT_mod = 6 PKNL = 1 PHC0 = -5297.497 PHC1 = 7.62193 SI = 16K 
       data hash MD5: 16K
       A8 37 79 EE 3E E1 AC 9F 9E FE 85 6B 68 89 9B 05>)
$$ ##END=
$$ 
$$ hash MD5
$$ C0 86 53 73 97 8A 09 73 DB D2 A4 C5 0E DC 0B 86
##$RELAX= 
##$RELAX= 
##$RELAX= 
##$RELAX= 
##$RELAX= 
##$RELAX= 
$$ Bruker specific parameters
$$ --------------------------
##$DU= <C:/Bruker/XWIN-NMR>
##$EXPNO= 1
##$NAME= <H-C>
##$PROCNO= 1
##$TYPE= <nmr>
##$USER= <yarkov2>
##$AMP= (0..31)
100 100 100 100 100 100 100 100 100 100 100 100 100 100 100 100 100 100 
100 100 100 100 100 100 100 100 100 100 100 100 100 100 
##$AQSEQ= 0
##$AQ_mod= 1
##$AUNM= <au_zg>
##$AUTOPOS= <>
##$BF1= 200.13
##$BF2= 200.13
##$BF3= 200.13
##$BF4= 200.13
##$BF5= 200.13
##$BF6= 200.13
##$BF7= 200.13
##$BF8= 200.13
##$BYTORDA= 1
##$CFDGTYP= 0
##$CFRGTYP= 5
##$CHEMSTR= <none>
##$CNST= (0..31)
1 1 145 1 1 1 1 1 1 1 1 1 1 1 1 1 1 1 1 1 1 1 1 1 1 1 1 1 1 1 1 1 
##$CPDPRG= <>
##$CPDPRG1= <>
##$CPDPRG2= <>
##$CPDPRG3= <>
##$CPDPRG4= <mlev>
##$CPDPRG5= <mlev>
##$CPDPRG6= <mlev>
##$CPDPRG7= <mlev>
##$CPDPRG8= <mlev>
##$CPDPRGB= <>
##$CPDPRGT= <>
##$D= (0..31)
0 0.7 0 0 0 0 0 0 0 0 0 0.03 0 0 0 0 0 0 0 0 0 0 0 0 0 0 0 0 0 0 0 0 
##$DATE= 1769152872
##$DBL= (0..7)
120 120 120 120 120 120 120 120 
##$DBP= (0..7)
150 150 150 150 150 150 150 150 
##$DBP07= 0
##$DBPNAM0= <>
##$DBPNAM1= <>
##$DBPNAM2= <>
##$DBPNAM3= <>
##$DBPNAM4= <>
##$DBPNAM5= <>
##$DBPNAM6= <>
##$DBPNAM7= <>
##$DBPOAL= (0..7)
0.5 0.5 0.5 0.5 0.5 0.5 0.5 0.5 
##$DBPOFFS= (0..7)
0 0 0 0 0 0 0 0 
##$DE= 6
##$DECBNUC= <off>
##$DECIM= 32
##$DECNUC= <off>
##$DECSTAT= 4
##$DIGMOD= 1
##$DIGTYP= 9
##$DL= (0..7)
0 120 120 120 120 120 120 120 
##$DP= (0..7)
$$ [...]
##$SUBNAM2= <"">
##$SUBNAM3= <"">
##$SUBNAM4= <"">
##$SUBNAM5= <"">
##$SUBNAM6= <"">
##$SUBNAM7= <"">
##$SUBNAM8= <"">
##$SUBNAM9= <"">
##$SW= 18.0517328524113
##$SWIBOX= (0..15)
0 0 2 0 0 0 0 0 0 0 0 0 0 0 0 0 
##$SW_h= 3612.71676300578
##$TD= 16384
##$TD0= 1
##$TE= 0
##$TE2= 300
##$TE3= 300
##$TEG= 300
##$TL= (0..7)
0 120 120 120 120 120 120 120 
##$TP= (0..7)
150 150 150 150 150 150 150 150 
##$TP07= 0
##$TPNAME0= <>
##$TPNAME1= <>
##$TPNAME2= <>
##$TPNAME3= <>
##$TPNAME4= <>
##$TPNAME5= <>
##$TPNAME6= <>
##$TPNAME7= <>
##$TPOAL= (0..7)
0.5 0.5 0.5 0.5 0.5 0.5 0.5 0.5 
##$TPOFFS= (0..7)
0 0 0 0 0 0 0 0 
##$TUNHIN= 0
##$TUNHOUT= 0
##$TUNXOUT= 0
##$USERA1= <user>
##$USERA2= <user>
##$USERA3= <user>
##$USERA4= <user>
##$USERA5= <user>
##$V9= 5
##$VALIST= <valist>
##$VCLIST= <CCCCCCCCCCCCCCC>
##$VD= 0
##$VDLIST= <DDDDDDDDDDDDDDD>
##$VPLIST= <PPPPPPPPPPPPPPP>
##$VTLIST= <TTTTTTTTTTTTTTT>
##$WBST= 1024
##$WBSW= 4
##$XGAIN= (0..3)
0 0 0 0 
##$XL= 0
##$YL= 0
##$YMAX_a= 165577
##$YMIN_a= -112633
##$ZGOPTNS= <>
##$ZL1= 120
##$ZL2= 120
##$ZL3= 120
##$ZL4= 120
##$ABSF1= 0
##$ABSF2= 0
##$ABSG= 0
##$ABSL= 0
##$ALPHA= 0
##$AQORDER= 0
##$ASSFAC= 0
##$ASSFACI= 0
##$ASSFACX= 0
##$ASSWID= 0
##$AUNMP= <proc_1d>
##$AZFE= 0.1
##$AZFW= 0.1
##$BCFW= 0
##$BC_mod= 2
##$BYTORDP= 0
##$COROFFS= 0
##$CY= -3
##$DATMOD= 1
##$DC= 0
##$DFILT= <>
##$DTYPP= 0
##$F1P= 0
##$F2P= 0
##$FCOR= 1
##$FTSIZE= 16384
##$FT_mod= 6
##$GAMMA= 0
##$GB= 0
##$INTBC= 1
##$INTSCL= 3.241238e-09
##$ISEN= 128
##$LB= 0.25
##$LEV0= 0
##$LPBIN= 0
##$MAXI= 10000
##$MC2= 0
##$MEAN= 0
##$ME_mod= 0
##$MI= 1.114404
##$NCOEF= 0
##$NC_proc= -8
##$NLEV= 6
##$NOISF1= 3.799351
##$NOISF2= 2.8
##$NSP= 0
##$NTH_PI= 0
##$NZP= 0
##$OFFSET= 15.47364
##$PC= 1
##$PHC0= -5297.497
##$PHC1= 7.62193
##$PH_mod= 1
##$PKNL= yes
##$PPARMOD= 0
##$PSCAL= 0
##$PSIGN= 0
##$REVERSE= no
##$SF= 200.130009617163
##$SI= 16384
##$SIGF1= 3
##$SIGF2= 2
##$SINO= 0.751879
##$SIOLD= 32768
##$SREGLST= <19F.Aceton>
##$SSB= 0
##$STSI= 16384
##$STSR= 0
##$SW_p= 3612.71676300578
##$SYMM= 0
##$S_DEV= 0
##$TDeff= 16384
##$TDoff= 0
##$TI= <>
##$TILT= no
##$TM1= 0
##$TM2= 0
##$TOPLEV= 0
##$USERP1= <user>
##$USERP2= <user>
##$USERP3= <user>
##$USERP4= <user>
##$USERP5= <user>
##$WDW= 1
##$XDIM= 16384
##$YMAX_p= 450959124
##$YMIN_p= -1395918
$$ End of Bruker specific parameters
$$ ---------------------------------
##NTUPLES= NMR SPECTRUM
##VAR_NAME=  FREQUENCY,     SPECTRUM/REAL,   SPECTRUM/IMAG
##SYMBOL=    X,             R,               I
##VAR_TYPE=  INDEPENDENT,   DEPENDENT,       DEPENDENT
##VAR_FORM=  AFFN,          ASDF,            ASDF
##VAR_DIM=   16384,         16384,           16384
##UNITS=     HZ,            ARBITRARY UNITS, ARBITRARY UNITS
##FACTOR=    0.220516191357247, 1,           1
##FIRST=     3096.73981044888, 0,            0
##LAST=      -515.976952556905, 0,           0
##MIN=       -515.976952556905, -1395918,    0
##MAX=       3096.73981044888, 450959124,    0
$$ Real data points
##PAGE= N=1
##DATA TABLE= (X++(R..R)), XYDATA
$$ [...]
$$ plain form
5164 5752298 5778820 6391612 6147281 6360228 6556162 6451057 6563306 6934321 6790577 6308020
5154 6308020 6520921 6214133 6215687 6230611 7318486 7506903 6773727 6957080 7051287 6980033
5144 6980033 7283957 7225185 6902473 6454494 6900000 6826297 6402271 6759242 6840630 7047104
5134 7047104 7179919 7267164 7066587 7480027 7715778 7645280 8383709 8478057 7927013 7714942
5124 7714942 7374390 7585869 7709832 7372988 6956313 6411014 7275855 7736627 7503301 7662233
5114 7662233 7486009 7654396 8169239 8222345 7483594 7163483 7767498 8110772 7953299 8131439
5104 8131439 8489751 8281506 8379403 9182054 8807003 8968937 9159248 9204635 9588383 10219123
5094 10219123 10604410 10254040 10053577 10674003 11430533 11950259 12626031 12523043 13059029
$$ packed form
5164E752298K6522O12792k44331K12947J95934j05105J12249L71015j43744m82557
5154F308020K12901l06788J554J4924J087875J88417p33176J83353R4207p1254
5144F980033L03924n8772l22712m47979M45506p3703m24026L56971Q1388K06474
5134G047104J32815Q7245k00577M13440K35751p0498P38429R4348n51044k12071
5124G714942l40552K11479J23963l36844m16675n45299Q64841M60772k33326J58932
5114G662233j76224J68387N14843N3106p38751l20111O04015L43274j57473J78140
5104H131439L58312k08245R7897Q02651l75051J61934J90311M5387L83748O30740
5094A0219123L85287l50370k00463O20426P56530N19726O75772j02988N35986
$$ plain form
5085 13059029 13932981 15123236 15527455 16354143 17234631 19026718 20135295 21402755 23197190
5076 23197190 25050503 26944985 29010809 31824951 35411442 40954671 51507200 66891723
5068 66891723 83319281 94730511 102529288 115096109 126337177 122783865 106580098
5061 106580098 88319107 70540960 55567954 45055844 38081601 32431221 27561794
5054 27561794 24801825 23023254 21380425 20426147 19584310 18279229 17641844 18017278 18055494
5045 18055494 17712817 16582070 16475703 15274850 14771867 14803376 14166574 13524745 13452266
5036 13452266 14155478 14598960 14888622 15112024 14736403 14193180 13845777 13749979 12888341 11554482
5026 11554482 11321644 10907680 10961151 11093546 10774737 10052797 9954706 11212844 11186018 10478219
$$ packed form
5085A3059029Q73952J190255M04219Q26688Q80488J792087J108577J267460J794435
5076B3197190J853313J894482K065824K814142L586491N543229J0552529J5384523
5068F6891723J6427558J1411230P798777J2566821J1241068l553312j6203767
5061A06580098j8260991j7778147j4973006j0512110o974243n650380m869427
5054B7561794k759969j778571j642829r54278q41837j305081o37385L75434L8216
5045A8055494l42677j130747j06367j200853n02983L1509o36802o41829p2479
5036A3452266P03212M43482K89662K23402l75621n43223l47403r5798q61638j333859
5026A1554482k32838m13964N3471J32395l18809p21940r8091J258138k6826p07799
$$ plain form
5016 10478219 10510307 10654230 10619102 10869043 11013725 10512516 10718813 12010133 12687951 12559934
5006 12559934 13674494 14517591 14261385 13578527 13785704 12745080 11689717 11464889 11171076
4997 11171076 11216816 11277885 10997901 9708696 9823049 10932921 10851225 10317185 10287443 10400042
4987 10400042 10570033 11286167 11603202 11208605 11121454 12008608 12077581 11976008 12212879 12371989
4977 12371989 12284495 12621499 12813198 12948978 13369196 13602053 13740164 13704380 14618149 14925035
4967 14925035 15000246 15277306 15933420 16336657 17318072 17700500 18209625 19090628 19827587 20415315
4957 20415315 20800022 22138649 23015445 24381717 25392596 26827867 28457143 30788296
4949 30788296 33042476 35014961 38947537 43173949 48628835 56888036 68927100 87898922
$$ packed form
5016A0478219L2088J43923l5128K49941J44682n01209K06297J291320O77818j28017
5006A2559934J114560Q43097k56206o82858K07177j040624j055363k24828k93813
4997A1171076M5740O1069k79984j289205J14353J109872q1696n34040k9742J12599
4987A0400042J69991P16134L17035l94597q7151Q87154O8973j01573K36871J59110
4977A2371989q7494L37004J91699J35780M20218K32857J38111l5784R13769L06886
4967A4925035P5211K77060O56114M03237R81415L82428N09125Q81003P36959N87728
4957B0415315L84707J338627Q76796J366272J010879J435271J629276K331153
4949C0788296K254180J972485L932576M226412N454886Q259201J2039064J8971822
$$ plain form
4941 87898922 116043545 147862266 173632691 182315638 173903654 155088920 131793811
4934 131793811 108814032 89407371 74797807 64256532 56747505 51101335 48206759
4927 48206759 46477553 47116643 49264611 52053898 54312713 54746780 54371532 54703385 55336123
4918 55336123 56167289 57547519 59994004 64376217 70133969 78862351 91569767 110524314
4910 110524314 136438804 166105876 193877870 220172960 246896032 268385283 277292702
4903 277292702 271734052 251554257 219426473 183570083 150769760 122397556 99595606
4896 99595606 82650090 69955172 61003210 55645372 53006887 52105091 51886337 52661030
4888 52661030 52955095 51748266 50474287 49089280 47893181 47252882 47820213 48963661 50477150
$$ packed form
4941H7898922K8144623L1818721K5770425Q682947q411984j8814734k3295109
4934A31793811k2979779j9406661j4609564j0541275p509027n646170k894576
4927D8206759j729206O39090K147968K789287K258815M34067l75248L31853O32738
4918E5336123Q31166J380230K446485M382213N757752Q728382J2707416J8954547
4910A10524314K5914490K9667072K7771994K6295090K6723072K1489251Q907419
4903B77292702n558650k0179795l2127784l5856390l2800323k8372204k2801950
4896I9595606j6945516j2694918q951962n357838k638485r01796k18754P74693
4888E2661030K94065j206829j273979j385007j196099o40299N67331J143448J513489
$$ plain form
4879 50477150 53083300 58437973 66698630 79842093 100463292 126658359 152030073 165837479
4871 165837479 162796210 146809971 124688713 101511902 81871319 65347514 53431918
4864 53431918 44835140 37314900 32140156 29151142 26922801 25073878 24072744 22826287
4856 22826287 22124263 21139669 21292022 20579053 20442730 20577781 20295368 19548656 19311448
4847 19311448 18753334 17608275 17319417 16800092 16870389 15844110 15618293 15320710 15552451
4838 15552451 15363877 15566615 15369968 15241440 15357781 15848772 16187139 15750736 16667735
4829 16667735 17383759 18659886 19634009 21792736 22910455 23484895 23006266 22547401 21888361
4820 21888361 21545941 21615721 20886312 20927928 21702435 22036320 21756847 21805844 20984449 21301782
$$ packed form
4879E0477150K606150N354673Q260657J3143463K0621199K6195067K5371714J3807406
4871A65837479l041269j5986239k2121258k3176811j9640583j6523805j1915596
4864E3431918q596778p520240n174744k989014k228341j848923j001134j246457
4856B2826287p02024r84594J52353p12969j36323J35051k82413p46712k37208
4847A9311448n58114j145059k88858n19325P0297j026279k25817k97583K31741
4838A5552451j88574K02738j96647j28528J16341M90991L38367m36403R16999
4829A6667735P16024J276127R74123K158727J117719N74440m78629m58865o59040
4820B1888361l42420O9780p29409M1616P74507L33885k79473M8997q21395L17333
$$ plain form
4810 21301782 21254812 20763342 19609450 18739013 18400141 17487382 17025858 16612666 16259858
4801 16259858 15294639 14780803 13699220 13991753 13931818 13463440 13234465 12669659 12721121 13154376
4791 13154376 12841993 11847319 11883047 12105249 12498285 11566714 11821886 11596931 11476099 11402152
4781 11402152 11078529 10792346 10908926 11214005 10622662 10370367 10366772 10348158 9775849 9613418
4771 9613418 9914223 10210357 9754786 9908924 9564092 9520398 9606233 9168714 8919586 8609908
4761 8609908 9084613 9452366 8784932 8256412 8366426 8217978 8415330 8383347 8064631 7896723
4751 7896723 7985432 8496119 8196775 8364741 8205415 7524238 7031586 7656176 7299919 6799964
4741 6799964 6799964 6353918 6408523 6874201 7284597 6671573 6339228 6787153 7116711 6612631 6794097
$$ packed form
4810B1301782m6970m91470j153892q70437l38872r12759m61524m13192l52808
4801A6259858r65219n13836j081583K92533n9935m68378k28975n64806N1462M33255
4791A3154376l12383r94674L5728K22202L93036r31571K55172k24955j20832p3947
4781A1402152l23623k86183J16580L05079n91343k52295l595j8614n72309j62431
4771I613418L00805K96134m55571J54138l44832m3694Q5835m37519k49128l09678
4761H609908M74705L67753o67434n28520J10014j48448J97352l1983l18716j67908
4751G896723Q8709N10687k99344J67966j59326o81177m92652O24590l56257m99955
4741F799964%m46046N4605M65678M10396o13024l32345M47925L29558n04080J81466
$$ plain form
4730 6794097 6260507 6257052 7347678 7973763 7353324 7225223 7776248 7386510 7414815 7515262
4720 7515262 6809202 5986432 5936836 6136395 5679021 5675050 5602426 5232804 5358158 5950885
4710 5950885 5537421 5215662 5426203 5788341 5404663 5382299 5394549 4936599 5215610 5330971
4700 5330971 5280782 5496027 5224694 4644420 5120370 5442741 5497048 5164972 5155506 5092661
4690 5092661 5342088 5699821 5150286 4745308 5005001 5265569 4764526 5106858 4937242 4708592
4680 4708592 4981735 5081252 4755906 4786916 5283758 5456714 5076840 4931803 4766419 4840205
4670 4840205 5017663 4867241 4611652 4352537 4994581 4524256 4241764 5018134 4944928 4631942
4660 4631942 4592331 4745646 4604932 4645030 4999184 4746082 4491246 4852754 4910069 4677392
$$ packed form
4730F794097n33590l455J090626O26085o20439j28101N51025l89738K8305J00447
4720G515262p06060q22770m9596J99559m57374l971p2624l69622J25354N92727
4710E950885m13464l21759K10541L62138l83678k2364J2250m57950K79011J15361
4700E330971n0189K15245k71333n80274M75950L22371N4307l32076r466o2845
4690E092661K49427L57733n49535m04978K59693K60568n01043L42332j69616k28650
4680D708592K73143R9517l25346L1010M96842J72956l79874j45037j65384P3786
4670D840205J77458j50422k55589k59115O42044m70325k82492P76370p3206l12986
4660D631942l9611J53315j40714M0098L54154k53102k54836L61508N7315k32677
$$ plain form
4650 4677392 4534060 4844275 4851235 4599924 4993610 4661407 4739194 5034753 4567987 4170133
4640 4170133 4648158 5055443 5128693 4588691 4267888 4733229 5257034 5000611 4716793 4552012
4630 4552012 4603079 5223029 5216161 5511662 5261562 4971792 5049199 4835825 5160661 5057243
4620 5057243 4614582 4197450 4551230 4864176 5201875 4690022 4449573 4155410 4419874 4727073
4610 4727073 4559670 4229818 4433369 5005199 4561400 4550869 4628571 4611027 4692958 5107713
4600 5107713 4948371 4749507 5363150 5501840 5260126 5498783 5700359 5366561 5870137 5904632
4590 5904632 5939084 5495772 5354503 5013007 4917004 5076715 5004064 4590307 4145801 4687815
4580 4687815 4404270 4716462 4360589 4118868 4345141 4463325 4726034 4674524 4618523 4838390
$$ packed form
4650D677392j43332L10215O960k51311L93686l32203P7787K95559m66766l97854
4640D170133M78025M07285P3250n40002l20803M65341N23805k56423k83818j64781
4630D552012N1067O19950o868K95501k50100k89770P7407k13374L24836j03418
4620E057243m42661m17132L53780L12946L37699n11853k40449k94163K64464L07199
4610D727073j67403l29852K03551N71830m43799j0531P7702j7544Q1931M14755
4600E107713j59342j98864O13643J38690k41714K38657K01576l33798N03576L4495
4590E904632L4452m43312j41269l41496r6003J59711p2651m13757m44506N42014
4580D687815k83545L12192l55873k41721K26273J18184K62709n1510n6001K19867
$$ plain form
4570 4838390 4854510 4896959 4534734 4590158 4827194 4509623 4748756 5251224 5198808 4820702
4560 4820702 5080761 5430729 5157504 5518093 5026398 4553749 4403564 4653973 4003701 3773389
4550 3773389 4387865 4468272 4165864 4378547 4411650 3891278 4100872 4562046 4475966 3971320
4540 3971320 4365119 4197528 3801332 4141404 4597742 4237371 4041074 4643245 4244981 4253848
4530 4253848 4340790 4365232 4427473 4088664 4171697 4265636 4217688 4603640 4269685 3942135 4003544
4519 4003544 4196964 4681326 4229003 4497513 4502173 4526454 4340900 4651672 4367831 4089538
4509 4089538 4601915 4686371 4547576 4279184 4687221 4275253 4120915 4820696 4791796 4107565
4499 4107565 4539141 4515141 4170557 4244927 4613684 4748240 4008911 4914631 4962724 4593420
$$ packed form
4570D838390J6120M2449l62225N5424K37036l17571K39133N02468n2416l78106
4560D820702K60059L49968k73225L60589m91695m72649j50185K50409o50272k30312
4550C773389O14476Q0407l02408K12683L3103n20372K09594M61174q6080n04646
4540C971320L93799j67591l96196L40072M56338l60371j96297O02171l98264Q867
4530D253848Q6942K4442O2241l38809Q3033R3939m7948L85952l33955l27550O1409
4519D003544J93420M84362m52323K68510M660K4281j85554L10772k83841k78293
4509D089538N12377Q4456j38795k68392M08037m11968j54338O99781k8900o84231
4499D107565M31576k4000l44584P4370L68757J34556p39329R05720M8093l69304
$$ plain form
4489 4593420 4529855 4712776 4662034 4805544 4753647 4457124 4430777 5284437 5647120 4934585
4479 4934585 4453020 4587432 5009711 4618840 5182186 4872447 4536910 4758413 5300782 5159592
4469 5159592 4811530 4941181 4964951 4680774 4919230 5200360 4958096 4731829 4821436 4810791
4459 4810791 4830213 5231916 5012339 4918405 5231855 5667770 5577615 5332468 5663894 5757904
4449 5757904 5927491 6096163 5717613 5734672 5720646 5855705 6094560 5899228 6081084 6075280
4439 6075280 6096688 6161518 6545625 6414832 5660079 5822536 6363954 6329561 6146677 6537781
4429 6537781 6630912 6402638 6800844 6952248 6269591 6273013 6184829 6056098 6064417 6562323 6793123
4418 6793123 6489713 6711030 6822082 6511974 6552907 6749459 6537092 6379094 6480379 6570953
$$ packed form
4489D593420o3565J82921n0742J43510n1897k96523k6347Q53660L62683p12535
4479D934585m81565J34412M22279l90871N63346l09739l35537K21503N42369j41190
4469E159592l48062J29651K3770k84177K38456K81130k42264k26267Q9607j0645
4459D810791J9422M01703k19577r3934L13450M35915r0155k45147L31426R4010
4449E757904J69587J68672l78550J7059j4026J35059K38855j95332J81856n804
4439F075280K1408O4830L84107j30793p54753J62457N41418l4393j82884L91104
4429F537781R3131k28274L98206J51404o82657L422q8184j28731Q319M97906K30800
4418F793123l03410K21317J11052l10108M0933J96552k12367j57998J01285R0574
$$ plain form
4408 6570953 6459164 6613243 6265978 6167447 6182995 6433153 6190058 5952059 6120797 6189349
4398 6189349 6386981 6330490 6374950 6477317 6375288 6881655 7399214 7201622 7310163 7036925
4388 7036925 7182232 6382288 6411479 6368485 6126872 6485857 6448682 6386800 6096310 6729141
4378 6729141 6726113 6372336 6422654 6577630 6229598 6328986 6483710 6357686 5815016 6137244
4368 6137244 6483878 6292248 6857455 6567170 6034357 5790433 6677589 6778752 6457833 6405320
4358 6405320 5955037 5724132 6195650 6569512 6193099 6065169 6558252 6552299 6081573 6408162
4348 6408162 6477982 6454816 6351659 6669708 6525536 6535514 6938873 6689107 6507526 6687898
4338 6687898 7088184 6966592 6769605 6831837 6938625 7227882 7352063 6809331 6807856 7135984
$$ packed form
4408F570953j11789J54079l47265r8531J5548K50158k43095k37999J68738O8552
4398F189349J97632n6491M4460J02367j02029N06367N17559j97592J08541k73238
4388G036925J45307p99944K9191m2994k41613L58985l7175o1882k90490O32831
4378F729141l028l53777N0318J54976l48032R9388J54724j26024n42670L22228
4368F137244L46634j91630N65207k90285n32813k43924Q87156J01163l20919n2513
4358F405320m50283k30905M71518L73862l76413j27930M93083n953m70726L26589
4348F408162O9820k3166j03157L18049j44172R978M03359k49766j81581J80372
4338F687898M00286j21592j96987O2232J06788K89257J24181n42732j475L28128
$$ plain form
4328 7135984 7563525 7188580 7289160 7869866 7873776 8339762 8608696 8857955 9514456 9967904
4318 9967904 10244958 10096073 10899150 11839367 13006719 14354241 16386068 19541276 26512136
4309 26512136 38972837 55222575 62042579 55762571 45443904 34107307 26225635 20262266
4301 20262266 16729168 14419023 12462571 10221803 9159441 9008041 8397874 8579694 8643389
4292 8643389 8001315 7628025 7613991 7337443 7021398 7079922 7487561 6792287 6770231 7048834
4282 7048834 6715189 6636028 6755865 6933445 6343870 6987972 6758118 6658123 6941798 7078270
4272 7078270 6756730 6283701 6139933 6244165 6268107 6354473 6024423 5587047 6381917 6295924
4262 6295924 6283515 5891690 5708889 5654933 5948585 6196525 6198707 6030245 5710522 5814836
$$ packed form
4328G135984M27541l74945J00580N80706L910M65986K68934K49259O56501M53448
4318I967904K77054j48885Q03077R40217J167352J347522K031827L155208O970860
4309B6512136J2460701J6249738O820004o280008j0318667j1336597p881672n963369
4301B0262266l533098k310145j956452k240768j062362j51400o10167J81820O3695
4292H643389o42074l73290j4034k76548l16045N8524M07639o95274k2056K78603
4282G048834l33645p9161J19837J77580n89575O44102k29854r9995K83675J36472
4272G078270l21540m73029j43768J04232K3942Q6366l30050m37376P94870q5993
4262F295924j2409l91825j82801n3956K93652K47940K182j68462l19723J04314
$$ plain form
4252 5814836 5852603 6211325 5975690 5714269 5646165 5578738 5272214 5428996 5204209 5321627
4242 5321627 5294228 5284366 5720129 5504934 5466370 5778721 5954513 5509602 5421073 5220894
4232 5220894 5339805 5528716 5669310 5569612 5480422 5526679 5850570 6035961 5633326 5441375
4222 5441375 5462002 6038472 6363837 6152596 5706166 5628247 5889319 5804735 5929495 5512873
4212 5512873 5438999 5678453 5682288 5465397 5644130 5598764 5162023 5447141 5917026 5562277
4202 5562277 5729118 6054566 5725536 5893159 5959585 5927272 5507449 6014802 6801556 6453859
4192 6453859 6633880 7060040 6780614 6397889 6634567 6208048 5768872 5957593 6375221 5934369
4182 5934369 5803787 6091635 5957113 6493077 6788150 6612461 5887508 6386128 6266947 5934844
$$ packed form
4252E814836L7767L58722k35635k61421o8104o7427l06524J56782k24787J17418
4242E321627k7399r862M35763k15195l8564L12351J75792m44911q8529k00179
4232E220894J18911J88911J40594r9698q9190M6257L23891J85391m02635j91951
4222E441375K0627N76470L25365k11241m46430p7919K61072q4584J24760m16622
4212E512873p3874K39454L835k16891J78733m5366m36741K85118M69885l54749
4202E562277J66841L25448l29030J67623O6426l2313m19823N07353P86754l47697
4192F453859J80021M26160k79426l82725K36678m26519m39176J88721M17628m40852
4182E934369j30582K87848j34522N35964K95073j75689p24953M98620j19181l32103
$$ plain form
4172 5934844 5798345 5965552 5647889 5597494 6068430 6147841 5905053 5724600 5821746 5673459
4162 5673459 5887096 6022169 5770027 5603152 6088041 6132495 5894322 5643030 5732251 5618902
4152 5618902 5612940 5648304 5527783 5559831 5754905 6102429 5890474 5580378 5595105 5616294 5584698
4141 5584698 5780258 6034180 5619684 4920324 5093125 5957071 5831398 5728042 5840187 5854181
4131 5854181 5925359 6438163 5955945 5474223 5552126 5993807 5804371 5781527 6300171 5922819
4121 5922819 5602138 5852184 5667005 5205352 6055131 6281322 5906598 5938205 5817118 5360230
4111 5360230 5347622 5868145 5983204 5334595 5087972 5655471 5255923 5843916 6206325 5562831
4101 5562831 5068088 5689184 6229220 5893868 5799506 5649663 5766405 5743077 6022922 5348694
$$ packed form
4172E934844j36499J67207l17663n0395M70936P9411k42788j80453R7146j48287
4162E673459K13637J35073k52142j66875M84889M4454k38173k51292Q9221j13349
4152E618902n962L5364j20521L2048J95074L47524k11955l10096J4727K1189l1596
4141E584698J95560K53922m14496o99360J72801Q63946j25673j03356J12145J3994
4131E854181P1178N12804m82218m81722P7903M41681j89436k2844N18644l77352
4121E922819l20681K50046j85179m61653Q49779K26191l74724L1607j21087m56888
4111E360230j2608N20523J15059o48609k46623N67499l99548N87993L62409o43494
4101E562831m94743O21096N40036l35352r4362j49843J16742k3328K79845o74228
$$ plain form
4091 5348694 5373026 5677735 5934824 5719783 5621739 5410830 5116792 5457925 5688771 5802090
4081 5802090 5314530 5702544 5868350 5941546 5975718 5771909 5555528 5521239 5852196 6072367
4071 6072367 5977100 6053994 6496708 6605867 6678735 6403405 5877070 5977622 6151324 5535493
4061 5535493 5597150 5338908 5288029 5579467 5791328 5954537 5620713 6152405 6172738 5640945
4051 5640945 6059291 6422488 5890935 5912208 6175144 6262659 5982458 6098965 6233779 6155696
4041 6155696 6267532 6330046 5677101 5108938 5909548 6086939 5929564 6040281 6078700 5642194
4031 5642194 5725970 5921371 5831405 5433129 6113003 5802307 5540511 5821766 5828631 5532588
4021 5532588 5719828 5999712 5869296 5898092 6045247 6259891 5998686 6162665 6122192 5487429
$$ packed form
4091E348694K4332L04709K57089k15041r8044k10909k94038L41133K30846J13319
4081E802090m87560L88014J65806P3196L4172k03809k16381l4289L30957K20171
4071F072367r5267P6894M42714J09159P2868k75330n26335J00552J73702o15831
4061E535493O1657k58242n0879K91438K11861J63209l33824N31692K0333n31793
4051E640945M18346L63197n31553K1273K62936Q7515k80201J16507J34814p8083
4041F155696J11836O2514o52945n68163Q00610J77391j57375J10717L8419m36506
4031E642194Q3776J95401q9966l98276O79874l10696k61796K81255O865k96043
4021E532588J87240K79884j30416K8796J47155K14644k61205J63979m0473o34763
$$ plain form
4011 5487429 5160354 5751484 6111335 6004958 5699629 5516161 5749430 5719545 6129068 6098378
4001 6098378 5773466 5901336 6590572 6394526 5737551 6343144 6652782 5954974 5934629 6214074
3991 6214074 5918115 5755498 6271330 6206973 5513479 6098592 6012491 5977786 6006666 6771079
3981 6771079 6237966 5562836 5928540 6163238 5814122 6137611 6263779 5985377 6425691 7069686
3971 7069686 6944300 6127612 6394400 6558569 6572488 6593923 7045449 6620984 6424495 6703999
3961 6703999 6552866 6387356 6512018 6706053 6440878 6490972 6937213 7080369 6214005 6768618
3951 6768618 6884584 6928956 6945635 7088558 6826445 6723391 7285436 7102839 6808007 7020237
3941 7020237 7710207 7144962 7067863 7346756 7276248 7452067 7711383 7457964 7089229 7360290
$$ packed form
4011E487429l27075N91130L59851j06377l05329j83468K33269k9885M09523l0690
4001F098378l24912J27870O89236j96046o56975O05593L09638o97808k0345K79445
3991F214074k95959j62617N15832o4357o93494N85113q6101l4705K8880P64413
3981F771079n33113o75130L65704K34698l49116L23489J26168k78402M40314O43995
3971G069686j25386q16688K66788J64169J3919K1435M51526m24465j96489K79504
3961F703999j51133j65510J24662J94035k65175N0094M46241J43156q66364N54613
3951F768618J15966M4372J6679J42923k62113j03054N62045j82597k94832K12230
3941G020237O89970n65245p7099K78893p0508J75819K59316k53419l68735K71061
$$ plain form
3931 7360290 7880110 7800805 7664559 7904175 7350226 7485636 7818880 7869786 7680324 7548128
3921 7548128 7764734 8084163 8374777 8076383 7893939 7869096 8053689 8489243 8469248 8371568
3911 8371568 8547080 8501520 8734512 8348796 8446295 8503639 8403224 8502105 8395499 8593383
3901 8593383 8563685 8940467 8656750 8635601 8830919 8470690 8320480 8666914 8899851 8625360
3891 8625360 8442876 8241047 8503613 8933149 9265141 8472666 8566757 8757267 9059809 9216462
3881 9216462 9198925 9163962 8541335 8972881 9510423 9322980 9118275 9141499 8959365 8881155
3871 8881155 8945280 8907721 9050533 9267065 9478814 8876384 9194236 9356280 9278908 9230170
3861 9230170 9687761 9340291 8721391 8893698 9204330 9605582 9652805 9324771 8773074 9151398
$$ packed form
3931G360290N19820p9305j36246K39616n53949J35410L33244N0906j89462j32196
3921G548128K16606L19429K90614k98394j82444k4843J84593M35554j9995r7680
3911H371568J75512m5560K32992l85716R7499N7344j00415R8881j06606J97884
3901H593383k9698L76782k83717k1149J95318l60229j50210L46434K32937k74491
3891H625360j82484k01829K62566M29536L31992p92475R4091J90510L02542J56653
3881I216462j7537l4963o22627M31546N37542j87443k04705K3224j82134p8210
3871H881155O4125l7559J42812K16532K11749o02430L17852J62044p7372m8738
3861I230170M57591l47470o18900J72307L10632M01252M7223l28034n51697L78324
$$ plain form
3851 9151398 9713582 9793294 9167108 9281852 9093203 9015793 9220476 9444627 9258796 8853102
3841 8853102 9367511 9642466 9842877 9638230 9581447 9412757 9561510 9845566 9709311 9576669
3831 9576669 9444336 9617837 9364450 9548200 9637111 9511451 8905724 9646685 9765397 9683110
3821 9683110 9571615 9627229 9546316 9253011 9039523 9345806 9051900 9195797 9630256 9534432
3811 9534432 9790477 9721219 9556829 9523969 9976584 9934318 10147359 9879313 10039233 10049373
3801 10049373 9987760 10076930 9755094 9882990 10444032 10596835 10109738 9943572 10097533 10416579
3791 10416579 10143872 10622551 10507534 9861327 9976820 10253884 10254746 10067432 9982539 9853250
3781 9853250 10056901 10527243 10889695 10457552 10315248 10654644 10969850 10906379 10981457 10644509
$$ packed form
3851I151398N62184P9712o26186J14744j88649p7410K04683K24151j85831m05694
3841H853102N14409K74955K00411k04647n6783j68690J48753K84056j36255j32642
3831I576669j32333J73501k53387J83750Q8911j25660o05727P40961J18712q2287
3821I683110j11495N5614q0913k93305k13488L06283k93906J43897M34459r5824
3811I534432K56045o9258j64390l2860M52615m2266K13041k68046J59920J0140
3801A0049373o1613Q9170l21836J27896N61042J52803m87097j66166J53961L19046
3791A0416579k72707M78679j15017o46207J15493K77064Q62j87314q4893j29289
3781I853250K03651M70342L62452m32143j42304L39396L15206o3471P5078l36948
$$ plain form
3771 10644509 11134462 11083416 11331769 11328898 10992905 11259778 11377470 11232592 11472784 11191193
3761 11191193 10902628 11205497 11121614 11189262 11074844 10813399 10905504 11265054 11361579 12008990
3751 12008990 11324930 11291878 11364323 11235722 11437056 11029903 11040483 11218884 11744000 12041311
3741 12041311 11699291 11293814 12261383 11810343 11710377 11922904 12195617 12004725 11969126 12028931
3731 12028931 11710442 11689719 11413672 11857813 11387169 11737461 11578129 11634112 12104495 12232178
3721 12232178 12146046 11970425 12102395 12205149 12328340 11961190 12089687 11876915 12309219 12133371
3711 12133371 12075340 11636266 11910848 12042953 12510896 12516289 12226403 12064664 12053768 12532643
3701 12532643 12317018 12148202 11886069 12532060 12395332 12806584 12430083 12847795 12503792
$$ packed form
3771A0644509M89953n1046K48353k871l35993K66873J17692j44878K40192k81591
3761A1191193k88565L02869q3883O7648j14418k61445R2105L59550R6525O47411
3751A2008990o84060l3052P2445j28601K01334m07153J0580J78401N25116K97311
3741A2041311l42020m05477R67569m51040r9966K12527K72713j90892l5599N9805
3731A2028931l18489k0723k76047M44141m70644L50292j59332N5983M70383J27683
3721A2232178q6132j75621J31970J02754J23191l67150J28497k12772M32304j75848
3711A2133371n8031m39074K74582J32105M67943N393k89886j61739j0896M78875
3701A2532643k15625j68816k62133O45991j36728M11252l76501M17712l44003
$$ plain form
3692 12503792 12586691 13057340 12915727 12730501 12463966 12361220 12474182 13048793 12573165 12650459
3682 12650459 12739264 13516694 13706368 13448481 12908856 12624897 13069939 13904936 13831640 13016091
3672 13016091 13381074 13434526 14179253 14181447 14244502 13660648 14122063 15012250 15763808 15502444
3662 15502444 15776105 16023359 16429755 18579120 21356709 25358183 30314783 33234814 32212288
3653 32212288 29030286 25051270 21580749 19188634 18473491 18130640 17054980 16381532 16375127
3644 16375127 16300855 16669122 16951177 16965866 16919886 17208312 17644614 17568407 17404993 17856794
3634 17856794 18181200 18525679 19108492 19095673 19371270 20544878 22560852 24500277 28622563
3625 28622563 36655928 47739277 54437659 52547279 46538162 38871782 32861424 28604915
$$ packed form
3692A2503792Q2899M70649j41613j85226k66535j02746J12962N74611m75628P7294
3682A2650459Q8805P77430J89674k57887n39625k83959M45042Q34997p3296q15549
3672A3016091L64983N3452P44727K194O3055n83854M61415Q90187P51558k61364
3662A5502444K73661K47254M06396K149365K777589M001474M956600K920031j022526
3653C2212288l182002l979016l470521k392115p15143l42851j075660o73448o405
3644A6375127p4272L68267K82055J4689m5980K88426M36302p6207j63414M51801
3634A7856794L24406L44479N82813j2819K75597J173608K015974J939425M122286
3625B8622563Q033365J1083349O698382j890380o009117p666380o010358m256509
$$ plain form
3617 28604915 25717529 23940304 22331778 21294515 20857518 20649679 20643288 20137728 20056029
3608 20056029 19742257 19661799 19919370 20287510 20008869 20010091 20446198 20886300 20879533 20747654
3598 20747654 21218542 21205256 22045565 23205924 24486596 28110135 33901860 38085121 38070772
3589 38070772 34851483 31016792 28342257 26412056 25123210 23461996 22480348 22625370
3581 22625370 22574968 22097958 22153066 21841112 22168636 22611223 22943303 22971044 23170579 23132289
3571 23132289 23069827 23503735 23639542 23400708 22908937 23638992 24119805 24350445 24242739 23942140
3561 23942140 24010195 24856869 25250845 25306139 24930632 25531734 26231405 26614363 26709338 26027446
3551 26027446 26402722 27197213 27847175 28201824 28312100 28075238 28740883 29261561 29370601
$$ packed form
3617B8604915k887386j777225j608526j037263m36997k07839o391n05560q1699
3608B0056029l13772q0458K57571L68140k78641J222M36107M40102o767j31879
3598B0747654M70888j3286Q40309J160359J280672L623539N791725M183261j4349
3589C8070772l219289l834691k674535j930201j288846j661214r81648J45022
3581B2625370n0402m77010N5108l11954L27524M42587L32080K7741J99535l8290
3571B3132289o2462M33908J35807k38834m91771P30055M80813K30640j07706l00599
3561B3942140O8055Q46674L93976N5294l75507O01102O99671L82958R4975o81892
3551B6027446L75276P94491O49962L54649J10276k36862O65645N20678J09040
$$ plain form
3542 29370601 29590975 30004971 30440849 31296246 31615522 31462144 31637472 31900620 32606563
3533 32606563 33102919 34047587 34727684 34772962 35258001 35966406 36342622 36630629 36847434 37356189
3523 37356189 38077455 38431112 38747933 39201562 39653115 40917395 41560053 41491792 42223188
3514 42223188 43034473 44520867 45882977 46653366 47199364 47703108 49320559 50910913 51619947
3505 51619947 53173589 54417788 55283063 57130670 58452314 59899036 61316823 63441135
3497 63441135 65694587 68408298 71100414 74278531 77688285 81745928 86334393 90859202
3489 90859202 96661234 103258295 110685640 118870944 127908931 138450167 150434611 162656665
3481 162656665 176266105 189339887 200474047 207416297 207037012 199154640 185992382 170149314
$$ packed form
3542B9370601K20374M13996M35878Q55397L19276j53378J75328K63148P05943
3533C2606563M96356R44668O80097M5278M85039P08405L76216K88007K16805N08755
3523C7356189P21266L53657L16821M53629M51553J264280O42658o8261P31396
3514D2223188Q11285J486394J362110P70389N45998N03744J617451J590354P09034
3505E1619947J553642J244199Q65275J847607J321644J446722J417787K124312
3497F3441135K253452K713711K692116L178117L409754M057643M588465M524809
3489I0859202N802032O597061P427345Q185304R037987J0541236J1984444J2222054
3481A62656665J3609440J3073782J1134160O942250l79285p882372j3162258j5843068
$$ plain form
3473 170149314 154229857 139590118 126195098 115830965 107000054 100408010 95842734
3466 95842734 91799549 87375674 82587293 78396255 74156247 70598442 67428822 64664225
3458 64664225 61642162 59972072 58976311 57541791 56028154 54696731 53150642 51666876
3450 51666876 50934815 49471618 47846317 47337472 47268107 46396204 45753032 45134960 44602777
3441 44602777 44387626 44315712 43636005 43387486 44378567 47026122 50253129 53233933 53943839
3432 53943839 52201978 49561244 47051769 44208837 41330718 38737958 36472957 34847378
3424 34847378 34133732 33520870 32584048 31796720 31290386 30705465 29855998 29414832 28804624
3415 28804624 28650545 28635842 28538025 28270118 27648724 27763532 28082770 27642161 27405000 27427989
$$ packed form
3473A70149314j5919457j4639739j3395020j0364133q830911o592044m565276
3466I5842734m043185m423875m788381m191038m240008l557805l169620k764597
3458F4664225l022063j670090r95761j434520j513637j331423j546089j483766
3450E1666876p32061j463197j625301n08845o9365q71903o43172o18072n32183
3441D4602777k15151p1914o79707k48519R91081K647555L227007K980804P09906
3432E3943839j741861k640734k509475k842932k878119k592760k265001j625579
3424C4847378p13646o12862r36822p87328n06334n84921q49467m41166o10208
3415B8804624j54079j4703r7817k67907o21394J14808L19238m40609k37161K2989
$$ plain form
3405 27427989 27860981 29196753 30796051 31892532 32413150 32194407 31277145 29700548 28181984
3396 28181984 27104254 25740663 24630453 24010164 22896293 22182013 21951876 21620305 21444910
3387 21444910 21477569 21165663 20787444 20630947 20661256 20260334 20279635 20159875 19934560 19670527
3377 19670527 19755469 19434472 18956265 18974842 18846866 18376567 18349183 18672058 18188731 17768875
3367 17768875 17877438 17942361 17581478 17073676 17353419 17802615 17880670 17135901 16595637 16697865
3357 16697865 17063825 17164271 16569371 15947021 16098993 16692232 16311725 15889631 15399484
3348 15399484 15269572 15617045 15698021 15634184 15366848 15504581 15539678 15293313 14813064 14974939
3338 14974939 14832170 14592724 14753123 15231545 15132299 14668117 14490094 14433537 14307441 14357438
$$ packed form
3405B7427989M32992J335772J599298J096481N20618k18743r17262j576597j518564
3396B8181984j077730j363591j110210o20289j113871p14280k30137l31571j75395
3387B1444910L2659l11906l78219j56497L0309m00922J9301j19760k25315k64033
3377A9670527Q4942l20997m78207J8577j27976m70299k7384L22875m83327m19856
3367A7768875J08563O4923l60883n07802K79743M49196P8055p44769n40264J02228
3357A6697865L65960J00446n94900o22350J51972N93239l80507m22094m90147
3348A5399484j29912L47473Q0976o3837k67336J37733L5097k46365m80249J61875
3338A4974939j42769k39446J60399M78422r9246m64182j78023n6557j26096M9997
$$ plain form
3328 14357438 14116749 13834421 14312402 14864072 14870718 13931679 13935860 13991618 14222025 14218947 14104939
3317 14104939 13673131 13847026 14002654 13961269 13433614 13244515 13515246 13786112 13962384 13635828
3307 13635828 13761201 13656632 13632805 13289229 13164200 13083640 12839224 12793446 13110177 12994693
3297 12994693 12845906 12673725 12382552 12614368 12456479 12603160 12368917 12648948 12682483 12753008
3287 12753008 12515389 12431675 12282271 12317707 12660935 12191071 12316638 12122118 12374057 12141803
3277 12141803 11954274 11648536 11526916 11492032 11746343 11722686 11669355 11771440 11431654 11384044
3267 11384044 11123908 11227344 11048677 11357861 11833852 11784950 11143479 11406716 11396277 11214689
3257 11214689 11340834 11562784 11357616 11306671 11378981 11246819 11052714 10866842 11080973 11163463
$$ packed form
3328A4357438k40689k82328M77981N51670O646r39039M181N5758K30407l078j14008
3317A4104939m31808J73895J55628m1385n27655j89099K70731K70866J76272l26556
3307A3635828J25373j04569k3827l43576j25029q0560k44416m5778L16731j15484
3297A2994693j48787j72181k91173K31816j57889J46681k34243K80031L3535P0525
3287A2753008k37619q3714j49404L5436L43228m69864J25567j94520K51939k32254
3277A2141803j87529l05738j21620l4884K54311k3657n3331J02085l39786m7610
3267A1384044k60136J03436j78667L09184M75991m8902o41471K63237j0439j81588
3257A1214689J26145K21950k05168n0945P2310j32162j94105j85872K14131Q2490
$$ plain form
3247 11163463 11509420 12016207 12050781 11644966 11904809 12217871 12117741 12249405 12414764 12220756
3237 12220756 12446242 12867016 12735485 12232020 12722952 13122281 13068406 13093158 13387456 13517124
3227 13517124 13549362 14239039 14474814 14167752 14476941 15034224 14994896 14971284 14967221 14863468
3217 14863468 15166877 15791552 16243667 16726913 16706375 17213077 16997010 16965133 17403710 16956846
3207 16956846 16577494 16363916 16917088 16843418 17033674 16975197 16808413 16706209 17253531 17191623
3197 17191623 17057827 16970670 17221622 17902186 18323641 19068145 19549201 20235291 20116238 20043844
3187 20043844 20060211 20255490 20730206 20960992 21399803 21830273 22881957 23642174 23848492
3178 23848492 24029019 24391825 24513196 24611371 24792200 25036972 25882430 26551843 26786470 27368144
$$ packed form
3247A1163463L45957N06787L4574m05815K59843L13062j00130J31664J65359j94008
3237A2220756K25486M20774j31531n03465M90932L99329n3875K4752K94298J29668
3227A3517124L2238O89677K35775l07062L09189N57283l9328k3612m063j03753
3217A4863468L03409O24675M52115M83246k0538N06702k16067l1877M38577m46864
3207A6956846l79352k13578N53172p3670J90256n8477j66784j02204N47322o1908
3197A7191623j33796q7157K50952O80564M21455P44504M81056O86090j19053p2394
3187B0043844J6367J95279M74716K30786M38811M30470J051684P60217K06318
3178B3848492J80527L62806J21371R8175J80829K44772Q45458O69413K34627N81674
$$ plain form
3168 27368144 28091026 28747465 29046043 29061282 29292368 29199827 29388378 29432241 29753590 30089678
3158 30089678 30777365 30780478 30573772 30688500 31103898 31747232 32229116 32961117 33409836 34789998
3148 34789998 35784233 36901990 38045101 39921883 41973528 44328584 47418854 50075273
3140 50075273 52880394 54700861 55215121 54018533 52050218 49404088 46652379 44133398
3132 44133398 42235043 40702150 39750432 38623178 38054722 38322153 38429250 38669931 39327642
3123 39327642 40225980 41261197 42937367 44277135 44936088 45207712 46085459 46695043 47371123
3114 47371123 48211931 48372875 49025934 50228094 50249306 49069928 47845023 46524107 44760829
3105 44760829 43005785 41176692 38986700 37297780 36503421 35024045 33832605 33535126
$$ packed form
3168B7368144P22882O56439K98578J5239K31086r2541J88551M3863L21349L36088
3158C0089678O87687L113k06706J14728M15398O43334M81884P32001M48719J380162
3148C4789998R94235J117757J143111J876782K051645K355056L090270K656419
3140E0075273K805121J820467N14260j196588j968315k646130k751709k518981
3132D4133398j898355j532893r51718j127254n68456K67431J07097K40681O57711
3123C9327642Q98338J035217J676170J339768O58953K71624Q77747O09584O76080
3114D7371123Q40808J60944O53059J202160K1212j179378j224905j320916j763278
3105D4760829j755044j829093k189992j688920p94359j479376j191440k97479
$$ plain form
3097 33535126 33192575 32973586 33308168 33695435 34017467 34683105 34685322 34085369 33406245 33192712
3087 33192712 32035381 30818944 29772435 28887994 27735245 26688308 25497215 24127325
3079 24127325 23198319 22666312 22025300 20951906 19955462 19064133 18507935 17677553 17633594
3070 17633594 16867901 16716675 16583352 16004347 15785842 15761458 15847753 15094935 15035148 15057875
3060 15057875 15422290 14689663 14338701 14224804 13744341 13330765 13124248 12672853 12159035
3051 12159035 12335208 12404845 11945089 11413986 11611175 10992953 10767781 10446067 10386144 10098804
3041 10098804 10374268 10198883 9767425 9483504 9639006 9308812 8775397 8883477 8527756
3032 8527756 8591171 8488469 8335034 7757553 7852913 7864957 7784739 7771504 7464995 7780011
$$ packed form
3097C3535126l42551k18989L34582L87267L22032O65638K217n99953o79124k13533
3087C3192712j157331j216437j046509q84441j152749j046937j191093j369890
3079B4127325r29006n32007o41012j073394r96444q91329n56198q30382m3959
3070A7633594p65693j51226j33323n79005k18505k4384Q6295p52818n9787K2727
3060A5057875L64415p32627l50962j13897m80463m13576k06517m51395n13818
3051A2159035J76173O9637m59756n31103J97189o18222k25172l21714n9923k87340
3041A0098804K75464j75385m31458k83921J55502l30194n33415J08080l55721
3032H527756O3415j02702j53435n77481R5360J2044q0218j3235l06509L15016
$$ plain form
3022 7780011 7705254 7674936 7352856 6880123 6623315 6946899 6816916 6553549 6841598 7098215
3012 7098215 6781937 6501007 6357902 5837155 5800893 5693908 5963619 5492244 5353192 5382452
3002 5382452 4693781 4665724 5231376 5484477 5253960 5120441 4963833 4753997 4848032 4549879
2992 4549879 4117752 3982899 4385055 4869572 4542728 4250723 4065266 3564993 3888499 4068221
2982 4068221 3633872 3694530 3717408 3644650 3777419 3706554 3107627 2924631 3104285 3344679
2972 3344679 3485012 3508757 3269159 3198127 3313473 3287514 3135050 2914962 2933325 2980127
2962 2980127 3335528 3405277 2934714 2579455 2514203 2852554 2754899 2829347 2567759 2423085
2952 2423085 2895428 2834024 2417147 2048609 2098404 2425599 2652178 2443081 2008702 1950836
$$ packed form
3022G780011p4757l0318l22080m72733k56808L23584j29983k63367K88049K56617
3012G098215l16278k80930j43105n20747l6262j06985K69711m71375j39052K9260
3002E382452o88671k8057N65652K53101k30517j33519j56608k09836R4035k98153
2992D549879m32127j34853M02156M84517l26844k92005j85457n00273L23506J79722
2982D068221m34349O0658K2878p2758J32769p0865n98927j82996J79654K40394
2972C344679J40333K3745k39598p1032J15346k5959j52464k20088J8363M6802
2962B980127L55401O9749m70563l55259o5252L38351r7655P4448k61588j44674
2952B423085M72343o1404m16877l68538M9795L27195K26579k09097m34379n7866
$$ plain form
2942 1950836 2277754 2185236 2141277 1845428 2095489 2216790 2459761 2440789 2094268 1919945
2932 1919945 1959115 1752591 1906957 1837845 2295686 1983654 2017272 2414974 2036957 1762331
2922 1762331 1550626 1612903 1985392 1915103 1592493 1785029 1539759 1923758 1971812 1665696
2912 1665696 1203578 1352543 1250807 1487822 1387655 1285059 1334572 1548063 1440995 1049943
2902 1049943 982020 1059818 997389 1077856 1285620 1208422 1446838 1459449 1638940 1157905 938369
2891 938369 1013209 864159 826332 947746 810657 477767 837183 1313559 1105658 879901
2881 879901 898677 942954 1116024 1006697 888590 496067 825704 1312943 1171254 1036063
2871 1036063 959390 752901 865772 1081645 1022881 881520 594607 925613 824573 438305
$$ packed form
2942A950836L26918r2518m3959k95849K50061J21301K42971j8972l46521j74323
2932A919945L9170k06524J54366o9112M57841l12032L3618L97702l78017k74626
2922A762331k11705O2277L72489p0289l22610J92536k45270L83999M8054l06116
2912A665696m62118J48965j01736K37015j00167j02596M9513K13491j07068l91052
2902A049943o7923P7798o2429Q0467K07764p7198K38416J2611J79491m81035k19536
2891I38369P4840j49050l7827J21414j37089l32890L59416M76376k07901k25757
2881H79901J8776M4277J73070j09327j18107l92523L29637M87239j41689j35191
2871A036063p6673k06489J12871K15873n8764j41361k86913L31006j01040l86268
$$ plain form
2861 438305 690239 541762 505028 931118 1413770 1170757 901114 946168 1215444 1211631
2851 1211631 942698 498247 497766 1055258 1334938 969720 795395 739457 578637 431946
2841 431946 584930 783257 322433 845797 1201662 985261 804920 748916 429179 519570
2831 519570 833371 706883 700888 531010 521492 587888 952617 818720 860544 641245 700389
2820 700389 898048 1034108 510496 -53024 639694 715501 632205 346203 399477 341179
2810 341179 653238 698499 640915 365137 632804 932130 363600 858218 668223 617981
2800 617981 608354 287683 40855 423430 402987 -120353 65171 548344 1000971 835546
2790 835546 580108 -41755 -135481 274682 985692 564640 404489 462060 559675 340604
$$ packed form
2861D38305K51934j48477l6734M26090M82652k43013k69643M5054K69276l813
2851A211631k68933m44451m81N57492K79680l65218j74325n5938j60820j46691
2841D31946J52984J98327m60824N23364L55865k16401j80341n6004l19737R0391
2831E19570L13801j26488n995j69878r518O6396L64729j33897M1824k19299N9144
2820G00389J97659J36060n23612n63520O92718P5807q3296k86002N3274n8298
2810C41179L12059M5261n7584k75778K67667K99326n68530M94618j89995n0242
2800F17981r627l20671k46828L82575k0443n23340J85524M83173M52627j65425
2790H35546k55438o21863r3726M10163P11010m21052j60151N7571R7615k19071
$$ plain form
2780 340604 190196 515230 414297 667082 649739 492599 77233 303769 131485 56333
2770 56333 426639 586832 546487 333277 208726 349869 661209 415775 199681 -249730
2760 -249730 147473 206731 390624 -10155 -277510 -116733 173692 486617 255268 -249420
2750 -249420 -117533 671558 715357 342401 124886 134018 -102816 155326 -87858 -76311
2740 -76311 163157 181299 146120 -38363 373381 15420 -253547 176105 460340 614850
2730 614850 317093 484155 139236 108526 288211 112934 154629 352581 249284 610167
2720 610167 580504 271800 -84999 -20120 144289 149629 -11181 -58305 255763 10025 126568
2709 126568 669477 457717 185048 -55969 27121 376422 571104 558063 310189 -240774
$$ packed form
2780C40604j50408L25034j00933K52785j7343j57140m15366K26536j72284p5152
2770E6333L70306J60193m0345k13210j24551J41143L11340k45434k16094m49411
2760b49730L97203N9258J83893m00779k67355J60777K90425L12925k31349n04688
2750b49420J31887P89091M3799l72956k17515R132k36834K58142k43184J1547
2740g6311K39468J8142l5179j84483M11744l57961k68967M29652K84235J54510
2730F14850k97757J67062l44919l0710J79685j75277M1695J97952j03297L60883
2720F10167k9663l08704l56799O4879J64409N340j60810m7124L14068k45738J16543
2709A26568N42909k11760k72669k41017Q3090L49301J94682j3041k47874n50963
$$ plain form
2699 -240774 228802 628924 441039 -88003 -251702 -162303 98155 566036 193814 -79065
2689 -79065 -101489 433131 148194 343712 257975 278526 -56755 267189 475772 126979
2679 126979 -361092 -157723 362937 227499 571637 40478 -248077 -278074 305714 498731
2669 498731 330826 110543 42095 92875 461364 998476 227351 -45608 281850 505400
2659 505400 323515 474529 -13042 2544 191272 578306 92120 -22896 514798 440849
2649 440849 652080 578707 175305 -235610 263807 102041 253526 232132 183295 -91357
2639 -91357 47119 140914 2194 -200192 -47521 374586 234062 466532 104413 71726
2629 71726 242611 656238 489496 128890 72471 69685 269756 725028 469329 -156957
$$ packed form
2699b40774M69576M00122j87885n29042j63699Q9399K60458M67881l72222k72879
2689g9065k2424N34620k84937J95518q5737K0551l35281L23944K08583l48793
2679A26979m88071K03369N20660j35438L44138n31159k88555k9997N83788J93017
2669D98731j67905k20283o8448N0780L68489N37112p71125k72959L27458K23550
2659E05400j81885J51014m87571J5586J88728L87034m86186j15016N37694p3949
2649D40849K11231p3373m03402m10915M99417j61766J51485k1394m8837k74652
2639i1357J38476R3795j38720k02386J52671M22107j40524K32470l62119l2687
2629G1726J70885M13627j66742l60606n6419k786K00071M55272k55699o26286
$$ plain form
2619 -156957 199749 364482 450421 373936 316826 575092 426933 395622 793824 1117329
2609 1117329 1582026 1949059 2297304 2203684 1869335 1741389 1509714 960932 638385 771737
2599 771737 578284 602801 405889 290648 325041 277297 535916 601295 337963 421620 525778
2588 525778 527229 697022 317667 -67435 138695 427535 287727 667631 669505 524532
2578 524532 570914 784459 376594 48233 80452 429117 533771 1059956 730288 433216
2568 433216 558905 602934 696763 530649 532922 314939 407107 280020 611394 334843 193886
2557 193886 182419 232635 455237 757073 684118 102349 483881 903028 826355 515005
2547 515005 194079 420407 625015 591720 424631 -84398 205103 348898 241177 182797
$$ packed form
2619a56957L56706J64733Q5939p6485n7110K58266j48159l1311L98202L23505
2609A117329M64697L67033L48245r3620l34349j27946k31675n48782l22547J33352
2599G71737j93453K4517j96912j15241L4393m7744K58619O5379k63332Q3657J04158
2588E25778J451J69793l79355l85102K06130K88840j39808L79904J874j44973
2578E24532M6382K13545m07865l28361L2219L48665J04654N26185l29668k97072
2568D33216J25689M4029R3829j66114K273k17983R2168j27087L31374k76551j40957
2557A93886j1467N0216K22602L01836p2955n81769L81532M19147p6673l11350
2547E15005l20926K26328K04608l3295j67089n09029K89501J43795j07721n8380
$$ plain form
2537 182797 344581 278474 -103026 196822 307187 624750 372171 -124952 467034 661591
2527 661591 455578 381268 102692 117142 286588 366885 209888 131115 544288 763528
2517 763528 786611 613902 662111 333004 373088 634690 730005 315823 190488 105409 151745
2506 151745 621646 878073 811649 294255 765963 958792 1179376 979806 723748 450219
2496 450219 768028 1212163 1020889 876526 1003750 1278856 1143367 837493 940486 579099
2486 579099 700376 1337969 1014349 1017035 1085770 1160983 1244709 1318660 1303099 598932 885256
2475 885256 1012050 999049 988655 939290 944647 1067939 1367681 1003031 753543 1201312 1113743
2464 1113743 1015855 1457387 1285673 865320 982891 1121920 1028593 1105584 1448965 1162747
$$ packed form
2537A82797J61784o6107l81500K99848J10365L17563k52579m97123N91986J94557
2527F61591k06013p4310k78576J4450J69446Q0297j56997p8773M13173K19240
2517G63528K3083j72709M8209l29107M0084K61602R5315m14182j25335q5079M6336
2506A51745M69901K56427o6424n17394M71708J92829K20584j99570k56058k73529
2496D50219L17809M44135j91274j44363J27224K75106j35489l05874J02993l61387
2486E79099J21277O37593l23620K686O8735P5213Q3726P3951j5561p04167K86324
2475H85256J26794j3001j0394m9365N357J23292K99742l64650k49488M47769q7569
2464A113743r7888M41532j71714m20353J17571J39029r3327P6991L43381k86218
$$ plain form
2454 1162747 982267 1485758 1723857 1612073 1514431 1582704 1434422 1547309 1988184 1776172
2444 1776172 1270814 1711577 2072009 1593249 1778007 1914667 1950937 2081304 2087168 2181673
2434 2181673 2205755 1991852 2315861 2211067 2086668 2372111 2503136 2625686 2685720 2975883
2424 2975883 3071591 2891860 2902020 2935270 3111452 3155002 3104094 2709679 2960195 3259327
2414 3259327 3387778 3421636 3396042 3643778 3440816 3617766 3847754 3440661 3553913 3875022
2404 3875022 3762381 3596416 3985718 4244332 4220710 4235716 4373087 4540200 4554833 4706959
2394 4706959 4490731 4365392 4826934 5066208 4744175 4830650 5218232 5253187 5287776 5639542
2384 5639542 6052459 6159768 6704398 6925348 7126573 7415780 7343240 7475803 7685581 7767248
$$ packed form
2454A162747j80480N03491K38099j11784r7642O8273j48282J12887M40875k12012
2444A776172n05358M40763L60432m78760J84758J36660L6270J30367N864R4505
2434B181673K4082k13903L24009j04794j24399K85443J31025J22550O0034K90163
2424B975883R5708j79731J0160L3250J76182M3550n0908l94415K50516K99132
2414C259327J28451L3858k5594K47736k02962J76950K29988m07093J13252L21109
2404C875022j12641j65965L89302K58614k3622J5006J37371J67113J4633J52126
2394D706959k16228j25339M61542K39274l22033Q6475L87582L4955L4589L51766
2384E639542M12917J07309N44630K20950K01225K89207p2540J32563K09778Q1667
$$ plain form
2374 7767248 7792867 8697257 8831746 9608264 10011158 10280900 10400182 11016480 11685469 12773405
2364 12773405 13317556 13770267 14018664 15134329 17038304 18478884 20551279 24208519 28991963
2355 28991963 32937703 34778464 34963604 34405906 35809002 38300342 42310018 46150552
2347 46150552 53531960 62932702 77276173 99462414 148990367 249917455 387621198
2340 387621198 450959124 410226323 320718749 226277607 163766334 121769717 93957491
2333 93957491 71230798 54566985 42083722 34670487 29762851 28135490 27705635 29756842
2325 29756842 29947353 27726242 24457466 21958794 19671511 17940753 17221640 16177942
2317 16177942 15064639 14231346 13674512 12731938 11732144 11221165 10827713 10360614 9556478
$$ packed form
2374G767248K5619R04390J34489P76518M02894K69742J19282O16298O68989J087936
2364A2773405N44151M52711K48397J115665J903975J440580K072395L657240M783444
2355B8991963L945740J840761J85140n57698J403096K491340M009676L840534
2347D6150552P381408R400742J4343471K2186241M9527953J00927088J37703743
2340C87621198O3337926m0732801q9507574r4441142o2511273m1996617k7812226
2333I3957491k2726693j6663813j2483263p413235m907636j627361m29855K051207
2325B9756842J90511k221111l268776k498672k287283j730758p19113j043698
2317A6177942j113303q33293n56834r42574r99794n10979l93452m67099q04136
$$ plain form
2308 9556478 9090823 8553334 8728715 8566856 7773240 7459134 7712783 7132757 6891024 6336312
2298 6336312 6255243 6014821 5960448 5911870 5792440 6128864 5675379 5347430 5586535 5621948
2288 5621948 5227049 4917325 4785802 4426933 4483889 4673842 4282984 3737540 3637947 3370634
2278 3370634 3424334 3554713 3546977 2961221 3114438 3155959 2958714 3516758 3045475 2446224
2268 2446224 2426269 2622124 2569559 2503523 2330379 2071334 2180427 2393073 2044525 1967999
2258 1967999 1869316 1802923 2061992 2282111 2020526 1619030 1663992 1938506 1725662 1543975
2248 1543975 1379646 1198239 1569291 2170620 1952571 1261525 888126 626069 1246921 1785208
2238 1785208 1307898 748561 488887 1046541 1198533 1174536 762206 434061 733217 1212552
$$ packed form
2308I556478m65655n37489J75381j61859p93616l14106K53649n80026k41733n54712
2298F336312q1069k40422n4373m8578j19430L36424m53485l27949K39105L5413
2288E621948l94899l09724j31523l58869N6956J89953l90858n45444r9593k67313
2278C370634N3700J30379p736n85756J53217M1521j97245N58044m71283n99251
2268B446224j9955J95855n2565o6036j73144k59045J09093K12646l48548p6526
2258A967999r8683o6393K59069K20119k61585m01496M4962K74514k12844j81687
2248A543975j64329j81407L71052O01329k18049o91046l73399k62057O20852N38287
2238A785208m77310n59337k59674N57654J51992k3997m12330l28145K99156M79335
$$ plain form
2228 1212552 869373 891727 726303 652457 349645 994961 741879 669636 741859 732079 927391
2217 927391 1131135 1006828 361425 307576 661910 535082 540418 826819 357280 606298
2207 606298 869465 559144 249728 392053 786564 511795 426715 151536 183601 136451
2197 136451 327499 127063 9674 190253 156303 77664 232932 -179616 135682 362296
2187 362296 274165 312422 351659 842822 157288 276296 -769 255547 513328 177223
2177 177223 -108267 -88188 113645 254120 492057 564989 210065 -39595 246195 228850
2167 228850 622640 424701 35175 -756305 -242232 235389 81181 44455 181510 124226
2157 124226 287797 658857 140656 -92348 -33767 535209 185093 168738 94679 -142713
$$ packed form
2228A212552l43179K2354j65424p3846l02812O45316k53082p2243P2223r780J95312
2217I27391K03744j24307o45403n3849L54334j26828N336K86401m69539K49018
2207F06298K63167l10321l09416J42325L94511k74769q5080k75179L2065m7150
2197A36451J91048k00436j17389J80579l3950p8639J55268m12548L15298K26614
2187C62296q8131L8257L9237M91163o85534J19008k77065K56316K57781l36105
2177A77223k85490K0079K01833J40475K37937P2932l54924k49660K85790j7345
2167B28850L93790j97939l89526p91480N14073M77621j54208l6726J37055n7284
2157A24226J63571L71060n18201k33004N8581N68976l50116j6355p4059k37392
$$ plain form
2147 -142713 -4547 496239 484880 1597 -4607 -280000 40584 -48592 -27204 -392191 -162311
2136 -162311 124190 296103 -37008 -349025 -347846 81795 318989 -65362 -446026 -760076
2126 -760076 -248839 -345814 94356 -250993 91096 -492860 -236340 196041 112488 -470522
2116 -470522 -597893 -401599 -192673 52027 -70829 -283767 -537239 -30987 -228183 -153199
2106 -153199 -270654 -337394 -357015 -311613 -439354 -541882 14852 -13091 -161506 -400659
2096 -400659 -1841 -220963 339233 319943 -270967 -858546 -115692 -258717 -425920 1991
2086 1991 111349 86792 -261162 -87322 -579620 -190392 118669 193687 -424612 461640
2076 461640 430138 -248501 -63955 934769 1424232 1787974 2409422 1930783 1139116 1171720
$$ packed form
2147a42713J38166N00786j1359m83283o204k75393L20584q9176K1388l64987K29880
2136a62311K86501J71913l33111l12017J179M29641K37194l84351l80664l14050
2126g60076N11237r6975M40170l45349L42089n83956K56520M32381q3553n83010
2116d70522j27371J96294K08926K44700j22856k12938k53472N06252j97196P4984
2106a53199j17455o6740j9621M5402j27741j02528N56734k7943j48415k39153
2096d00659L98818k19122N60196j9290n90910n87579P42854j43025j67203M27911
2086A991J09358k4557l47954J73840m92298L89228L09061P5018o18299Q86252
2076D61640l1502o78639J84546R98724M89463L63742O21448m78639p91667L2604
$$ plain form
2066 1171720 734838 -470551 181437 320008 -228986 -628379 -153966 -234612 22995 310281
2056 310281 73089 -576419 -89786 419906 -295512 -99515 -36034 -456767 -670040 -102749
2046 -102749 -460226 -733263 -243285 250277 -48093 -243230 -85865 -773300 -985866 -291553
2036 -291553 -288448 -277031 -48288 -55060 54032 -98451 -109856 -459640 -558469 -135886 -36917
2025 -36917 -276187 16372 177095 -251314 -227433 -168883 -309825 -507929 -324524 205304
2015 205304 10388 -10220 -43119 -603421 -324816 140052 -17651 -428515 -409003 -96021
2005 -96021 385140 -85456 -541725 -639728 -169156 125185 -68129 -111822 -212125 -98453
1995 -98453 32916 -258543 -626869 -634970 -382102 -392233 -131569 -358448 -185536 -82480
$$ packed form
2066A171720m36882j205389O51988J38571n48994l99393M74413q0646K57607K87286
2056C10281k37192o49508M86633N09692p15418J95997O3481m20733k13273N67291
2046a02749l57477k73037M89978M93562k98370j95137J57365o87435k12566O94313
2036b91553L105J1417K28743o772J09092j52483j1405l49784r8829M22583R8969
2025c6917k39270K92559J60723m28409K3881N8550j40942j98104J83405N29828
2015B05304j94916k0608l2899n60302K78605M64868j57703m10864J9512L12982
2005i6021M81161m70596m56269r8003M70572K94341j93314m3693j00303J13672
1995i8453J31369k91459l68326q101K52868j0131K60664k26879J72912J03056
$$ plain form
1985 -82480 -48409 -51796 -57273 -270800 -217870 -204947 -14059 115136 -580276 -662722 -646687
1974 -646687 -447728 -140534 -174981 -535841 -515882 -114754 355427 -39059 -748571 -617680
1964 -617680 -458634 223872 258139 -164210 -171205 -177874 -88620 -446172 -525019 -235799 120458
1953 120458 -136549 -143549 -722077 -668942 -638592 -418621 -341518 -332530 -335833 -369308 -157174
1942 -157174 -514743 -295198 -923957 -528714 -571229 -305067 -150974 -277076 -657195 -595098
1932 -595098 -470897 -311319 -460642 -731673 -734378 -800971 -407649 -671287 -628324 -665373 -610552
1921 -610552 -780210 -313647 -507794 -133486 170718 -89236 -88904 -216736 -398456 -497802
1911 -497802 -515153 -477433 -189519 -438051 53628 -4830 -449849 -904694 -401489 -375806
$$ packed form
1985h2480L4071l387n477k13527N2930J2923J90888J29195o95412q2446J6035
1974f46687J98959L07194l4447l60860J9959M01128M70181l94486p09512J30891
1964f17680J59046O82506L4267m22349o995o669Q9254l57552p8847K89220L56257
1953A20458k57007p000n78528N3135L0350K19971P7103Q988l303l3475K12134
1942a57174l57569K19545o28759L95243m2515K66162J54093j26102l80119O2097
1932e95098J24201J59578j49323k71031k705o6593L93322k63638M2963l7049N4821
1921f10552j69658M66563j94147L74308L04204k59954L32j27832j81720r9346
1911d97802j7351L7720K87914k48532M91679n8458m45019m54845N03205K5683
$$ plain form
1901 -375806 -359189 -377980 -292842 -336563 -800039 93173 -569768 -500844 -423157 -434738 -486055
1890 -486055 46596 -375188 -572090 -566080 -388098 -356252 -439946 -8508 -293000 -100584
1880 -100584 -82592 333237 -478444 -399109 -433650 4304 123654 41740 -317021 -767329
1870 -767329 13240 122993 -332420 -369765 100081 -127704 306222 -414840 -622968 -910935
1860 -910935 -79324 -75829 -146786 -140140 -176704 -384443 -476105 -339677 -608403 -197724 -415823
1849 -415823 -472220 -47713 394415 -338391 -111520 -635897 -227335 -141759 157830 74455
1839 74455 -668436 65354 175383 37110 -273322 -165327 -540764 -168541 -172644 -61287
1829 -61287 -205542 -208500 -382798 -685416 -467840 -469438 -731939 -340883 381028 -426535 -266700
$$ packed form
1901c75806J6617j8791Q5138m3721m63476Q93212o62941O8924P7687j1581n1317
1890d86055N32651m21784j96902O010J77982L1846q3694M31438k84492J92416
1880a00584J7992M15829q11681P9335l4541M37954J19350q1914l58761m50308
1870g67329P80569J09753m55413l7345M69846k27785M33926p21062k08128k87967
1860i10935Q31611L495p0957O646l6564k07739r1662J36428k68726M10679k18099
1849d15823n6397M24507M42128p32806K26871n24377M08562Q5576K99589q3375
1839G4455p42891P33790J10029j38273l10432J07995l75437L72223m103J11357
1829f1287j44255k958j74298l02618K17576j598k62501L91056P21911q07563J59835
$$ plain form
1818 -266700 -232469 -574525 -514020 -11820 -53273 -281288 -299949 301378 -67801 -349699
1808 -349699 -189615 -688830 -711729 -608594 -432844 -197408 454130 -52752 12972 14405
1798 14405 106606 -278780 -618325 -237596 -111923 -134673 1286 -381502 -638331 -168616
1788 -168616 -366677 -106841 -120972 214801 -286110 -532917 -105942 -265058 -413922 -166203
1778 -166203 -186229 -407332 -212229 -112217 13135 -129270 -130666 -236578 -360317 -621431
1768 -621431 -225446 -390620 -117830 238676 -298039 47548 -363975 -279382 -50015 -494985
1758 -494985 -355725 -121197 -609203 -366720 -631662 -510379 -553065 -254497 -24788 -53096
1748 -53096 95621 -160963 -550699 -425540 253708 106023 -58944 184185 -284549 -268925
$$ packed form
1818b66700L4231l42056O0505N02200m1453k28015j8661O01327l69179k81898
1808c49699J60084m99215k2899J03135J75750K35436O51538n06882O5724J433
1798A4405R2201l85386l39545L80729J25673k2750J35959l82788k56829M69715
1788a68616j98061K59836j4131L35773n00911k46807M26975j59116j48864K47719
1778a66203k0026k21103J95103J00012J25352j42405j396j05912j23739k61114
1768f21431L95985j65174K72790L56506n36715L45587m11523Q4593K29367m44970
1758d94985J39260K34528m88006K42483k64942J21283m2686K98568K29709k8308
1748e3096J48717k56584l89736J25159O79248j47685j64967K43129m68734J5624
$$ plain form
1738 -268925 -339981 -511499 -542517 -671622 -27979 187098 68730 460841 90793 -319271
1728 -319271 129977 184686 -353412 -413059 -282076 -244274 -261045 218150 -16208 -694681
1718 -694681 -327493 -171437 -413681 -119088 342179 -72970 -226041 142557 261910 -610653
1708 -610653 -268503 348683 -276682 -187493 252456 -640129 -926884 -228548 -130305 -427241
1698 -427241 -502801 59213 -611470 -571995 426712 129219 -641710 -341128 -70518 -667213
1688 -667213 39451 146164 -280847 -532324 33742 -276863 -1002557 -449637 -66454 -694371
1678 -694371 -512392 104289 -201803 -253053 -273753 -225119 -600308 -220798 -161164 -562640
1668 -562640 -254636 140264 -257148 -653823 -276729 -162260 -220543 -463150 177559 -77710
$$ packed form
1738b68925p1056j71518l1018j29105O43643K15077j18368L92111l70048m10064
1728c19271M49248N4709n38098n9647J30983L7802j6771M79195k34358o78473
1718f94681L67188J56056k42244K94593M61267m15149j53071L68598J19353q72563
1708f10653L42150O17186o25365Q9189M39949q92585k86755O98336R8243k96936
1698d27241p5560N62014o70683L9475R98707k97493p70929L00582K70610n96695
1688f67213P06664J06713m27011k51477N66066l10605p25694N52920L83183o27917
1678f94371J81979O16681l06092n1250k0700M8634l75189L79510N9634m01476
1668e62640L08004L94900l97412l96675L77094J14469n8283k42607O40709k55269
$$ plain form
1658 -77710 -268135 -257743 -214789 -612094 -460797 -251749 -416799 -4250 -3386 -146446 -504463
1647 -504463 -111434 238811 -39800 -625902 1495 -352261 -489379 -345456 -268726 -392794
1637 -392794 -439760 16727 -268989 -148748 159629 -416 -990652 -566834 -372645 -121987
1627 -121987 -190603 -287630 -426537 -455973 -352118 13122 -375180 -876524 -375004 -458979
1617 -458979 -423256 -403582 -335025 -847239 -800872 -367998 -444158 -530998 80211 -34724 -573499
1606 -573499 -198449 -9168 -51203 -488994 -294936 -357219 22197 -40945 -125403 -657336
1596 -657336 -560753 -14691 -540017 -689622 94273 29892 -128923 405900 55627 -228348
1586 -228348 -373278 226952 -330096 -757526 -215265 156332 -302845 -102659 717 -575271
$$ packed form
1658g7710j90425J0392M2954l97305J51297K09048j65050M12549Q64j43060l58017
1647e04463L93029L50245k78611n86102O27397l53756j37118J43923P6730j24068
1637c92794m6966M56487k85716J20241L08377j60045r90236M23818J94189K50658
1627a21987o8616r7027j38907k9436J03855L65240l88302n01344N01520q3975
1617d58979L5723J9674O8557n12214M6367M32874p6160q6840O11209j14935n38775
1606e73499L75050J89281m2035m37791J94058o2283L79416o3142q4458n31933
1596f57336R6583N46062n25326j49605P83895o4381j58815N34823l50273k83975
1586b28348j44930O00230n57048m27430N42261L71597m59177K00186J03376n75988
$$ plain form
1576 -575271 -254135 -341639 -116022 -305547 -145887 -259396 -589255 -15057 180660 -384257
1566 -384257 -734474 -237515 -219188 209660 7858 -14824 -584963 -312484 -242010 -364296
1556 -364296 -474817 -113601 89898 236726 142517 -491135 -27031 207107 142307 -114064
1546 -114064 -15808 -46792 -140998 -309629 -129220 -362771 -267726 20708 -491172 -129902
1536 -129902 -14192 -183639 -462212 -289718 -584061 -362355 -510618 -415777 -330263 -43276
1526 -43276 314656 159147 -166249 -72881 -71392 -436773 -187668 -199273 97592 -29581 -252922
1515 -252922 -571101 -404157 -133559 -141662 -269858 -172900 -294487 -593938 -229332 -294218
1505 -294218 -103464 -172147 -513978 -81650 319493 -26230 -491391 -665378 -500695 -319667
$$ packed form
1576e75271L21136q7504K25617j89525J59660j13509l29859N74198J95717n64917
1566c84257l50217M96959J8327M28848k01802k2682n70139K72479P0474j22286
1556c64296j10521L61216K03499J46828r4209o33652M64104K34138o4800k56371
1546a14064R8256l0984r4206j68631J80409k33551R5045K88434n11880L61270
1536a29902J15710j69447k78573J72494k94343K21706j48263R4841Q5514K86987
1526d3276L57932j55509l25396R3368J489l65381K49105j1605K96865j27173k23341
1515b52922l18179J66944K70598q103j28196R6958j21587k99451L64606o4886
1505b94218J90754o8683l41831M32328M01143l45723m65161j73987J64683J81028
$$ plain form
1495 -319667 -27223 -14344 -674245 -257610 73497 -42997 -440519 -95160 -413846 -250102
1485 -250102 -128292 -182394 -253970 -134506 -76652 -386776 -255141 -132674 -233492 -420338
1475 -420338 -164830 -547469 -350862 -86077 -343159 -736413 -805502 -404030 -721473 -442635
1465 -442635 272542 112192 -531119 -823998 -927649 -491548 -352597 -317381 -528517 -216673
1455 -216673 197184 -261432 -556520 -691988 -605138 -283339 73218 -436047 -470378 22488
1445 22488 39213 -326643 -416959 -408690 -332760 -126459 -49453 299096 245867 -2978 -214376
1434 -214376 -184700 -69286 -140858 -223228 -3696 68412 -3855 -123558 -176692 -123845 -329036
1423 -329036 -496828 -386497 -645502 -188290 405651 -32105 -482901 -481250 -307520 -391774
$$ packed form
1495c19667K92444J2879o59901M16635L31107j16494l97522L45359l18686J63744
1485b50102J21810n4102p1576J19464N7854l10124J31635J22467j00818j86846
1475d20338K55508l82639J96607K64785k57082l93254o9089M01472l17443K78838
1465d42635P15177j60350o43311k92879j03651M36101J38951L5216k11136L11844
1455b16673M13857m58616k95088j35468Q6850L21799L56557n09265l4331M92866
1445B2488J6725l65856r0316Q269P5930K06301P7006L48549n3229k48845k11398
1434b14376K9676J15414p1572q2370K19532P2108p2267j19703n3134N2847k05191
1423c29036j67792J10331k59005M57212N93941m37756m50796J651J73730q4254
$$ plain form
1413 -391774 -289995 27263 -318777 -348852 -57514 -288318 -411992 -365811 -332674 -613706
1403 -613706 -411329 -151283 -351469 -772612 -568968 -73837 -354697 -136234 -183198 -72189
1393 -72189 267557 182488 -306154 -427251 -127323 24449 33607 70576 -86696 -249422 -68770
1382 -68770 -91210 -431603 -1037574 -187202 -167436 -14893 78044 -46630 -370920 -319405 -43725
1371 -43725 -287621 -413799 -409030 -531398 -360912 271750 108309 -82890 -392470 -260469
1361 -260469 -214878 39450 -396200 -1121092 -680937 67223 116550 -380883 -708255 -578929
1351 -578929 106452 261033 118919 -499663 -449974 -357371 -62041 -402235 -356084 -386665
1341 -386665 -335029 181453 -10565 27693 -399845 -231748 -41571 42116 -200083 -292934
$$ packed form
1413c91774J01779L17258l46040l0075K91338k30804j23674M6181L3137k81032
1403f13706K02377K60046k00186m21143K03644M95131k80860K18463m6964J11009
1393g2189L39746q5069m88642j21097K99928J51772R158L6969j57272j62726J80652
1382f8770k2440l40393o05971Q50372J9766J52543R2937j24674l24290N1515K75680
1371d3725k43896j26178M769j22368J70486O32662j63441j91199l09580J32001
1361b60469M5591K54328m35650p24892M40155P48160M9327m97433l27372J29326
1351e78929O85381J54581j42114o18582M9689R2603K95330l40194M6151l0581
1341c86665N1636N16482j92018L8258m27538J68097J90177Q3687k42199r2851
$$ plain form
1331 -292934 -532457 -233919 -87943 -173228 -385714 -502978 -264694 139797 154449 -409169
1321 -409169 -248965 -141408 32187 -54238 -219873 -495032 -164835 385034 403058 -167564
1311 -167564 -388309 -574617 -399508 -260825 -381975 -499395 -531295 -110163 -212277 -314897
1301 -314897 -542469 -655166 -215007 -61935 -84681 -394000 -569868 48737 -80345 -696141
1291 -696141 -442560 -177827 -439915 -78590 -50568 -188740 -343876 -483036 -613087 -566671
1281 -566671 62717 -190347 -629923 -540616 173042 70335 -257459 -510539 -714746 -465245
1271 -465245 -74219 62611 -369429 -341711 -227144 -103246 -700717 -796559 -575911 302906
1261 302906 354658 -82047 -711256 -580083 -283635 -83476 -228997 -775954 -817424 -367454
$$ packed form
1331b92934k39523K98538J45976q5285k12486j17264K38284M04491J4652n63618
1321d09169J60204J07557J73595q6425j65635k75159L30197N49869J8024n70622
1311a67564k20745j86308J75109J38683j21150j17420l1900M21132j02114j02620
1301c14897k27572j12697M40159J53072k2746l09319j75868O18605j29082o15796
1291f96141K53581K64733k62088L61325K8022j38172j55136j39160j30051M6416
1281e66671O29388k53064m39576Q9307P13658j02707l27794k53080k04207K49501
1271d65245L91026J36830m32040K7718J14567J23898n97471r5842K20648Q78817
1261C02906N1752m36705o29209J31173K96448K00159j45521n46957m1470M49970
$$ plain form
1251 -367454 -78307 -283084 37033 -512506 -694776 -229301 137381 -108678 -38575 -142256
1241 -142256 -423198 -82383 378906 -37270 -716866 -365189 -160742 -95250 -320582 -607108
1231 -607108 -808886 -234999 272830 -228670 -639126 -367707 -49352 -348960 55508 -458550
1221 -458550 -565273 -212412 147746 -310127 -656138 -293856 -221197 -476724 -150071 -491219
1211 -491219 -882066 -297133 -114060 34023 -165569 -268284 -850623 -563637 -129445 -174028
1201 -174028 -290824 -44504 -156078 -266088 -120342 -424568 -593154 -595960 32913 -227623
1191 -227623 119897 -149991 -624896 -326924 -228980 -80916 -441438 -185983 -491685 -677608
1181 -677608 -4226 215353 -542406 -491336 -291846 -467932 -570398 -418301 -429493 -256528
$$ packed form
1251c67454K89147k04777L20117n49539j82270M65475L66682k46059P0103j03681
1241a42256k80942L40815M61289m16176o79596L51677K04447O5492k25332k86526
1231f07108k01778N73887N07829n01500m10456K71419L18355k99608M04468n14058
1221d58550j06723L52861L60158m57873l46011L62282P2659k55527L26653l41148
1211d91219l90847N84933J83073J48083j99592j02715n82339K86986M34192m4583
1201a74028j16796K46320j11574j10010J45746l04226j68586k806O28873k60536
1191b27623L47520k69888m74905K97972R7944J48064l60522K55455l05702j85923
1181f77608O73382K19579p57759N1070J99490j76086j02466J52097j1192J72965
$$ plain form
1171 -256528 -47519 -338933 -703620 -580726 -287103 -557732 -245631 -70498 -224291 -375993
1161 -375993 -457756 -272288 -157296 -149417 -490092 -475554 -154800 231190 -58752 -248563
1151 -248563 -585236 -413263 -10781 -18763 -105728 -295677 -252758 -128189 -111991 -316666 -461824
1140 -461824 -454769 -281923 -462308 -485841 -354441 -161814 -582531 -410725 -700140 -841796
1130 -841796 -474925 -477422 -183364 -55138 -250165 -651617 -488208 -245280 1434 -289519
1120 -289519 -185350 -151594 -36599 253244 -247633 -629916 -782631 -61412 -224649 -148693
1110 -148693 -412799 -370267 -445555 -397054 139731 -228769 -277807 -189555 -123773 -164007 -305592
1099 -305592 -597851 -580399 -520060 -26008 -119240 -481118 -481706 -126212 -76067 -178356 -422491
$$ packed form
1171b56528K09009k91414l64687J22894K93623k70629L12101J75133j53793j51702
1161c75993q1763J85468J14992P879l40675J4538L20754L85990k89942j89811
1151b48563l36673J71973M02482p982q6965j89949M2919J24569J6198k04675j45158
1140d61824P055J72846j80385k3533J31400J92627m20717J71806k89415j41656
1130h41796L66871k497K94058J28226j95027m01452J63409K42928K46714k90953
1120b89519J04169L3756J14995K89843n00877l82283j52715P21219j63237P5956
1110a48693k64106M2532p5288M8501N36785l68500m9038Q8252O5782m0234j41585
1099c05592k92259J7452O0339M94052r3232l61878n88L55494N0145j02289k44135
$$ plain form
1088 -422491 -371895 -30162 -25502 -183120 -923184 -905478 -162228 259856 1453 -263292
1078 -263292 -400368 -83624 62837 -171984 -219221 -430914 -396263 -657418 -315168 -121244
1068 -121244 58104 -335769 -510191 -376147 34047 70496 -559108 -290717 -131829 -64646
1058 -64646 -156096 -388722 -619172 -230710 -330554 -172885 -582468 -188355 154097 -95397
1048 -95397 -266692 -264624 -100259 18610 125439 -261734 -616842 -797447 -184495 38494
1038 38494 -70694 -188810 -389739 -451069 -46740 30158 -346614 -748715 -666648 -64673
1028 -64673 -457597 -160652 -330470 -1179435 -654438 84067 349447 6756 -479928 -593135
1018 -593135 -410941 -260929 -50643 -590652 -688585 -72696 24477 -357314 -169106 -549993
$$ packed form
1088d22491N0596L41733M660j57618p40064J7706P43250M22084k58403k64745
1078b63292j37076L16744J46461k34821m7237k11693L4651k61155L42250J93924
1068a21244J79348l93873j74422J34044M10194L6449o29604K68391J58888O7183
1058f4646r1450k32626k30450L88462r9844J57669m09583L94113L42452k49494
1048i5397j71295K068J64365J18869J06829l87173l55108j80605O12952K22989
1038C8494j09188j18116k00929o1330M04329P6898l76772m02101Q2067O01975
1028f4673l92924K96945j69818q48965N24997P38505K65380l42691m86684j13207
1018e93135J82194J50012K10286n40009r7933O15889R7173l81791J88208l80887
$$ plain form
1008 -549993 -595679 -371052 -161917 -212375 -608841 -65222 21664 -176771 -83123 -413686
998 -413686 -790214 -201342 134950 -148912 -641371 -665668 -465765 -252487 -332860 -225305
988 -225305 -791970 -794748 -152005 8988 214172 49698 -418740 -706098 -208474 185481
978 185481 42498 -660748 -447956 -197791 -266902 -417791 -894466 -775310 -304405 122618
968 122618 135273 -383864 -547120 102304 191614 -228105 -439399 -290060 -142424 -107995
958 -107995 6160 -312159 -599355 -257804 80320 -581673 -444024 -484484 -683599 -423668
948 -423668 -32514 3949 -433174 -513428 -439454 -553121 -98017 227127 -560639 -827328
938 -827328 145985 360919 -275739 -143057 -340554 -301534 26986 444309 182024 -391536
$$ packed form
1008e49993m5686K24627K09135n0458l96466N43619Q6886j98435R3648l30563
998d13686l76528N88872L36292k83862m92459k4297J99903K13278q0373J07555
988b25305n66665k778O42743J60993K05184j64474m68438k87358M97624L93955
978A85481j42983p03246K12792K50165o9111j50889m76675J19156M70905M27023
968A22618J2655n19137j63256O49424Q9310m19719k11294J49339J47636L4429
958a07995J14155l18319k87196L41551L38124o61993J37649m0460j99115K59931
948d23668L91154L6463m37123q0254P3974j13667M55104L25144p87766k66689
938h27328R73313K14934o36658J32682j97497L9020L28520M17323k62285n73560
$$ plain form
928 -391536 201339 -30510 -270924 17507 173379 30457 -272381 -404803 -327388 -652988
918 -652988 -412578 -270282 -138964 -57043 42482 -183443 -139639 127292 19844 72779 -629548
907 -629548 7159 86143 132955 -187771 -192255 -458060 37550 26810 -178828 -403462 167126
896 167126 260085 -484550 -282301 -29739 54744 -62706 404279 -97818 -376973 -331143
886 -331143 -226925 -382224 -222251 -336182 -517763 -378668 190787 -22382 -427555 -75734
876 -75734 -343249 -85286 -47321 -361521 -418954 -262863 204929 301735 -109656 -381535 -488186
865 -488186 -365700 88317 -73567 -229967 -434519 -229015 -67441 286395 -550895 -660311
855 -660311 -498684 -342213 180196 69535 60537 -546469 -655727 -218896 -311435 -792528
$$ packed form
928c91536N92875k31849k40414K88431J55872j42922l02838j32422P7415l25600
918f52988K40410J42296J31318Q1921R9525k25925M3804K66931j07448N2935p02327
907f29548O36707P8984M6812l20726m484k65805M95610j0740k05638k24634N70588
896A67126R2959p44635K02249K52562Q4483j17450M66985n02097k79155M5830
886c31143J04218j55299J59973j13931j81581J39095N69455k13169m05173L51821
876g5734k67515K57963L7965l14200n7433J56091M67792R6806m11391k71879j06651
865d88186J22486M54017j61884j56400k04552K05504J61574L53836q37290j09416
855f60311J61627J56471N22409j10661q998o07006j09258M36831r2539m81093
$$ plain form
845 -792528 -423940 -573644 -278831 -36649 -192283 -326506 -432897 -210185 -171220 -84517
835 -84517 127562 279664 -33717 256253 257803 -373204 -803386 -281681 197808 154609 -178355
824 -178355 -90083 -314006 -201042 363551 -94455 -359297 -397439 -201141 -256566 93351
814 93351 -123154 -823199 -997213 -8883 142683 -288529 -181550 -424743 -521550 -338704
804 -338704 -312295 -531133 -361322 -243136 -434252 -802607 -17305 22885 -396742 -104326
794 -104326 182407 2408 -410957 -284851 -273597 -75130 -472990 -540660 -839962 -396483
784 -396483 301692 -184077 -601516 -361038 -251608 -232371 -331993 -131997 -64522 -554796
774 -554796 53020 70797 -754915 -582978 -109266 -491464 -407847 177073 42307 -115549
$$ packed form
845g92528L68588j49704K94813K42182j55634j34223j06391K22712L8965Q6703
835h4517K12079J52102l13381K89970J550o31007m30182N21705M79489m3199l32964
824a78355Q8272k23923J12964N64593m58006k64842l8142J96298n5425L49917
814I3351k16505p00045j74014R88330J51566m31212J06979k43193r6807J82846
804c38704K6409k18838J69811J18186j91116l68355P85302M0190m19627K92416
794a04326K86733j79999m13365J26106J1254J98467l97860o7670k99302M43479
784c96483O98175m85769m17439K40478J09430J9237r9622J99996O7475m90274
774e54796O07816J7777q25712J71937M73712l82198Q3617N84920j34766j57856
$$ plain form
764 -115549 -546786 -220115 -215813 -126388 232080 -654612 -615128 -1339 4065 -67156 151725
753 151725 34107 -344450 -317521 148474 -354885 -338179 140727 -450798 -745686 -28352
743 -28352 153170 -365389 -583612 -466983 -62904 16022 100640 19089 -101894 -290286 -403389
732 -403389 -567754 -437023 -29110 -125039 393796 -237602 -145028 -130838 -308670 -149851
722 -149851 -66503 -333457 -279886 130882 -4268 -350921 -441796 -270965 -532016 -91881
712 -91881 209271 726 -290345 201465 -394647 -333028 28219 51719 -590524 -869333
702 -869333 -55744 -306176 -233301 49970 -214580 -704369 -253579 -381397 -259437 -154061
692 -154061 -65330 -219153 -547900 -90181 -397467 -367460 61299 -37317 -631828 -39413
$$ packed form
764a15549m31237L26671M302Q9425L58468q86692L9484O13789N404p1221K18881
753A51725j17618l78557K6929M65995n03359J6706M78906n91525k94888P17334
743b8352J81522n18559k18223J16629M04079P8926Q4618q1551j20983j88392j13103
732d03389j64365J30731M07913r5929N18835o31398R2574J4190j77832J58819
722a49851Q3348k66954N3571M10768j35150l46653r0875J70831k61051M40135
712i1881L01152k08545k91071M91810n96112O1619L61247K3500o42243k78809
702h69333Q13589k50432P2875K83271k64550m89789M50790j27818J21960J05376
692a54061Q8731j53823l28747M57719l07286L0007M28759r8616n94511N92415
$$ plain form
682 -39413 -11265 -386845 -627506 -946361 -539388 41413 -233725 -453328 -388967 -346707 22799
671 22799 -130845 -115015 -316643 -181337 347475 52269 -682236 -400735 -268633 -82380
661 -82380 -176002 -469159 -116414 -198256 20175 12089 -346072 -161912 -411825 -622178 3212
650 3212 186459 -165955 -366984 -473899 -277488 60165 -71778 -142453 -303814 -170299
640 -170299 266648 108920 -353395 -465663 287111 540062 451362 -6151 -427775 -801220
630 -801220 -111113 112954 -383025 -635019 -660813 -687973 -455826 -233853 -226655 -206969 -375270
619 -375270 5245 21082 223424 -20688 -240278 -259784 -314204 -568247 -380056 -637570
609 -637570 -619772 -195824 -488151 -542853 -410697 180740 106950 -416262 -503934 -600497 -680172
$$ packed form
682c9413K8148l75580k40661l18855M06973N80801k75138k19603O4361M2260L69506
671B2799j53644J5830k01628J35306N28812k95206p34505K81501J32102J86253
661h2380r3622k93157L52745q1842K18431q086l58161J84160k49913k10353O25390
650C212J83247l52414k01029j06915J96411L37653j31943p0675j61361J33515
640a70299M36947j57728m62315j12268P52774K52951q8700m57513m21624l73445
630h01220O90107K24067m95979k51994k5794k7160K32147K21973P198J9686j68301
619c75270L80515J5837K02342k44112k19590j9506n4420k54043J88191k57514
609f37570J7798M23948k92327n4702J32156N91437p3790n23212q7672r6563p9675
$$ plain form
598 -680172 -45034 22853 -555853 -565527 -479077 -365820 -431041 -498275 -848136 -710577 -828853
587 -828853 -378803 -495944 95529 113671 -365765 -410870 -222177 -420882 -492614 -115018
577 -115018 -60690 -337709 -525701 -344233 -714929 -308856 -366577 -623276 -450174 120208
567 120208 -142694 -173855 -127003 -414465 -204584 -260841 147571 140011 -143459 -256290 -200496
556 -200496 -155321 -122025 -325938 -353185 -386865 -372765 8603 -559465 -705516 -684892 -325570
545 -325570 -329704 -112507 -333205 -286766 -201749 9299 -121946 -600151 -183445 -68446 -480573
534 -480573 -331234 -175164 -635187 -282849 69823 255820 -87975 -237745 -247318 -755904
524 -755904 -437199 -69784 -535270 -452136 64618 -220309 -198218 -137458 -662575 -557447
$$ packed form
598f80172O35138O7887n78706r674Q6450J13257o5221o7234l49861J37559j18276
587h28853M50050j17141N91473J8142m79436m5105J88693j98705p1732L77596
577a15018N4328k77019j87992J81468l70696M06073n7721k56699J73102N70382
567A20208k62902l1161M6852k87462K09881n6257M08412p560k83470j12831N5794
556b00496M5175L3296k03913k7247l3680J4100L81368n68068j46051K0624L59322
545c25570m134K17197k20698M6439Q5017K11048j31245m78205M16706J14999m12127
534d80573J49339J56070m60023L52338L52672J85997l43795j49770r573n08586
524g55904L18705L67415m65486Q3134N16754k84927K2091O0760n25117J05128
$$ plain form
514 -557447 -36562 248579 122942 -294453 -250607 -341384 -189687 237416 -338166 -576841
504 -576841 -500298 -452242 202499 9373 -268407 -486430 -524054 -79575 -132499 -519686 -311021
493 -311021 12869 -73062 -215532 -428153 -37085 297790 -268290 -250458 -275723 -485554
483 -485554 22855 -203836 -340739 -96060 -232961 44441 -9078 41434 264659 -260158
473 -260158 -421298 -345771 -350449 -172200 -100189 -376164 -857152 -463443 214657 54418 -249367
462 -249367 87653 35904 -2337 303728 -174479 -154593 77984 74219 -143016 -415266 -9632
451 -9632 -209902 -491764 -259167 -541152 -499016 -48668 -1171 -440674 -537097 133238 305593
440 305593 -372023 -261324 -357776 -396852 -308749 136318 -195693 -462837 69283 -127311
$$ packed form
514e57447N20885K85141j25637m17395M3846r0777J51697M27103n75582k38675
504e76841P6543M8056O54741j93126k77780k18023l7624M44479n2924l87187K08665
493c11021L23890q5931j42470k12621L91068L34875n66080J7832k5265k09831
483d85554N08409k26691j36903K44679j36901K77402n3519N0512K23225n24817
473b60158j61140P5527m678J78249P2011k75975m80988L93709O78100j60239l03785
462b49367L37020n1749l8241L06065m78207J9886K32577l765k17235k72250M05634
451i632k00270k81862K32597k81985M2136M50348M7497m39503r6423O70335J72355
440C05593o77616J10699r6452l9076Q8103M45067l32011k67144N32120j96594
$$ plain form
430 -127311 -661593 -389428 82586 -317951 -736766 267337 294130 -641045 -100684 -334433
420 -334433 -681523 304343 430971 -490187 -370434 201961 -609029 -1021363 -354116 -130739
410 -130739 -713948 -255563 331902 -518368 -629765 -46288 -371321 -692559 21069 -181697
400 -181697 -930316 -628765 -120610 -495022 -693585 -208617 -520427 -584146 -124208 164788
390 164788 -59797 -69076 99144 -146876 -402692 -125185 -38888 -533098 -315136 18919
380 18919 28144 -156864 -103885 28626 210507 -140505 88921 -134949 -539942 -208018 -344736
369 -344736 -770165 -616255 -336826 -437141 -560805 -215256 -202204 -306005 52879 -137196
359 -137196 -413999 5073 256773 -98130 -336472 -61937 63808 -221947 -632022 -254823
$$ packed form
430a27311n34282K72165M72014m00537m18815J004103K6793r35175N40361k33749
420c34433l47090R85866J26628r21158J19753N72395q10990m12334O67247K23377
410a30739n83209M58385N87465q50270j11397N83477l25033l21238P13628k02766
400a81697p48619L01551N08155l74412j98563M84968l11810o3719M59938K88996
390A64788k24585r279J68220k46020k55816K77507Q6297m94210K17962L34055
380A8919R225j85008N2979J32511J81881l51012K29426k23870m04993L31924j36718
369c44736m25429J53910K79429j00315j23664L45549J3052j03801L58884j90075
359a37196k76803M19072K51700l54903k38342K74535J25745k85755m10075L77199
$$ plain form
349 -254823 -201309 -223825 -511517 -465232 -413353 -155259 144942 156943 -358642 -50235 100941
338 100941 -124192 -81815 -26892 -254993 27504 128767 -189126 -470520 -537730 -19558
328 -19558 -667068 -345578 71887 -265461 -845348 -383072 -546344 -386488 -111669 65859
318 65859 -249931 -396176 -7888 -322769 -696253 -780729 -600721 -542963 -187393 -175341 -156439
307 -156439 -152444 -269786 -14404 -157507 -165344 -447052 -94629 -304996 -316934 -657148 -370957
296 -370957 -399227 -273372 -181916 -212558 -261100 -562301 -403197 -296831 -284289 -602812 -499518
285 -499518 -710096 -123114 -169108 52977 -80707 -273596 -497539 -194762 72638 -243229
275 -243229 -359059 -396027 -122567 -234680 -146684 -540375 -325983 -157283 108863 -13550
$$ packed form
349b54823N3514k2516k87692M6285N1879K58094L00201J2001n15585L08407J51176
338A00941k25133M2377N4923k28101K82497J01263l17893k81394o7210N18172
328a9558o47510L21490M17465l37348n79887M62276j63272J59856K74819J77528
318F5859l15790j46245L88288l14881l73484q4476J80008N7758L55570J2052J8902
307a56439L995j17342K55382j43103p837k81708L52423k10367j1938l40214K86191
296c70957k8270J25855R1456l0642m8542l01201J59104J06366J2542l18523J03294
285d99518k10578N86982m5994K22085j33684j92889k23943L02777K67400l15867
275b43229j15830l6968K73460j12113Q7996l93691K14392J68700K66146j22413
$$ plain form
265 -13550 -258947 -155292 -167101 14015 -371540 -140700 -449189 -415901 -176970 -391700
255 -391700 -843930 -433720 -377055 -445349 -527528 -346938 -392541 -859425 -327688 -221278 -319387
244 -319387 -284311 62486 -311903 -244683 -92068 -340127 -403187 -175600 -477670 -689313
234 -689313 -185416 -82523 -50757 -169641 25291 -584335 -234367 -404729 -400563 -230211
224 -230211 -259707 -322398 -593221 -507846 -124584 -213153 -436904 -161606 -550857 -363204 -290699
213 -290699 -350607 -532595 -330650 -326120 -3161 -241063 -689184 -378426 -208575 -182725 -366905
202 -366905 -379752 -324102 -462205 -434450 -288440 -615009 -378625 157701 -338914 -528962
192 -528962 -293671 -200460 -626971 -573633 -295312 -613256 -433667 88344 -318507 -543050
$$ packed form
265a3550k45397J03655j1809J81116l85555K30840l08489L3288K38931k14730
255c91700m52230M10210N6665o8294q2179J80590m5603m66884N31737J06410r8109
244c19387L5076L46797l74389O7220J52615k48059o3060K27587l02070k11643
234f89313N03897J02893L1766j18884J94932o09626L49968j70362M166J70352
224b30211k9496o2691k70823Q5375L83262q8569k23751K75298l89251J87653P2505
213b90699n9908j81988K01945M530L22959k37902m48121L10758J69851K5850j84180
202c66905j2847N5650j38103K7755J46010l26569K36384N36326m96615j90048
192e28962K35291R3211m26511N3338K78321l17944J79589N22011m06851k24543
$$ plain form
182 -543050 -133997 -200318 -766235 -262115 184441 -448641 -384095 118276 153716 -280429
172 -280429 -251885 -544645 -958681 -163845 38603 -427476 -659506 -547769 -331809 -569610
162 -569610 -161810 -262691 -558641 -477667 -230155 -511659 -616988 -480115 -690138 -596158
152 -596158 -236562 -289802 -493119 -600112 -487105 -322545 -733662 -262943 -307382 -504656
142 -504656 -361658 53982 -119017 -334086 -515401 -438194 -76807 -205702 -448847 -535434
132 -535434 -109331 -197387 -107097 -517586 -471279 -655320 -360667 -373394 -340172 -233649 -773410
121 -773410 -414002 -266966 -139262 -566465 -550642 -255889 -122356 -498607 -272905 -527639
111 -527639 -373292 3625 -250623 -434926 -543483 -311059 -560670 -443574 -685719 -778485
$$ packed form
182e43050M09053o6321n65917N04120M46556o33082O4546N02371L5440m34145
172b80429K8544k92760m14036P94836K02448m66079k32030J11737K15960k37801
162e69610M07800j00881k95950Q0974K47512k81504j05329J36873k10023R3980
152e96158L59596n3240k03317j06993J13007J64560m11117M70719m4439j97274
142e04656J42998M15640j72999k15069j81315P7207L61387j28895k43145q6587
132e35434M26103q8056R0290m10489M6307j84041K94653j2727L3222J06523n39761
121g73410L59408J47036J27704m27203J5823K94753J33533l76251K25702k54734
111e27639J54347L76917k54248j84303j08557K32424k49611J17096k42145r2766
$$ plain form
101 -778485 -833826 -295573 75076 -145832 -137893 -500939 -1020770 -736203 -435545 -745958
91 -745958 -883705 -561218 -229944 -607217 -352691 -222008 -722660 -485979 -267255 -261158
81 -261158 -617458 -307712 -46926 -476836 -593931 -374154 -657579 -596394 -367511 -361334 -455564
70 -455564 -364914 -286864 -747377 -594965 -320270 -387586 -566950 -473246 -533154 -658613 -524208
59 -524208 -576411 -682844 -471605 -399788 -449476 -461125 -224074 -29817 -310786 -268896 -551102
48 -551102 -782610 -516926 -262685 -458580 -828081 -660963 -550457 -738128 -666629 -419193
38 -419193 -497983 -501163 -366103 -524707 -680656 -539611 -544331 -675296 -676707 -653729 -764918
27 -764918 -610204 -492670 -675704 -639804 -436967 -667545 -741084 -693414 -661033 -828136 -460231
$$ packed form
101g78485n5341N38253L70649k20908P939l63046n19831K84567L00658l10413
91g45958j37747L22487L31274l77273K54526J30683n00652K36681K18724O097
81b61158l56300L09746K60786m29910j17095K19777k83425O1185K28883O177r4230
70d55564R0650P8050m60513J52412K74695o7316j79364R3704n9908j25459J34405
59e24208n2203j06433K11239P1817m9688j1649K37051J94257k80969M1890k82206
48e51102k31508K65684K54241j95895l69501J67118J10506j87671P1499K47436
38d19193p8790l180J35060j58604j55949J41045m720j30965j411K2978j11189
27g64918J54714J17534j83034L5900K02837k30578p3539M7670L2381j67103L67905
$$ plain form
16 -460231 -215931 -585339 -930616 -835257 -690857 -460762 -214059 -439371 -697079 -595026
6 -595026 -445327 -818109 -889051 -576057 -727781 -798612
0 -798612
$$ packed form
16d60231K44300l69408l45277R5359J44400K30095K46703k25312k57708J02053
6e95026J49699l72782p0942L12994j51724p0831
0g98612
$$ Imaginary data points
##PAGE= N=2
##DATA TABLE= (X++(I..I)), XYDATA
$$ plain form
16383 -1273348 -1571393 -1708781 -1345647 -1400019 -1393536 -1184953 -1289364 -1669852 -1252320 -933189
16373 -933189 -1394750 -1403781 -1074598 -960715 -644182 -537931 -476868 -722091 -773642 -429622
16363 -429622 -815208 -970079 -623341 -550583 -608691 -613562 -434841 -394760 -453617 -254526 -232389
16352 -232389 -295781 -287744 -570480 -486681 -333937 -39191 -229207 -224447 -191650 -163065 241325
16341 241325 177236 -100252 -145979 -21219 -3783 19791 91345 120591 40632 457671 439884
16330 439884 476165 346695 419644 556771 402826 725456 670187 765295 665706 505706
16320 505706 671189 735130 802227 742308 732251 1072188 838737 685173 796389 1079117
16310 1079117 1183616 873683 1150948 1093634 1173045 1389250 1388958 1038746 957384 1123381
$$ packed form
16383a273348k98045j37388L63134n4372O483K08583j04411l80488M17532L19131
16373i33189m61561r031L29183J13883L16533J06251O1063k45223n1551L44020
16363d29622l85586j54871L46738P2758n8108m871J78721M0081n8857J99091K2137
16352b32389o3392Q037k82736Q3799J52744K94746j90016M760L2797K8585M04390
16341B41325o4089k77488m5727J24760J7436K3574P1554K9246p9959M17039j7787
16330D39884L6281j29470P2949J37127j53945L22630n5269R5108r9589j60000
16320E05706J65483O3941O7097n9919j0057L39937k33451j53564J11216K82728
16310A079117J04499l09933K77265n7314P9411K16205k92l50212q1362J65997
$$ plain form
16300 1123381 1178896 1493790 1602932 1377435 1379373 1394607 1584410 1670609 1493271 1498371 1202739
16289 1202739 1337205 1636357 1762176 1507213 1461797 1775304 1695365 1403611 1936743 1981301
16279 1981301 1670464 1766175 2007090 1907284 1788645 2240534 1974465 1633497 2258469 2356619
16269 2356619 1881485 1809129 2110266 2093806 1892798 2220685 2219213 2232158 2324576 2567922
16259 2567922 1895570 1742787 2534552 2532297 2012066 2202220 2544044 2165048 2405133 2909418
16249 2909418 2738210 2614465 2757327 2954617 2547651 2672259 3230809 2619514 2506462
16240 2506462 3086716 3141386 2913969 2678644 2881597 2587063 3068332 3489931 2778435 2416760
16230 2416760 2778654 2874120 2837292 3033445 3348976 3044440 3083688 3460927 3181846 2953526
$$ packed form
16300A123381N5515L14894J09142k25497J938J5234J89803Q6199j77338N100k95632
16289A202739J34466K99152J25819k54963m5416L13507p9939k91754N33132M4558
16279A981301l10837R5711K40915r9806j18639M51889k66069l40968O24972R8150
16269B356619m75134p2356L01137j6460k01008L27887j472J2945R2418K43346
16259B567922o72352j52783P91765k255n20231J90154L41824l78996K40085N04285
16249B909418j71208j23745J42862J97290m06966J24608N58550o11295j13052
16240B506462N80254N4670k27417k35325K02953k94534M81269M21599p11496l61675
16230B416760L61894R5466l6828J96153L15531l04536L9248L77239k79081k28320
$$ plain form
16220 2953526 3278269 3436910 3042696 3134374 3263563 3030973 2797320 3218615 3698468 3214119
16210 3214119 3077968 3636186 3424171 3230731 3414382 3282982 3111811 3082129 3783146 3307315
16200 3307315 2998615 3296886 3374247 3182881 3414282 3760654 3260649 3154672 3365045 3341546
16190 3341546 3550965 4140990 3813426 3354281 3214500 3673914 3183035 3442632 3813399
16181 3813399 3797472 3514859 3329719 3626820 3732023 3825920 3695403 3511625 3497660 4278998
16171 4278998 4244193 4017033 3591540 3726052 3769370 3833355 3592523 3241723 3801035 3653964
16161 3653964 4114479 3625402 3602476 3773360 3881508 3723080 3777969 3957972 3876347 3669674
16151 3669674 3732585 3910371 3918289 3985724 3814128 3749144 3900181 4266877 3592331 3551940
$$ packed form
16220B953526L24743J58641l94214R1678J29189k32590k33653M21295M79853m84349
16210C214119j36151N58218k12015j93440J83651j31400j71171k9682P01017m75831
16200C307315l08700K98271P7361j91366K31401L46372n00005j05977K10373k3499
16190C341546K09419N90025l27564m59145j39781M59414m90879K59597L70767
16181C813399j5927k82613j85140K97101J05203R3897j30517j83778j3965P81338
16171D278998l4805k27160m25493J34512M3318O3985k40832l50800N59312j47071
16161C653964M60515m89077k2926J70884J08148j58428N4889J80003q1625k06673
16151C669674O2911J77786P918O7435j71596o4984J51037L66696o74546m0391
$$ plain form
16141 3551940 3800531 4072265 3989964 3471933 3542885 3576820 4185923 4088922 3972160 3840435
16131 3840435 4185083 4263043 4162492 3695606 3834725 3888134 3964888 4414769 4352082 4011628
16121 4011628 3636381 4388334 4292667 4508133 4106274 3981993 3961351 3873000 4045370 3989309
16111 3989309 3769338 3950548 4522402 4337327 4251343 4000111 4091182 3737070 4301322 4105886
16101 4105886 4103263 4568030 4626157 4471308 4123867 4528277 3771532 3848667 3900596 4090284
16091 4090284 3897849 4120596 4016904 3750616 3740813 4469435 4203802 3716310 4155055 4209462
16081 4209462 4213256 3813943 4074758 3747307 4089995 4199668 4068778 3993605 4469502 4353998
16071 4353998 4463042 4298334 3937920 3916991 3636820 4000677 3597264 4100882 4091659 4256916
$$ packed form
16141C551940K48591K71734q2301n18031P0952L3935O09103r7001j16762j31725
16131C840435L44648P7960j00551m66886J39119N3409P6754M49881o2687l40454
16121D011628l75247P51953r5667K15466m01859j24281k0642q8351J72370n6061
16111C989309k19971J81210N71854j85075q5984k51232R1071l54112N64252j95436
16101D105886k623M64767N8127j54849l47441M04410p56745P7135N1929J89688
16091D090284j92435K22747j03692k66288r803P28622k65633m87492M38745N4407
16081D209462L794l99313K60815l27451L42688J09673j30890p5173M75897j15504
16071D353998J09044j64708l60414k0929k80171L63857m03413N03618r223J65257
$$ plain form
16061 4256916 4127443 4370015 4182719 3946377 4017211 4135865 4397427 4255789 4336720 4266636
16051 4266636 3951693 3879377 4264537 3775109 4134120 4284311 4654557 4152734 3806925 4257377
16041 4257377 4186747 4578715 4419083 4407945 4193696 4636394 4742473 4229869 3856716 4011765
16031 4011765 3933060 4141535 4123037 4131654 4284468 4156915 4231521 4152863 4302923 4181300
16021 4181300 4384436 4475844 4202501 4394429 4041255 3928342 4232270 4243609 4007791 4163758
16011 4163758 4147790 4226174 4584501 4538959 4059609 4177066 4220681 4051490 4427712 4080236
16001 4080236 4258692 4084613 3927331 4273531 4063850 4217188 4611448 4449535 4347005
15992 4347005 4331627 4358835 4281860 4354737 4207746 4116073 4238235 4212274 4589496 4351453
$$ packed form
16061D256916j29473K42572j87296k36342P0834J18654K61562j41638Q0931p0084
16051D266636l14943p2316L85160m89428L59011J50191L70246n01823l45809M50452
16041D257377p0630L91968j59632j1138k14249M42698J06079n12604l73153J55049
16031D011765p8705K08475j8498Q617J52814j27553P4606p8658J50060j21623
16021D181300K03136R1408k73343J91928l53174j12913L03928J1339k35818J55967
16011D163758j5968P8384L58327m5542m79350J17457M3615j69191L76222l47476
16001D080236J78456j74079j57282L46200k09681J53338L94260j61913j02530
15992D347005j5378K7208p6975P2877j46991r1673J22162k5961L77222k38043
$$ plain form
15982 4351453 4306754 4050240 4035624 4388132 4292971 4244546 3586576 3908830 4244586 4380461
15972 4380461 4309119 3928629 3762876 4472143 4482714 4236021 4384741 4435962 4297920 3961298
15962 3961298 4052994 4060369 3825635 4151554 4393493 4119358 4017095 4430164 4117754 4227156
15952 4227156 4667933 4596400 4249054 4323046 4295446 4202686 4244215 4330420 3666023 3796930
15942 3796930 4418398 4277367 4006646 3732138 4071628 4070795 4322785 4291837 3934241 3734203
15932 3734203 4040639 4352604 4073405 4112927 4563622 3913711 3943158 4088716 4062089 4222490
15922 4222490 4083896 4440407 4184283 4157062 4470654 4025169 4185440 4683185 4687157 4106556
15912 4106556 4143634 4771691 4612374 4099059 4266880 4579214 4389332 4742802 4875997 3951834
$$ packed form
15982D351453m4699k56514j4616L52508r5161m8425o57970L22254L35756J35875
15972D380461p1342l80490j65753P09267J0571k46693J48720N1221j38042l36622
15962C961298R1696P375k34734L25919K41939k74135j02263M13069l12410J09402
15952D227156M40777p1533l47346P3992k7600r2760M1529Q6205o64397J30907
15942C796930O21468j41031k70721k74508L39490q33K51990l0948l57596k00038
15932C734203L06436L11965k79199L9522M50695o49911K9447J45558k6627J60401
15922D222490j38594L56511k56124k7221L13592m45485J60271M97745L972n80601
15912D106556L7078O28057j59317n13315J67821L12334j89882L53470J33195r24163
$$ plain form
15902 3951834 3862127 4675814 4345906 4156098 4228919 4506652 4068390 4288943 4882128 4029458
15892 4029458 4151859 4508242 4531694 4313414 4676620 4861942 4388245 4450377 4877048 4056367
15882 4056367 3671911 4194022 4429759 4477420 4817233 4887936 3794631 4388149 4869809 4741808
15872 4741808 4117232 4381291 4691998 4419128 4264909 3975572 3728607 3776435 4651667 4263644
15862 4263644 3936316 3846979 4414601 3770093 4199189 4422762 4239840 4415048 4408696 4477047
15852 4477047 4218757 4672989 4405291 4076794 4133746 4456514 4154279 3927062 4058112 4688874
15842 4688874 4501113 4715169 4400874 4109678 4319491 4501827 4868903 4174968 4213264 4151531
15832 4151531 4321497 3956800 4070084 4091331 4302729 4262840 4367854 4382568 4248282 4295111
$$ packed form
15902C951834q9707Q13687l29908j89808P2821K77733m38262K20553N93185q52670
15892D029458J22401L56383K3452k18280L63206J85322m73697O2132M26671q20681
15882D056367l84456N22111K35737M7661L39813P0703j093305N93518M81660j28001
15872D741808o24576K64059L10707k72870j54219k89337k46965M7828Q75232l88023
15862D263644l27328q9337N67622o44508M29096K23573j82922J75208o352O8351
15852D477047k58290M54232k67698l28497N6952L22768l02235k27217J31050O30762
15842D688874j87761K14056l14295k91196K09813J82336L67076o93935L8296o1733
15832D151531J69966l64697J13284K1247K11398l9889J05014J4714j34286M6829
$$ plain form
15822 4295111 4461401 4418557 4162831 4510627 4123775 4136008 4232628 4662150 4428875 4235277
15812 4235277 4244352 4203153 4362754 4595153 4028547 3803352 4294907 4188248 4213808 4137182
15802 4137182 4570065 3938463 4123218 4469307 4410142 4183942 4492604 4586555 4138742 4401723
15792 4401723 4249742 4050184 4406467 4616714 4313221 4557817 4399145 4466251 4058987 4352118
$$ packed form
15822D295111J66290m2844k55726L47796l86852J2233R6620M29522k33275j93598
15812D235277R075m1199J59601K32399n66606k25195M91555j06659K5560p6626
15802D137182M32883o31602J84755L46089n9165k26200L08662R3951m47813K62981
15792D401723j51981j99558L56283K10247l03493K44596j58672O7106m07264K93131
$$ [...]
##END NTUPLES=NMR SPECTRUM
##END=
