##TITLE=1H_DE-80H_X3
 200.13MHz, d2o
 8 sc
 
 19ns.26.2.2025
##JCAMPDX= 6.0         $$ Bruker NMR JCAMP-DX V2.0
##DATA TYPE= NMR SPECTRUM
##DATA CLASS= NTUPLES
##ORIGIN= UXNMR, Bruker Analytische Messtechnik GmbH
##OWNER= pz
$$ XWIN-NMR		Version 3.5
$$ Wed Jan 21 10:53:04 2026 Russian Standard Time (UT+4h)  Yarkov@DPX200
##.OBSERVE FREQUENCY= 200.1313
##.OBSERVE NUCLEUS= ^1H
##.ACQUISITION MODE= SIMULTANEOUS
##.ACQUISITION SCHEME= undefined
##.AVERAGES= 8
##.DIGITISER RES= 18
##SPECTROMETER/DATA SYSTEM= spect
##.PULSE SEQUENCE= zg30
##.SOLVENT NAME= CDCl3
##.SHIFT REFERENCE= (INTERNAL, CDCl3, 0, 15.4968)
##AUDIT TRAIL= $$ (NUMBER, WHEN, WHO, WHERE, WHAT)
$$ ##TITLE= Audit trail, XWIN-NMR		Version 3.5
$$ ##JCAMPDX= 5.01
$$ ##ORIGIN= Bruker BioSpin GmbH
$$ ##OWNER= Yarkov
$$ C:/Bruker/XWIN-NMR/data/yarkov2/nmr/H-C/1/pdata/1/auditp.txt
$$ ##AUDIT TRAIL=  $$ (NUMBER, WHEN, WHO, WHERE, WHAT)
(   1,<2026-01-21 10:52:16.85 +0400>,<Yarkov>,<DPX200>,
      <created by zg, POWCHK disabled, PULCHK disabled
       configuration hash MD5:
       00 E9 B6 7A A2 85 ED C7 34 08 36 98 17 FE 4E 26
       data hash MD5: 16K
       C1 B8 F1 38 C5 A5 58 E8 57 A3 67 B6 78 CD BA 8F>)
(   2,<2026-01-21 10:52:22.92 +0400>,<Yarkov>,<DPX200>,
      <Start of raw data processing
       efp BC_mod = 2 LB = 0.25 FT_mod = 6 PKNL = 1 PHC0 = -5297.497 PHC1 = 7.62193 SI = 16K 
       data hash MD5: 16K
       EC DE 25 7E BE 44 19 8A 62 C8 95 FE 6B 16 54 3A>)
$$ ##END=
$$ 
$$ hash MD5
$$ 3B 0F 95 90 18 75 65 4D 98 30 DC 58 34 ED B0 6F
##$RELAX= 
##$RELAX= 
##$RELAX= 
##$RELAX= 
##$RELAX= 
##$RELAX= 
$$ Bruker specific parameters
$$ --------------------------
##$DU= <C:/Bruker/XWIN-NMR>
##$EXPNO= 1
##$NAME= <H-C>
##$PROCNO= 1
##$TYPE= <nmr>
##$USER= <yarkov2>
##$AMP= (0..31)
100 100 100 100 100 100 100 100 100 100 100 100 100 100 100 100 100 100 
100 100 100 100 100 100 100 100 100 100 100 100 100 100 
##$AQSEQ= 0
##$AQ_mod= 1
##$AUNM= <au_zg>
##$AUTOPOS= <>
##$BF1= 200.13
##$BF2= 200.13
##$BF3= 200.13
##$BF4= 200.13
##$BF5= 200.13
##$BF6= 200.13
##$BF7= 200.13
##$BF8= 200.13
##$BYTORDA= 1
##$CFDGTYP= 0
##$CFRGTYP= 5
##$CHEMSTR= <none>
##$CNST= (0..31)
1 1 145 1 1 1 1 1 1 1 1 1 1 1 1 1 1 1 1 1 1 1 1 1 1 1 1 1 1 1 1 1 
##$CPDPRG= <>
##$CPDPRG1= <>
##$CPDPRG2= <>
##$CPDPRG3= <>
##$CPDPRG4= <mlev>
##$CPDPRG5= <mlev>
##$CPDPRG6= <mlev>
##$CPDPRG7= <mlev>
##$CPDPRG8= <mlev>
##$CPDPRGB= <>
##$CPDPRGT= <>
##$D= (0..31)
0 0.7 0 0 0 0 0 0 0 0 0 0.03 0 0 0 0 0 0 0 0 0 0 0 0 0 0 0 0 0 0 0 0 
##$DATE= 1768978336
##$DBL= (0..7)
120 120 120 120 120 120 120 120 
##$DBP= (0..7)
150 150 150 150 150 150 150 150 
##$DBP07= 0
##$DBPNAM0= <>
##$DBPNAM1= <>
##$DBPNAM2= <>
##$DBPNAM3= <>
##$DBPNAM4= <>
##$DBPNAM5= <>
##$DBPNAM6= <>
##$DBPNAM7= <>
##$DBPOAL= (0..7)
0.5 0.5 0.5 0.5 0.5 0.5 0.5 0.5 
##$DBPOFFS= (0..7)
0 0 0 0 0 0 0 0 
##$DE= 6
##$DECBNUC= <off>
##$DECIM= 32
##$DECNUC= <off>
##$DECSTAT= 4
##$DIGMOD= 1
##$DIGTYP= 9
##$DL= (0..7)
0 120 120 120 120 120 120 120 
##$DP= (0..7)
$$ [...]
##$SUBNAM2= <"">
##$SUBNAM3= <"">
##$SUBNAM4= <"">
##$SUBNAM5= <"">
##$SUBNAM6= <"">
##$SUBNAM7= <"">
##$SUBNAM8= <"">
##$SUBNAM9= <"">
##$SW= 18.0517328524113
##$SWIBOX= (0..15)
0 0 2 0 0 0 0 0 0 0 0 0 0 0 0 0 
##$SW_h= 3612.71676300578
##$TD= 16384
##$TD0= 1
##$TE= 0
##$TE2= 300
##$TE3= 300
##$TEG= 300
##$TL= (0..7)
0 120 120 120 120 120 120 120 
##$TP= (0..7)
150 150 150 150 150 150 150 150 
##$TP07= 0
##$TPNAME0= <>
##$TPNAME1= <>
##$TPNAME2= <>
##$TPNAME3= <>
##$TPNAME4= <>
##$TPNAME5= <>
##$TPNAME6= <>
##$TPNAME7= <>
##$TPOAL= (0..7)
0.5 0.5 0.5 0.5 0.5 0.5 0.5 0.5 
##$TPOFFS= (0..7)
0 0 0 0 0 0 0 0 
##$TUNHIN= 0
##$TUNHOUT= 0
##$TUNXOUT= 0
##$USERA1= <user>
##$USERA2= <user>
##$USERA3= <user>
##$USERA4= <user>
##$USERA5= <user>
##$V9= 5
##$VALIST= <valist>
##$VCLIST= <CCCCCCCCCCCCCCC>
##$VD= 0
##$VDLIST= <DDDDDDDDDDDDDDD>
##$VPLIST= <PPPPPPPPPPPPPPP>
##$VTLIST= <TTTTTTTTTTTTTTT>
##$WBST= 1024
##$WBSW= 4
##$XGAIN= (0..3)
0 0 0 0 
##$XL= 0
##$YL= 0
##$YMAX_a= 343478
##$YMIN_a= -197619
##$ZGOPTNS= <>
##$ZL1= 120
##$ZL2= 120
##$ZL3= 120
##$ZL4= 120
##$ABSF1= 0
##$ABSF2= 0
##$ABSG= 0
##$ABSL= 0
##$ALPHA= 0
##$AQORDER= 0
##$ASSFAC= 0
##$ASSFACI= 0
##$ASSFACX= 0
##$ASSWID= 0
##$AUNMP= <proc_1d>
##$AZFE= 0.1
##$AZFW= 0.1
##$BCFW= 0
##$BC_mod= 2
##$BYTORDP= 0
##$COROFFS= 0
##$CY= -3
##$DATMOD= 1
##$DC= 0
##$DFILT= <>
##$DTYPP= 0
##$F1P= 0
##$F2P= 0
##$FCOR= 1
##$FTSIZE= 16384
##$FT_mod= 6
##$GAMMA= 0
##$GB= 0
##$INTBC= 1
##$INTSCL= 3.241238e-09
##$ISEN= 128
##$LB= 0.25
##$LEV0= 0
##$LPBIN= 0
##$MAXI= 10000
##$MC2= 0
##$MEAN= 0
##$ME_mod= 0
##$MI= 1.114404
##$NCOEF= 0
##$NC_proc= -7
##$NLEV= 6
##$NOISF1= 3.799351
##$NOISF2= 2.8
##$NSP= 0
##$NTH_PI= 0
##$NZP= 0
##$OFFSET= 15.49678
##$PC= 1
##$PHC0= -5297.497
##$PHC1= 7.62193
##$PH_mod= 1
##$PKNL= yes
##$PPARMOD= 0
##$PSCAL= 0
##$PSIGN= 0
##$REVERSE= no
##$SF= 200.130004987346
##$SI= 16384
##$SIGF1= 3
##$SIGF2= 2
##$SINO= 0.751879
##$SIOLD= 32768
##$SREGLST= <19F.Aceton>
##$SSB= 0
##$STSI= 16384
##$STSR= 0
##$SW_p= 3612.71676300578
##$SYMM= 0
##$S_DEV= 0
##$TDeff= 16384
##$TDoff= 0
##$TI= <>
##$TILT= no
##$TM1= 0
##$TM2= 0
##$TOPLEV= 0
##$USERP1= <user>
##$USERP2= <user>
##$USERP3= <user>
##$USERP4= <user>
##$USERP5= <user>
##$WDW= 1
##$XDIM= 16384
##$YMAX_p= 302468629
##$YMIN_p= -1456517
$$ End of Bruker specific parameters
$$ ---------------------------------
##NTUPLES= NMR SPECTRUM
##VAR_NAME=  FREQUENCY,     SPECTRUM/REAL,   SPECTRUM/IMAG
##SYMBOL=    X,             R,               I
##VAR_TYPE=  INDEPENDENT,   DEPENDENT,       DEPENDENT
##VAR_FORM=  AFFN,          ASDF,            ASDF
##VAR_DIM=   16384,         16384,           16384
##UNITS=     HZ,            ARBITRARY UNITS, ARBITRARY UNITS
##FACTOR=    0.220516191357247, 1,           1
##FIRST=     3101.37073784078, 0,            0
##LAST=      -511.346025164996, 0,           0
##MIN=       -511.346025164996, -1456517,    0
##MAX=       3101.37073784078, 302468629,    0
$$ Real data points
##PAGE= N=1
##DATA TABLE= (X++(R..R)), XYDATA
$$ [...]
7639F413109J57728j97322k01058j05488j35401J69498P8131j53760K4749q9990
7629E960196l46020l43255j4715J86883K39025K10130r3745k04348j51506m3980
7619E398665q4226J5430K5951K2552j58171j87901k03447j49403K03664J96119
7609E079233L41183l3986j25793j12661M0232p125p1214J22154k43501k12408
7599D776114o542n6455L41638L94476K34609L4235k62649o0341o9878J3899K16320
7588E555426M85061N1305l31621k58989j4795J64186L50734R0736n7659J05106
7578F139490q7357j01209k1656n3030L00461K41685j80448k63252p2748j11153
7568E790783J17809J64226j49633k59622o5542k45113r1815O7492P1243K22421
$$ plain form
7639 6413109 6570837 6373515 6172457 6066969 5931568 6101066 6179197 6025437 6050186 5960196
7629 5960196 5614176 5270921 5256206 5443089 5682114 5892244 5798499 5594151 5442645 5398665
7619 5398665 5314439 5329869 5355820 5378372 5220201 5032300 4828853 4679450 4883114 5079233
7609 5079233 5420416 5386430 5260637 5147976 5188208 5181083 5109869 5232023 4988522 4776114
7599 4776114 4769572 4713117 5054755 5449231 5683840 5718075 5455426 5395085 5325207 5339106 5555426
7588 5555426 6040487 6091792 5760171 5501182 5486387 5650573 6001307 6092043 6034384 6139490
7578 6139490 6052133 5950924 5929268 5876238 6176699 6418384 6237936 5974684 5901936 5790783
7568 5790783 5908592 6072818 5923185 5663563 5598021 5352908 5261093 5328585 5399828 5622249
7558E622249K80119j37018l55615r5524j71875p2917K9904j53144j93917P6598
7548D828860K2857j36767j41444J44245K9602r7237l25371M542J42243n2134J92310
7537D611706J11531J90433k41586m74545n09337k04677J11672K7799K84999N27107
7527D435102J52855k56700n2173L3207L94875O23185N11913R22j0314k99211l79582
7516E154079j78944k80178l40325k78172k22331k09478L900k79360j94512j2082
7506C162597r7592m4726J75979J9210J17982K53958j52806k85924r3677J76913
7496C231914O7722J0880J05873J2038j94514k40126j07745J74533J58752M71754
7486C691081J94305r9728j37479m8680l70295l18204m9990o345N2427K96223L34250
$$ plain form
7558 5622249 5902368 5765350 5409735 5314211 5142336 5069419 5099323 4946179 4752262 4828860
7548 4828860 4851717 4714950 4573506 4717751 4747353 4650116 4324745 4329287 4471530 4419396 4611706
7537 4611706 4723237 4913670 4672084 4197539 3688202 3483525 3595197 3622996 3907995 4435102
7527 4435102 4587957 4331257 4279084 4312291 4707166 5330351 5842264 5843186 5832872 5533661 5154079
7516 5154079 4975135 4694957 4354632 4076460 3854129 3644651 3648551 3369191 3174679 3162597
7506 3162597 3065005 3020279 3196258 3215468 3333450 3587408 3434602 3148678 3055001 3231914
7496 3231914 3299636 3310516 3416389 3428427 3233913 2993787 2886042 3060575 3219327 3691081
7486 3691081 3885386 3785658 3648179 3599499 3229204 2911000 2861010 2854665 2907092 3203315 3537565
7475C537565K13255L53406R2925j03370o4897J45730m6978r8766j54324j27604
7465C746942j83893j05690j9979J38437K06865J02665j44881m84171l58457p4078
7455B823760N839J70200P4536j0131q2448j66740l05427j16260L18037J80085
7445B891451l0052q6444j87547k95571j48540j4440l5746R136j31029j52855J5962
7434A834325L0445K82582J15969k65446k58539n9933J46108N2454L05417K93396
7424B476778J6713j75697l08818l34422j79924J27669L69433O8833p546k9216
7414B023803j08819o3126N218J28351Q4040J64463J73477j29191k22264k0753
7404B035199k11645j73626k03537j19820J6457M34309N23440p2292p5045q7632
$$ plain form
7475 3537565 3750820 4104226 4197151 4093781 4028884 4174614 4127636 4028870 3874546 3746942
7465 3746942 3563049 3457359 3437380 3575817 3782682 3885347 3740466 3256295 2897838 2823760
7455 2823760 2829599 2999799 3074335 3064204 2981756 2815016 2509589 2393329 2711366 2891451
7445 2891451 2861399 2774955 2587408 2291837 2143297 2128857 2093111 2102247 1971218 1818363 1834325
7434 1834325 1864770 2147352 2263321 1997875 1739336 1679403 1825511 1877965 2183382 2476778
7424 2476778 2493491 2317794 2008976 1674554 1494630 1622299 1991732 2060565 2053019 2023803
7414 2023803 1914984 1851858 1857076 1985427 2069467 2233930 2407407 2278216 2055952 2035199
7404 2035199 1823554 1649928 1446391 1326571 1343028 1777337 2300777 2228485 2153440 2065808
7394B065808l11363l56056j66951Q9829K66561K81373N6570j53524o98R2388J88477
7383B052414r3335j66969n2026j52418j96465k3722K82716K47896K17932j67788
7373A948235l48610K22939J78104n6602J29050P9333k13110k79311m47450j72391
7363A040187P1211L43399J89902J03407P052j1460p7516j98463j0045k8806j05663
7352A323205j37461J00532K0681Q8515J0244k3087l55003p1192N1751K45813J62195
7341A416193J46698k3529m3740o4466j00788j14289p9681L94865L36737l1038
7331A836962l43534j84431K4050p6095J9236J99487J22096J64155m1634m80133
7321A240159l29116K9345R9717J11865K29847K37102K87500l1371m37494m08524
$$ plain form
7394 2065808 1754445 1398389 1231438 1321267 1587828 1869201 1925771 1772247 1771549 1863937 2052414
7383 2052414 1959079 1792110 1740084 1587666 1391201 1367479 1650195 1898091 2116023 1948235
7373 1948235 1599625 1822564 2000668 1944066 2073116 2152449 1939339 1660028 1212578 1040187
7363 1040187 1111398 1454797 1644699 1748106 1755158 1743698 1666182 1467719 1457674 1428868 1323205
7352 1323205 1185744 1286276 1306957 1395472 1405716 1382629 1027626 956434 1008185 1253998 1416193
7341 1416193 1562891 1539362 1495622 1431156 1330368 1216079 1136398 1531263 1868000 1836962
7331 1836962 1493428 1308997 1333047 1256952 1276188 1475675 1597771 1761926 1720292 1240159
7321 1240159 911043 940388 1040105 1151970 1381817 1618919 1906419 1875048 1437554 1029030
7311A029030j40900n3687L27017J84044J47987K30109j1971k54545k14641k06479
7301A035964j16789N0103J51370R1094L4641M96794K12993K6509l28922l11587
7291A342170k08117j39821K95421L25862K68762Q1145k52234m29786j78000J41033
7281A246435K07773R5702j6862o6464j61279m9038j86857J00998M12504L58783
7271A941695k15084m34971j42121n2535Q7193P5142p3946J3319j020q4593J6042
7260A129121L6780K26464R6494l81829j56141q2759J70437K89179N8305j72747
7250A213304j85710j55758j4170M6523M00973P02683K90700j96579l83800m28591
7240A289575l34154P2729K34438M08968M01846J60174L1816k37360q0454J18740
$$ plain form
7311 1029030 888130 834443 1161460 1345504 1493491 1723600 1711629 1457084 1242443 1035964
7301 1035964 919175 969278 1120648 1211742 1246383 1743177 1956170 1982679 1653757 1342170
7291 1342170 1134053 994232 1289653 1615515 1884277 1965422 1713188 1283402 1105402 1246435
7281 1246435 1454208 1549910 1533048 1466584 1305305 1256267 1069410 1170408 1582912 1941695
7271 1941695 1726611 1291640 1149519 1096984 1184177 1259319 1185373 1198692 1197672 1113079 1129121
7260 1129121 1165901 1392365 1488859 1107030 950889 868130 1038567 1327746 1386051 1213304
7250 1213304 1027594 871836 857666 904189 1305162 2007845 2298545 2101966 1718166 1289575
7240 1289575 955421 1028150 1262588 1671556 2073402 2233576 2265392 2028032 1947578 2066318
7230B066318N6891k49788l70561q4261K2017R6678Q1244K11534L28183R6775R8381
7219B353411p3122j9035j10523l2542o9736j29157o0358k280J25842R8131P4732
7208B155363L7211K82170J26968l5250r3843k23415o9743J19303N4800R5424J73587
7197B622575N0843o4081j48383N1742J56987K64838J61528J0196k21789J3365
7187B897821J05219r707J40224P6130K61541o1150j32173J9984K09837K11592
7177C719318P2832k36067k528j4933j22411l6841K39351J11064P0227l44127k23197
7166C232688R7140K23954M68834L54474L19046K91798J37692k33276q7499J17127
7156D921978M55238M26861L3144J5406k15177L11333M14820O28511M48171N26257
$$ plain form
7230 2066318 2123209 1873421 1502860 1418599 1440616 1537294 1618538 1830072 2158255 2255030 2353411
7219 2353411 2280289 2261254 2150731 2118189 2048453 1919296 1858938 1856658 1982500 2080631 2155363
7208 2155363 2192574 2474744 2601712 2566462 2472619 2249204 2179461 2298764 2353564 2448988 2622575
7197 2622575 2673418 2609337 2460954 2512696 2669683 2934521 3096049 3106245 2884456 2897821
7187 2897821 3003040 2993333 3133557 3209687 3471228 3410078 3277905 3297889 3507726 3719318
7177 3719318 3792150 3556083 3553555 3538622 3416211 3379370 3618721 3729785 3800012 3455885 3232688
7166 3232688 3329828 3553782 4022616 4377090 4696136 4987934 5125626 4892350 4804851 4921978
7156 4921978 5377216 5804077 5837221 5852627 5637450 5948783 6363603 6992114 7440285 7966542
7146G966542L67187P5326J50671O10819O07376N94449N05502M42829N91240Q44834
7136A2756775J215077J316186J446330J766561K043727K345919L064030M194073
7128C0148678N417180P113055J0807464J8333538L1162857M2167009M7887617
7121A93037398M3121021J1890392j1605056q640005j7286350k5744058l1201833
7114A53571509l7926714l0782123k0756482j3873065r252799p439996n963218
7107B7577112m563231l464217k423259j488440j064017q71497j090031p93265
7099A1819155l97057l59810o37689n95767n24845n28494m87503l70466k46294
7090G671230p6883k59009l65640l46060k94082l70984k49658l44549k31223q9532
$$ plain form
7146 7966542 8333729 8409055 8559726 9170545 9777921 10372370 10877872 11320701 11911941 12756775
7136 12756775 13971852 15288038 16734368 18500929 20544656 22890575 25954605 30148678
7128 30148678 35565858 42678913 53486377 71819915 102982772 145149781 193037398
7121 193037398 236158419 248048811 236443755 227803750 210517400 184773342 153571509
7114 153571509 115644795 84862672 64106190 50233125 40980326 33540330 27577112
7107 27577112 23013881 19549664 17126405 15637965 14573948 13702451 12612420 11819155
7099 11819155 11422098 11062288 10424599 9828832 9303987 8775493 8287990 7917524 7671230
7090 7671230 7594347 7335338 6969698 6623638 6329556 5958572 5708914 5364365 5133142 5043610
7080E043610K37591N5006K05j48102j14557J64277j95954l96844j71203p818j40772
7069D325439k16246k52313l5016k8345m9722j35099j50582K05924L2827j19554
7059C577313j20764l8977l50475k17080k50245j86672J22707K10110q0072j37726
7049B528119j66484k25821j12553l5180K22778r196R7159j32982j33396j75612
7039A856832k62147k06419K6425k55410K911j1931J20705L15543J73763L2489
7029A792761J01366K6858k36194k86604k28661Q8134K28032o4984k37390k3491
7019A159827j34034M3270m0002j02214K81874L16008J17335k30094J31681j59897
7009A383754k56463l81425k72781j12988J87890K75962J75275J1556j80812j21272
$$ plain form
7080 5043610 5281201 5336207 5336412 5188310 5073753 5238030 5042076 4645232 4474029 4466211 4325439
7069 4325439 4109193 3856880 3821864 3793519 3743797 3608698 3458116 3664040 3696867 3577313
7059 3577313 3456549 3417572 3067097 2850017 2599772 2413100 2535807 2745917 2665845 2528119
7049 2528119 2361635 2135814 2023261 1988081 2210859 2201663 2298822 2165840 2032444 1856832
7039 1856832 1594685 1388266 1414691 1159281 1162192 1150261 1270966 1586509 1760272 1792761
7029 1792761 1894127 1920985 1684791 1398187 1169526 1257660 1485692 1420708 1183318 1159827
7019 1159827 1025793 1069063 1029061 926847 1208721 1524729 1642064 1411970 1543651 1383754
7009 1383754 1127291 745866 473085 360097 547987 823949 999224 1010780 829968 708696
6999G08696j89481k559K71094K62578K63002M1623p4576k64271j61735j88604
6989F65767Q7532O607J21307n7272j19799j55625p4971L17256L20613J85657J7364
6978A314436j00425r8551r4091k43703n5825k25705m23588j01994j60417K03993
6968A4130M46354K78435J15303j56848K4221L1980O954j42606J98270n6035j65296
6957E94862k21817R8684J41469J6038J2062j22613j30146P6491J0578r6660M3800
6946D22748N36692K59055l64751k67364k71240k93902P0232Q6963K15266Q9030
6936D82729o2405j95926j37622J89642Q3465l1496K8952J78887L4872k18742K2514
6925C74870Q1900j20594k46780j50489J26094P9269K84102n9700k29281K06872
$$ plain form
6999 708696 519215 516656 787750 1050328 1313330 1354953 1280377 1016106 854371 665767
6989 665767 753299 759906 881213 823941 704142 548517 473546 790802 1111415 1297072 1314436
6978 1314436 1214011 1115460 1021369 777666 721841 496136 72548 -29446 -189863 14130
6968 14130 460484 738919 854222 697374 721595 753575 760529 617923 816193 760158 594862
6957 594862 373045 471729 613198 629236 641298 518685 388539 465030 475608 378948 422748
6946 422748 959440 1218495 853744 586380 315140 21238 91470 178433 393699 482729
6936 482729 420324 224398 86776 276418 359883 328387 357339 536226 571098 352356 374870
6925 374870 456770 336176 89396 -61093 65001 144270 428372 368672 139391 346263
6915C46263M2443j708m6749K49549K3713o2461k92267m2330j50027m9163K5713
6904D2976K12325J32758K01992j14907k90720q7171J46626J92579J64507J65313
6894G66278P4529j12106k81590k20126j89956L5039L8025K29461J09765k9724
6884D19595L1123L2413Q7020N4315j91930J44019M6j51789k45972j85101o7515
6873g3776o2088R4865L26701Q6989M3144n4731j27673k94841K64397J19577P8965
6862D01529J05948J39996J09133l58069m18790l25040p1540Q8301K49307K37342
6852A58117M45206J37060q8406l5322k13984r1502k3534L7023R6018K06029o3081
6841E63624j39578m08325j61374K1403L09957K71443M09439P5727l49537l48432
$$ plain form
6915 346263 388706 386998 340249 589798 613511 551050 258783 216453 66426 17263 42976
6904 42976 255301 388059 590051 475144 184424 97253 243879 436458 600965 766278
6894 766278 840807 728701 447111 226985 37029 72068 110093 339554 449319 419595
6884 419595 450718 483131 570151 624466 432536 576555 576601 424812 178840 -6261 -73776
6873 -73776 -135864 -40999 285702 372691 415835 361104 233431 -61410 202987 322564 401529
6862 401529 507477 647473 756606 398537 -20253 -345293 -416833 -328532 -79225 158117
6852 158117 603323 740383 651977 616655 402671 311169 287635 324658 420676 626705 563624
6841 563624 424046 15721 -145653 -124250 185707 457150 866589 942316 592779 244347
6831B44347n8754l0007p793N16n5744O4593q5594j44483J32240J84008K7519p9075
6819A91773l56286j80922J43865K35405J72326J31399J25207j23013o5867p8604
6809A95283n0356J09899J62722l2981j74047N3867J52707J49221J11283M4836
6799G22434q1720j98971l52443l4346J5340K12912J64140Q3512l57006j7542K35336
6788C91646J8462q3022j0818j36364j72120l2812O201R4503J11743l2236k45628
6777i0445j22289r2203O1631K74514L49715Q6703K6079K2344r3858j12025j33265
6766A76901K99105q9419l64456j24783L31834R5039K51215J69492k0590m701k21553
6755D98084k43277p4370J63577J60040L2730j90812k50570j10993L7861J42706
$$ plain form
6831 244347 185593 155586 147793 148309 92565 157158 71564 -72919 59321 243329 270848 191773
6819 191773 -164513 -345435 -201570 33835 206161 337560 462767 339754 273887 195283
6809 195283 144927 254826 417548 384567 210520 264387 417094 566315 677598 722434
6799 722434 640714 441743 89300 54954 70294 283206 447346 530858 173852 156310 391646
6788 391646 410108 327086 316268 179904 7784 -25028 -18827 75676 187419 155183 -90445
6777 -90445 -212734 -304937 -243306 31208 380923 467626 493705 516049 422191 310166 176901
6766 176901 476006 386587 22131 -102652 229182 324221 575436 744928 724338 719637 498084
6755 498084 254807 180437 344014 504054 536784 345972 95402 -15591 22270 164976
6745A64976R9596o3050l4346j06181r5922r856K02835K73026j79780p8664o284
6734A66350p2270j06537J71695K73159o472j34244P4255j53987q9724J79188J07907
6723D09320O6039J23048j16984R4223L33868M57275L08049O8733j6930l1868j18044
6712A576729p2190p3356k39138L8965k15838m57977l60398K6798J72771J02558
6702D98924O4151n1022j28178j34265p3032J9571J49909Q7931j15184L8586k09531
6691A47860m0425j08806j54696j90842L47700L88867J90009n387O7462m7664j74170
6680D19908j80762J00581m8401J44381J35352m4589k22128L586k23438j57013
6670g2523L31229M56882r4550j79530r7301r0948N2079J06247Q769K24629J90462
$$ plain form
6745 164976 264572 201522 167176 60995 -34927 -44783 158052 431078 251298 172634 166350
6734 166350 94080 -12457 159238 432397 425925 291681 365936 211949 122225 301413 409320
6723 409320 475359 598407 481423 575646 909514 1366789 1674838 1743571 1726641 1694773 1576729
6712 1576729 1504539 1431183 1192045 1231010 1015172 557195 196797 223595 396366 498924
6702 498924 563075 512053 383875 249610 176578 196149 346058 433989 318805 357391 147860
6691 147860 107435 -1371 -156067 -346909 791 389658 579667 574280 641742 594078 419908
6680 419908 239146 339727 291326 435707 571059 526470 304342 307928 84490 -72523
6670 -72523 258706 715588 621038 441508 344207 253259 305338 411585 420354 644983 835445
6659H35445j61335k67080l17429O9675k7891J41932k7045r92P6180M2893m5133
6648C19220N2512J62019j09076K394K14189K11594o2429k06528j55476j05029
6638C23390j68057j69331J04493J90164L22481K08740k51641l09351j62467r9742
6628a1321K49080M16399K79025j17107j40365m01822l26686j39511J98523L80102
6618C86317L16915n4304j8592j92537n2619L9512L5115r4737N398J33749j4223
6607D89994k3707J30896J60560k9576j57346m2506J1334Q4398Q2980j4152R7902
6596G90777N8176j08357j18054k9066P8159J24741Q8275j05912j8905j53743o9561
6585E36530K22174K27372J13108n9233k85558j91223M0382j0526j52719j6914
$$ plain form
6659 835445 674110 407030 89601 159276 131385 273317 246272 245280 321460 364353 319220
6648 319220 371732 533751 424675 427069 641258 852852 790423 583895 428419 323390
6638 323390 155333 -13998 90495 280659 603140 811880 560239 250888 88421 -11321
6628 -11321 237759 654158 933183 816076 675711 273889 -52797 -192308 6215 386317
6618 386317 703232 648928 630336 437799 385180 424692 459807 365070 370468 504217 489994
6607 489994 466287 597183 757743 728167 570821 528315 539649 624047 707027 692875 790777
6596 790777 848953 740596 622542 593476 671635 796376 884651 778739 759834 606091 536530
6585 536530 758704 986076 1099184 1039951 754393 563170 603552 593026 440307 423393
6575D23393J56219Q1610J80681K73282M58679K85858k22516k73572j38985m5863
6565A178786j15240O4740Q4146M5081k43453j15940K04410M97888L82147r2858
6555A889707j13388j72967j82112k65439k23113L7345J19476L06150Q6522j10665
6545A371516J55868J5245J24039M9732j8883j03890o6709l8461J71950L34955
6535A995362K21759P962r566r1012l2849j37226m2891M3459Q2704j26126k38244
6524A673332j82648l436K12245J17841J98133L56660j12696j94254j15384j88758
6514A761035k3540J48390J5166J72633q1273j19798J1968J91875K46294K26141
6504B548891n2719j41815j25786j04449p5782J3510o7964M0516j07827j84488
$$ plain form
6575 423393 579612 661222 841903 1115185 1573864 1859722 1637206 1363634 1224649 1178786
6565 1178786 1063546 1128286 1212432 1257513 1014060 898120 1102530 1600418 1982565 1889707
6555 1889707 1776319 1603352 1421240 1155801 932688 970033 1089509 1395659 1482181 1371516
6545 1371516 1527384 1542629 1666668 1716400 1697517 1593627 1526918 1488457 1660407 1995362
6535 1995362 2217121 2225083 2215517 2124505 2091656 1954430 1911539 1954998 2037702 1911576 1673332
6524 1673332 1490684 1487248 1699493 1817334 2015467 2372127 2259431 2065177 1949793 1761035
6514 1761035 1737495 1885885 1901051 2073684 1992411 1872613 1884581 2076456 2322750 2548891
6504 2548891 2496172 2354357 2228571 2124122 2048340 2061850 1993886 2034402 1926575 1742087
6494A742087R7667K38582J83080J37614M297j88354k36631j21903J01908Q168
6484A966515m2089O2147J01626j52331k96998l06375r120J29900J59275R1380
6474A703930J12973J55436J17592r4384k34726O6971j9599o7706p9258O9530J9582
6463A750341J72249Q325j59221J67893J35874J76614j74889j11626N3267P9518
6453B098345j86953O1739K2921M2552q7654j68266j55505L5264O473K0189j26358
6442A562747j51853k073m1987J64508J64537K3964j35566j02833j49586r1022
6432A240836J32243J37079L95376R0904j2491k42319k38175k35420l2012J45184
6422A381205K48925K78605K06516j56660k31910p4916k9454j09621K81500J75440
$$ plain form
6494 1742087 1839754 2078336 2261416 2399030 2403327 2214973 1978342 1856439 1958347 1966515
6484 1966515 1924426 1986573 2088199 1935868 1638870 1332495 1323375 1453275 1612550 1703930
6474 1703930 1816903 1972339 2089931 1995547 1760821 1827792 1808193 1740487 1661229 1730759 1750341
6463 1750341 1922590 1930915 1771694 1939587 2075461 2252075 2077186 1965560 2018827 2098345
6453 2098345 1911392 1973131 1996052 2038604 1950950 1782684 1627179 1662443 1668916 1689105 1562747
6442 1562747 1410894 1408821 1366834 1531342 1695879 1719843 1584277 1481444 1331858 1240836
6432 1240836 1373079 1510158 1905534 1996438 1983947 1741628 1503453 1268033 1236021 1381205
6422 1381205 1630130 1908735 2115251 1958591 1726681 1651765 1622311 1512690 1794190 1969630
6412A969630k7270J31163j54362j90142k80841k48463k05706Q0004J08547J84842
6402A367402L29649K48002j5769n0661j32783n0346O6691j72966k22035m4598
6392A322586J10804k66473k25927q227L48981M04342R7505J62704K18664Q1135
6382B246094j14923k43847l00059P9015L45525L9597j49453J95351o7858k15259
6372A814183k03017p0477K79044M98980J83547j16322J31838l7604m32807j31709
6362A915656l03207K34561J66193K4435r2979m5121J99574j74382j46740P0136
6352A848126n7114j0770K91265J94078L7584J97621L5956k84075k22563K5126
6342B055234p6593J69695M37923L71712k1356l7942j74829j63845k50182L9650
$$ plain form
6412 1969630 1942360 2073523 1919161 1729019 1448178 1199715 994009 1074013 1182560 1367402
6402 1367402 1697051 1945053 1929284 1878623 1745840 1695494 1762185 1589219 1367184 1322586
6392 1322586 1433390 1166917 940990 932763 1281744 1686086 1783591 1946295 2164959 2246094
6382 2246094 2131171 1887324 1587265 1666280 2011805 2051402 1901949 2097300 2029442 1814183
6372 1814183 1611166 1540689 1819733 2318713 2502260 2385938 2517776 2480172 2047365 1915656
6362 1915656 1612449 1847010 2013203 2037638 1944659 1899538 2099112 1924730 1777990 1848126
6352 1848126 1791012 1780242 2071507 2265585 2303169 2500790 2536746 2252671 2030108 2055234
6342 2055234 1978641 2148336 2586259 2957971 2936615 2898673 2723844 2559999 2309817 2349467
6332B349467J56873N3553K21595K16921m1439J49138J13655j36457r3724j40309
6322B849273k60004j64033P7904K14777M62160K55571K25781j32762j01425j86946
6312C240296O4082O5299m8619R7410J4498r307N5296J83043K33171L84426K08180
6301D487775j83622j61245o8077J48444O7029R1625J40710q1308J3137j91685
6291D262783j03271M08468M82409L56105J87538K36177K48709j1794k24911J08882
6281E951095J98882J99944K17715Q6422J81816P93058K29775M5608J43048K91710
6271H339073M82421M51638O76229Q15796J102171R94587J040795J116270P37442
6262A5756422M20253L07816M24068K41350J25430M8074K91533P21590J155603
$$ plain form
6332 2349467 2506340 2559893 2781488 2998409 2956970 3106108 3219763 3083306 2989582 2849273
6322 2849273 2589269 2425236 2503140 2717917 3180077 3435648 3661429 3528667 3427242 3240296
6312 3240296 3304378 3369677 3321058 3418468 3432966 3423659 3478955 3661998 3895169 4279595 4487775
6301 4487775 4304153 4142908 4074831 4223275 4290304 4381929 4522639 4441331 4454468 4262783
6291 4262783 4159512 4567980 5050389 5406494 5594032 5830209 6078918 6067124 5842213 5951095
6281 5951095 6149977 6349921 6567636 6654058 6835874 7628932 7858707 7904315 8047363 8339073
6271 8339073 8821494 9273132 9949361 10765157 11867328 12861915 13902710 15018980 15756422
6262 15756422 16176675 16484491 16908559 17149909 17275339 17323413 17614946 18336536 19492139
6253A9492139J069986J338743J605272J713246J649836J699847J866755J676310
6245C2112134J218041J054155J115472P27786O78285L30358J93943L29865P28206
6236C8488245J260974K081041K686821K701480K151189L61726j524500j472505
6228D6734471j118225j466545j680399k081363k023423j442913l61513M79540
6220C7039630J021553J510180K092599K703825L147338L671019L941761L993928
6212E9121833L462603K703812J816814J327063Q40476N04220L44907M29671M90458
6203G1041857R81065J365796J672550J429899j85711k842815l613082l384476
6195F6465083l699912m125316m358255m377781l523058k434672k000109j370192
$$ plain form
6253 19492139 20562125 21900868 23506140 25219386 26869222 28569069 30435824 32112134
6245 32112134 33330175 34384330 35499802 36227588 36905873 37236231 37430174 37760039 38488245
6236 38488245 39749219 41830260 44517081 47218561 49369750 49731476 48206976 46734471
6228 46734471 45616246 44149701 42469302 40387939 38364516 36921603 36560090 37039630
6220 37039630 38061183 39571363 41663962 44367787 47515125 51186144 55127905 59121833
6212 59121833 62584436 65288248 67105062 68432125 69272601 69776821 70121728 70551399 71041857
6203 71041857 72022922 73388718 75061268 76491167 76305456 73462641 69849559 66465083
6195 66465083 62765171 58639855 54281600 49903819 46380761 43946089 41945980 40575788
6187D0575788l70576L34643J121438J786141K638257L359867L880548M641870
6179E7967976N442059N925291O120156N334978L835143K503006J099104J86532
6171H8414245o03453j053094j523289k057590l736479m820262m966648m750613
6163F4902817m432758m105084l990673l647725l203073k672860j810714j123412
6155C9916518n72687k02197M75666J137897J760009K608068L750748N344178O861691
6146F1079891P888675Q233643P843236O950090N401031L416126J659288n5635
6138A02416345j615706l151137m630656n582377o555951o959010o806780o354716
6130F0760012n685833m605255l799287l124722k304789j628216j436188j302681
$$ plain form
6187 40575788 40205212 40539855 41661293 43447434 46085691 49445558 53326106 57967976
6179 57967976 63410035 69335326 75455482 80790460 84625603 87128609 88227713 88414245
6171 88414245 87810792 86757698 85234409 83176819 79440340 74620078 69653430 64902817
6163 64902817 60470059 56364975 52374302 48726577 45523504 42850644 41039930 39916518
6155 39916518 39343831 39141634 39617300 40755197 42515206 45123274 48874022 54218200 61079891
6146 61079891 68968566 77202209 85045445 91995535 97396566 100812692 102471980 102416345
6138 102416345 100800639 97649502 93018846 87436469 80880518 73921508 67114728 60760012
6130 60760012 55074179 50468924 46669637 43544915 41240126 39611910 38175722 36873041
6122C6873041r06658p49943m80197o20M09953Q18916J637097K407483L471391
6113D3480463M361880M912633M870124M167054L000082J698663M03635j49187
6105F6745347n41096p91753j338544k199162l087876l888988m160067l828939
6097D6908922l461392l183495l179103k937689k472867k059267j726584j475793
6089B6412732j396429j028631j162761j631663j569705q72469q02974o48481m15300
6080A6884319l63836l63967r1041Q9417K66825P28654J036251J419887K098641
6071B1705150K902261L013368K318759J001582O2516j086692j731240k462799
6063B5722905k630277k308685j552714j399324j061944j004395j058910r82976
$$ plain form
6122 36873041 35966383 35216440 34736243 34735623 35145576 35964492 37601589 40009072 43480463
6113 43480463 47842343 52754976 57625100 61792154 64792236 66490899 66894534 66745347
6105 66745347 66204251 65412498 64073954 61874792 58786916 54897928 50737861 46908922
6097 46908922 43447530 40264035 37084932 34147243 31674376 29615109 27888525 26412732
6089 26412732 25016303 23987672 22824911 21193248 19623543 18751074 17948100 17299619 16884319
6080 16884319 16520483 16156516 16065475 16154892 16421717 17150371 18186622 19606509 21705150
6071 21705150 24607411 27620779 29939538 30941120 31003636 29916944 28185704 25722905
6063 25722905 23092628 20783943 19231229 17831905 16769961 15765566 14706656 13723680
6055A3723680r03731n36892l57666k25053m75119k69534k24231o4448K42249k25958
6045A0683297j02036K12412N94806Q47912J577821K180436K953059K611544J924691
6036B3483942Q74503k64085r40277j302876j721181j990564j742049j292610p02984
6027A4401819J79449J186942J233990J045090M10593J9267m65358o63274q18521
6018A6529997q49338p95879q77378j204880j087786n28086j52344m1018R018L59642
6008A1361948O72118N72476Q19108J101826J024460O24834J74815K7208R8898
5999A6477691N28228J001336J615524K267648K854228K720057J878513P84167
5991C0127392l95773j023555j727459k615532l024183k839806k693396k150985
$$ plain form
6055 13723680 12819949 12283057 11925391 11700338 11225219 10955685 10731454 10667006 10909255 10683297
6045 10683297 10581261 10793673 11388479 12236391 13814212 15994648 18947707 21559251 23483942
6036 23483942 24358445 24094360 23154083 21851207 20130026 18139462 16397413 15104803 14401819
6027 14401819 14581268 15768210 17002200 18047290 18457883 18477150 18011792 17348518 16529997
6018 16529997 15680659 14884780 14007402 12802522 11714736 11186650 11034306 10993288 11002306 11361948
6008 11361948 12034066 12606542 13425650 14527476 15551936 16176770 16351585 16378793 16477691
5999 16477691 17005919 18007255 19622779 21890427 24744655 27464712 29343225 30127392
5991 30127392 29731619 28708064 26980605 24365073 21340890 18501084 15807688 13656703
5983A3656703j519747j104475r37481q33047m10296m09535k62987j13140n3148
5974H012847r5175o1711L13338K47196L46959Q77491J067183Q51838J072545J302143
5964A3934654J255830Q09908J16309k08321p98962j043497j191353j399319j363829
5955A0111420j014999q38230r52025p01793o94533l98460k96359k21104m42065
5946D551852k86671j05767m59710m24256p5754Q948R0174n1399J31903j25183
5936C254137M79k40531o3605o7841k24792q8571j03603j68439N3232K19060j91086
5925B378440j84689q3432q9842o1878Q8716J50246M1306J36718j54386l50703
5915A870496J25198K56177M0407j35320j74487j48684j78897j54050M0224R8400
$$ plain form
5983 13656703 12136956 11032481 10095000 9261953 8851657 8442122 8179135 8065995 8012847
5974 8012847 7917672 7855961 8169299 8416495 8763454 9640945 10708128 11559966 12632511 13934654
5964 13934654 15190484 16000392 16116701 15908380 15109418 14065921 12874568 11475249 10111420
5955 10111420 9096421 8258191 7306166 6604373 5909840 5511380 5215021 4993917 4551852
5946 4551852 4265181 4159414 3699704 3275448 3199694 3208642 3298816 3247417 3379320 3254137
5936 3254137 3254616 3014085 2950480 2882639 2657847 2569276 2465673 2297234 2350466 2569526 2378440
5925 2378440 2193751 2110319 2020477 1958599 2047315 2197561 2238867 2375585 2221199 1870496
5915 1870496 1995694 2251871 2292278 2156958 1982471 1833787 1654890 1500840 1541064 1639464
5905A639464L22566J80703j72773k64375J27069j87033q4705j23089L56080N4966
5895A848873j71874k36186J6904O3442J71458r1507j81902k6726K18890R6531
5885A707903j0044J53961k6458l38246m30265J918K50342M06755J55862J2432
5875A884160R554O485k22259m37802l19042L0248N2945j73628J92021L09456K55773
5864A587911K20139J45237j10122l12412j58816k76677K185L11564K38804Q2950
5854A730763n6942j69553j90193k63225J06084J43480L30679J30124k3239j49103
5844A588875l22563k04591L3269j05139o232Q3640J54454J22112J55524N1753
5834A551102q0256R1331j64338q7326r9703J05757J52344q5179L2991J07079M1788
$$ plain form
5905 1639464 1962030 2142733 1969960 1705585 1832654 1645621 1560916 1437827 1793907 1848873
5895 1848873 1676999 1440813 1457717 1521159 1692617 1601110 1419208 1392482 1611372 1707903
5885 1707903 1697859 1851820 1825362 1487116 1056851 1058769 1309111 1715866 1871728 1884160
5875 1884160 1893714 1900199 1677940 1240138 921096 951344 1004289 830661 1022682 1332138 1587911
5864 1587911 1808050 1953287 1843165 1530753 1371937 1095260 1097445 1409009 1647813 1730763
5854 1730763 1673821 1504268 1314075 1050850 1156934 1300414 1631093 1761217 1737978 1588875
5844 1588875 1266312 1061721 1094990 989851 983619 1067259 1221713 1343825 1499349 1551102
5834 1551102 1470846 1562177 1397839 1310513 1210810 1316567 1468911 1383732 1416723 1523802 1565590
5823A565590K7764L7995L1114L0842L324l49595k76117j59883J42548J69149l7510
5812A185221J44101J73002j73717k50931k74556P2549J96908j03570P0517J46519
5802A186043L44516j3474k15843k94372j58179j06755j59440L3301L76579L24086
5792A316462O8177m0910O1955Q6886j16681j78909J55708J80097L1508q9214l9222
5781A435857r6131P429p1365k02071l1091j2138j94530j42303J25678L10426J08512
5770A238273P5329j71651j6439k7637k71546p7132K94658L47533K10048o8026
5760A533410n22569j14164J3241O3927J33024J21913O3473K05435k0960n160J31213
5749A602783J40051K13116L7434K4261j92589N7133J25842K23558K79478N4826
$$ plain form
5823 1565590 1593354 1631349 1662463 1693305 1696629 1347034 1070917 911034 1053582 1222731 1185221
5812 1185221 1329322 1502324 1328607 1077676 803120 875669 1072577 969007 1039524 1186043
5802 1186043 1530559 1517085 1301242 1006870 848691 741936 582496 615797 992376 1316462
5792 1316462 1384639 1343729 1405684 1492570 1375889 1196980 1352688 1532785 1564293 1475079 1435857
5781 1435857 1339726 1347155 1275790 1073719 1042628 1030490 835960 693657 819335 1129761 1238273
5770 1238273 1313602 1141951 1125512 1097875 826329 749197 1043855 1391388 1601436 1533410
5760 1533410 1010841 896677 909918 973845 1106869 1228782 1292255 1497690 1476730 1471570 1602783
5749 1602783 1742834 1955950 1993384 2017645 1825056 1882189 2008031 2231589 2511067 2565893
5739B565893o3952j9166j16318O5275J55061o1333k08794j65557R5971K5843J8937
5728B291860j81732K20390N8392j08626p0869J16511Q8138M16420L88946J74279
5718C393709p6578k07796k41928l41238O0905L06162M65492L63157Q6094Q2707
5708C890686r025p7253p0907l1084q6016M9353P44J93689O47505P91912Q05764
5697F105368Q43399O22227k84059n74183l9665o0211j8961l83211p53257q20677
5687D636770m71101k45016k46938m31346l41232p1227k64872j35198j54846L5167
5677B310161o2839k69868r0853j85144J65670K29652j284R8630n8450l16583o25922
5666A193170l88000L09359L86959L57589L45392k38049j53536M4047l05778q4851
$$ plain form
5739 2565893 2501941 2482775 2366457 2431732 2586793 2525460 2316666 2151109 2247080 2272923 2291860
5728 2291860 2110128 2330518 2388910 2280284 2209415 2325926 2414064 2830484 3219430 3393709
5718 3393709 3317131 3109335 2867407 2526169 2587074 2893236 3358728 3721885 3807979 3890686
5708 3890686 3881661 3804408 3733501 3702417 3616401 3665754 3666498 3860187 4507692 5299604 6105368
5697 6105368 6948767 7570994 7286935 6712752 6673087 6612876 6593915 6210704 5457447 4636770
5687 4636770 4165669 3920653 3673715 3242369 2901137 2829910 2565038 2429840 2274994 2310161
5677 2310161 2247322 1977454 1886601 1701457 1867127 2096779 2095495 2194125 2135675 1819092 1193170
5666 1193170 805170 1114529 1501488 1859077 2204469 1966420 1812884 1856931 1551153 1466302
5656A466302K06925K82605j54805l67986j3716Q5397K24198K65952l6450j63684
5646A794738M5048k10696L6948J40410J55181M3867k578r9298k52112k14151P7579
5635A514936P9708M42918J03942o3943k39005l67631k56450k04416J20784J39881
5625A270724R5710K59759K3615m9491L0292Q5622k51397l50735j60689J45749
5615A099159M90166K95877Q7760K25798J35454k51991m64219j635k5162K27808
5605A819015P7593m1027M5843j29962j95255p9762R1294M67942L91756k21462
5595B225975j10450k12513m69754k41830J70997N8012K11680k9570m7586j31478
5585A423483m5620O8559J38317j21470L1160J60882K12724j33483n2805o5279
$$ plain form
5656 1466302 1673227 1955832 1801027 1433041 1419325 1504722 1728920 1994872 1958422 1794738
5646 1794738 1839786 1629090 1666038 1806448 1961629 2005496 2002918 1903620 1651508 1437357 1514936
5635 1514936 1594644 2037562 2141504 2077561 1838556 1470925 1214475 1010059 1130843 1270724
5625 1270724 1366434 1626193 1649808 1600317 1630609 1716231 1464834 1114099 953410 1099159
5615 1099159 1589325 1885202 1972962 2198760 2334214 2082223 1618004 1616369 1591207 1819015
5605 1819015 1896608 1855581 1901424 1771462 1576207 1496445 1587739 2055681 2447437 2225975
5595 2225975 2115525 1903012 1433258 1191428 1362425 1420437 1632117 1602547 1554961 1423483
5585 1423483 1377863 1446422 1584739 1463269 1494429 1655311 1868035 1734552 1681747 1616468
5575A616468p7136J85667Q3430R6315N3634J17731P0312j94845q5842K3295Q5263
5564A974292J22789M6127p8140K5419J91500J37280J8103k18116l20920l17989
5554A580345j97671J11702J91236M19545J13186J21095j0091j75556j06556k37771
5544A809464J07788J92996J2102q6283p3245m5200j43450K76722R2233m973j8640
5533B119514k60425j28043r556J80189K71762J12766j20987m9707n6964k57265
5523A801284N4905K14962L62314L8485o0474k60540P4410K9433j82643n131J43372
5512B210377J62323j91151l72944n6382N32384K01557j18532j42812P991K8741
5502B261552N9222P9044N5001N3601o9445n82191k82410K39230K93385K67913
$$ plain form
5575 1616468 1539332 1724999 1808429 1904744 1958378 2076109 2146421 1951576 1865734 1889029 1974292
5564 1974292 2097081 2143208 2065068 2090487 2281987 2419267 2437370 2219254 1898334 1580345
5554 1580345 1382674 1494376 1685612 2105157 2218343 2339438 2329347 2153791 2047235 1809464
5544 1809464 1917252 2110248 2122350 2036067 1962822 1917622 1774172 2050894 2143127 2138154 2119514
5533 2119514 1859089 1731046 1721490 1901679 2173441 2286207 2165220 2115513 2058549 1801284
5523 1801284 1856189 2071151 2433465 2471950 2411476 2150936 2225346 2254779 2072136 2067005 2210377
5512 2210377 2372700 2181549 1808605 1752223 2284607 2486164 2367632 2224820 2232811 2261552
5502 2261552 2320774 2399818 2454819 2508420 2438975 1856784 1574374 1813604 2106989 2374902
5492B374902J37743j74661O2052r6095m0239O0329M06003O9043n7991k80289q7468
5481B373329q2080q5377J34453J77158m4590j3439J76341j46745k49257N5936
5471B295729P9806K29631J97857J24353K6701K84025M0708k45964k37566r6742
5461B698538k21412n6233K74731L62516J76761l8612r7968O4004J8230O0155L76885
5450C617595J51717J09856j44455l8646k2798K52601n4800j17774m8688K7026
5440C731634M43K2258J62329O959J2859P6423p2923J11371M13551K00523j32033
5429D533394j87965k02603m9034j35999m6150M04789M94263L34362n7365k44287
5419D843405J90647J25550O2366l9724J60748N47940L37576p9082K56275M15529
$$ plain form
5492 2374902 2512645 2337984 2400036 2303941 2263702 2324031 2730034 2799077 2741086 2460797 2373329
5481 2373329 2291249 2205872 2340325 2517483 2472893 2459454 2635795 2489050 2239793 2295729
5471 2295729 2375535 2605166 2803023 2927376 2954077 3238102 3278810 3032846 2795280 2698538
5461 2698538 2477126 2420893 2695624 3058140 3234901 3196289 3098321 3162325 3180555 3240710 3617595
5450 3617595 3769312 3879168 3734713 3696067 3673269 3925870 3871070 3753296 3704608 3731634
5440 3731634 3732077 3754335 3916664 3923623 3936482 4012905 3939982 4051353 4464904 4665427 4533394
5429 4533394 4345429 4142826 4093792 3957793 3911643 4316432 4810695 5145057 5087692 4843405
5419 4843405 5034052 5159602 5221968 5182244 5342992 5890932 6228508 6149426 6405701 6821230
5409F821230N15990p1410j76862R8294L05336L76119L54155K69396L03218L77762
5399I173228K74407K49865N75528R20239O75004P28514R85361Q79484J100335
5390A5561965J200272J025610J364833J638251J611945J681723J772288J723717
5382B7580604J664890J417553J047411N36412M40046K93136L02069K53188M49228
5373C3984537K36317J06337m5577j90170o01048p60479n03084m82286m65667n01455
5363C0777425n15194k46150J0829M0871L96897M64773Q52478J218874J399586
5354C4400389J634174K002570K279452K641449K692820K685255K461551K182615
5346E2980275J840816J297568P85599O66269K39537l15662l30297m30411p89143
$$ plain form
5409 6821230 7337220 7265810 7088948 7187242 7492578 7868697 8222852 8492248 8795466 9173228
5399 9173228 9447635 9697500 10273028 11193267 11868271 12596785 13582146 14461630 15561965
5390 15561965 16762237 17787847 19152680 20790931 22402876 24084599 25856887 27580604
5382 27580604 29245494 30663047 31710458 32246870 32686916 32980052 33282121 33535309 33984537
5373 33984537 34220854 34327191 34281614 34091444 33490396 32729917 32226833 31744547 31278880 30777425
5363 30777425 30262231 30016081 30026910 30067781 30464678 30929451 31781929 33000803 34400389
5354 34400389 36034563 38037133 40316585 42958034 45650854 48336109 50797660 52980275
5346 52980275 54821091 56118659 56904258 57570527 57810064 57494402 57164105 56733694 55944551
5337E5944551p63725q34182j316872j519818j623766j979964k347607k107900
5329D3450717j904225j957543j800783j862071j715913j550853j278580q02647
5321C0578102l03986j48519j75347k7889j56768K97504O07423O63967M17783N08498
5311C2260768J28038k62339j66812j20860K7158O574m50185m25729k81499m55864
5301C0259250n73148m58180o20191o86973o79890r45081j051797q78038j233754
5292B3132198j146390j268844j658844j462072j241270j095602p08748l88131
5284A4162297m41161r26312j154399j015480o82847l38355j29344R6049J40592
5275I711040M3788o7946n5615K2046J50474M8155j29801J1909K85169O18953Q71785
$$ plain form
5337 55944551 55180826 54346644 53029772 51509954 49886188 47906224 45558617 43450717
5329 43450717 41546492 39588949 37788166 35926095 34210182 32659329 31380749 30578102
5321 30578102 30274116 30125597 29950250 29922361 29765593 30063097 30670520 31334487 31752270 32260768
5311 32260768 32388806 32126467 31959655 31838795 31865953 31872527 31422342 30996613 30715114 30259250
5301 30259250 29686102 29227922 28607731 27920758 27240868 26295787 25243990 24365952 23132198
5292 23132198 21985808 20716964 19058120 17596048 16354778 15259176 14550428 14162297
5284 14162297 13721136 12794824 11640425 10624945 9942098 9603743 9474399 9570448 9711040
5275 9711040 9754828 9686882 9631267 9653313 9803787 9851942 9722141 9734050 10019219 10638172 11509957
5264A1509957Q17234N65969L45175k03148n36238m02960j47421j32378k76357
5255A1539833m24867o41605m90753n33209n73273k65867K76728K23208o7235j34550
5245H908410J11530K33445N42234K20042N83515Q71738O76054P73879J360798
5236A4281645K286028L063464L195522K259572R96610k04190j143018k042973
5228B2692660k439954j969089j272453j277687j377855j064411o95742l52132
5220A2243337k22986l27670k62412L5428K1856J10415K73050J94653j94976m28599
5210A1442096o39021q06584m39907j78413k895k1643k4559l77286k96380j91345
5200H464063J21705R4240K32219J63192P454K94632l3204m6552K62933J01160
$$ plain form
5264 11509957 12327191 12893160 13238335 13035187 12498949 12095989 11948568 11816190 11539833
5255 11539833 11114966 10473361 9982608 9449399 8876126 8610259 8886987 9110195 9042960 8908410
5245 8908410 9019940 9253385 9795619 10015661 10599176 11470914 12146968 12920847 14281645
5236 14281645 16567673 19631137 22826659 25086231 26082841 25878651 24735633 22692660
5228 22692660 20252706 18283617 17011164 15733477 14355622 13291211 12595469 12243337
5220 12243337 12020351 11692681 11430269 11465697 11487553 11597968 11871018 12065671 11870695 11442096
5210 11442096 10803075 9996491 9556584 9378171 9375276 9353633 9329074 8951788 8655408 8464063
5200 8464063 8585768 8680008 8912227 9075419 9082873 9377505 9344301 9297749 9560682 9661842
5190I661842r5383l4002k32431j03558J42313J52909j39594K3040n56O152P9077
5179I459809K81518M47507L62909J92656J98684R4488M36601L88246J24341M2099
5169A2028858k8761k06999q74298j076463o42644k38993R2734q0200j27453j8180
5159H827601J60354R9755j91381N3390K75807J40835N2068R4178M02621O17192
5149A0532420M10386K62211L5826p7044J2932K24062J57229L21846L26069j27228
5139A2078709k74152k51758n02786k65598J92771J99668J78516J60372j62398
5130A1353344L3985l8967P6780j00886j2500K5730L9676K01092K10946M94547
5120A2283747O74677N17866K42094K90869J87633L09752L68281k4376n1916J3380
$$ plain form
5190 9661842 9566459 9532457 9300026 9196468 9338781 9491690 9352096 9375136 9374580 9380732 9459809
5179 9459809 9741327 10188834 10551743 10744399 10943083 11037571 11474172 11862418 11986759 12028858
5169 12028858 12000097 11793098 10918800 9842337 9199693 8960700 9053434 8973234 8845781 8827601
5159 8827601 8987955 9087710 8896329 8949719 9225526 9366361 9418429 9512607 9915228 10532420
5149 10532420 10942806 11205017 11240843 11163799 11176731 11400793 11558022 11879868 12205937 12078709
5139 12078709 11804557 11552799 11050013 10784415 10977186 11176854 11355370 11515742 11353344
5130 11353344 11387329 11348362 11425142 11324256 11311756 11337486 11377162 11578254 11789200 12283747
5120 12283747 12958424 13476290 13718384 14009253 14196886 14506638 14874919 14850543 14798627 14812007
5110A4812007k97559l90170R2290M74023K24333K75461L1159J85283K92470J99114
5100A5898411M9397L6377j73783l56822k70176o28162n88591n4129l56777n03405
5090A3052340k59593p5865O6544K19042M18765K79263K05593J16693j8903j36870
5080A3867009R5800M12580N85437K40750K44274J78767J85339J50846J56454K23767
5070A6341023L81106P66047Q99245J039536J495140R95317M92852L17529m421
5061B2723374L57647M22792n27L2862K71527K72721L27943R70698J366560J978916
5051B8724513L017585L825240N392251Q332106J1944972J4714293J5993334J3188275
5043A05132569K924231m168102m099016o556532r040350j1292885j3611709j1400256
$$ plain form
5110 14812007 14514448 14124278 14216568 14690591 14914924 15190385 15221544 15406827 15699297 15898411
5100 15898411 15947808 15984185 15810402 15453580 15183404 14555242 13966651 13912522 13555745 13052340
5090 13052340 12792747 12716882 12783426 13002468 13421233 13700496 13906089 14022782 14003879 13867009
5080 13867009 13962809 14375389 14960826 15201576 15445850 15624617 15809956 15960802 16117256 16341023
5070 16341023 16722129 17488176 18387421 19426957 20922097 21917414 22410266 22727795 22723374
5061 22723374 23081021 23503813 23503286 23536148 23807675 24080396 24408339 25379037 26745597 28724513
5051 28724513 31742098 35567338 40959589 49291695 61236667 75950960 91944294 105132569
5043 105132569 108056800 103888698 99789682 93233150 84192800 72899915 59288206 47887950
5035D7887950p956003n555164l770502k704251k109942j450020j131089p67054
5027B2443925j58022K95574N36595O56369J030576J559278J917466J991558K380559
5018C2653878K666608K327885J378896M59001j165564j761466j966535k097060
5010C2495643k000372j584816j283580j573608j401567j547647j320807r49087
5002B0834159q79383q43636l85434P7735J25155J48114n4876m7829K27175K27846
4992A9429026L58284Q23720J267537J570856J662467J476598J207347O69802o0588
4983B8405049q68060j189971j336824j415533j301416j428315j170193o54728
4975A9040009o82754q24788m79965k95310l64008l26429n15395n99041m74557
$$ plain form
5035 47887950 39931947 34376783 30606281 27902030 25792088 24342068 23210979 22443925
5027 22443925 22285903 22581477 23118072 23774441 24805017 26364295 28281761 30273319 32653878
5018 32653878 35320486 37648371 39027267 39486268 38320704 36559238 34592703 32495643
5010 32495643 30495271 28910455 27626875 26053267 24651700 23104053 21783246 20834159
5002 20834159 19954776 19111140 18725706 18803441 18928596 19076710 19021834 18974005 19201180 19429026
4992 19429026 19787310 20611030 21878567 23449423 25111890 26588488 27795835 28465637 28405049
4983 28405049 27536989 26347018 25010194 23594661 22293245 20864930 19694737 19040009
4975 19040009 18357255 17532467 17052502 16757192 16393184 16066755 15551360 14952319 14477762
4966A4477762o37177n26813J25961R0604j25959k36380k99745k96346j19467K30075
4956A2682515J81050N96341K43164k20337l41890j09123j12178L93729O96295
4947A4009566P27023Q81512M64402J14555Q7466n8923J542K84368K16431K24507
4937A6952449K97137L9841j39850N4927K84003K22792M80796O19346Q80405J154078
4927B0845924J349170J250489J466499J905184K988362M088677N705018P003507
4919D6602830P863259P217583M595677J696819l47765j496102j995507k961564
4911F1175230m144335m868905n219185m818433l892266k704533j980357r28117
4903C2619099m44749l62536l12805K53628L5421L89021N03834J151517J423650
$$ plain form
4966 14477762 13840585 13313772 13439733 13530337 13404378 13167998 12868253 12571907 12452440 12682515
4956 12682515 12863565 13459906 13703070 13482733 13140843 13031720 12919542 13313271 14009566
4947 14009566 14736589 15618101 16082503 16197058 16284524 16225601 16227143 16511511 16727942 16952449
4937 16952449 17249586 17289427 17149577 17204504 17488507 17711299 18192095 18811441 19691846 20845924
4927 20845924 22195094 23445583 24912082 26817266 29805628 33894305 39599323 46602830
4919 46602830 54466089 61683672 66279349 67976168 67628403 66132301 64136794 61175230
4911 61175230 57030895 52161990 46942805 42124372 38232106 35527573 33547216 32619099
4903 32619099 32174350 31811814 31499009 31752637 31788058 32177079 32680913 33832430 35256080
4894C5256080J550088J981409L378224N081792O909934Q808942J0268958J1239552
4886H4474979J1136848R555812O924242L781982K70951k373784m161524n200874
4878A04408632o756991q557308r554804r207652p637648o239671n259073m470798
4870D6724687l321517k397793j691539j501354r87845l26520j53995r3632K66061
4861C6516553P23988J177035K012046K661922L515807M922744O030194O330471
4853F3890760O091221M709488K242424J01180p18735j308598j811337k931065
4845G0265338l797487l693741k676721j177775K18341J326738K232439L703639
4837F6400771N050231O807610R319055J3130296J7614604K4118290L1829061L7956318
$$ plain form
4894 35256080 36806168 38787577 42165801 47247593 54157527 62966469 73235427 84474979
4886 84474979 95611827 105167639 112091881 115873863 116144814 113771030 109609506 104408632
4878 104408632 97651641 89094333 79539529 70331877 62694229 56454558 51195485 46724687
4870 46724687 43403170 41005377 39313838 37812484 36824639 36498119 36344124 36250492 36516553
4861 36516553 37240541 38417576 40429622 43091544 46607351 51530095 57560289 63890760
4853 63890760 69981981 74691469 76933893 77035073 76316338 75007740 73196403 70265338
4845 70265338 66467851 62774110 60097389 58919614 59137955 60464693 62697132 66400771
4837 66400771 71451002 78258612 87577667 100707963 118322567 142440857 174269918 212226236
4829B12226236L9161259L2185177J7228651J667306j0020994j9952278k7473380
4822B45021977l2059387l2989094l0014076k5246653k0207775j5705667j2711675
4815G6087650r984545p177819n658037m339273l002255k287267j925724j412915
4807D0299815j247655r96983q83545j039966j296661j333437j203843j376951
4799C0920774j282116j243169j240631j152405q60348r12747o25781m54486n40783
4790B2608308o99448m94890o31062l13720m1326J24074L49297P64033M62199M99538
4780B2627003N95423Q66844J154508J151096Q20701O94218M20451k94948l29583
4771B7705713n53449q59710j108615j493501j470445j208757j365847j335161
$$ plain form
4829 212226236 251387495 283572672 300801323 302468629 292447635 272495357 245021977
4822 245021977 212962590 179973496 149959420 124712767 104504992 88799325 76087650
4815 76087650 66103105 58925286 53267249 48927976 45925721 43638454 41712730 40299815
4807 40299815 39052160 38055177 37171632 36131666 34835005 33501568 32297725 30920774
4799 30920774 29638658 28395489 27154858 26002453 25142105 24229358 23603577 23149091 22608308
4790 22608308 21908860 21413970 20782908 20469188 20427862 20551936 20901233 21665266 22127465 22627003
4780 22627003 23222426 24089270 25243778 26394874 27215575 27909793 28330244 28035296 27705713
4771 27705713 27152264 26292554 25183939 23690438 22219993 21011236 19645389 18310228
4763A8310228q06776o91687q97181p28290p35785p18828l11610k36896n02247
4754A2680928q9275J08753o7523j03468J49806M23201L46225M96374M08768P84115
4744A5137904O81142M07908J22595R5446n3293o54453q68116r90362p30677o78287
4734A2469807q17075p93034n38232l44294l80457m35342k13651p3414l02861m76792
4724H094655l07598p9040j81546p8062k03133k61323k26405k44586n2487N5475
4714F515950j08628J17703K19648K9441k91961k77261j76213j25717J8759p1222
4704E850499j89504k18379Q9134j80438j73331k3287j20113m8013J54996m5077
4694E096487k54525k134m4980q2535R3127K01199J40126j19705j09838j35522
$$ plain form
4763 18310228 17503452 16811765 15914584 15186294 14450509 13731681 13420071 13183175 12680928
4754 12680928 12591653 12700406 12632883 12529415 12679221 13102422 13448647 13945021 14353789 15137904
4744 15137904 15819046 16226954 16349549 16444995 16391702 15737249 14869133 13878771 13148094 12469807
4734 12469807 11652732 10859698 10321466 9977172 9596715 9161373 8947722 8874308 8571447 8094655
4724 8094655 7787057 7708017 7526471 7448409 7245276 6983953 6757548 6512962 6460475 6515950
4714 6515950 6407322 6525025 6744673 6774114 6482153 6204892 6028679 5902962 5921721 5850499
4704 5850499 5660995 5442616 5531750 5351312 5177981 5154694 5034581 4986568 5141564 5096487
4694 5096487 4841962 4839828 4794848 4712313 4805440 5006639 5146765 5027060 4917222 4781700
4684D781700r1867l08605k12097K06096L89430M07710L9077k25924j15460k05028
4674D665032k33297k99461L0265J9558K46453J55228P2973j79468p8437k32127
4664D166719J2115r6932L6715R599J24834q0388p2745k27654m52261k00152M8991
4653C268841N0362K41708O30043K57186r2696k07092j87117o2222n6041m2384
4643C800588p1501j787l2971k06230p6414N1891K11920J70958m5521k11050R2308
4632C682191J72299O3608j63547q914K2751j97562m63502l12761j40617L33910
4622B987856J22747J60808N7423L113o0218j42380k91057m6204j81737K66997
4612B877348M2662q479P2019P9396k71050r4564M0313j45135K16995L06177J30412
$$ plain form
4684 4781700 4689833 4381228 4169131 4375227 4764657 5172367 5211444 4985520 4870060 4665032
4674 4665032 4431735 4132274 4162539 4182097 4428550 4583778 4656751 4477283 4398846 4166719
4664 4166719 4178834 4081902 4118617 4128216 4253050 4172662 4099917 3872263 3420002 3219850 3268841
4653 3268841 3319203 3560911 4190954 4448140 4355444 4148352 3961235 3899013 3842972 3800588
4643 3800588 3729087 3727300 3694329 3488099 3411685 3463576 3675496 3846454 3800933 3589883 3682191
4632 3682191 3854490 3918098 3754551 3745637 3768388 3570826 3107324 2794563 2653946 2987856
4622 2987856 3110603 3271411 3328834 3331947 3271729 3129349 2838292 2792088 2610351 2877348
4612 2877348 2920010 2911531 2983550 3062946 2791896 2697332 2737645 2592510 2809505 3115682 3246094
4601C246094M5440J60611l09150j30927j53199K2374q8984R7243n250O089q2683
4590B807658j22547R5320o5606K2665j18493j54185J52180Q7463k9449N732j51821
4579B528917j67970j26721K06341J02271K90345M25761m8487k13605l75609k04803
4569B416440l04776P2307K39327J62072J66720j95923l91289k6432M6715J36407
4559B321568J90173J02738q3410k86480j00643K4016J18092K67434o6902k57946
4549B228640p7436n7427M441Q5007K56946J03210J29932k22025j18632k06808
4539B125848R2124P1554J05658n2369j26018r5855Q729J9957R3655J35931o522
4528B372692o3989j09049Q1451K34324K77897K41729Q2919q3590O3255n5005j53042
$$ plain form
4601 3246094 3291534 3452145 3142995 3012068 2858869 2881243 2792259 2889502 2884252 2890341 2807658
4590 2807658 2685111 2780431 2714825 2737490 2618997 2464812 2616992 2704455 2675006 2680738 2528917
4579 2528917 2360947 2234226 2440567 2542838 2833183 3258944 3210457 2996852 2621243 2416440
4569 2416440 2111664 2183971 2423298 2585370 2752090 2556167 2164878 2138446 2185161 2321568
4559 2321568 2511741 2614479 2531069 2244589 2143946 2167962 2286054 2553488 2486586 2228640
4549 2228640 2151204 2093777 2098218 2183225 2440171 2543381 2673313 2451288 2332656 2125848
4539 2125848 2217972 2289526 2395184 2342815 2216797 2120942 2129671 2149628 2243283 2379214 2372692
4528 2372692 2308703 2199654 2281105 2515429 2793326 3035055 3117974 3034384 3097639 3042634 2889592
4517B889592p5726K43836r6399k39285l34180j86140l2041Q6258j72974j17249
4507A965692j4203k1783j20677J9607K636K16466K51364m2005p6225P9550j30386
4496B130036k96365j16142L2164l8759M1576K16887R0022m2593j61051j64241
4486A691534K8056P3971m3015r042N2042K55683q1446j33950l1287J79824j36212
4475A846158j06474j5756r921J55473J24422m7146j14242o247j12538j12858L3912
4464A634783L10981K83243J25139k95153R9014Q3662l3135j58155p7948K1303
4454A993734q4431j01214r1837j34943J22643R5529j25996K47171J52260K29947
4444B302863K8215R3709k96479j59063L3684r3493n550j24096k9489J1048r1409
$$ plain form
4517 2889592 2813866 3057702 2961303 2722018 2387838 2201698 2169657 2255915 2082941 1965692
4507 1965692 1951489 1929706 1809029 1828636 1831272 2047738 2299102 2257097 2180872 2260422 2130036
4496 2130036 1833671 1717529 1749693 1710934 1752510 1969397 2059419 2016826 1855775 1691534
4486 1691534 1719590 1793561 1750546 1741504 1793546 2049229 1967783 1833833 1802546 1982370 1846158
4475 1846158 1739684 1723928 1714007 1869480 1993902 1946756 1832514 1826267 1713729 1600871 1634783
4464 1634783 1945764 2229007 2354146 2058993 2158007 2241669 2208534 2050379 1972431 1993734
4454 1993734 1909303 1808089 1716252 1581309 1703952 1799481 1673485 1920656 2072916 2302863
4444 2302863 2331078 2424787 2128308 1969245 2002929 1909436 1903886 1779790 1750301 1761349 1669940
4433A669940J68894K07913K05110L70798O4205r8922q6242k49834j43514J00167
4423B208515Q5456j85452j17950k5544j28952k6336M46958K74914M6325r0762
4413B487172R4269l4735j12925m9757j04625N5814P2656n3407j86810K01525J08573
4402B477750N7055j19264R2973j60250k1372O9506J28916J39759k09011k12418
4392B243644j41427J47279J5985q7382J30995J14582n2041j61076k32072N0534
4382B029021K27269K69036J2835L5182j97348k87029q2065K8814Q7516K85310
4372B408541K49851j78161K4819J03560L11126N3859M3534j1553M9171j54390
4362B900357j44332k72078j85104k73666j06930j15226K27355J89987L4912L40126
$$ plain form
4433 1669940 1838834 2046747 2251857 2622655 2686860 2587938 2501696 2251862 2108348 2208515
4423 2208515 2293971 2108519 1990569 1965025 1836073 1809737 2256695 2531609 2577934 2487172
4413 2487172 2581441 2546706 2433781 2384024 2279399 2335213 2407869 2354462 2167652 2369177 2477750
4402 2477750 2534805 2415541 2508514 2348264 2326892 2396398 2525314 2665073 2456062 2243644
4392 2243644 2102217 2249496 2265481 2178099 2309094 2423676 2371635 2210559 1978487 2029021
4382 2029021 2256290 2525326 2538161 2573343 2375995 2088966 2006901 2035715 2123231 2408541
4372 2408541 2658392 2480231 2505050 2608610 2919736 2973595 3017129 3005576 3054747 2900357
4362 2900357 2756025 2483947 2298843 2025177 1918247 1803021 2030376 2220363 2255275 2595401
4352B595401P9207p3318l32446k0682p2675l5148j25957k97234j63235k24984
4342A328929k13840K04758N25131M16892L07758N1949j74327l26139m3996q3303
4332A993812j4611K91052J58456j64743j53715j57984j69032p5302n1305J19820
4322A776448K15439J13155l699J38829q0238j39814k01998k14131l06798l5058
4312A262135O0663L08251k6267J07811j02805j21869k5163Q9424O9003J78533
4302A799716R8684O3769j78150k80465o9666K17171J51564J16605L2668q6583
4292A865313J51234R6656J42796K73492K3171j34572J07658j05470K42120N83199
4282C245597L86692M3888P1971Q6000k74950k80793l55894l23879k84104m10785
$$ plain form
4352 2595401 2674608 2601290 2268844 2248162 2175487 2140339 2014382 1717148 1553913 1328929
4342 1328929 1115089 1319847 1844978 2261870 2569628 2621577 2447250 2121111 2077115 1993812
4332 1993812 1979201 2270253 2428709 2263966 2110251 1952267 1783235 1707933 1656628 1776448
4322 1776448 1991887 2105042 2101343 2240172 2159934 2020120 1818122 1603991 1297193 1262135
4312 1262135 1322798 1631049 1604782 1712593 1609788 1487919 1462756 1552180 1621183 1799716
4302 1799716 1898400 1962169 1784019 1503554 1433888 1651059 1802623 1919228 1951896 1865313
4292 1865313 2016547 2113203 2255999 2529491 2552662 2418090 2525748 2420278 2662398 3245597
4282 3245597 3632289 3676177 3748148 3834148 3559198 3278405 2922511 2598632 2314528 1903743
4272A903743k97734q1742p1842j20430P1786K06038J42128r6047Q879N5120R5037
4261A814936j16213o2538r0847k611N8858m4525L1551K37980K15422m1423r5835
4250A904755R6149K36104K58226Q5190k62939j31161l26791k40292k35076K0705
4240A404870J10061J28097L44980L26975O7530J96156J41086j90520j86351l64902
4230A977982j60862l06904k36799j96057K90063L20193J50898M05766J82992k3663
4220B403609N2194O8008j825j0027R1147M8171k96033q4670o0772k0191l1187
4209B158424L82472M07266K12801L33447L05914J52808q7192J5805l79298k71157
4199C231290p0926p7197J4829M95231L98709M14203L79974J19453K1236K96856
$$ plain form
4272 1903743 1606009 1524267 1452425 1331995 1403781 1609819 1751947 1655900 1664779 1719899 1814936
4261 1814936 1698723 1636185 1545338 1542727 1601585 1557060 1588611 1826591 2042013 2000590 1904755
4250 1904755 2000904 2237008 2495234 2580424 2317485 2186324 1859533 1619241 1384165 1404870
4240 1404870 1514931 1643028 1988008 2314983 2382513 2578669 2719755 2529235 2342884 1977982
4230 1977982 1817120 1510216 1273417 1077360 1367423 1687616 1838514 2244280 2427272 2403609
4220 2403609 2455803 2523811 2521986 2511959 2603106 2651277 2355244 2270574 2209802 2189611 2158424
4209 2158424 2540896 2948162 3160963 3494410 3800324 3953132 3865940 3881745 3502447 3231290
4199 3231290 3160364 3083167 3097996 3593227 3991936 4406139 4786113 4905566 4926802 5223658
4189E223658P9636L12907N37396O36791O78640R02754P36302P47480J217287J836068
4179A2908919L009178N597985Q924086J2003624J3547858J0756341L693364j407648
4171F9033707m544655p167755q526520r355413q285733n905083m028637k696497
4163A8523414k077130j935071j738459j343659r26829o68498n93786q22290p67623
4154G650069p43415p81901n41885j81575k96997k20756l37304j76710n8257K2388
4144D333657k04788l27550j83350k66200j67208j5710l10728j15242N1043M3078
4134B837002j70691J58772L40376J96526J34921j18266k13310j94257j84631k86250
4124B500192j92401K65126p7259k60872m269O3703L48247L83850R1596O8680k86885
$$ plain form
4189 5223658 5303294 5616201 6153597 6790388 7469028 8371782 9108084 9855564 11072851 12908919
4179 12908919 15918097 21516082 30440168 42443792 55991650 66747991 70441355 69033707
4171 69033707 64489052 57321297 48794777 39439364 31153631 25248548 21219911 18523414
4163 18523414 16446284 14511213 12772754 11429095 10502266 9833768 9239982 8417692 7650069
4154 7650069 6906654 6124753 5582868 5401293 5104296 4883540 4546236 4369526 4311269 4333657
4144 4333657 4128869 3801319 3617969 3351769 3184561 3168851 2858123 2742881 2793924 2837002
4134 2837002 2666311 2825083 3165459 3361985 3496906 3378640 3165330 2971073 2786442 2500192
4124 2500192 2307791 2572917 2495658 2234786 2230517 2294220 2642467 3026317 3117913 3186593 2899708
4113B899708k60602k96309j60586j37130L33073O7265j71307J9348r1145K37470
4103B439785J10660Q9911O3826p395l34267k40833K20739Q4064r522J2346j56138
4092B273176m24745j28411J92756L37342L43340K03170k11176m02055k89831k66917
4082A626649K3721K86995L44270K08543j99208j10462q7394l5674J94408P4508
4072B326356p0902N102q2503P8827j5510K49268J18462j56616o4009k84061j9905
4061B084509K14607J29097K1914j68353k49108L8905J4464K20408K08825O2279
4051B577547j04817k64243j59162p8935L33062M37762K27476k43774k24205k1525
4041B479186k27581q1284K71515K75612R5961J55926k36560J2154n8792n7282
$$ plain form
4113 2899708 2639106 2342797 2182211 2045081 2378154 2445419 2274112 2293460 2202315 2439785
4103 2439785 2550445 2640356 2704182 2696787 2362520 2121687 2342426 2426490 2416968 2429314 2273176
4092 2273176 1848431 1720020 1912776 2250118 2593458 2796628 2585452 2183397 1893566 1626649
4082 1626649 1650370 1937365 2281635 2490178 2290970 2180508 2093114 2057440 2251848 2326356
4072 2326356 2255454 2260556 2178053 2256880 2241370 2490638 2609100 2452484 2388475 2104414 2084509
4061 2084509 2299116 2428213 2450127 2281774 2032666 2071571 2086035 2306443 2515268 2577547
4051 2577547 2472730 2208487 2049325 1970390 2303452 2741214 2968690 2724916 2500711 2479186
4041 2479186 2251605 2170321 2441836 2717448 2813409 2969335 2732775 2744929 2686137 2628855
4031B628855r1389j07206j0003L27230J19519n8433j19507r2906k13684n6554
4021B325922M1608K99227L27337J40843J2732k05801o2861k05315J35610J34212
4011B943514l5127k21312k21194j50476K49914M65852K68137K68873j122l71711
4001C195348l27176j08528j02406K56684O2492J38047L18768L28341Q7484L18188
3991D167242L08871J16214j82798l87929m03202l063J72412k2681j6003n1903
3981C697160q1793o8952P0889m1475J39925J70721q0371l47504l01721k16517
3971B940362J48283J46408J18303p9995k24590P5647P663J17820P3259L30364
3961C653524M2551l74087k30474K0756k7752N7529Q4958Q7680K28482J43248o1485
$$ plain form
4031 2628855 2537466 2430260 2420257 2747487 2867006 2808573 2689066 2596160 2382476 2325922
4021 2325922 2367530 2666757 2994094 3134937 3147669 2941868 2879007 2673692 2809302 2943514
4011 2943514 2908387 2687075 2465881 2315405 2565319 3031171 3299308 3568181 3567059 3195348
4001 3195348 2868172 2759644 2657238 2913922 2976414 3114461 3433229 3761570 3849054 4167242
3991 4167242 4476113 4592327 4409529 4021600 3618398 3615335 3787747 3765066 3749063 3697160
3981 3697160 3615367 3546415 3617304 3575829 3715754 3886475 3806104 3458600 3156879 2940362
3971 2940362 3088645 3235053 3353356 3273361 3048771 3124418 3132081 3249901 3323160 3653524
3961 3653524 3696075 3321988 3091514 3112270 3084518 3142047 3227005 3314685 3543167 3686415 3624930
3950C624930j19047N8293j49819k31780j34030j45667K99428M77728J28274R9027
3940C907337p2822k59251l03668j30015l3167K27112K52708J61999q9151j17816
3930C543266Q018J7759K9077k35771M4759J06282R8722R6776J68398J88338K2101
3919D087725j17695l15138L1970n2781R7116J76750K99466J2911l5637k5960M2807
3908D201534J51141K71991P1813m4157j84533l48211j81587Q2244K70122K46728
3898D537085R7619l1148j28566m8K0066N0516Q6007o6049j53217j1339K44378
3887D645304K92865J46058q7603k05361J3410j13537j6966K56491L31493L08553
3877E570707Q921k46243k24574j21379P197K46405K17743k0523P044l16251l69154
$$ plain form
3950 3624930 3505883 3564176 3414357 3182577 3048547 2902880 3202308 3680036 3808310 3907337
3940 3907337 3834515 3575264 3271596 3141581 3108414 3335526 3588234 3750233 3661082 3543266
3930 3543266 3551284 3569043 3598120 3362349 3407108 3513390 3612112 3708888 3877286 4065624 4087725
3919 4087725 3970030 3654892 3686862 3634081 3731197 3907947 4207413 4220324 4184687 4158727 4201534
3908 4201534 4352675 4624666 4696479 4652322 4467789 4119578 3937991 4020235 4290357 4537085
3898 4537085 4634704 4603556 4474990 4474942 4495008 4545524 4631531 4565482 4412265 4400926 4645304
3887 4645304 4938169 5084227 4996624 4791263 4804673 4691136 4674170 4930661 5262154 5570707
3877 5570707 5579628 5333385 5108811 4987432 4994629 5241034 5458777 5438254 5445298 5129047 4759893
3866D759893n916K1451J07071M05102K59613R122J77179j9076k05169j50093l50837
3855E008340k57329J53450k6251j1936J60558K41599O4573L1104o0962k7806K03570
3844E478910J40933j87110j89024j41152k09776r9761N2766J62259K89193K93992
3834E591230l3125p1395k26042o3155J12492M5428J96622K08167J26794k22006
3824E665010j17094j13207j772Q4042Q9773o7736r9309j0766k1516J74195J74038
3813E755658L39552K60985o3437l07460k85303j53886j3010K14439J19796j70077
3803E697257j6769L6442l17763j48014R4663K88517J03739J16763k0698m9380
3793E784757M0170n2753j64260J79883p375L2558J86191J42951K1912r2975k11462
$$ plain form
3866 4759893 4753977 4775428 4882499 5287601 5547214 5556336 5733515 5714439 5509270 5359177 5008340
3855 5008340 4751011 4904461 4878210 4866274 5026832 5268431 5333004 5364108 5303146 5275340 5478910
3844 5478910 5619843 5432733 5243709 5102557 4892781 4793020 4845786 5008045 5297238 5591230
3834 5591230 5558105 5486710 5260668 5197513 5310005 5355433 5552055 5760222 5887016 5665010
3824 5665010 5547916 5434709 5432937 5516979 5606752 5539016 5439707 5428941 5407425 5581620 5755658
3813 5755658 6095210 6356195 6292758 5985298 5699995 5546109 5533099 5747538 5867334 5697257
3803 5697257 5680488 5716930 5399167 5251153 5345816 5634333 5738072 5854835 5834137 5784757
3793 5784757 5824927 5772174 5607914 5787797 5780422 5812980 5999171 6142122 6164034 6071059 5859597
3782E859597l29240j81122J76659L97170N95506M16235M5809L5713l19164l03478
3772F393685k11774O736L59760J89062J59825j83792l97033k59019p9904J79218
3762F156764L02528M50373L95960k6768m84074k93011j41755J29734J9668M8088
3752F557507L50977J98964j70309j31614N1653o6335O1449K77450J02788L45254
3742G577784J92230j1890j25870M8372j77839j80095r0117j3720N3272J66145
3732G438272l9105J0706J50987m9540J24510L1402R7368J16459l143l02926o4725
3721G510265J33296J38051M3961J95714J3560q4324k1558j43366J83400L17420
3711H286419K0606K036k9267j24054L721j07072j12314l7354K15542l2398o72
$$ plain form
3782 5859597 5530357 5349235 5525894 5923064 6518570 6934805 6980614 7016327 6697163 6393685
3772 6393685 6181911 6188647 6548407 6737469 6897294 6713502 6316469 6057450 5977546 6156764
3762 6156764 6459292 6909665 7305625 7278857 6794783 6501772 6360017 6489751 6509419 6557507
3752 6557507 6908484 7107448 6937139 6805525 6857178 6790843 6852292 7129742 7232530 7577784
3742 7577784 7770014 7758124 7632254 7680626 7502787 7322692 7232575 7218855 7272127 7438272
3732 7438272 7399167 7409873 7560860 7511320 7635830 7667232 7764600 7881059 7877916 7574990 7510265
3721 7510265 7643561 7781612 7825573 8021287 8034847 7950523 7928965 7785599 7968999 8286419
3711 8286419 8307025 8309061 8279794 8155740 8159461 8052389 7940075 7902721 8118263 8085865 8085193
3700H085193L53679P8142J2068j20421j99050j61293j355j08808P5125K86588
3690H299868J57022j43772m7812K1147J83536k630o817j9659o4036j39912j17403
3679H119532K96018J46631K68291J52673j38218j56625N8415p4790p2788J18125
3669H717264N3074Q3609L01010L7783n3550q0431j59835P8401R241j10556M6860
3658H922870J13463J68403J12844N6401j36623Q3040J5909j52886J02552K50924
3648I536897K39689K3752r149L2080J50167P1235l9778J93959L65969L34995L41571
3637A1241387K88023L25876M42539M90920P69313J311706K006448K746657L349848
3628B2972717L277049K484448N85973n75010l58274o79484j338406k033534k584897
$$ plain form
3700 8085193 8438872 8517014 8529082 8408661 8209611 8048318 8046963 7938155 8013280 8299868
3690 8299868 8456890 8313118 8265306 8286453 8469989 8467359 8460542 8440883 8376847 8236935 8119532
3679 8119532 8415550 8562181 8830472 8983145 8844927 8688302 8746717 8671927 8599139 8717264
3669 8717264 8770338 8853947 9154957 9192740 9139190 9058759 8898924 8977325 8986566 8876010 8922870
3658 8922870 9036333 9204736 9317580 9373981 9237358 9320398 9336307 9183421 9285973 9536897
3648 9536897 9776586 9800338 9791189 9823269 9973436 10044671 10004893 10198852 10564821 10899816 11241387
3637 11241387 11529410 11855286 12297825 12788745 13558058 14869764 16876212 19622869 22972717
3628 22972717 26249766 28734214 29320187 28745177 28386903 27707419 26369013 24335479 21750582
3619B1750582k534918k074438j221535p84690o32795n43118k68134j36622K58496
3610A3812828K55099J54965J80291J72863K84842M76496N79586J048710J150616
3601A8116296J330543J808723K904212M731418O217490O902749O224381K379041
3593E0614853j085376j306199j913696k846414l774319m947840n396785l926949
3585B5417275k680126j523244j083545j110430p77483p50169o78497l30053m2506
3576A6441222J46622K73621K78034K83855K36683K82783K65313L51977R06396
3567A9466506J460776K288870L094595L188935L061737J614359l35543n98170
3559C3242065l56911o94442j324130k014461k453286j841651j149277o58341l85655
$$ plain form
3619 21750582 19215664 17141226 15919691 15135001 14502206 13959088 13690954 13554332 13812828
3610 13812828 14067927 14222892 14403183 14576046 14860888 15337384 15916970 16965680 18116296
3601 18116296 19446839 21255562 24159774 28891192 35108682 42011431 48235812 50614853
3593 50614853 49529477 48223278 46309582 43463168 39688849 34741009 29344224 25417275
3585 25417275 22737149 21213905 20130360 19019930 18242447 17492278 16813781 16483728 16441222
3576 16441222 16587844 16861465 17139499 17423354 17660037 17942820 18208133 18560110 19466506
3567 19466506 20927282 23216152 26310747 29499682 32561419 34175778 33840235 33242065
3559 33242065 32885154 32190712 30866582 28852121 26398835 24557184 23407907 22749566 22363911
3550B2363911j84812j28222j04887l32252l95228l79552r4886k56156M9590J6002
3540B0553508l03533l98582k55393j69809k3141K69881M08232M44234J40532J245
3530B0667174L1190K51810J77648L63457N62659M25778N96829O03227Q99067J275411
3520B5854250J290760R62714O37144M76864J69064L63657N74351L01021J04266
3511C0734091M5186l72507n01296n19443j27280J6808J9299M1445J13912L94372
3501B9844587P77870Q55831O58295N36514M66354N04440R74836K023161L215341
3492C9857229M301610M714345L440778J158216L47047l70933q98174j296543j330077
3483D9923498j152032n43827L7626O65768J186346J262726J282162J500777J759005
$$ plain form
3550 22363911 22179099 22050877 21945990 21613738 21218510 20838958 20744072 20487916 20537506 20553508
3540 20553508 20249975 19851393 19596000 19426191 19403050 19672931 20081163 20525397 20665929 20667174
3530 20667174 20698364 20950174 21127822 21491279 22053938 22479716 23076545 23679772 24578839 25854250
3520 25854250 27145010 28107724 28744868 29221732 29390796 29754453 30328804 30629825 30734091
3511 30734091 30779277 30406770 29905474 29386031 29258751 29275559 29294858 29336303 29450215 29844587
3501 29844587 30622457 31478288 32136583 32673097 33139451 33643891 34618727 36641888 39857229
3492 39857229 44158839 48873184 52313962 53472178 53819225 53448292 52550118 51253575 49923498
3483 49923498 48771466 48227639 48265265 48931033 50117379 51380105 52662267 54163044 55922049
3474E5922049K077507K870917L426258M191920M418434M894477N287035O409300
3466H9497897P693858Q916084R982810J0788987J0953937J0820321R361684O892310
3458A64907888K313737m618122r117036j1429152j3076823j2770832j2325588
3451A03884072j0598595q172553o632622n595069m773923m026425l043257k695721
3443E8345907k048161j341804j113480r08405q23156j053175r88616q58691j009037
3434D8201382j066912j440636j458741j196987m50939N33605J390188K074528
3426D6585488J957702O25372r68761j305394j682297j932801k310347k657349
3418C8311613k375322k275240j717118j285958j022170p83313m07792J857N26192
$$ plain form
3474 55922049 57999556 60870473 64296731 68488651 72907085 77801562 83088597 89497897
3466 89497897 97191755 106107839 116090649 126879636 137833573 148653894 158015578 164907888
3458 164907888 167221625 162603503 153486467 142057315 128980492 116209660 103884072
3451 103884072 93285477 85112924 78480302 72885233 68111310 64084885 61041628 58345907
3443 58345907 56297746 54955942 53842462 52934057 52110901 51057726 50069110 49210419 48201382
3434 48201382 47134470 45693834 44235093 43038106 42587167 43120772 44510960 46585488
3426 46585488 48543190 49168562 48199801 46894407 45212110 43279309 40968962 38311613
3418 38311613 35936291 33661051 31943933 30657975 29635805 28852492 28444700 28446557 28972749
3409B8972749O97124Q91053J003117N66408j38017n71784r46124r09027j190221
3400B8375278j441676j653549j286173r09011r56361q26883l88152k45467j36238
3391B0531768j29023k11230k09284k71742m11685o07848o3747j24887k17827J3172
3381A8297667l053K1741n7672J93575M69323O10871L11993M4431n06355l85839
3371A8996682m12626l04234q4038j24657l36748q58837p72729p71683n93545l50981
3361A4386604J34505K95252j8391p9308m38061m09042j78326k01572j11441j67294
3351A3212926K8111m3047r5873k30365k4085J07673k00709m65794k87193n4795
3341A1946849J8422L35593J73964j26402k56277l71336k48159j63178J67166K57497
$$ plain form
3409 28972749 29669873 30560926 31564043 32130451 31992434 31420650 30474526 29565499 28375278
3400 28375278 26933602 25280053 23993880 23084869 22128508 21301625 20913473 20668006 20531768
3391 20531768 20402745 20191515 19982231 19710489 19298804 18690956 18627209 18502322 18284495 18297667
3381 18297667 18294614 18316355 18258683 18452258 18921581 19532452 19844445 19888876 19382521 18996682
3371 18996682 18584056 18279822 18195784 18071127 17734379 16875542 16102813 15331130 14737585 14386604
3361 14386604 14521109 14816361 14797970 14718662 14280601 13871559 13693233 13491661 13380220 13212926
3351 13212926 13241037 13197990 13102117 12871752 12847667 12955340 12754631 12288837 12001644 11946849
3341 11946849 11965271 12300864 12474828 12348426 12092149 11720813 11472654 11309476 11476642 11734139
3331A1734139K86807M0430l07924k80861r1319j02370j17061n7015j0697k1839
3321A1072290j90424j07951q1606P2816K64822N4847m38479j38679j54810k28369
3311A0124457n4706J56996m7387R8277K7762j59866R7178J32727Q6747q9742j60597
3300A0211846q8638L0780j42838k779L883j8815r6015q1702k20783k02134J37997
3289I530802R4617j04962k1390O2282p9860r2115q036j0009k1941J39991j61044
3278I328335k45710j78327k5115m5414Q2484K03779j012j19695M646J72857p9398
3267I097430j72396j33464j5939k76164l72423j60367J06980L32070K79129m324
3257H680532k05599J1924q1195k29210j01346o1242K5880j11899k47332L1653
$$ plain form
3331 11734139 12020946 12061376 11753452 11472591 11381272 11278902 11161841 11104826 11094129 11072290
3321 11072290 10881866 10773915 10692309 10765125 11029947 11084794 10646315 10507636 10352826 10124457
3311 10124457 10069751 10226747 10179360 10277637 10305399 10145533 10242711 10375438 10462185 10372443 10211846
3300 10211846 10123208 10153988 10011150 10008371 10012254 9993439 9897424 9815722 9594939 9392805 9530802
3289 9530802 9625419 9520457 9499067 9561349 9481489 9389374 9381338 9371329 9349388 9489379 9328335
3278 9328335 9082625 8904298 8879183 8833769 8916253 9120032 9119020 8999325 9003971 9176828 9097430
3267 9097430 8925034 8791570 8775631 8499467 8127044 7966677 8073657 8405727 8684856 8680532
3257 8680532 8474933 8486857 8405662 8176452 8075106 8013864 8039744 7927845 7680513 7712166
3247G712166J30199L17024J50393j83670l48117j25602L5184j14193N0459J73115
3237G796958P7357l4679k84894k64980K07286M74207L81134K0091l7646n0078
3227H284756j63686j71719k6207R5618L10355q7547k13370j36253J57377L76222
3217H425546K62655N1484o0292j74394k79228k13427j25090M81170L92004K4702
3207H785130k28603K6455L43196J18327K26826K30516K72159K32136K85585l2858
3197A0258869P6711J39257n343K513k06864n4653L17824L09316L88148K61485
3187A1487263r3629l29410j68416j57679p1673K22067J80698K58062j1718k34082
3177A1081483k23305j7676J19578K88383L69472M11531L95503M22378J62036J12592
$$ plain form
3247 7712166 7842365 8159389 8309782 8126112 7777995 7652393 7687577 7573384 7623843 7796958
3237 7796958 7874315 7839636 7554742 7289762 7497048 7971255 8352389 8372480 8334834 8284756
3227 8284756 8121070 7949351 7923144 8018762 8329117 8241570 8028200 7891947 8049324 8425546
3217 8425546 8688201 8739685 8679393 8504999 8225771 8012344 7887254 8368424 8760428 8785130
3207 8785130 8556527 8582982 8926178 9044505 9271331 9501847 9774006 10006142 10291727 10258869
3197 10258869 10335580 10474837 10469494 10472007 10265143 10210490 10528314 10837630 11225778 11487263
3187 11487263 11393634 11064224 10895808 10738129 10666456 10888523 11069221 11327283 11315565 11081483
3177 11081483 10858178 10840502 10960080 11248463 11617935 12029466 12424969 12847347 13009383 13121975
3167A3121975K71865J82082J53517J22694L58996L22730L63880K60560J38892
3158A5297191K41073N40761J92250L58671M16029K02724M45507J95160P5392R2893
3148A8057651M73276O41974M73664K94997K21993N3594k7676J2478J72042J97742
3138B0571735M18900J60420k7415K2116K69732N62413N21927R37114Q22623J031921
3128B5291486P29590P04062P93191J265306J415433J236081J683272J684275J390089
3119C6192785J004427L56015l08483n71814j291027j353231j696499j248290j148007
3110B9935876p12901m02030j30183J17154L34343L74487M49911L59021L04697
3101C0630375K85772J80442J55217K68708M11245N27053Q98788O37681N21916
$$ plain form
3167 13121975 13393840 13575922 13729439 13852133 14211129 14533859 14897739 15158299 15297191
3158 15297191 15538264 16079025 16271275 16629946 17045975 17248699 17694206 17889366 17964758 18057651
3148 18057651 18530927 19172901 19646565 19941562 20163555 20217149 20189473 20201951 20373993 20571735
3138 20571735 20990635 21151055 21123640 21145756 21415488 21977901 22499828 23436942 24259565 25291486
3128 25291486 26021076 26725138 27518329 28783635 30199068 31435149 33118421 34802696 36192785
3119 36192785 37197212 37553227 37244744 36672930 35381903 34028672 32332173 31083883 29935876
3110 29935876 29222975 28820945 28690762 28807916 29142259 29516746 29966657 30325678 30630375
3101 30630375 30916147 31096589 31251806 31520514 31931759 32458812 33357600 33995281 34517197
3092C4517197M13467j093n36038q19657r60987r15586o15629r52163j335245j099757
3082B7694509q77970q39576o64073k42386k8938P5243j22047m49247k59520k20262
3072B4065733l11198l61734l07348m79454n78788o40103q87256o09601o04525
3063A9285726o78423p53680p94359j027639p75872o46104l13470j13806m11871
3054A3770502o82067n76494o41795o52271l05033L60398J83913p8257j47597k90683
3044A0940616j98349k96761l20286m5983O3917r5386j94294j87271j22485p7269
3034I466449l47677o40883m73607P3712k3948j71398K29535K42980m0595m20482
3024G894086p89560l30637J27273M0436J28474J26554m53243l59206j22113l26736
$$ plain form
3092 34517197 34930664 34929571 34393533 33573876 32612889 31697303 31081674 30129511 28794266 27694509
3082 27694509 26816539 25976963 25312890 25070504 25041566 25116809 24994762 24545515 24285995 24065733
3072 24065733 23754535 23392801 23085453 22605999 22027211 21387108 20499852 19890251 19285726
3063 19285726 18607303 17853623 17059264 16031625 15255753 14609649 14296179 14182373 13770502
3054 13770502 13088435 12511941 11870146 11217875 10912842 11273240 11457153 11378896 11231299 10940616
3044 10940616 10742267 10445506 10125220 10079237 10143154 10047768 9853474 9666203 9543718 9466449
3034 9466449 9118772 8477889 8004282 8077994 8054046 7882648 8112183 8355163 8314568 7894086
3024 7894086 7104526 6773889 6901162 6941598 7070072 7196626 6743383 6384177 6262064 5935328
3014E935328l6615K18611M34070j3442j04312l79230n1374o8800k8905j70721
3004E734610k22136m28062k48986r859k32616k37004J58498L16412p5163Q3585
2994D839279q776O5249o2781l33833m13725k01162k24654J88012o5330j29661
2984C652618J27765p0243k13369j46196N292j018M38504K64857j23505l83298
2974C551407r6418l45171j79354j93445N5449K04133j81759j70078j6482K78779
2964B907061J77122J92197k45546k70952j20855M9491k01155k66584o7373R7252
2954B250658m8742j16449j37193O0350K45491o2736j57559r8442o026J5921J1618
2943A956891r6607L3526r4041l11671j27229M7910J22762N4237J17211M4942L10591
$$ plain form
3014 5935328 5898713 6117324 6551394 6537952 6433640 6054410 6003036 5934236 5905331 5734610
3004 5734610 5512474 5084412 4835426 4825567 4592951 4355947 4514445 4830857 4755694 4839279
2994 4839279 4830503 4895752 4832971 4499138 4085413 3884251 3659597 3847609 3782279 3652618
2984 3652618 3780383 3710140 3496771 3350575 3355867 3354849 3793353 4058210 3934705 3551407
2974 3551407 3454989 3109818 2930464 2737019 2792468 2996601 2814842 2644764 2628282 2907061
2964 2907061 3084183 3276380 3030834 2759882 2639027 2688518 2487363 2220779 2153406 2250658
2954 2250658 2201916 2085467 1948274 2008624 2254115 2191379 2033820 1935378 1929352 1945273 1956891
2943 1956891 1860284 1893810 1799769 1488098 1360869 1408779 1531541 1585778 1702989 1747931 2058522
2932B058522q7085k11774j70527J34678q0779q3372j02647j07600n0284N0562
2922A349694j52785m0823K03184n0285k8300l8693M9126J22521k1251k26468J11558
2911A277478m1736J3313l28707q7777q1041J03559J54200o0062J70533J57579
2901A277339k39273j54453K95074Q5052J58840j24381j053r1175k10750k43867
2891G51353j02879O0266K19880J68189K9974j38944M6855R2996p2774Q8978l7722
2880A106172j12333m5743j06660l06648J10268J62763r1672o6299J02844K5298
2870G77990K9182J4197R3862j39788n3734j90785j57271m8359L31084J99936M9364
2859I05678k13753k50472L5099j08363Q7110L00313J67791J32913N0861l24797
$$ plain form
2932 2058522 1971437 1759663 1589136 1723814 1643035 1559663 1457016 1349416 1299132 1349694
2922 1349694 1196909 1156086 1359270 1308985 1280685 1241992 1291118 1413639 1392388 1165920 1277478
2911 1277478 1235742 1249055 920348 832571 751530 855089 1009289 949227 1119760 1277339
2901 1277339 1038066 883613 1178687 1263739 1422579 1298198 1297145 1205970 995220 751353
2891 751353 648474 708740 928620 1096809 1126783 987839 1034694 1127690 1054916 1143894 1106172
2880 1106172 993839 948096 841436 534788 645056 807819 716147 649848 752692 777990
2870 777990 807172 821369 915231 775443 721709 530924 373653 325294 656378 856314 905678
2859 905678 691925 441453 476552 368189 455299 755612 923403 1056316 1107177 782380
2849G82380l76731M338J52839p3700M6987K01618J2723J09570j70218p9611M4862
2838F55057p6190j06949r3095J35663J81796o5390K8329K4438r8530j57470P8983
2827E06642J60500j1981L7308k15280p4638j86572R7369M9786L7004R9059j06481
2816C92716j27350o7754K87915J85385J71910o8880n5347k27519j12313m7476
2806C31287j9164N6591J06592j10040j46450j10648Q8082M8510L2318L06630J40425
2795G24133m8360n5954o6464k94347O4622n9603J11171n4665j76707N8693J80707
2784C83226k9246j67720P2731J55658j7443O2124J88129l6385j0898l63885l16883
2773h0592N670L08463N8245j74020j04924j06078J83235J16676j4071k565L03535
$$ plain form
2849 782380 405649 409987 562826 489126 536113 737731 750454 860024 689806 610195 655057
2838 655057 578867 471918 378823 514486 696282 630892 659221 683659 585129 427659 506642
2827 506642 667142 655161 692469 477189 402551 215979 313348 363134 400138 499197 392716
2816 392716 265366 197612 485527 670912 842822 773942 718595 491076 378763 331287
2806 331287 312123 368714 475306 365266 218816 108168 196250 244760 277078 583708 724133
2795 724133 675773 619819 553355 259008 323630 264027 375198 320533 143826 202519 383226
2784 383226 353980 186260 258991 414649 397206 459330 647459 611074 600176 236291 -80592
2773 -80592 -74922 233541 291786 117766 12842 -93236 89999 206675 192604 190039 493574
2762D93574m5426n8847k62103Q9956K2193j20471l23145L0460R2737L19714J37519
2751C76161j07601l2798R1993q191k01632J12446K80940J86907j52179j56323
2741C89723m41216k60169j65622J33996N54770M45516J53676k66990l22627k11129
2731I928R1570j02054P5221m8344n9728l1517N6606K8775K46741P3665j01184
2720B39679K7692j80605o7074r974J97611O6881j85820l02549j28222L0924L63633
2709E2176K09487K47421m6639j70427j07573l68569l8972L42284K45629Q0046
2699D44863k01735l92981j28139K12545J71194L56985M550j46317j55223l74006
2689b08264j41689K70493L83896J0245k00722j30199l46461p2871j2695K20321
$$ plain form
2762 493574 448148 389301 127198 217154 239347 118876 -204269 -173809 -81072 238642 376161
2751 376161 268560 235762 327755 319564 117932 230378 511318 698225 546046 389723
2741 389723 -51493 -311662 -477284 -343288 211482 656998 810674 543684 221057 9928
2731 9928 101498 -556 74665 26321 -33407 -64924 -8318 20457 267198 340863 239679
2720 239679 267371 86766 19692 9718 207329 274210 88390 -214159 -342381 -311457 52176
2709 52176 261663 509084 462445 292018 184445 -184124 -223096 119188 364817 444863
2699 444863 243128 -149853 -277992 -65447 105747 462732 467282 320965 165742 -208264
2689 -208264 -349953 -79460 304436 314681 113959 -16240 -362701 -435572 -448267 -227946
2679b27946J28135L24096J61857j14019l0096K24537J653l68842n67982j06530
2669e75137K07484J33176K21304J29744L18665J10858k51745j25880J10698J6462
2659B95629K8469j34790k04423k75022j46213j17076J24508K24858L21207Q2852
2649A99999O5417n2494l7945K1671o3661q4368l07138j85214o3424j9553J11671
2638d15039M33120L6681J26324J22662J64467o4921o9131r8599k1043j46311j39263
2627g1053m4611m3441J86376J3896P8089p7686J27747L5482J29965M025K21623
2616E60412j8398m09579l21300k7442J13035l0335j82253o0500J54998p0320M2849
2605b48833R0625M57282L30141Q7093m11163k57387j14340j18309N1212n9388
$$ plain form
2679 -227946 -99811 224285 386142 272123 242027 466564 468217 99375 -468607 -575137
2669 -575137 -367653 -234477 -13173 116571 435236 546094 294349 168469 279167 295629
2659 295629 324098 189308 -15115 -290137 -436350 -553426 -428918 -204060 117147 199999
2649 199999 265416 212922 174977 196648 132987 48619 -258519 -443733 -507157 -526710 -415039
2638 -415039 18081 54762 181086 303748 468215 403294 334163 235564 214521 68210 -71053
2627 -71053 -115664 -159105 27271 41167 119256 41570 169317 204799 334764 338789 560412
2616 560412 542014 132435 -188865 -216307 -103272 -133607 -315860 -376360 -221362 -291682 -248833
2605 -248833 -158208 299074 629215 716308 305145 47758 -66582 -184891 -133679 -193067
2595a93067O0791L55134K08060j97087M4618L81213L55420J03819m8289k07952
2585H62660n9727P9841k61718k93689k10474M125R9563k6710j19636K05827J96876
2574D76938j7989l69808l42486K4745r7910J11519J59287K53692r2882j40226
2564c5120j05187P2960o5501J1672j90504J15764j72727p4003J77151L03358L26269
2553C64132Q1575K9197j31397k84840j02845r6296l2526L22554j9936q2451k2107
2542B5060K75730J02299J09995j37653j85013j3421l0594l8534j3240K53526Q1935
2531D30090l19628l03450k76208k0053J89688K61963L04283J38880l6505j14690
2521B54370k18127k11753J34630k6679o1671n7989N9396J67121J80555O3724j61351
$$ plain form
2595 -193067 -132276 222858 430918 233831 278449 659662 1015082 1118901 1070612 862660
2585 862660 802933 882774 621056 327367 116893 121018 220581 193871 74235 280062 476938
2574 476938 458949 89141 -253345 -228600 -326510 -214991 -55704 197988 105106 -35120
2564 -35120 -140307 -67347 -132848 -121176 -311680 -195916 -368643 -442646 -265495 37863 364132
2553 364132 445707 474904 343507 58667 -44178 -140474 -173000 149554 129618 47167 25060
2542 25060 300790 403089 513084 375431 190418 176997 146403 107869 94629 348155 430090
2531 430090 110462 -192988 -469196 -489249 -299561 -37598 266685 405565 369060 254370
2521 254370 36243 -175510 -40880 -67559 -129230 -187219 -127823 39298 219853 283577 122226
2510A22226p629M5131l5500M2769K1744N213N4495j27999j64522q7370J53445
2499B2003K14921J35516p8234m4475N6635J04642j86403j45983J62526J84114
2489D25262M9252k05679j87893j19607J29195J10878O536J35350J72288o0775
2479D54807j09772j03624N7150j12662k10917j17440J26573K37791J34320O3128
2469D19354O1912j0367k60872r4334L8716J03796p6301l4086J39286J43520K52770
2458F83394k43317k36375j35826J5450k0345J16966K53359N41941n3762k86739
2448F34746l40305j13556j11783j56880J62687L19488J85175J1916k0158r9168
2438D72162O8211J2799k5511j56253K4510k19750K504j64700K49249J37207n8746
$$ plain form
2510 122226 114597 159728 124228 166997 188741 193954 248449 120450 -44072 -131442 22003
2499 22003 236924 372440 294206 249731 306366 411008 224605 78622 241148 425262
2489 425262 474514 268835 80942 -38665 90530 201408 207944 343294 515582 454807
2479 454807 345035 241411 298561 185899 -25018 -142458 -15885 221906 356226 419354
2469 419354 481266 470899 210027 115693 154409 258205 181904 147818 287104 430624 683394
2458 683394 440077 203702 67876 83326 62981 179947 433306 975247 921485 634746
2448 634746 294441 180885 69102 -87778 74909 394397 579572 591488 571330 472162
2438 472162 540373 553172 527661 371408 395918 176168 178672 13972 263221 400428 341682
2427C41682R3554n4435j7260K25575J29865j60532K0837o6267M25P7232K85278
2416H75954N3906j1014j64933l57145p6271J67873L06147K24819K34089j59073
2406A094352j26062m9615j17004k09987K17053J42609Q1398j54279j41264j46755
2396E90446K08736J93179n7151J46526Q0078p5243m9686K40705K25784N150j52579
2385A355945o86373n3837J89667K08238M85605L22996o3260j18114l56329o1521
2375A223017K71167M44725j75805j87499k07589j24632j12393J16288L67072M84822
2365B099173L10399j70278j65892R6866J63661Q6867k46978K05935L32289j22837
2355B589205k6081J01634L18317K16454n8963k208j1555L28899L81661K05768
$$ plain form
2427 341682 435236 380801 363541 589116 718981 558449 579286 513019 513444 590676 875954
2416 875954 929860 918846 753913 396768 320497 488370 794517 1019336 1253425 1094352
2406 1094352 968290 918675 801671 591684 808737 951346 1032744 878465 737201 590446
2396 590446 799182 992361 935210 1081736 1161814 1086571 1036885 1277590 1503374 1508524 1355945
2385 1355945 669572 615735 805402 1013640 1499245 1822241 1758981 1640867 1284538 1223017
2375 1223017 1494184 1938909 1763104 1575605 1368016 1243384 1130991 1247279 1614351 2099173
2365 2099173 2409572 2239294 2073402 2170268 2333929 2420796 2173818 2379753 2712042 2589205
2355 2589205 2563124 2664758 2983075 3199529 3140566 3138358 3126803 3455702 3837363 4043131
2345D043131J38590K53384J45204J61140M34758Q34310J134141J294894J194118
2336I633670J037870R12837N86719N06679O41616J063793J325361J848577K917612
2327B0474734M276156O008250R065631J5818132K5662767L4551676L0265294Q817818
2319A54940458l648079j8214801k3080986k3943216k2446330j5401964j1132867
2312C7072215p525610n628782l831790k788741j739381j188449l62728o17507
2304A3389227q31105j356921r95549j231212q69522p47060l21321r8154k90906
2295F647477p27190l88011k98859k09270P2571P0336l13104n35251m52622m58594
2285C407483l29634J23204O7516K20763K38170k72139j17616Q591n5109j98778
$$ plain form
2345 4043131 4181721 4435105 4580309 4741449 5176207 6010517 7144658 8439552 9633670
2336 9633670 10671540 11584377 12171096 12677775 13319391 14383184 15708545 17557122 20474734
2327 20474734 24750890 30759140 39824771 55642903 81305670 115857346 146122640 154940458
2319 154940458 151292379 133077578 109996592 86053376 63607046 48205082 37072215
2312 37072215 29546605 23917823 20086033 17297292 15557911 14369462 14006734 13389227
2304 13389227 12558122 11201201 10205652 8974440 8104918 7357858 7036537 6938383 6647477
2295 6647477 5920287 5532276 5233417 5024147 5096718 5167054 4853950 4318699 3866077 3407483
2285 3407483 3077849 3201053 3268569 3489332 3727502 3455363 3337747 3346338 3291229 3092451
2275C092451j99119k40558r3617Q5031l21497l5611o8660n2170j52343k05618
2265A808289l07503L92293L02742J05247j06059j69058k55677l58703l42999N4584
2255A123156K58780K01051N0896j50346j53872J8000J65291J75576k01983n874
2245A480675K8596n1933k53229n2707j52195J45249J0766R483j82440J20831k63183
2234H39913n1019k27441j06236J64258K44400N1775J49578j2920l97815j85775
2224D68718k16441k34060K9631L48680L85260K32812j48669k24701k67089r3754
2214B80387j96926Q9203L2978J34948J88089M8704q5687J6815J29916L8055J26141
2203H02623p5004L8165J38589j55596l49391k45862l476j7512L8861r891J15475
$$ plain form
2275 3092451 2893332 2652774 2559157 2644188 2322691 2287080 2218420 2166250 2013907 1808289
2265 1808289 1500786 1893079 2195821 2301068 2195009 2025951 1770274 1411571 1068572 1123156
2255 1123156 1381936 1582987 1633883 1483537 1329665 1347665 1512956 1688532 1486549 1480675
2245 1480675 1509271 1457338 1204109 1151402 999207 1144456 1155222 1164705 982265 1103096 839913
2234 839913 788894 561453 455217 619475 863875 915650 1065228 1052308 654493 468718
2224 468718 252277 18217 47848 396528 781788 1014600 865931 641230 374141 280387
2214 280387 83461 172664 205642 340590 528679 577383 491696 508511 638427 676482 802623
2203 802623 727619 765784 904373 748777 399386 153524 150048 132536 171397 161506 276981
2192B76981R6151J87065j25624L4175O7138O7882o8514l518j48952j50277r4975
2181A37532j38580j32106j49425p7357L07891P6785J74053L21647J48710o4268
2171F04882k73809k30528j34919N8103l2696j73617j123p3625j11041K5846K71301
2160g1226M49694K29565Q9903n6054n6144p7501j92308k4044k17502l18894j68920
2149d13431l9928M4667L40819L14011l7037j03251k48005k33231J75833K99743
2139A00190J64314K5007o16l67422r8540n1964q2768K82715J31752L8215O7654
2128B08537k26427m58183L3328K36710J30993J23015K62816j26600k2167J13572
2118B75594l61686r0920K4987k71954k61321J36217J38920M85333K63356K29k53795
$$ plain form
2192 276981 373132 560197 434573 468748 535886 603768 535254 531736 382784 232507 137532
2181 137532 -1048 -133154 -282579 -359936 -52045 24740 198793 520440 669150 604882
2171 604882 331073 100545 -34374 23729 -8967 -182584 -183707 -257332 -368373 -342527 -71226
2160 -71226 378468 608033 697936 641882 585738 508237 315929 291885 74383 -244511 -413431
2149 -413431 -453359 -408692 -67873 246138 209101 105850 -142155 -375386 -199553 100190
2139 100190 264504 289511 288895 -78527 -177067 -229031 -311799 -29084 102668 140883 208537
2128 208537 -17890 -476073 -442745 -206035 -75042 47973 310789 184189 162022 275594
2118 275594 -86092 -177012 -152025 -423979 -685300 -549083 -410163 75170 338526 338755 84960
2107H4960l7561k03844l9312J55702R6435J28780p4464l19660k98162J50273N1063
2096c05790K19393P6625K34552K7104L2816k29000j5301J21130n36j77392j76296
2085a92695N8470O1523l8592j57403L03953M7569K43j88637J021J01190L36698
2074C33340l5080k33435j40228j21631k96832K5684L14911J76508J30778j74262
2064b0247j82743q7246K96529O9180J11631J74415J4054j09865j86691l05387
2054b26370K43873K41168J07950K41614K18100o0123j50876k1096l57360k28293
2044H587j24254k1907M3014K09165L95664J4342j41651n10072k59365k69995Q130
2033f48342J81175N15539J06101L7683l5347k04161j77956P2381R127Q8081J21170
$$ plain form
2107 84960 47399 -156445 -195757 -40055 56380 185160 110696 -208964 -507126 -356853 -305790
2096 -305790 -86397 -9772 224780 251884 284700 55700 40399 161529 160993 -16399 -192695
2085 -192695 -134225 -72702 -111294 -268697 35256 82825 83068 -105569 -104548 -3358 333340
2074 333340 298260 64825 -75403 -197034 -493866 -468182 -153271 23237 154015 -20247
2064 -20247 -202990 -290236 6293 75473 187104 361519 375573 265708 79017 -226370
2054 -226370 17503 258671 366621 608235 826335 766212 615336 594240 236880 8587
2044 8587 -115667 -137574 -94560 114605 510269 524611 382960 -127112 -386477 -656472 -648342
2033 -648342 -467167 48372 154473 192156 156809 -47352 -225308 -152927 -143800 -55719 65451
2022F5451j47831j10053J6966j45097n3966K48388j09182o9530K10154J98455
2012A03755J10873K13121n4316l7392o7575l73963l46184q6279J27495R5712J53501
2001a61252l8949L6300N1355p8296l4757L7687J77482P5247k0281j56009N7994
1990e3479P2922m42639n15597j02349K39061M23971L90243J74449J26228n8682
1980B54128k82728m4017J17843j05468l5070M0703k55296J46134J34912j9315
1970d8174Q0L6946j68143j64758j12335O0243L38296K15000k48028j37336j318
1959b29527k22219N2103J99696K32655N6796q2343k24139j65214J28348o3526
1949c17370J04002L9284m3499j53878j59212r0971N38314L74047J34269j99850
$$ plain form
2022 65451 -82380 -192433 -175467 -320564 -374530 -126142 -235324 -304854 -94700 103755
2012 103755 214628 427749 373433 336041 268466 -105497 -451681 -537960 -410465 -314753 -161252
2001 -161252 -200201 -163901 -112546 -190842 -225599 -187912 -10430 64817 44536 -111473 -53479
1990 -53479 19443 -423196 -938793 -1041142 -802081 -378110 12133 186582 312810 254128
1980 254128 -28600 -72617 45226 -60242 -95312 -54609 -309905 -163771 -28859 -48174
1970 -48174 -48094 -11148 -179291 -344049 -456384 -396141 -57845 157155 -90873 -228209 -229527
1959 -229527 -451746 -399643 -199947 32708 89504 7161 -216978 -382192 -253844 -317370
1949 -317370 -213368 -174084 -217583 -371461 -530673 -621644 -83330 290717 424986 225136
1939B25136j89754m75198r3875N14672J33874P0472j08517l86997m73203P1023
1929g12367K75296O25459L31683k08065l29440k47596l32194m712K49424L75530
1919B3018J40410k42095m86354k72100K23474K69935N00582K96158r486l99330
1909D4212j96136l24284j2221J21516J77980r3283l79552q4158L24983P30546
$$ plain form
1939 225136 35382 -439816 -533691 -19019 114855 185327 76810 -310187 -783390 -712367
1929 -712367 -437071 188388 520071 312006 -17434 -265030 -597224 -601936 -352512 23018
1919 23018 163428 -78667 -565021 -837121 -613647 -343712 156870 453028 443542 44212
1909 44212 -151924 -476208 -488429 -366913 -188933 -282216 -661768 -745926 -420943 309603
$$ [...]
##END NTUPLES=NMR SPECTRUM
##END=
