##TITLE=1H_DE-80H_X3
 200.13MHz, d2o
 8 sc
 
 19ns.26.2.2025
##JCAMPDX= 6.0         $$ Bruker NMR JCAMP-DX V2.0
##DATA TYPE= NMR SPECTRUM
##DATA CLASS= NTUPLES
##ORIGIN= UXNMR, Bruker Analytische Messtechnik GmbH
##OWNER= pz
$$ XWIN-NMR		Version 3.5
$$ Fri Jan 16 10:22:25 2026 Russian Standard Time (UT+4h)  Yarkov@DPX200
##.OBSERVE FREQUENCY= 200.1313
##.OBSERVE NUCLEUS= ^1H
##.ACQUISITION MODE= SIMULTANEOUS
##.ACQUISITION SCHEME= undefined
##.AVERAGES= 8
##.DIGITISER RES= 18
##SPECTROMETER/DATA SYSTEM= spect
##.PULSE SEQUENCE= zg30
##.SOLVENT NAME= DMSO
##.SHIFT REFERENCE= (INTERNAL, DMSO, 0, 15.4957)
##AUDIT TRAIL= $$ (NUMBER, WHEN, WHO, WHERE, WHAT)
$$ ##TITLE= Audit trail, XWIN-NMR		Version 3.5
$$ ##JCAMPDX= 5.01
$$ ##ORIGIN= Bruker BioSpin GmbH
$$ ##OWNER= Yarkov
$$ C:/Bruker/XWIN-NMR/data/yarkov2/nmr/H-C/1/pdata/1/auditp.txt
$$ ##AUDIT TRAIL=  $$ (NUMBER, WHEN, WHO, WHERE, WHAT)
(   1,<2026-01-16 10:21:08.67 +0400>,<Yarkov>,<DPX200>,
      <created by zg, POWCHK disabled, PULCHK disabled
       configuration hash MD5:
       00 E9 B6 7A A2 85 ED C7 34 08 36 98 17 FE 4E 26
       data hash MD5: 16K
       EF 27 B1 FE 5F DF 61 F9 D6 A9 53 28 61 DE CE A9>)
(   2,<2026-01-16 10:21:39.84 +0400>,<Yarkov>,<DPX200>,
      <Start of raw data processing
       efp BC_mod = 2 LB = 0.25 FT_mod = 6 PKNL = 1 PHC0 = -5301.897 PHC1 = 7.62193 SI = 16K 
       data hash MD5: 16K
       D3 A8 66 CC 4E 34 38 0B 9E 4C 85 7F 8C 6F 83 78>)
$$ ##END=
$$ 
$$ hash MD5
$$ E8 AD 93 CE 06 F6 DB 45 C8 B5 9A 7C DC D1 2C E6
##$RELAX= 
##$RELAX= 
##$RELAX= 
##$RELAX= 
##$RELAX= 
##$RELAX= 
$$ Bruker specific parameters
$$ --------------------------
##$DU= <C:/Bruker/XWIN-NMR>
##$EXPNO= 1
##$NAME= <H-C>
##$PROCNO= 1
##$TYPE= <nmr>
##$USER= <yarkov2>
##$AMP= (0..31)
100 100 100 100 100 100 100 100 100 100 100 100 100 100 100 100 100 100 
100 100 100 100 100 100 100 100 100 100 100 100 100 100 
##$AQSEQ= 0
##$AQ_mod= 1
##$AUNM= <au_zg>
##$AUTOPOS= <>
##$BF1= 200.13
##$BF2= 200.13
##$BF3= 200.13
##$BF4= 200.13
##$BF5= 200.13
##$BF6= 200.13
##$BF7= 200.13
##$BF8= 200.13
##$BYTORDA= 1
##$CFDGTYP= 0
##$CFRGTYP= 5
##$CHEMSTR= <none>
##$CNST= (0..31)
1 1 145 1 1 1 1 1 1 1 1 1 1 1 1 1 1 1 1 1 1 1 1 1 1 1 1 1 1 1 1 1 
##$CPDPRG= <>
##$CPDPRG1= <>
##$CPDPRG2= <>
##$CPDPRG3= <>
##$CPDPRG4= <mlev>
##$CPDPRG5= <mlev>
##$CPDPRG6= <mlev>
##$CPDPRG7= <mlev>
##$CPDPRG8= <mlev>
##$CPDPRGB= <>
##$CPDPRGT= <>
##$D= (0..31)
0 0.7 0 0 0 0 0 0 0 0 0 0.03 0 0 0 0 0 0 0 0 0 0 0 0 0 0 0 0 0 0 0 0 
##$DATE= 1768544468
##$DBL= (0..7)
120 120 120 120 120 120 120 120 
##$DBP= (0..7)
150 150 150 150 150 150 150 150 
##$DBP07= 0
##$DBPNAM0= <>
##$DBPNAM1= <>
##$DBPNAM2= <>
##$DBPNAM3= <>
##$DBPNAM4= <>
##$DBPNAM5= <>
##$DBPNAM6= <>
##$DBPNAM7= <>
##$DBPOAL= (0..7)
0.5 0.5 0.5 0.5 0.5 0.5 0.5 0.5 
##$DBPOFFS= (0..7)
0 0 0 0 0 0 0 0 
##$DE= 6
##$DECBNUC= <off>
##$DECIM= 32
##$DECNUC= <off>
##$DECSTAT= 4
##$DIGMOD= 1
##$DIGTYP= 9
##$DL= (0..7)
0 120 120 120 120 120 120 120 
##$DP= (0..7)
$$ [...]
##$SUBNAM2= <"">
##$SUBNAM3= <"">
##$SUBNAM4= <"">
##$SUBNAM5= <"">
##$SUBNAM6= <"">
##$SUBNAM7= <"">
##$SUBNAM8= <"">
##$SUBNAM9= <"">
##$SW= 18.0517328524113
##$SWIBOX= (0..15)
0 0 2 0 0 0 0 0 0 0 0 0 0 0 0 0 
##$SW_h= 3612.71676300578
##$TD= 16384
##$TD0= 1
##$TE= 0
##$TE2= 300
##$TE3= 300
##$TEG= 300
##$TL= (0..7)
0 120 120 120 120 120 120 120 
##$TP= (0..7)
150 150 150 150 150 150 150 150 
##$TP07= 0
##$TPNAME0= <>
##$TPNAME1= <>
##$TPNAME2= <>
##$TPNAME3= <>
##$TPNAME4= <>
##$TPNAME5= <>
##$TPNAME6= <>
##$TPNAME7= <>
##$TPOAL= (0..7)
0.5 0.5 0.5 0.5 0.5 0.5 0.5 0.5 
##$TPOFFS= (0..7)
0 0 0 0 0 0 0 0 
##$TUNHIN= 0
##$TUNHOUT= 0
##$TUNXOUT= 0
##$USERA1= <user>
##$USERA2= <user>
##$USERA3= <user>
##$USERA4= <user>
##$USERA5= <user>
##$V9= 5
##$VALIST= <valist>
##$VCLIST= <CCCCCCCCCCCCCCC>
##$VD= 0
##$VDLIST= <DDDDDDDDDDDDDDD>
##$VPLIST= <PPPPPPPPPPPPPPP>
##$VTLIST= <TTTTTTTTTTTTTTT>
##$WBST= 1024
##$WBSW= 4
##$XGAIN= (0..3)
0 0 0 0 
##$XL= 0
##$YL= 0
##$YMAX_a= 132742
##$YMIN_a= -107550
##$ZGOPTNS= <>
##$ZL1= 120
##$ZL2= 120
##$ZL3= 120
##$ZL4= 120
##$ABSF1= 0
##$ABSF2= 0
##$ABSG= 0
##$ABSL= 0
##$ALPHA= 0
##$AQORDER= 0
##$ASSFAC= 0
##$ASSFACI= 0
##$ASSFACX= 0
##$ASSWID= 0
##$AUNMP= <proc_1d>
##$AZFE= 0.1
##$AZFW= 0.1
##$BCFW= 0
##$BC_mod= 2
##$BYTORDP= 0
##$COROFFS= 0
##$CY= -3
##$DATMOD= 1
##$DC= 0
##$DFILT= <>
##$DTYPP= 0
##$F1P= 0
##$F2P= 0
##$FCOR= 1
##$FTSIZE= 16384
##$FT_mod= 6
##$GAMMA= 0
##$GB= 0
##$INTBC= 1
##$INTSCL= 3.241238e-09
##$ISEN= 128
##$LB= 0.25
##$LEV0= 0
##$LPBIN= 0
##$MAXI= 10000
##$MC2= 0
##$MEAN= 0
##$ME_mod= 0
##$MI= 1.114404
##$NCOEF= 0
##$NC_proc= -8
##$NLEV= 6
##$NOISF1= 3.799351
##$NOISF2= 2.8
##$NSP= 0
##$NTH_PI= 0
##$NZP= 0
##$OFFSET= 15.4957
##$PC= 1
##$PHC0= -5301.897
##$PHC1= 7.62193
##$PH_mod= 1
##$PKNL= yes
##$PPARMOD= 0
##$PSCAL= 0
##$PSIGN= 0
##$REVERSE= no
##$SF= 200.130005203812
##$SI= 16384
##$SIGF1= 3
##$SIGF2= 2
##$SINO= 0.751879
##$SIOLD= 32768
##$SREGLST= <19F.Aceton>
##$SSB= 0
##$STSI= 16384
##$STSR= 0
##$SW_p= 3612.71676300578
##$SYMM= 0
##$S_DEV= 0
##$TDeff= 16384
##$TDoff= 0
##$TI= <>
##$TILT= no
##$TM1= 0
##$TM2= 0
##$TOPLEV= 0
##$USERP1= <user>
##$USERP2= <user>
##$USERP3= <user>
##$USERP4= <user>
##$USERP5= <user>
##$WDW= 1
##$XDIM= 16384
##$YMAX_p= 439747666
##$YMIN_p= -1036525
$$ End of Bruker specific parameters
$$ ---------------------------------
##NTUPLES= NMR SPECTRUM
##VAR_NAME=  FREQUENCY,     SPECTRUM/REAL,   SPECTRUM/IMAG
##SYMBOL=    X,             R,               I
##VAR_TYPE=  INDEPENDENT,   DEPENDENT,       DEPENDENT
##VAR_FORM=  AFFN,          ASDF,            ASDF
##VAR_DIM=   16384,         16384,           16384
##UNITS=     HZ,            ARBITRARY UNITS, ARBITRARY UNITS
##FACTOR=    0.220516191357247, 1,           1
##FIRST=     3101.1544981229, 0,             0
##LAST=      -511.56226488288, 0,            0
##MIN=       -511.56226488288, -1036525,     0
##MAX=       3101.1544981229, 439747666,     0
$$ Real data points
##PAGE= N=1
##DATA TABLE= (X++(R..R)), XYDATA
$$ [...]
8385A140236j50246j9361L63579j19259O4669j16086k02252J12104n9038q2563
8375I31783L24208n8648k39947L90999k4441m89030R4861J28331K31985l84660
8365I05441J06196j12140K88949j15401N8437l8455l39533L75451P6381K04694
8355A410020k41081k2349r014M7003J22017l89468Q7384K768p1635R7255j76790
8344H56110J08497O6767N3177K2419K58953m48177J02338k40109Q8504J24517
8334I92996j46703J92259l921l04767j40466J43974J16456j71528L2612P1646
8324G82558o1330Q2315J93904j37498k41057M44931l8521n00861J68191K18832
8314I11464O9119k18470j3341J12857J30956J73215P0084k44883k73573O2346
$$ plain form
8385 1140236 989990 970629 1334208 1214949 1279618 1163532 961280 1073384 1014346 931783
8375 931783 1255991 1197343 957396 1348395 1323954 834924 929785 1058116 1290101 905441
8365 905441 1011637 899497 1188446 1073045 1131482 1093027 753494 1128945 1205326 1410020
8355 1410020 1168939 1146590 1137576 1184579 1306596 917128 1004512 1007280 935645 1032900 856110
8344 856110 964607 1031374 1084551 1106970 1365923 917746 1020084 779975 868479 992996
8334 992996 846293 1038552 1034631 729864 589398 733372 849828 678300 710912 782558
8324 782558 721228 803543 997447 859949 618892 1063823 1025302 524441 692632 911464
8314 911464 980583 762113 748772 861629 992585 1165800 1235884 991001 717428 779774
8304G79774l14707M39635j45612o5541j5920M40298q3394n21626K54540J69454
8294I36901k75806J10428K61302l26596o5248J28985Q0573k19619N4429O31435
8284A316784j73933j37097J05608m41217j03691L14342m05930P8807O2485j48669
8274D67489K03812m34770L27453N1797m0846N2259j87141J99104Q6889J42869
8264H68915n2014j88785m7416L06697j99920p6642K17517m346L10482k24425J66105
8253A076168l28339L2490K2587n8478N3175k33526J66427P0716L47008J14186
8243A262414k30175m73401L28530j10828q530J99148n50751L95253j30621K13890
8233H94929k99321m0132J33015m89209J37608M44697J65563l45559K84195l2641
$$ plain form
8304 779774 465067 904702 759090 693549 677629 1117927 1034533 512907 767447 936901
8294 936901 661095 771523 1032825 706229 640981 769966 850539 630920 685349 1316784
8284 1316784 1142851 1005754 1111362 670145 566454 880796 474866 553673 616158 467489
8274 467489 671301 236531 563984 615781 574935 627194 440053 639157 726046 868915
8264 868915 816901 628116 580700 887397 687477 610835 828352 824006 1134488 910063 1076168
8253 1076168 747829 780319 802906 744428 797603 564077 730504 801220 1148228 1262414
8243 1262414 1032239 558838 887368 776540 768010 967158 416407 811660 681039 894929
8233 894929 595608 555476 688491 199282 336890 781587 947150 601591 885786 853145
8223H53145L5300P5505R5090j87804m75750L99223j14347L08262K11435J2205
8213A212264l20485j93150L25393l03104L38149j06636n00855J38619j12134j04572
8203C73489L9840p2400J51809j28930k87340Q60296l17742K36384M8808k79484
8193F24730Q9455j249330J514602K7675l13524P11415o59258k4861M87610q40855
8183C67659K69506K92788j77081J08800j4554K95921l43673J35595J85068n26927
8173E93102l51549L69041k02133J08509N50422j46437o29786K64336M64380o25761
8163C94124M05092K6462M1539q6180k24282N78589j93237l04249n8058k9046J75597
8152G26351L93493k72266K25595J22977k39971m15199Q7002L57444m46551j97472
$$ plain form
8223 853145 888445 963950 1059040 871236 395486 794709 680362 988624 1200059 1212264
8213 1212264 891779 698629 1024022 720918 1059067 952431 451576 590195 478061 373489
8203 373489 413329 340929 492738 363808 76468 936764 619022 855406 904214 624730
8193 624730 714185 -535145 979457 1007132 693608 1405023 745765 720904 1208514 367659
8183 367659 637165 929953 752872 861672 847118 1143039 799366 934961 1120029 593102
8173 593102 241553 610594 408461 516970 1067392 920955 291169 555505 1019885 394124
8163 394124 799216 825678 867217 781037 556755 1135344 942107 637858 579800 550754 726351
8152 726351 1119844 847578 1073173 1196150 956179 540980 627982 985426 538875 341403
8142C41403L6248m00998N53651L82500n3836n8558J0180J24708k21763M5255L05055
8131A063845n04544k23852K20776Q8749k19382K1445K65976l17335M3891K40112
8121F79681j40731M07123j73405k03801L2084K22569J22792m39601j71007J55433
8111D91137K71743J21896J19414j99375J64576l26414Q3885J41877k77342J22764
8101G14161o9147M2628J41306l31834K12454J92553r3676j1354q6439l4271K42032
8090I18413l5899L00768p29954K19709K78062k68692O33977n20457K062M29242
8080A227231p10962N7370J48092l99856N13898J00183k03744J85056Q9125J84798
8070A191191j68222r6413K42662k03198J48033r2490n85203m091J78695N9951
$$ plain form
8142 341403 377651 -23347 530304 912804 858968 800410 810590 935298 713535 758790 1063845
8131 1063845 559301 335449 556225 644974 425592 447037 713013 395678 439569 679681
8121 679681 538950 946073 772668 568867 600951 823520 946312 506711 335704 491137
8111 491137 762880 884776 1004190 804815 969391 642977 726862 868739 591397 714161
8101 714161 645014 687642 828948 497114 709568 902121 808445 797091 710652 676381 918413
8090 918413 882514 1183282 453328 673037 951099 682407 1316384 795927 797989 1227231
8080 1227231 516269 573639 721731 321875 835773 935956 732212 917268 1006393 1191191
8070 1191191 1022969 926556 1169218 966020 1114053 1021563 436360 432269 610964 670915
8060F70915p1909o6774l916l0251L53014Q6301q6076m1409K42720M7468j99472
8049I00611J84704J6061k46416j68664K0707o7489Q2733K86057J82834m02384
8039G88754M6383j26559N7567M83234j36548m91644k25394M55653J30061k02538
8029G78969L77744J30613k56809J58499K1197j74766j30827K18273n6705l66022
8019G00166L0573L18171J91724p5547p4407m64643L56507L27170l27212M31399
8009A413901k18023l3578K44341k60492l09860j22815Q0510L24490j69558o3193
7999H85723M85310l22329J07974k7474m05686L91733j61811J20311N388K87155
7989A366294N945p9459k45276L12433j33127l85590O18795j41095r0906k97176
$$ plain form
8060 670915 599006 532232 528316 498065 851079 937380 851304 809895 1052615 1100083 900611
8049 900611 1085315 1101376 854960 686296 707003 639514 722247 1008304 1191138 788754
8039 788754 835137 708578 766145 1249379 1112831 621187 395793 851446 981507 778969
8029 778969 1156713 1287326 1030517 1189016 1210213 1035447 904620 1122893 1066188 700166
8019 700166 730739 1048910 1240634 1165087 1090680 626037 982544 1309714 982502 1413901
8009 1413901 1195878 1162300 1406641 1146149 836289 713474 793984 1118474 948916 885723
7999 885723 1371033 1048704 1156678 1129204 723518 1115251 953440 1073751 1079139 1366294
7989 1366294 1372239 1292780 1047504 1359937 1226810 841220 1460015 1318920 1228014 930838
7979I30838O5903L5181J98652M8049n21192O93521K36085j66541j64706K34023
7969A589813P264n50891K70374J3843k12748k980K54709k54576Q7968M51206n38087
7958A115895K45243J9787l05329k43671O29588j43334l62975K58970k05968O35739
7948A643945n8252n2040O8773m83101L12009J46665n32105J61653q2775J89546
7938A314318L04985m16664L50816o47345J26583N60251p09075M39157O529j16684
7928A212871R1943j02969j04639K96549l17927L97694j84267k23905L58541k17486
7918A206405K85299o8668k48741N04094j16754k43825J45313j84008l87288N27157
7908A418984j14194J22327K56839l93416P247o8958o5845m1753k26668J37350
$$ plain form
7979 930838 996741 1031922 1230574 1278623 757431 1450952 1687037 1520496 1355790 1589813
7969 1589813 1597077 1046186 1316560 1330403 1117655 1114675 1369384 1114808 1202776 1653982 1115895
7958 1115895 1361138 1380925 1075596 831925 1461513 1318179 955204 1214174 1008206 1643945
7948 1643945 1585693 1533653 1602426 1119325 1431334 1577999 1045894 1207547 1124772 1314318
7938 1314318 1619303 1202639 1553455 906110 1032693 1592944 883869 1323026 1329555 1212871
7928 1212871 1304814 1201845 1097206 1393755 1075828 1473522 1289255 1065350 1423891 1206405
7918 1206405 1491704 1423036 1174295 1678389 1561635 1317810 1463123 1279115 891827 1418984
7908 1418984 1304790 1427117 1683956 1290540 1297787 1228829 1162984 1121231 894563 1031913
7898A031913J40373m40474P7636j784l49284L02666n1976Q3575J44585L7704K11298
7887A186232l59554K03921K7086L1830K73027k01712j81610J95336O1010j25587
7877A109979n73463k0110M85484m95711L81654K49213j33691L68095m71665M9174
7867I48959L1383k2036K11519j41316L2395j08208l12960L07798K29243n23797
7857F52980M27171r9976q0721K25234j93044K95998k93181J28553L7487o06858
7847D93643M88541K04352m66605J98234j72501q7391R6674k75413J48150N03676
7837A131360k43169M36056l82394J17126N0148m30148M16091J06446l81083j34336
7827F86097L70601Q9857k38431K31618K5056J2041j52102K36658K5472l90147
$$ plain form
7898 1031913 1172286 731812 809448 807664 458380 761046 709070 792645 937230 974934 1186232
7887 1186232 826678 1030599 1057685 1089515 1362542 1160830 979220 1174556 1235566 1109979
7877 1109979 536516 516406 1001890 506179 887833 1137046 1003355 1371450 899785 948959
7867 948959 980342 958306 1169825 1028509 1060904 952696 639736 947534 1176777 652980
7857 652980 1080151 980175 899454 1124688 931644 1227642 934461 1063014 1100501 493643
7847 493643 982184 1186536 719931 918165 745664 658273 754947 479534 627684 1131360
7837 1131360 888191 1324247 941853 1058979 1109127 678979 1095070 1201516 820433 686097
7827 686097 1056698 1146555 908124 1139742 1164798 1176839 1024737 1261395 1286867 896720
7817H96720q2169K89356l58132J10190K73408k27462N32960m61894k57915O6899
7807G81961N08718O37689p75235k17432k85551J17537L31734o17649J00145P9466
7797F61383J99425m3848j90163o3299L09555K5625K34629l86799p2855L2657J8126
7786G24436M11617l13023P5501J35225R6021J71462R5729l85539O7209k1653J8028
7775A075013J12510l44948J93964K78990p2833j35508m9897O21807j02011l22194
7765A254893r29K0405p1977k13086J28339k84113K03512j89807O8211l64057L10070
7754H61461l0622J48668K34831l65873j99459R8607M73156o3875O2787J08903
7744A328584j94971L33857j23283K28497l53146J86522N7053J51718l84187K6835
$$ plain form
7817 896720 814551 1103907 745775 855965 1129373 901911 1434871 972977 715062 781961
7807 781961 1290679 1928368 1153133 935701 650150 767687 1099421 481772 581917 661383
7797 661383 860808 816960 626797 563498 873053 898678 1133307 746508 673653 706310 724436
7786 724436 1136053 823030 898531 1033756 1129777 1301239 1396968 1011429 1078638 1056985 1075013
7775 1075013 1187523 842575 1036539 1315529 1242696 1107188 1057291 1679098 1577087 1254893
7765 1254893 1253964 1274369 1202392 989306 1117645 833532 1037044 847237 915448 551391 861461
7754 861461 830839 979507 1214338 848465 649006 747613 1220769 1156894 1219681 1328584
7744 1328584 1133613 1467470 1344187 1572684 1219538 1406060 1463113 1614831 1230644 1257479
7734A257479J1841k89246M63204k16371M30093k68159k7018K66314j30853k42540
7724A254744J26491J14311j47859K682J26793K30426j70842m9413M24855j68691
7714A743497N00325o14371J49397n8997J33411N9506j55788L59238j57472j78708
7704A780038M83186K51792o34605K06357j0231J4756J3333K80095O5367J3173
7694B463261M47209o8858P0842R505l40803J36119j71512Q2891l28350J20391
7684B420695P83578k14897j3942k73762R9951P4830l17384l2977J32832l32355
7674B326569L56387j27743l92257M0188R5637M7444J84442K2276p4064n65950
7664A912929K91005l00693K78298M9636M1832k0448j1610j77713j0676l5047L9816
$$ plain form
7734 1257479 1269320 980074 1443278 1226907 1657000 1388841 1361823 1628137 1497284 1254744
7724 1254744 1381235 1495546 1347687 1350369 1477162 1707588 1536746 1487333 1912188 1743497
7714 1743497 2243822 1629451 1778848 1719851 1853262 1912768 1756980 2116218 1958746 1780038
7704 1780038 2263224 2515016 1880411 2086768 2076537 2091293 2104626 2384721 2450088 2463261
7694 2463261 2910470 2841612 2912454 2921959 2581156 2717275 2545763 2628654 2300304 2420695
7684 2420695 3204273 2989376 2975434 2701672 2801623 2876453 2559069 2526092 2658924 2326569
7674 2326569 2682956 2555213 2162956 2203144 2298781 2346225 2530667 2552943 2478879 1912929
7664 1912929 2203934 1903241 2181539 2231175 2273007 2252559 2240949 2063236 2052560 2017513 2057329
7653B057329k30565k40117M23508K7642L48924l83528l00865M42911R1931j04157
7643B133013k52165L7378L90871J06132K81075l42550l11089K19085K68447m10214
7633B119983M96766N6272L54172l29619m67116J83581k55243K2168K66743k30903
7623B216804N0257o2644K47798O6155P0159k35194O9703j92561M38339o26685
7613B042131R9837m2659J13340N06240l8812j0561k16194K84774J60153m95400
7603B402849J04674j60889m5172M63563j22511n25126M92735J15972k19495k00921
7593B305679j4417J69914N0426K61967j35439j69752J98476J05523k92975L87524
7583B866926r0384j15937M00942j23290o1091m30186M22004L73066m87937J90070
$$ plain form
7653 2057329 1826764 1586647 2010155 2037797 2386721 2003193 1702328 2145239 2237170 2133013
7643 2133013 1880848 1918226 2309097 2415229 2696304 2353754 2042665 2261750 2530197 2119983
7633 2119983 2616749 2673021 3027193 2697574 2230458 2414039 2158796 2180964 2447707 2216804
7623 2216804 2267061 2204417 2452215 2518370 2588529 2353335 2423038 2230477 2668816 2042131
7613 2042131 2141968 2099309 2212649 2718889 2680077 2669516 2453322 2738096 2898249 2402849
7603 2402849 2507523 2346634 2301462 2765025 2642514 2117388 2610123 2726095 2506600 2305679
7593 2305679 2291262 2461176 2511602 2773569 2638130 2468378 2666854 2772377 2479402 2866926
7583 2866926 2776542 2660605 3061547 2938257 2877166 2446980 2868984 3242050 2754113 2944183
7573B944183J06211P2012M54178j02056p48846L32438K6445L92858j07254J76618
7563C546787J5911j7985K03821N68915k94883k68247O08188k59331q2143Q43733
7553D864766k45683P6642N4037O75627k14054J09209N81170J03383j60699O26339
7543F470737l05093J76271N63560k97527m7231J214M08157j26306l99355M89043
7533F933470j52442o2990J92966K9716q0794J51867K83734J08496L68370K48375
7523H020768J24761o5731P13891k25446O1790R65866J00641O2441N60762K26245
7513A0545988M96241J00351J05561K00900J27777O65481L55658j289P87232K3668
7503A3407568r0095L20046k05158L68883O1452k5817K05661m18939K43101J80002
$$ plain form
7573 2944183 3050394 3122406 3576584 3474528 2725682 3058120 3084565 3477423 3370169 3546787
7563 3546787 3562698 3544713 3748534 4317449 4022566 3754319 4362507 4103176 4021033 4864766
7553 4864766 4619083 4695725 4749762 5425389 5211335 5320544 5901714 6005097 5844398 6470737
7543 6470737 6165644 6341915 6905475 6607948 6560717 6561931 6970088 6843782 6444427 6933470
7533 6933470 6781028 6718038 6911004 6940720 6859926 7011793 7295527 7404023 7772393 8020768
7523 8020768 8145529 8079798 8793689 8568243 8630033 9595899 9696540 9758981 10319743 10545988
7513 10545988 11042229 11142580 11248141 11449041 11576818 12242299 12597957 12596668 13383900 13407568
7503 13407568 13317473 13637519 13432361 13801244 13862696 13836879 14042540 13623601 13866702 14046704
7493A4046704k17143l2582k3451m53356P1422j70544r18233L7347m32621k131
7483A1905412j92550m88750l37102k90852k27671j19608l2735q15723P08n66548
7473H834581o4641j33474q49239j15808n55687k95700M40750o20667M6596L65789
7463G052500j75683l47255k44714l25804K22034p16056Q6895k16286l28246L41778
7453E349163k06981k02202k19394l3210l56140k9825L35103l93629j80848P2777
7443D134814j61237l40191J01141j19889n1563q9565K59028k62983l65313M13634
7433C517876j96449J07228j05501J02097l1276o64532K96377R9946m84497L21667
7423B962936N8870r0470K28079l40417j96733P2859J22306Q0820n55877O7212
$$ plain form
7493 14046704 13829561 13796979 13773528 13320172 13391594 13221050 12302817 12340164 11907543 11905412
7483 11905412 11712862 11224112 10887010 10596158 10368487 10248879 10216144 9400421 9401129 8834581
7473 8834581 8769940 8636466 7787227 7671419 7115732 6820032 7260782 6640115 6686711 7052500
7463 7052500 6876817 6529562 6284848 5959044 6181078 5465022 5551917 5335631 5007385 5349163
7453 5349163 5142182 4939980 4720586 4687376 4331236 4301411 4636514 4242885 4062037 4134814
7443 4134814 3973577 3633386 3734527 3614638 3563075 3473510 3732538 3469555 3104242 3517876
7433 3517876 3321427 3428655 3323154 3425251 3393975 2729443 3025820 3125766 2641269 2962936
7423 2962936 3021806 2931336 3159415 2818998 2622265 2695124 2817430 2898250 2342373 2409585
7413B409585N9277j76375J51016k8924k16168k73330M82164k47473J71827L37553
7403B669152q18451K24503l939j22218k539K42744J49892l4886o359O34540o29990
7392B302449n55475O38483l81685j11481J80829m61717K39340J86949n7627k04024
7382A776041Q1200o0796J49533m92223M20910l42057j30491K63118l1446P6900
7372A710689Q5743K30687P5697l62638j12202M11350j66105k68136O17684o43740
7362A579029K90368K53490k68863j41815j16451k08764j13715M40603n65351L43045
7352A491576p2145J27457m40693j41903M27657k14995J25925J83506K04557l50950
7342A339992q6823J43488l717M1619j3856K66684n89753P69849j98356j52544
$$ plain form
7413 2409585 2468862 2292487 2443503 2414579 2198411 1925081 2407245 2159772 2331599 2669152
7403 2669152 1850701 2075204 2071265 1949047 1946508 2189252 2339144 2304258 2297899 2932439 2302449
7392 2302449 1746974 2385457 2003772 1892291 2073120 1611403 1850743 2037692 1980065 1776041
7382 1776041 1857241 1796445 1945978 1453755 1874665 1532608 1402117 1665235 1633789 1710689
7372 1710689 1796432 2027119 2102816 1740178 1627976 2039326 1873221 1605085 2222769 1579029
7362 1579029 1869397 2122887 1854024 1712209 1595758 1386994 1273279 1713882 1148531 1491576
7352 1491576 1419431 1546888 1106195 964292 1391949 1176954 1302879 1486385 1690942 1339992
7342 1339992 1253169 1396657 1392940 1434559 1420703 1687387 1097634 1867483 1669127 1516583
7332A516583N328O717K64262m43249Q5479k33538k00082M0049M147k46931K71344
7321A070109J46035j15773M88067m15797L13831n43806K97455L26414m09068o0646
7311A096821l9078L40035n0445l1530j29062J82907m0281J24424m942l48726K34860
7300A334983k07933J24245l27642K53175m5717P6143L43284o17507J4220R2798
7290A040049j81671j09407K76056Q4427N6796J1845j49180K6690m7936K08711
7280A216380m93039K77367N1707M6626J16241k28459J47175l91653J64198M42531
7270A349074j82283j64972J80593k91321J26703L41833l9916m75446r2459M49424
7260A201230j87300k49312L04277l56071q9794M30557o6122n21349J10864N89395
$$ plain form
7332 1516583 1521911 1528628 1792890 1349641 1435120 1201582 1001500 1041549 1045696 798765 1070109
7321 1070109 1216144 1100371 1588438 1172641 1486472 942666 1240121 1566535 1157467 1096821
7311 1096821 1057743 1397778 1347333 1315803 1186741 1369648 1329367 1453791 1448849 1100123 1334983
7300 1334983 1127050 1251295 923653 1176828 1131111 1207254 1550538 933031 947251 1040049
7290 1040049 858378 748971 1025027 1109454 1166250 1178095 1028915 1055605 1007669 1216380
7280 1216380 723341 1000708 1052415 1099041 1215282 986823 1133998 742345 906543 1349074
7270 1349074 1166791 1001819 1182412 891091 1017794 1359627 1319711 844265 751806 1201230
7260 1201230 1013930 764618 1068895 712824 623030 1053587 987465 466116 576980 1166375
7250A166375o8862q5967R9986j38735J08342J06458n8327l49202M46346M02841
7240A629255k62127m98853j44230l28817N8843J71165L8305l44505K23129K17422
7230G59587P4387j06268K6265K35084J98484m31142K51660k8169K08464j21j89009
7219I99222j38587K81201J86607j86582j38300k91922k39892K68438M91805r9044
7209A132946o18708J42014L23207k09876K61713k25266J31641J16921k78064M7514
7199H24042l1959R7338n9115m8559J69289Q719j0528K13067K7625j84430j89250
7188H16239M05708J23639m27907J54128R9464J94208m28705n453j71055J05070
7178H65336j37241K90778j7658k68389j62962J76344J70886l91730j41402M09719
$$ plain form
7250 1166375 1097513 1011546 1111532 972797 1081139 1187597 1129270 780068 1226414 1629255
7240 1629255 1367128 868275 724045 395228 454071 625236 663541 319036 542165 759587
7230 759587 833974 727706 753971 989055 1187539 756397 1008057 979888 1188352 1188231 999222
7219 999222 860635 1141836 1328443 1141861 1003561 711639 471747 740185 1231990 1132946
7209 1132946 514238 656252 979459 769583 1031296 806030 937671 1054592 776528 824042
7199 824042 792083 889421 830306 781747 951036 959755 949227 1162294 1189919 1005489 816239
7188 816239 1221947 1345586 917679 1071807 1171271 1365479 936774 931321 760266 865336
7178 865336 728095 1018873 1001215 732826 569864 746208 917094 525364 383962 793681
7168G93681K30162J39888k81931K35709j43754J9230L63759k24051n3003j05890
7158I73800k6822J67284j99533P0215r5999R9955R8388j18843m14160N60047n6486
7147A057846j09575m83351K01296K36386j52334J9502j55054P8243M06300K25919
7137A325178l75754k93614k8199J04838J96996j83029K73146n06159M72961O14158
7127A600522m84889j33000j48436J69217M8072J69317l95830K79284O5112Q4505
7117A253874j42690l45838M26281M9313l11322L16760n38649j8868M65807j27058
7107A027610k07026J44952p4249L11353k48080K01441l03110k25025M77317n0886
7097A054297n22247K47068J41579j05288L74537k3203j52776m9636j974j32173
$$ plain form
7168 793681 1023843 1163731 881800 1117509 973755 992985 1356744 1132693 1079690 973800
7158 973800 946978 1114262 914729 984944 888945 988900 1087288 968445 554285 1114332 1057846
7147 1057846 948271 464920 666216 902602 750268 769770 614716 692959 1099259 1325178
7137 1325178 949424 655810 627611 732449 929445 746416 1019562 513403 986364 1600522
7127 1600522 1115633 982633 834197 1003414 1051486 1220803 824973 1104257 1169369 1253874
7117 1253874 1111184 765346 1191627 1240940 929618 1246378 707729 688861 1154668 1027610
7107 1027610 820584 965536 891287 1202640 954560 1156001 852891 627866 1105183 1054297
7097 1054297 532050 779118 920697 815409 1189946 1166743 1013967 964331 962357 830184
7087H30184n73629N43905L3283k64515J93481J53610m54183O04310K79368n80467
7077G65347o513m9835J67940j66259j09422L07107j16463M41218M10664l72000
7067A271784j49044n9306k86763L30829q1112k43509j30946K72150J53414k12859
7057H64638j59224M24829o9926o4910k6544l19553L09358M81245K41451m48028
7047A233336j79129N13032p03309Q6872r4218l28218M19971R8248J96956k22753
7037A020788P8542R4182q8956l25179N31968j29444k25399K96250o63302K25040
7027H14490M7712k71663K10706J07259L75091k32566J85349l5526l4491k46765
7017I19596K43391n27593r2946J28717K9291M24135L0282k18315J87503M9469
$$ plain form
7087 830184 256555 800460 833743 569228 762709 916319 462136 1066446 1345814 765347
7077 765347 758834 708999 876939 710680 601258 908365 791902 1233120 1643784 1271784
7067 1271784 1122740 1063434 776671 1107500 1026388 782879 651933 924083 1077497 864638
7057 864638 705414 1130243 1060317 995407 968863 649310 958668 1439913 1681364 1233336
7047 1233336 1054207 1567239 863930 950802 856584 528366 948337 1046585 1243541 1020788
7037 1020788 1099330 1193512 1104556 779377 1311345 1181901 956502 1252752 589450 814490
7027 814490 862202 590539 801245 908504 1283595 1051029 1236378 1200852 1166361 919596
7017 919596 1162987 635394 542448 671165 700456 1124591 1154873 936558 1124061 1173530
7007A173530K4636J04861k75025n88490K74915j76226N19920J921K47932K4694
6997A332668o56716n1560K99215k90564M69013J28687l51792K95018Q0822k25312
6987A029479L64157m53794J79080M7077j67762J29907k28577J11947m7815q5392
6977H78307n0173Q7289J6913K33722m1819j41103L23855k53226L06285l43291
6967A016759q2544K32959k57437j65657o5508R4818J68919J73613L6996J62712
6957A315630j36754j1066j22275K1406R6555N2699m37890L3820l3066J80087m23232
6946E35914L16843p0195k4217n9559J09794j71419K68748j07911L36711l561J21180
6935A252328k87203Q158K72360q7632l72900J77202K27682j36748j06367K85323
$$ plain form
7007 1173530 1198166 1303027 1028002 439512 714427 538201 1058121 1060042 1307974 1332668
6997 1332668 675952 624392 923607 633043 1102056 1230743 878951 1173969 1254791 1029479
6987 1029479 1393636 939842 1118922 1165999 998237 1128144 899567 1011514 963699 878307
6977 878307 828134 915423 932336 1166058 1124239 983136 1306991 1053765 1360050 1016759
6967 1016759 934215 1167174 909737 744080 678572 773390 942309 1115922 1152918 1315630
6957 1315630 1178876 1167810 1045535 1066941 1163496 1216195 778305 812125 779059 959146 535914
6946 535914 852757 782562 758345 698786 808580 637161 905909 797998 1134709 1131148 1252328
6935 1252328 965125 973283 1245643 1158011 785111 962313 1189995 1053247 946880 1232203
6925A232203K55477p3700k78874L92386n29853J58515K16897n77006K54876J77620
6915A228541k12984K53863J22633l88756P7772Q1253m8464o7937l75126Q1572
6905G52367K16616l17596L26682N8648q7825L67440l29735j77646J15568l3943
6895H90576J28374j68025l632N4339q4583J96545k0459k29367K06898O1907K36415
6884A268988k11112O1646j31630k85240R9101J25696q3104o9253o9676N1721J40612
6873H97749J9360j63774J30027j03839N05369j14597n0049J5424j28530J11428
6863A118568M3515N191M56978m13258M8770k70057J05689Q4261k43310j43064
6853G93283L76547k27617N6484o0701M391l074J78729j03101l2169J35853O7395
$$ plain form
6925 1232203 1487680 1413980 1135106 1527492 997639 1156154 1373051 796045 1050921 1228541
6915 1228541 1015557 1269420 1392053 1003297 1081069 1162322 1113858 1045921 670795 752367
6905 752367 968983 651387 978069 1036717 948892 1316332 986597 808951 924519 890576
6895 890576 1018950 850925 847293 901632 817049 1013594 993135 763768 970666 1032573 1268988
6884 1268988 1057876 1119522 987892 702652 801753 927449 844345 775092 705416 757137 897749
6873 897749 917109 753335 883362 779523 1284892 1170295 1120246 1135670 1007140 1118568
6863 1118568 1162083 1167274 1624252 1210994 1259764 989707 1095396 1179657 936347 793283
6853 793283 1169830 942213 998697 937996 942387 939313 1118042 1014941 982772 1118625 1186020
6842A186020J44306n96521K39794j55304K72143K94310j25867j02808J02244l55902
6832I02415m1898q2730J21519J35235k29576L00645l03116l39194L93510q6756
6822G70054K81252l6760j32908L20118K99584q677k14008N927j92755K37779l42930
6811I86676k2387K90755m45804K58572Q630k56200N1784L90770J86035j97992
6801A250839K10612k21105j19994J03238m604l07397L60973J59145l71873k6980
6791A032854j65521K33568l27683K75588l72845K12462K81347Q1299K09049j82780
6781A277338j3838K8889j73032m0195N5254K52190L08465j24109n09285K40229
6771A301906k97997K12318k44501K5030J08689m9565M7749M2998P9161k74681
$$ plain form
6842 1186020 1330326 733805 973599 818295 1090438 1384748 1258881 1156073 1258317 902415
6832 902415 860517 777787 899306 1034541 804965 1105610 802494 463300 856810 770054
6822 770054 1051306 1014546 881638 1201756 1501340 1492663 1278655 1284582 1091827 1329606 986676
6811 986676 964289 1255044 809240 1067812 1076442 820242 872026 1262796 1448831 1250839
6801 1250839 1461451 1240346 1120352 1223590 1218986 911589 1272562 1431707 1059834 1032854
6791 1032854 867333 1100901 773218 1048806 675961 888423 1169770 1251069 1460118 1277338
6781 1277338 1263500 1292389 1119357 1079162 1134416 1386606 1695071 1570962 1061677 1301906
6771 1301906 1003909 1216227 971726 996756 1105445 1055880 1103629 1146627 1225788 951107
6761I51107O7405j71193L2285N04740n91182r9977O74843o7093k31213L3245J53723
6750A256690K55861R443q5151O7250k67566N13550n23579J53345J81346l54875
6740A206314R1966J86959k79625j63660P062J41487O8794l38474P3785J81262
6730A175870O3400J8736j99182J53210J86901K43864k01587m27615K15830J39786
6720A369213P7195L53746p6434m70305o2109K57188l11263N2609L07820J27392
6710A625052j50445K00446n25960k04477K79515r3412K84975k88339p4810J49830
6700A202375J54928P9461m81553K75120P3535Q8915k45953J64029J04889j47927
6690A267819J02949J5553m28550M1017K19339m9130J28557K636q5960J84396k26259
$$ plain form
6761 951107 1018512 847319 879604 1384344 793162 693185 1368028 1300935 1069722 1102967 1256690
6750 1256690 1512551 1521994 1436843 1504093 1236527 1750077 1226498 1379843 1561189 1206314
6740 1206314 1298280 1485239 1205614 1041954 1049016 1190503 1259297 920823 994608 1175870
6730 1175870 1239270 1258006 1058824 1212034 1398935 1642799 1441212 1013597 1229427 1369213
6720 1369213 1446408 1800154 1723720 1253415 1191306 1448494 1137231 1189840 1497660 1625052
6710 1625052 1474607 1675053 1149093 944616 1224131 1130719 1415694 1127355 1052545 1202375
6700 1202375 1357303 1436764 955211 1230331 1303866 1392781 1146828 1310857 1415746 1267819
6690 1267819 1370768 1386321 957771 998788 1218127 1168997 1297554 1300190 1214230 1398626 1172367
6679A172367J9499q9712L58426K94576k88716j60788K78454k71100m930K68481
6669A576557k73912O2873J46873M74433n06589l27182K79959k2801n0781K55684
6659A615114k73927k51288N79340j06569o15386L95004k1077N23677k11450j25584
6649A507854j70507J61986j4048J61557n03904J04392J27339j3763K11569r0398
6639A482077l34651J14456K95924J42043l86763J05881K70532j42268j50198L6477
6629A433510l60071J90481O27786k37492k10701l08211L67130J58545j26693j54880
6619A379404K21422K89769J25746k41559k63075J51986m59896o9611L11377j87794
6609A257769J29547K25844r118l01506k2062L35884K77689k00725k90825j40342
$$ plain form
6679 1172367 1191866 1102154 1460580 1755156 1466440 1305652 1584106 1313006 1308076 1576557
6669 1576557 1302645 1365518 1512391 1986824 1480235 1153053 1433012 1410211 1359430 1615114
6659 1615114 1341187 1089899 1669239 1562670 947284 1342288 1321211 1844888 1633438 1507854
6649 1507854 1337347 1499333 1485285 1646842 1142938 1247330 1374669 1360906 1572475 1482077
6639 1482077 1147426 1261882 1557806 1699849 1313086 1418967 1689499 1547231 1397033 1433510
6629 1433510 1073439 1263920 1891706 1654214 1443513 1135302 1502432 1660977 1534284 1379404
6619 1379404 1600826 1890595 2016341 1774782 1511707 1663693 1203797 1134186 1445563 1257769
6609 1257769 1387316 1613160 1604042 1302536 1280474 1616358 1894047 1693322 1402497 1262155
6599A262155M954O93343k25149j88024K59577K392K7444J93142j42580l71088
6589A516166M13876K03720k14216l77918Q8132L03715J72240k67162k38207k1971
6579A578375j11584P7899P3474k27318M26023K1801l4541j13055j73227M9050
6569A566897N56011l54020k59835K2255L00128J1715J3661j97620k46575R3915
6559A506532N03328j62526l54075N43071k9903p7440L94066n00636n42586K21533
6549A501364N64934r7790l30844K9019q8780M53574K21330l74111k49679L95126
6539B024143J43200n7542m84879k672L84163L2205K56456k57090k24332M48809
6529B262461J31265k55940j14346K6173L37363l4247q7322k11735n0808M06666
$$ plain form
6599 1262155 1267109 1960452 1735303 1547279 1806856 1809248 1836692 2029834 1887254 1516166
6589 1516166 1930042 2133762 1919546 1541628 1629760 1933475 2105715 1838553 1600346 1578375
6579 1578375 1466791 1544690 1618164 1390846 1816869 1838670 1804129 1691074 1517847 1566897
6569 1566897 2122908 1768888 1509053 1531308 1831436 1843151 1856812 1659192 1412617 1506532
6559 1506532 2009860 1847334 1493259 2036330 2006427 1928987 2323053 1822417 1279831 1501364
6549 1501364 2066298 1968508 1637664 1666683 1577903 2031477 2252807 1878696 1629017 2024143
6539 2024143 2167343 2109801 1624922 1622250 2006413 2038618 2295074 2037984 1813652 2262461
6529 2262461 2393726 2137786 2023440 2049613 2386976 2352729 2265407 2053672 2002864 2409530
6519B409530r2401m24451O7731M10617P1916k95492L23098l76815J2544N88258
6509B694535r8502l46037K26356N50115o0665K73476k33891l39043K51667J82880
6499C100891M8327j9721j73283J81388J6671j06573J08728k37557j4881O13391
6489C517381n51224L39916N0404m14316N71837k54998o0537J37669o7094M64272
6479C733310l3896r4333M11285k56686k70811O00243p01245J30221m7968J37222
6469C607342j09302K276M80000l33299M0901J68663o74351L8210M41867k01355
6459C460952j77214P7428r5299K89254K7364k1533m75042L22661L88577k97540
6449C499608P7325l70827K6645o1298K66668j10421k00893O39246k23818j18840
$$ plain form
6519 2409530 2317129 1892678 1960409 2371026 2442942 2147450 2470548 2093733 2106277 2694535
6509 2694535 2596033 2249996 2476352 3026467 2965802 3239278 3005387 2666344 2918011 3100891
6499 3100891 3149218 3129497 2956214 3137602 3154273 3047700 3156428 2918871 2903990 3517381
6489 3517381 2966157 3306073 3356477 2942161 3513998 3259000 3198463 3336132 3269038 3733310
6479 3733310 3699414 3605081 4016366 3759680 3488869 4089112 3387867 3518088 3470120 3607342
6469 3607342 3498040 3500316 3980316 3647017 3687918 3856581 3182230 3220440 3662307 3460952
6459 3460952 3283738 3361166 3265867 3555121 3582485 3560952 3085910 3408571 3797148 3499608
6449 3499608 3576933 3206106 3232751 3171453 3438121 3327700 3126807 3766053 3542235 3423395
6439C423395k09997J27790J42996M5858J68815m11696N6762J26639M9018m40381
6429C079199L30210j97197J07499Q6240l79990l0068J36450M98781k61597o02631
6419B766896K07033J31156M207K07411R0854k36451J05995J73965N1789l47120
6409C155735K38917M9415j37441M55390l5318k81805L68075j81209j55093m18640
6399C058026L58938p1102j66199r0322J39378l56676K65363r9426j95416O9078
6389B911642J433K66334k30677K21479n4921n99543K30440K58399m66378k9577
6379B508631L04861J2675n6412m7537l7916K91593P9131l0050n40160K23767k00194
6368B508389j86041N2872k4153J91731j61332L68877l54076L1557Q2088P6492
$$ plain form
6439 3423395 3213398 3341188 3484184 3530042 3698857 3287161 3343923 3470562 3519580 3079199
6429 3079199 3409409 3212212 3319711 3405951 3025961 2995893 3132343 3631124 3369527 2766896
6419 2766896 2973929 3105085 3109292 3316703 3407557 3171106 3277101 3451066 3502855 3155735
6409 3155735 3394652 3444067 3306626 3762016 3726698 3444893 3812968 3631759 3476666 3058026
6399 3058026 3416964 3345862 3179663 3089341 3228719 2872043 3137406 3037980 2842564 2911642
6389 2911642 2913075 3179409 2948732 3170211 3115290 2515747 2746187 3004586 2538208 2508631
6379 2508631 2813492 2826167 2769755 2722218 2684302 2975895 3055026 3024976 2484816 2708583 2508389
6368 2508389 2322348 2375220 2351067 2542798 2381466 2750343 2396267 2427824 2509912 2586404
6358B586404m0891j01816L08493j61738L05766m74048K88078j88539J7301l5977
6348B503033k81470R4105m1291M46492r6815L0176J75335j27419k9178j62996
6338B509972J91078j61881j9382j36215j18336k4276L10371k98621M00416J2626
6328B665752m81557L08385J53946L22685j95392m14499J07340o4507K30452P5645
6318B708250n4917q6789K10851r0328R1166l25310J44417L89858n27129K49247
6308B709316p9316o8404M3950K86616k64973p956M07363k05628K94883m8433l23902
6297B743516k45518J84945k73600O4531k4000q521M09736k41915M23869k90740
6287B742303Q2766L79956k38918j73499R4607j18426j40J25578n0952k2801k09491
$$ plain form
6358 2586404 2545513 2443697 2752190 2590452 2896218 2422170 2710248 2521709 2539010 2503033
6348 2503033 2221563 2315668 2274377 2720869 2624054 2654230 2829565 2702146 2672968 2509972
6338 2509972 2701050 2539169 2519787 2383572 2265236 2240960 2551331 2252710 2653126 2665752
6328 2665752 2184195 2492580 2646526 2969211 2773819 2359320 2466660 2402153 2632605 2708250
6318 2708250 2653333 2566544 2777395 2687067 2778233 2452923 2597340 2987198 2460069 2709316
6308 2709316 2630000 2561596 2605546 2892162 2627189 2619233 3026596 2820968 3115851 3067418 2743516
6297 2743516 2497998 2682943 2409343 2473874 2449874 2441353 2851089 2609174 3033043 2742303
6287 2742303 2825069 3205025 2966107 2792608 2887215 2768789 2768649 2894227 2843275 2820474 2610983
6276B610983K32276J19174k50442M14588L5887j71201J202J20978l20586J19211
6266B912070M81391m37786l83018L40493J5706l384K6260J94742j19655m5652
6256B981167K69145l97431j99697N17404l80790K34215K31597l89083J65539r3949
6246B938117J50384J84813m62494K59008j64166l73222J80018J83636j7428Q2370
6236B961036L4L42543k24526j07489J03612j41038J11316K1534O1094Q5071m7134
6225C166053P6021j72140m909n0782k21705J69734j92322L07317R263p8583K30293
6214C238240R5516n67776J29965M360P0792P4605k09365L28383l36576M11668
6204C239812K7025k92802K58985J22468j61381J83456J92106n40210M62280l76422
$$ plain form
6276 2610983 2843259 2962433 2711991 3126579 3162466 2991265 2992467 3113445 2792859 2912070
6266 2912070 3393461 2955675 2572657 2913150 2928856 2925472 2951732 3146474 3026819 2981167
6256 2981167 3250312 2852881 2653184 3170588 2789798 3024013 3255610 2866527 3032066 2938117
6246 2938117 3088501 3273314 2810820 3069828 2905662 2532440 2712458 2896094 2878666 2961036
6236 2961036 2961070 3303613 3079087 2971598 3075210 2934172 3045488 3067022 3128116 3213187 3166053
6225 3166053 3242074 3069934 3065025 3014243 2792538 2962272 2769950 3077267 3086530 3007947 3238240
6214 3238240 3333756 2765980 2895945 2900305 2971097 3045702 2836337 3164720 2828144 3239812
6204 3239812 3266837 2974035 3233020 3355488 3194107 3377563 3569669 3029459 3491739 3115317
6194C115317L13834J80323p8597L35929l48906K17453J64827j97861k12212M5397
6184C535504R1701O18K83107m57314N09577j24762k09192m1018j83155L52917
6174C757983J19783J8185J26925p0712k46802K39714j83586q593M21503j49445
6164D024955p4816k1937J19674j27685M5451J71642j401m49407M23240L19383
6154D429099l42377o245O8679k47870L70837K02553j98238J39842o97q4451j87795
6143D143337J38931K98008K52584q5534P2035k46236q5370K82397k8780k03601
6133D537771j24714k61157N03281K63615k15147j5756j7180K5975L39336m63885
6123D572139K93542k77183j83357M79926j44244j20308o8994j92804M53151J27600
$$ plain form
6194 3115317 3429151 3609474 3530877 3866806 3517900 3735353 3900180 3702319 3490107 3535504
6184 3535504 3627205 3627823 3910930 3453616 3963193 3838431 3629239 3588221 3405066 3757983
6174 3757983 3877766 3895951 4022876 3952164 3705362 3945076 3761490 3752897 4174400 4024955
6164 4024955 3950139 3928202 4047876 3920191 3965642 4137284 4135883 3686476 4109716 4429099
6154 4429099 4086722 4080477 4149156 3901286 4272123 4474676 4276438 4416280 4415583 4331132 4143337
6143 4143337 4282268 4580276 4832860 4747326 4819361 4573125 4487755 4770152 4741372 4537771
6133 4537771 4413057 4151900 4655181 4918796 4703649 4687893 4670713 4696688 5036024 4572139
6123 4572139 4865681 4588498 4405141 4885067 4740823 4620515 4551521 4358717 4811868 4939468
6113D939468j01743N99M0708M4459j16957l80341M63387q1003o2472L99599j48813
6102D996891Q89M67029K04565m26953L2649J27654K20488K9533k25181j4767j27107
6091E285690j18284L47099j11769q9139P2789J11207M2292l77159J54997n8415
6081E259308M41908J36809j63063P4354Q6459J30818J77169k34337J12943J43907
6071F166275J02228L25249l52575R3148L46993j34772L83988m6311l14320K3069
6061F592972J22718N14838j88640K25126M44419l9211j77933J520j22866N03038
6051G875981k8639J7118L48483J09076L54549J87867j52188M53698L42502J54734
6041I663181q289L98508K68486J83579O4199Q87615k73746O83012Q31993k41423
$$ plain form
6113 4939468 4837725 4838324 4879032 4923491 4806534 4426193 4889580 4808577 4746105 5145704 4996891
6102 4996891 4997780 5464809 5669374 5242421 5275070 5402724 5623212 5652745 5427564 5412797 5285690
6091 5285690 5167406 5514505 5402736 5313597 5386386 5497593 5539885 5162726 5317723 5259308
6081 5259308 5701216 5838025 5674962 5749316 5835775 5966593 6143762 5909425 6022368 6166275
6071 6166275 6268503 6593752 6241177 6334325 6681318 6546546 6930534 6884223 6569903 6592972
6061 6592972 6715690 7230528 7041888 7267014 7711433 7672222 7494289 7495809 7372943 7875981
6051 7875981 7847342 7864460 8212943 8322019 8676568 8864435 8712247 9165945 9508447 9663181
6041 9663181 9654892 10053400 10321886 10505465 10569664 11457279 11183533 11866545 12698538 12457115
6031A2457115N07837J37850K84289K89323K71099J04214K74602K54581P0424M7855
6021A4699189j04740M23139k52633K75169p0695K4669J46315K20073O02156J85392
6011A6148034K76381J01950O34809J28045p0767J34475J10850K16452O91328K83132
6001A8654689p3752J89618J0652k5657K9113L33084j85259L09734L88018k55953
5991A9374287J87826k41585N08435L41071m301J63205K18725J22456K97711j73154
5981B0794676j01552M03491m113L44844k35726m46212K84081p74107j7467o64152
5971A9583763r80118Q9219n20244j38785j1558p58630L08996L0049j34705l4252
5961A7433735j07983J10890J56861r5115L87023l13600j19914K8786l3556k56746
$$ plain form
6031 12457115 12964952 13102802 13387091 13676414 13947513 14051727 14326329 14580910 14651334 14699189
6021 14699189 14594449 15017588 14764955 15040124 14969429 14994098 15140413 15360486 15962642 16148034
6011 16148034 16424415 16526365 17161174 17289219 17218452 17352927 17463777 17680229 18371557 18654689
6001 18654689 18580937 18770555 18781207 18755550 18784663 19117747 18932488 19242222 19630240 19374287
5991 19374287 19562113 19320528 19828963 20170034 20165733 20328938 20547663 20670119 20967830 20794676
5981 20794676 20693124 21096615 21092502 21437346 21201620 20755408 21039489 20265382 20247915 19583763
5971 19583763 18603645 18692864 18172620 18033835 18022277 17263647 17572643 17602692 17467987 17433735
5961 17433735 17325752 17436642 17593503 17498388 17885411 17571811 17451897 17480683 17447127 17190381
5951A7190381l18807J6760M09646j00263k08135j18836O3742k15197j99932j005179
5941A5514180l18620R9648q96363j21590p45888k84857p12326k53976l56365m99279
5931A1424564l61093Q3727n15745l47156K99797k04086J88202J37982k05101J17706
5921A0618797j57279O35121m05428k46832J92348O0684K40972L7230k19199o9979
5911A0686435k5796j67695J59723m96909j19783J00351j70933k0279j43610k02926
5901I598578k0784l58294j24954K08770m66163J08489L07796k90839R2153j54357
5891H900395l1761J6469M5727J86000m5848K56805K01509n5087k7824J28300l08363
5880I266322Q8830m65378J21015Q3966k10831R6445r1669m4464M26321R6329J07679
$$ plain form
5951 17190381 16871574 16888334 17297980 17197717 16989582 16870746 16934488 16719291 16519359 15514180
5941 15514180 15195560 15295208 14398845 14277255 13531367 13246510 12534184 12280208 11923843 11424564
5931 11424564 11063471 11147198 10631453 10284297 10584094 10380008 10568210 10706192 10501091 10618797
5921 10618797 10461518 11096639 10691211 10444379 10636727 10697411 10938383 10975613 10756414 10686435
5911 10686435 10660639 10492944 10652667 10155758 10035975 10136326 9965393 9945114 9801504 9598578
5901 9598578 9577794 9219500 9094546 9303316 8837153 8945642 9253438 8962599 9054752 8900395
5891 8900395 8868634 8885103 8930830 9116830 9070982 9327787 9529296 9474209 9446385 9574685 9266322
5880 9266322 9355152 8889774 9010789 9094755 8883924 8980369 8888700 8844236 9270557 9366886 9474565
5869I474565K75100j36340l97798K3331P9140j86572l68942Q59408j63303m81915
5859H976674M88499r6511J45062J12547K06346j04519j50994N5665M24154k85645
5849I771278L72888j47310p5145m7086J77416j23734J98226J1498N16336m31045
5839A0223322k40729M95842j69208r8674J48087k8791k68146j12702M42317K26027
5829A0617345O6695K88562j6966O3047J37521l87825M0043M08529J8621q468k46674
5818A0980430R0415K42547K04485j10369L60817k59747K81389K45018j17710J26433
5808A2043708j37310j18415K73213j73624k39163K33662J87001K88943m83l39079
5798A2018453K96226L19622k38110l15521L13731M56428k32564m2862J05320K76435
$$ plain form
5869 9474565 9749665 9613325 9215527 9238858 9317998 9131426 8762484 9621892 9458589 8976674
5859 8976674 9465173 9368662 9513724 9626271 9832617 9728098 9577104 9632769 10056923 9771278
5849 9771278 10144166 9996856 9921711 9874625 10052041 9928307 10126533 10138031 10654367 10223322
5839 10223322 9982593 10478435 10309227 10210553 10358640 10329849 10061703 9949001 10391318 10617345
5829 10617345 10684040 10972602 10955636 11018683 11156204 10768379 10808422 11216951 11235572 11227104 10980430
5818 10980430 11070845 11313392 11517877 11407508 11768325 11508578 11789967 12034985 11917275 12043708
5808 12043708 11906398 11787983 12061196 11887572 11648409 11882071 12069072 12358015 12357532 12018453
5798 12018453 12314679 12634301 12396191 12080670 12394401 12850829 12618265 12575403 12680723 12957158
5788A2957158r6047L27969k25149M1467J72244J07210K39568l9085p4952J51154
5778A3561537L74643k45500K78765n4355m5274M09053j90938l19056K10118L67860
5768A4346853R3345R5696k8992J63429L3419M2677N24849o00310O4101L81472
5758A5116539L75277k22357M02220l13071K02427K77875k71535L36089j47933
5749A5755531L18720K14775j37931J32582K38238q114J34953j90296q4894J65716
5739A6539280L69159N45828k79192J6890K41472K40892L26296L0425K69358N4341
5729A8354749J79348J50430K22188q7065J27139L71323n2256J12576L6382j47052
5719A9267762O72814J28443l60564J63983N27744J92272J89947J07817K19271
$$ plain form
5788 12957158 12861111 13189080 12963931 13005398 13177642 13284852 13524420 13485335 13410383 13561537
5778 13561537 13936180 13690680 13969445 13915090 13869816 14278869 14087931 13768875 13978993 14346853
5768 14346853 14440198 14535894 14506902 14670331 14703750 14746427 15271276 14670966 14735067 15116539
5758 15116539 15491816 15269459 15671679 15358608 15561035 15838910 15567375 15903464 15755531
5749 15755531 16074251 16289026 16151095 16283677 16521915 16513801 16648754 16458458 16373564 16539280
5739 16539280 16908439 17454267 17175075 17191965 17433437 17674329 18000625 18031050 18300408 18354749
5729 18354749 18534097 18684527 18906715 18819650 18946789 19318112 19265856 19378432 19414814 19267762
5719 19267762 19940576 20069019 19708455 19872438 20400182 20592454 20782401 20890218 21109489
5710B1109489J40685k68487P46582M5656L0204K24547m5069K72622Q2136J73614
5700B2511979L07468K18323L8191K49011J0093j1830O75341J08392J39439M21320
5690B4667727p4889K32291j59411M22591L38506K85695J62076M12579m69561L82957
5680B6200561J37552M58158N99219P203L41024K42415L52150N5255O7672N38115
5670B8999324K02607J34424J25635M37650K46829K20618L49263M72387J11494
5661C1300231M00374Q16085j70764K12140J36435L34140L86998N78435N6239K95829
5651C4346142J68312N48476L12592N42390N04663K18792M66226N48206M76657
5642C8132456K74759J88779Q06709n5836Q55556K60077L40186O78386K73258M49935
$$ plain form
5710 21109489 21250174 20981687 21728269 21773925 21804129 22028676 21983607 22256229 22338365 22511979
5700 22511979 22819447 23037770 23075961 23324972 23335065 23323235 23998576 24106968 24246407 24667727
5690 24667727 24592838 24825129 24665718 25088309 25426815 25712510 25874586 26287165 25817604 26200561
5680 26200561 26338113 26796271 27395490 27402693 27743717 27986132 28338282 28393537 28461209 28999324
5670 28999324 29201931 29336355 29461990 29899640 30146469 30367087 30716350 31188737 31300231
5661 31300231 31700605 32516690 32345926 32558066 32694501 33028641 33415639 33994074 34050313 34346142
5651 34346142 34514454 35062930 35375522 35917912 36422575 36641367 37107593 37655799 38132456
5642 38132456 38407215 38595994 39402703 39346867 40202423 40462500 40802686 41481072 41754330 42204265
5632D2204265N28168P52885J81596N23964L77544L90408O34155R33085L04960
5623D6831030L14099M56306O76645Q90402N62237L55948M25072M77077J019234
5614E2008050L78322O93991Q14119P19169O94847O64115Q28955J241446P86885
5605E8829899L21760P57936M57545J368187R22210Q51807N90471O79092R86274
5596F5765181J371421J030165P90177R93598J151919J570439Q62488N34680J283113
5587G5353181J267570J077142O83641J653894J528168R10775J250339J528985
5579H5253695J003883J529344J979745J348183J466519J239578J680590J568450
5571I7069987J811648J470884J547105J932992K448958J448017J378082K466879
$$ plain form
5632 42204265 42732433 43485318 43666914 44190878 44568422 44958830 45592985 46526070 46831030
5623 46831030 47145129 47601435 48278080 49168482 49730719 50086667 50511739 50988816 52008050
5614 52008050 52386372 53080363 53894482 54613651 55308498 55972613 56801568 58043014 58829899
5605 58829899 59151659 59909595 60367140 61735327 62657537 63509344 64099815 64778907 65765181
5596 65765181 67136602 68166767 68956944 69950542 71102461 72672900 73535388 74070068 75353181
5587 75353181 76620751 77697893 78381534 80035428 81563596 82474371 83724710 85253695
5579 85253695 86257578 87786922 89766667 91114850 92581369 93820947 95501537 97069987
5571 97069987 98881635 100352519 101899624 103832616 106281574 107729591 109107673 111574552
5563A11574552K097327J807588K439506J985488K170244K049820K587837K600821
5555A29313183K206508K626684K703544K619019K915480K935355K558656L228636
5547A51107065L660210K744515K905099L962701L755174L373882L457835L649567
5539A78616048L646572L779435M386224L897989M164879M676313M269766M716269
5531B12153495M835530M795402M705988N190604N269117N389817N313389N832423
5523B53485765N799579N732451N863428O299081O423380O479536O657498N827308
5515C02568026O147288P144269O929155O639516O890779O445168O566343O844041
5507C56174585O671830N990303O522353O412082O112938N755534O090482N358048
$$ plain form
5563 111574552 113671879 115479467 117918973 119904461 122074705 124124525 126712362 129313183
5555 129313183 131519691 134146375 136849919 139468938 142384418 145319773 147878429 151107065
5547 151107065 154767275 157511790 160416889 164379590 168134764 171508646 174966481 178616048
5539 178616048 182262620 186042055 190428279 194326268 198491147 203167460 207437226 212153495
5531 212153495 216989025 221784427 226490415 231681019 236950136 242339953 247653342 253485765
5523 253485765 259285344 265017795 270881223 277180304 283603684 290083220 296740718 302568026
5515 302568026 308715314 315859583 322788738 329428254 336319033 342764201 349330544 356174585
5507 356174585 362846415 368836718 375359071 381771153 387884091 393639625 399730107 405088155
5499D05088155N212521N037796M217555L763890L766322L382499K509328K494762
5491D35472828K101635N42970Q50816P79417p24191j363130j588967j852876k451039
5482D31767463k937266l643142l952011m652158m339523n595355n396126n523726
5474C95728156n738274o788193o104279o271822p426080o872951o978233p394939
5466C42153385p127388o854004o600497p127880p075723o455700o894826o683946
5458B87333421o126428o652994o825923n845221o055744n987125n906235n525071
5450B38408680n488474n547848n116824n527324n369395m605915m571343n322775
5442A96858782m453045m417766m443891l833918m279200l613363m104178l550330
$$ plain form
5499 405088155 410300676 415338472 419556027 423319917 427086239 430468738 432978066 435472828
5491 435472828 437574463 438117433 438968249 439747666 439023475 437660345 436071378 434218502 431767463
5482 431767463 428830197 425187055 421235044 416582886 412243363 406648008 401251882 395728156
5474 395728156 389989882 383201689 377097410 370825588 363399508 356526557 349548324 342153385
5466 342153385 335025997 328171993 321571496 314443616 307367893 300912193 294017367 287333421
5458 287333421 281206993 274553999 267728076 261882855 255827111 249839986 243933751 238408680
5450 238408680 232920206 227372358 222255534 216728210 211358815 206752900 202181557 196858782
5442 196858782 192405737 187987971 183544080 179710162 175430962 171817599 167713421 164163091
5434A64163091l111120m042034l342299k951255l268446l303235l053090k894303
5426A38197309l008564k892409k309762k972997k822565k209632k805724k230146
5418A16945510k085671k460537k176703j915869j914279k412241k031518j535398
5410A00413294k147691j858400j691717k191739j731977j219930j985094j836174
5402H5750572j514456j332529j317939j412712j559307j251234j561103j355894
5394G4445398j026949j274604j413631j212494j436195p89091j225291r91326
5386F5075817j113604r12819p98964j257700j106803m49616j207616r21515k40513
5377E7066667j610807o39454n50448j036337q58491r76276n94287j049390o37575
$$ plain form
5434 164163091 161051971 157009937 153667638 150716383 147447937 144144702 141091612 138197309
5426 138197309 135188745 132296336 129986574 127013577 124191012 121981380 119175656 116945510
5418 116945510 114859839 112399302 110222599 108306730 106392451 103980210 101948692 100413294
5410 100413294 98265603 96407203 94715486 92523747 90791770 89571840 87586746 85750572
5402 85750572 84236116 82903587 81585648 80172936 78613629 77362395 75801292 74445398
5394 74445398 73418449 72143845 70730214 69517720 68081525 67292434 66067143 65075817
5386 65075817 63962213 63049394 62250430 60992730 59885927 59436311 58228695 57307180 57066667
5377 57066667 55455860 54816406 54265958 53229621 52371130 51394854 50800567 49751177 49113602
5368D9113602k60659r95175r01240m34804p03684q32230m21768q67803n79211
5359D3117028j157659j69406n53724n87538j73778m78429j035518n01879j26455
5350C8332642j035357k83548k14858o34353o21443m43133k15001r30847j33199
5341C3820903m62839n99869n75360Q8034o21926l48288k48540q13197l50942n85226
5331B9302750q9538l83254l08153l72788j9892m80522m85636j90777p44423q233
5321B6219534k25716l39361o29175j18339J23002p61796m04816l5484j47516m65724
5311B3214609o7046l83307n66998j79297k35632n53880p5247K9005q34535J29712
5301B0477384j25657p62802j2315l852P9567o80463k01158J052k5530j79430n3819
$$ plain form
5368 49113602 48852943 47857768 46956528 46521724 45818040 44985810 44564042 43696239 43117028
5359 43117028 41959369 41789963 41236239 40648701 40474923 39996494 38960976 38459097 38332642
5350 38332642 37297285 37013737 36798879 36164526 35543083 35099950 34884949 33954102 33820903
5341 33820903 33358064 32758195 32182835 32270869 31648943 31300655 31052115 30238918 29887976 29302750
5331 29302750 29213212 28829958 28521805 28149017 28129125 27648603 27162967 26972190 26227767 26219534
5321 26219534 25993818 25654457 25025282 24906943 25029945 24268149 23863333 23827849 23680333 23214609
5311 23214609 23147563 22764256 22197258 22017961 21782329 21228449 21153202 21182207 20347672 20477384
5301 20477384 20351727 19588925 19576610 19572758 19652325 18971862 18770704 18771756 18746226 18566796 18512977
5290A8512977l57637j31748m82973J42409k84569k91288n6918n92838q4777K60004
5280A6632642k91968n36583j63057j00358l83153L57245l24674l53271L1857m28852
5270A4439828K57524k96567q2261L884m49773R6178j96371k08602J70293p91282
5260A2942851k38755M70960n25317r0214l6744k30263j00380m88903L59534J74527
5250A2237296l29824k4310R7178o35309k8915j12992l64511J32163j10803J16365
5240A0976338m47836J51108L21198p31926K08604K99670J63355k06107K21036
5231A0955440j65040n43173j52788L9569l8079j38518L8120p03617J1173L59610
5221I662697k68553R1040k02732k97064q8781j60613J21018q6739j65743q0839
$$ plain form
5290 18512977 18155340 18023592 17540619 17683028 17398459 17107171 17050253 16457415 16372638 16632642
5280 16632642 16340674 15804091 15641034 15540676 15157523 15514768 15190094 14836823 14868680 14439828
5270 14439828 14697352 14400785 14318524 14322408 13872635 13968813 13772442 13563840 13734133 12942851
5260 12942851 12704096 13175056 12649739 12559525 12522781 12292518 12192138 11703235 12062769 12237296
5250 12237296 11907472 11883162 11980340 11345031 11316116 11203124 10838613 10970776 10859973 10976338
5240 10976338 10528502 10679610 11000808 10268882 10477486 10777156 10940511 10734404 10955440
5231 10955440 10790400 10247227 10094439 10134008 10095929 9957411 9995531 9291914 9303087 9662697
5221 9662697 9394144 9485184 9282452 8985388 8896607 8735994 8857012 8770273 8604530 8523691
5211H523691k01401J89798K97326J7948J49169l01805l13813n9389Q4459N19249
5201H905232j51945J31106q4391l40443j7037k40074J24801K6893l69397j57851
5191G826894J47510m4480j64205n49319j07K24560k75967j6177n1458l25879r1424
5180F679948K21408n6042J08319L30097m41782J55273N79658m77469P6991m67488
5170F708913Q4485m0121j15689L79059m66572j63649K98032k19956N5268j68307
5160F351463j3221M7765k02851j32733n16930k32915L65596J15510l82737P6823
5150E475770o9504M42941k18289k32299k12593k32770M79214k086m9760L04621
5140E685245k29180k67330O35440l16957q6077n01433p1668L46763k53853M29063
$$ plain form
5211 8523691 8322290 8512088 8809414 8827362 8976531 8674726 8360913 8301524 8385983 8905232
5201 8905232 8753287 8884393 8800002 8459559 8442522 8202448 8327249 8354142 7984745 7826894
5191 7826894 7974404 7929924 7765719 7216400 7216293 7440853 7164886 7148709 7097251 6771372 6679948
5180 6679948 6901356 6845314 6953633 7283730 6841948 6997221 7576879 7099410 7176401 6708913
5170 6708913 6793398 6753277 6637588 7016647 6550075 6386426 6684458 6464502 6519770 6351463
5160 6351463 6338242 6386007 6183156 6050423 5533493 5300578 5666174 5781684 5398947 5475770
5150 5475770 5406266 5849207 5630918 5398619 5186026 4953256 5432470 5430384 5380624 5685245
5140 5685245 5456065 5188735 5824175 5507218 5421141 4919708 4848040 5194803 4940950 5370013
5130E370013l79828l88504l6388J74239k93033R8482L41729m55065K46733J12455
5120D790833k39823L34326k06611j02510j61612J1430J23541k68359k8377L25004
5110D577842k32113L31917k23211J29461q5653j42439J32783R2852m62116L30648
5100D449971l13867l46039M76410k92741J74273j07256j69857K702m38879N16278
5090C950995j35324m48037Q02073m58638k16086N42290j29394j44030L00403n57427
5080C506825K87890l53367L32143L20777m21821r3690k9435n4471J44282P9077
5070C718210k20561n2492j86645p2961k96218j50277P51099k19197K84260L2871
5060C588089k60497j47429n5407l1174P6527J99623m1480Q7209l22235N93463
$$ plain form
5130 5370013 4990185 4601681 4565293 4739532 4446499 4544981 4886710 4431645 4678378 4790833
5120 4790833 4551010 4885336 4678725 4576215 4414603 4426033 4549574 4281215 4252838 4577842
5110 4577842 4345729 4677646 4454435 4583896 4498243 4355804 4488587 4581439 4119323 4449971
5100 4449971 4136104 3790065 4266475 3973734 4148007 4040751 3870894 3873596 3434717 3950995
5090 3950995 3815671 3367634 4169707 3711069 3494983 4037273 3907879 3763849 4064252 3506825
5080 3506825 3794715 3441348 3773491 4094268 3672447 3578757 3549322 3494851 3639133 3718210
5070 3718210 3497649 3445157 3258512 3185551 2889333 2739056 3490155 3270958 3555218 3588089
5060 3588089 3327592 3180163 3124756 3093582 3170109 3369732 3328252 3415461 3093226 3686689
5050C686689J62594l90096M03804k20363l52873J76765l33647J61386R3385m76058
5040B911586K11432m04417o495L69654k22614N29989k56669j71371K47338k05955
5030C002478k01826J19276j48861L92257k40785M5685M90952j77148N1462R8690
5020C432180q8497j70740N1602M24801k87802K17251l74410l9171R7003K98268
5010C560485n28301N5661K93700l43862K64142k35059J89201n78478K83927L93523
5000C354939m43642R2540J52212j58709O5741M32241j55813k00999K05818J27580
4990C471908k72678j9354M03244m48387K10028J14405K55110k13196O5313j71774
4980C394619o91250J82311M40729k69715j24549L78473Q0096k81611O24858J31927
$$ plain form
5050 3686689 3849283 3459187 3862991 3642628 3289755 3466520 3132873 3294259 3387644 2911586
5040 2911586 3123018 2718601 2712106 3081760 2859146 3389135 3132466 2961095 3208433 3002478
5030 3002478 2800652 2919928 2771067 3163324 2922539 2968224 3459176 3282028 3333490 3432180
5020 3432180 3343683 3172943 3224545 3649346 3361544 3578795 3204385 3165214 3262217 3560485
5010 3560485 3032184 3087845 3381545 3037683 3301825 3066766 3255967 2677489 2961416 3354939
5000 3354939 2911297 3003837 3156049 2997340 3063081 3495322 3339509 3138510 3344328 3471908
4990 3471908 3199230 3179876 3583120 3134733 3344761 3459166 3714276 3501080 3566393 3394619
4980 3394619 2703369 2885680 3326409 3056694 2932145 3310618 3390714 3109103 3733961 3865888
4970C865888n37306J0616L56636k68336K17190J70777k37944J92044j17176p6706
4960C575683l5575J37169L78651m05376j85739M82214j74619q0037K94134k12798
4950C773707J35880J50936K48825J6508l63272O44824J46673K6788L07484M4867
4940E133220L32900K21721O85151M64326Q8551O48705o37580J10177L53612l83619
4930G017164k14155N4121n26885l87386o22052k21815l29196j61563K35520p43690
4920D100063K5893n36869R6838L35502n95440L3223K8508l2811L70946l41032
4910C484821j49684K99435k15370J00852K22625j0585J6788j08083m2412m0315
4900C558072O9038n1977O579l55064k10598J19998J57279L89117j85635l75930
$$ plain form
4970 3865888 3328582 3339198 3695834 3427498 3644688 3815465 3577521 3769565 3652389 3575683
4960 3575683 3540108 3677277 4055928 3650552 3464813 3947027 3772408 3692371 3986505 3773707
4950 3773707 3909587 4060523 4309348 4325856 3962584 4607408 4754081 4780869 5088353 5133220
4940 5133220 5466120 5687841 6372992 6837318 6925869 7574574 6936994 7047171 7400783 7017164
4930 7017164 6803009 6857130 6330245 5942859 5320807 5098992 4769796 4608233 4843753 4100063
4920 4100063 4125956 3589087 3685925 4021427 3425987 3459210 3487718 3454907 3825853 3484821
4910 3484821 3335137 3634572 3419202 3520054 3742679 3732094 3748882 3640799 3598387 3558072
4900 3558072 3627110 3575133 3581712 3226648 3016050 3136048 3293327 3682444 3496809 3120879
4890C120879J44990J42304l02140J3527O164O6739P1500q0655j59979j47534p5162
4879B800633L04383k4115k0406J24099k77383J53392j16354j69149M86452n32103
4869B729449l0111L86542o90664m0298N03441K58879l99819J04937L53643l02993
4859B873006k20069J63911j65705j52334o8319l28584K83897K19255J18877K33727
4849B957662R4703m51246O8029j67147M45595K59950m82528L45696K20933m15468
4839B876179L2366J80440k32397q2189L11138P0360L03837k00859j28166m8602
4829C082107J51414J18425j85619K5097K91948n86341J12236P63712k38654K25782
4819C760107j31090j68616J52174P6649J05917l54038o5124J08936l6938K50836
$$ plain form
4890 3120879 3265869 3408173 3106033 3119560 3125724 3192463 3263963 3183308 3023329 2875795 2800633
4879 2800633 3105016 3080901 3060495 3184594 2907211 3060603 2944249 2775100 3261552 2729449
4869 2729449 2699338 3085880 2395216 2354918 2858359 3117238 2717419 2822356 3175999 2873006
4859 2873006 2652937 2816848 2651143 2498809 2430490 2101906 2385803 2605058 2723935 2957662
4849 2957662 3052365 2601119 2669148 2502001 2947596 3207546 2725018 3070714 3291647 2876179
4839 2876179 2908545 3088985 2856588 2774399 3085537 3155897 3459734 3258875 3130709 3082107
4829 3082107 3233521 3351946 3166327 3191424 3483372 2897031 3009267 3772979 3534325 3760107
4819 3760107 3629017 3460401 3612575 3689224 3795141 3441103 3375979 3484915 3447977 3698813
4809C698813N27237l44669m84434Q49567m0123k25196L67958L66432l73752L44217
4799D686050N18083l27069j1201M55542q1823K47056O50612J74166J5272O3406
4789F390094M65537J76374J40285O38426l58583l81331K13541j0745j061538L22052
4779F534112j65119j019072K17171r6575k86574l10348M85563j82875j032050
4770D144233L71988J66808p67642L56166J67017m06582L78164j35665M55369m73654
4760D256202k131r9373m33229R56866K37171o87801K9865j61221l5369p03l9529
4749D020748L19844m05437m3274R22440p67729K24164K00141l64067L13350q6071
4739D334109M913j59995K37893k7708k32396M9236L51417j87262J33556J80143
$$ plain form
4809 3698813 4226050 3881381 3396947 4246514 4206391 3981195 4349153 4715585 4341833 4686050
4799 4686050 5204133 4877064 4865863 5321405 5239582 5486638 6137250 6311416 6326688 6390094
4789 6390094 6855631 7032005 7172290 7810716 7452133 7070802 7284343 7273598 6212060 6534112
4779 6534112 6368993 5349921 5567092 5470517 5183943 4873595 5359158 5176283 4144233
4770 4144233 4516221 4683029 3915387 4271553 4438570 4031988 4410152 4274487 4729856 4256202
4760 4256202 4254071 4154698 3721469 4678335 4915506 4227705 4257570 4096349 4060980 4060277 4020748
4749 4020748 4340592 3935155 3891881 4814321 4046592 4270756 4470897 4106830 4420180 4334109
4739 4334109 4339022 4179027 4416920 4389212 4156816 4206052 4557469 4370207 4503763 4683906
4729D683906m49108j1436M39455l2432p9112K46491j70514k34826N44769j12325
4719D824868j37636j16564O13659k97588K1877M65828q8243j04354L76578r326
4709E549099k82344M86117O0719k82879p7678L64090J065j06778J009272m41230
4699F279453p85936Q03714j37744l0880L1642J01170K12070j07796N40434L96451
4689G302578n50013M05959L81336j90659L68373J99617N9696j74862N93809P3899
4679H469733l17703R82993N504k37571L95805m00614O45726K06382m4185K11212
4669I917282l20549L65387R27873m64314l3667K44649M84706M09447l7126J31917
4659A1625605N12746J17121Q49293K97205K65741K91208L11981J37494N90402
$$ plain form
4729 4683906 4234798 4223362 4662817 4630385 4551273 4797764 4627250 4392424 4937193 4824868
4719 4824868 4687232 4570668 5184327 4886739 4908616 5374444 5286201 5181847 5558425 5549099
4709 5549099 5266755 5752872 5813591 5530712 5453034 5817124 5818189 5711411 6720683 6279453
4699 6279453 5493517 6297231 6159487 6128607 6160249 6261419 6473489 6365693 6906127 7302578
4689 7302578 6752565 7158524 7539860 7349201 7717574 7917191 7976887 7802025 8395834 8469733
4679 8469733 8152030 9135023 9140527 8902956 9298761 8898147 9543873 9750255 9706070 9917282
4669 9917282 9596733 9962120 10889993 10425679 10392012 10636661 11121367 11530814 11493688 11625605
4659 11625605 12138351 12255472 13104765 13401970 13667711 13958919 14270900 14408394 14998796
4650A4998796P50887M00488Q45568P26900M13358L52329O51446J425512O04150
4641B1169434J88215J205853J269574J118048J126103J240774J062500J679732
4633C0060233J832507K128905J971764K752858K557720K401958K643971K271424
4625D8621340J557850J518917O28902r4599l88779j22444k80427n50742K01519
4616E1091537M73949L375J830554J576308J285520K302123K577042K746758L035144
4607F6922310L482442L337048L305223L824875L787606L700486L653917M339273
4599I6353180L729086L428206L664698K783488K177987K923674J865041J002889
4591A17928249J529844J426576o8296o29593j113514j817311k082566j848044
$$ plain form
4650 14998796 15749683 16150171 16995739 17722639 18135997 18488326 19139772 20565284 21169434
4641 21169434 21357649 22563502 23833076 24951124 26077227 27318001 28380501 30060233
4633 30060233 31892740 34021645 35993409 38746267 41303987 43705945 46349916 48621340
4625 48621340 50179190 51698107 52327009 52232410 51843631 51721187 51440760 50890018 51091537
4616 51091537 51565486 51568861 53399415 54975723 56261243 58563366 61140408 63887166 66922310
4607 66922310 70404752 73741800 77047023 80871898 84659504 88359990 92013907 96353180
4599 96353180 100082266 103510472 107175170 109958658 112136645 115060319 116925360 117928249
4591 117928249 119458093 120884669 120816373 120186780 119073266 117255955 115173389 113325345
4583A13325345k603967l529593l266356k992403m335992m297480l880108m717253
4575H3702193m132214l334195m769239m244335l533121l914253m042704l331889
4567E2400243k925454l138005k559947j907913k271068k572505j178220j380162
4559C4466969j629907q21689r56715j153268p47943o17827q99258j177084Q1469
4550B6544747r60168r38478l26058m53392j079780k02759q79199l37687o38486
4541B0728740o5585K76760p85598L15191j44357p08437O91451j46872j27219K14435
4531B0248509J72818j78074J47970k92514j56899J6686j02436j9032n0291k21079
4521A9565658l76995J13206l42045k94923m00611j17714k50536k97627j40760
$$ plain form
4583 113325345 110721378 107191785 103925429 100933026 96597034 92299554 88419446 83702193
4575 83702193 79569979 76235784 71466545 67222210 63689089 59774836 55732132 52400243
4567 52400243 49474789 46336784 43776837 41868924 39597856 37025351 35847131 34466969
4559 34466969 32837062 32015373 31058658 29905390 29157447 28539620 27640362 26463278 26544747
4550 26544747 25584579 24646101 24320043 23866651 22786871 22584112 21704913 21367226 20728740
4541 20728740 20663155 20939915 20154317 20469508 20325151 19616714 20308165 20161293 20034074 20248509
4531 20248509 20421327 20243253 20391223 20098709 19941810 19958496 19856060 19837028 19786737 19565658
4521 19565658 19188663 19301869 18959824 18664901 18264290 18146576 17896040 17598413 17457653
4512A7457653m5308j15529k77146m72993n37050n1484n03138l23378J11773j045775
4502A4197625J95235O8998n55134j03308l73606J9434O4933k50476j29670k08817
4492A2925214m9012J13878n66734K07930L204J109l49412m53341r2518n2263k70017
4481A1418038n59271m16866o67596m8878p3533n81178m4086l56687k87399K46715
4471H629259l09212m95639j69953k11336k5986k51777n39097M48424q87302p8100
4461F109281K17020j2273l76505K8786J8581m60387l55148L3046J42187k5261
4451E319327K6101n19708l44622O01619l96847j33308j33863j31033J19513k09589
4441D197590J5611j78355m92615L19259K14m09590J28642R2011k7273m09149M00099
$$ plain form
4512 17457653 17412345 17296816 17019670 16546677 16009627 15958143 15455005 15131627 15243400 14197625
4502 14197625 14392860 14461858 13906724 13803416 13429810 13449244 13514177 13263701 13134031 12925214
4492 12925214 12876202 12990080 12423346 12631276 12634480 12635589 12286177 11832836 11740318 11688055 11418038
4481 11418038 10858767 10441901 9774305 9725427 9651894 9070716 9026630 8669943 8382544 8629259
4471 8629259 8320047 7824408 7654455 7443119 7417133 7165356 6626259 7074683 6187381 6109281
4461 6109281 6326301 6314028 5937523 5966309 5984890 5524503 5169355 5202401 5344588 5319327
4451 5319327 5345428 4825720 4481098 5082717 4685870 4552562 4418699 4287666 4407179 4197590
4441 4197590 4213201 4034846 3542231 3861490 3861704 3452114 3580756 3672767 3645494 3236345 3636444
4430C636444q2361n59954P34916l04040o80648K38708m5802j32410J9627J85466
4420C009946R635n00317J4188P8982j48975L1573j78546K96571n9929K0011L39987
4409B913126P7703j91213l16696k00260O9447J63761k68156J56024k8620j19742
4399B255374K81301m91450K0107J82069l37937k52079O58135l05812m10857K91519
4389A890370P1744K90438l53258j17056J58727j23473L43568j16883J2991o1492
4379A995676K46170q86790O79858L53390k85540j6526N7353j33695q4733o7845
4369A857318q1142m79820K11250M96038l99313K1543M08103o78920J82595J07406
4359A645058j08019m7650K72940J43941m50874M81045k35383k58332M0559M14625
$$ plain form
4430 3636444 3554083 2994129 3729045 3425005 2744357 2983065 2937263 2804853 2824480 3009946
4420 3009946 3019581 2519264 2533452 2612434 2463459 2495032 2316486 2613057 2553128 2573139 2913126
4409 2913126 2990829 2799616 2482920 2282660 2352107 2515868 2247712 2403736 2375116 2255374
4399 2255374 2536675 2045225 2065332 2247401 1909464 1657385 2315520 2009708 1598851 1890370
4389 1890370 1962114 2252552 1899294 1782238 1940965 1817492 2161060 2044177 2057168 1995676
4379 1995676 2241846 1355056 2034914 2388304 2102764 2086238 2143591 2009896 1925163 1857318
4369 1857318 1776176 1296356 1507606 2003644 1604331 1625874 2033977 1355057 1537652 1645058
4359 1645058 1537039 1489389 1762329 1906270 1455396 1936441 1701058 1442726 1483285 1897910
4349A897910k06100N8331J62852o2178l0141m8932K18512l82797Q1882N47382
4339B236721o23557j7234L45161L2532n38786L09567q6585l51439K56443K49129
4329A811952j44561J77102o1891j49288m89468L26679N743O5803O25590k90476
4319A877185p69924M95207M94233k69534j98583L30450j27644k23236N65054l52774
4309A820434l43000M16036k45786J48600n0427L14886J16318p22933L24957j62211
4299A616874k50306R48487k23590j8667M5624R4463J30964o4756j74990J6447
4289B120550k66129K34868K01635r8227J35417j63590K43808o5719J15647o7306
4279B390954m05981O19264l18515l70102L60935j63480k94511K93403j46412l02423
$$ plain form
4349 1897910 1691810 1750141 1912993 1850815 1820674 1771742 1990254 1607457 1689339 2236721
4339 2236721 1613164 1595930 1941091 1973623 1434837 1744404 1657819 1306380 1562823 1811952
4329 1811952 1667391 1844493 1782602 1633314 1143846 1470525 1476268 1542071 2167661 1877185
4319 1877185 1107261 1602468 2096701 1827167 1628584 1959034 1831390 1608154 2173208 1820434
4309 1820434 1477434 1893470 1647684 1796284 1745857 2060743 2177061 1454128 1779085 1616874
4299 1616874 1366568 2315055 2091465 2072798 2118422 2212885 2343849 2279093 2104103 2120550
4289 2120550 1854421 2089289 2290924 2192697 2328114 2164524 2408332 2342613 2458260 2390954
4279 2390954 1984973 2604237 2285722 1915620 2276555 2113075 1818564 2111967 1965555 1663132
4269A663132M46728l01598J01361j51525k755k92044K09059O7898l5324J52936
4259A857868j11567J81153J0031P0557m8143l59422M07795R352k90980J6586L85195
4248B128425k78248J74611l27087L86707r6445n14526k7565K29478m649l40282
4238A330419j8170j21095O6488r9603J58773M49159k52364j85246L04990L44668
4228A978019o89672K04952K2891J73958J64448l17771M87875l31560l7437m8840
4218A606863m0241P8733p0794k56993M18960k32337m12976K28904J77526L53472
4208A851117n13490L45942L5159n51874P78925k89400j64243K94303k78710Q6619
4198A594348O1428L46540k23442q4577k6303K15110n75898Q92374K32551r54866
$$ plain form
4269 1663132 2109860 1808262 1909623 1758098 1755343 1463299 1672358 1740256 1704932 1857868
4259 1857868 1746301 1927454 1937485 2008042 1959899 1600477 2008272 2017624 1726644 1743230 2128425
4248 2128425 1850177 2024788 1697701 2084408 1987963 1473437 1445872 1675350 1670701 1330419
4238 1330419 1312249 1191154 1257642 1158039 1316812 1765971 1513607 1328361 1633351 1978019
4228 1978019 1288347 1493299 1516190 1690148 1854596 1536825 2024700 1693140 1655703 1606863
4218 1606863 1566622 1645355 1574561 1317568 1736528 1504191 1091215 1320119 1497645 1851117
4208 1851117 1337627 1683569 1718728 1166854 1945779 1656379 1492136 1786439 1507729 1594348
4198 1594348 1655776 2002316 1778874 1694297 1667994 1883104 1307206 2199580 2432131 1477265
4188A477265J56683K23879J05479j12179K84229r6980l56111K48592L17755n87195
4178A661417m37935O60256q8168j85724L84374j23310j26268L98213K19479o84367
4168A677967Q7637K91463L29407j63924L8944j64376J8582J28179L94623l76955
4158B261547j71812N77259P3078k35605N22792l34849m9802N00416Q6830j93012
4148C036842j20753P8651M26549j87672K64519J39537J38714O0531j53886l0182
4138C652850O26510J56511q4280K91334o8843J87279K12654P97421J13445j22428
4128E762453R78746N40643O99059Q52507O51611N32980J350299N77258O82198
4119A2627754J674583J103594J443482J293128J479418N94709m20137J23962p06278
$$ plain form
4188 1477265 1633948 1857827 1963306 1851127 2135356 2038376 1682265 1930857 2248612 1661417
4178 1661417 1223482 1883738 1795570 1609846 1994220 1870910 1744642 2142855 2362334 1677967
4168 1677967 1765604 2057067 2386474 2222550 2261494 2097118 2115700 2243879 2638502 2261547
4158 2261547 2089735 2666994 2740072 2504467 3027259 2692410 2642608 3143024 3229854 3036842
4148 3036842 2916089 2994740 3421289 3233617 3498136 3637673 3776387 3836918 3683032 3652850
4138 3652850 4279360 4435871 4351591 4642925 4574082 4761361 4974015 5771436 5884881 5762453
4128 5762453 6741199 7281842 7980901 8833408 9485019 10017999 11368298 11945556 12627754
4119 12627754 14302337 15405931 16849413 18142541 19621959 20216668 19796531 19920493 19214215
4110A9214215j370930j306776j176114j611055p37494j619607j039778m52057
4102I900404q55020p30935r72597k34166j56098n40685l79129J83789m99100k57574
4092E458889L00817o93040o25179K23237N5614l38202n23790N61777J01784M88816
4082E010723o04746J30000m86402L17757L2024j08809k0771L60763O1134M06491
4072E098164P9544N6698j11540K56779N4113L50766L06791J54630Q8139N60444
4062F894528O80007K47748k52498R47219P67661Q2685J052591M33311J077643
4053A1930895Q93398R26059J343820J427598J300985J247332L88965K21826k73504
4044A9407374o71700l26246j324390j169210p73274j000618o73614j655916l50821
$$ plain form
4110 19214215 17843285 16536509 15360395 13749340 13011846 11392239 10352461 9900404
4102 9900404 9045384 8314449 7341852 7107686 6951588 6410903 6031774 6215563 5716463 5458889
4092 5458889 5759706 5066666 4441487 4664724 4720338 4382136 3858346 4420123 4521907 5010723
4082 5010723 4405977 4535977 4049575 4367332 4399356 4290547 4269776 4630539 4691673 5098164
4072 5098164 5177708 5234406 5122866 5379645 5433758 5784524 6091315 6245945 6334084 6894528
4062 6894528 7574535 7822283 7569785 8517004 9284665 9367350 10419941 10853252 11930895
4053 11930895 12824293 13750352 15094172 16521770 17822755 19070087 19459052 19680878 19407374
4044 19407374 18735674 18409428 17085038 15915828 15142554 14141936 13468322 11812406 11461585
4035A1461585l70803q90143o41249o48036n02084O4340o05019o89951j28433m81824
4025F568383r8960j48712l20481n53633k90999q7029J9258l47160r34434N32762
4015D338995l84233K8607j20503k56199L783l45405k8601j50280n5695j24496
4005B905973P9269R8340l81898K69669k30569M44567m74731l36774j04493K29369
3995B498722r9987m2021j71709j43194K07345q8903j77454p6214J32350Q5316
3985B124251L16707k79442j92676M07662l28742r55J34590n4641J57068m63473
3975A820349N15239k06592n38122L83767L20085k45929k69644o42828N26379M777
3965A667481j81012M35425n13985Q2192M63550m12994J58325j08155m39670O07227
$$ plain form
4035 11461585 11090782 10200639 9559390 8911354 8409270 8473610 7868591 7178640 7050207 6568383
4025 6568383 6469423 6320711 6000230 5446597 5155598 5068569 5087827 4740667 3806233 4338995
4015 4338995 3954762 3983369 3862866 3606667 3610450 3265045 3236444 3086164 3030469 2905973
4005 2905973 2985242 3083582 2701684 2971353 2740784 3185351 2710620 2373846 2269353 2498722
3995 2498722 2398735 2356714 2185005 2041811 2249156 2160253 1982799 1906585 2038935 2124251
3985 2124251 2440958 2161516 1968840 2376502 2047760 2046805 2181395 2126754 2283822 1820349
3975 1820349 2335588 2128996 1590874 1974641 2294726 2048797 1779153 1136325 1662704 1667481
3965 1667481 1486469 1921894 1407909 1490101 1953651 1540657 1698982 1590827 1151157 1758384
3955A758384k25779P0028M3747l36852M30589l75507k47565M91801L66668j27330
3945A848184l9610j38093J41432j35245M7773R3511k55641j04235L22768L73778
3935B154622m09447m12308J50062J23890J33187k43675O793o9129r4782M04466
3925A743679r2228j41896J47534P6068J97696j74437l68558J06767L13904l1958
3915A776571r1512l62527M98428J72057j06441m21495L11631j90966J219M95455
3905B082420n26863p6420k563J10103m589o84256R21313j28739k08269J98923
3895A681060l26215k42515L90424l07442Q7214j15495M7549K37071r6516L11937
3885A667072q5749P2820J11014J56259m69990L34855M8855j39028j44198M9156
$$ plain form
3955 1758384 1532605 1602633 1646380 1309528 1740117 1364610 1117045 1608846 1975514 1848184
3945 1848184 1808574 1670481 1811913 1676668 1724441 1817952 1562311 1458076 1780844 2154622
3935 2154622 1745175 1332867 1482929 1606819 1740006 1496331 1503124 1433995 1339213 1743679
3925 1743679 1651451 1509555 1657089 1733157 1930853 1756416 1387858 1494625 1808529 1776571
3915 1776571 1685059 1322532 1820960 1993017 1886576 1465081 1776712 1585746 1586965 2082420
3905 2082420 1555557 1479137 1476574 1586677 1582088 897832 1819145 1690406 1482137 1681060
3895 1681060 1354845 1112330 1502754 1195312 1282526 1167031 1214580 1451651 1355135 1667072
3885 1667072 1581323 1654143 1765157 1921416 1451426 1786281 1835136 1696108 1551910 1601066
3875A601066K51900l18813m25075N02130j95080j98880J26324K51992p22608M17973
3865A290929l8271K21859j11153j62808l16004j66417M37036J34783k7347l12451
3855I50156K83750j17877J05394K26395q24524N5012L51852M30217l95943L7862
3845A102294k14298j1201R0743j88509l1840K20951J49090K9114O1111m13581
3835G93874l0100K18527q6776M49155n60984k6173K58452o2689l2375J50171j04544
3824I66538j90477K19419L731Q2213J74000k97000r6821J98489K6778P961J64568
3813A259399r5692j99719O4868J26962p0793m57285L18910Q849l48195J04763
3803G12067M3457l49115M20837j72005M54670l41062p4090J62204M9686n1429
$$ plain form
3875 1601066 1852966 1534153 1109078 1611208 1416128 1217248 1343572 1595564 872956 1290929
3865 1290929 1252658 1474517 1363364 1200556 884552 718135 1155171 1289954 1262607 950156
3855 950156 1233906 1116029 1221423 1447818 623294 678306 1030158 1460375 1064432 1102294
3845 1102294 887996 876795 967538 779029 747189 968140 1117230 1146344 1207455 793874
3835 793874 763774 982301 895525 1344680 783696 757523 1015975 953286 920911 1071082 966538
3824 966538 776061 995480 999211 1081424 1255424 958424 861603 1060092 1086870 1094831 1259399
3813 1259399 1163707 963988 1028856 1155818 1085025 627740 946650 955499 607304 712067
3803 712067 755524 406409 827246 655241 1109911 768849 694759 856963 906649 855220
3793H55220R9282k96094P5195N3488L15726k35630M81426P352l73393k88322J32186
3782H26436l3383N22513o215j04399n42835K14019M778j22961L30077n272l84083
3771F98675j69001P33261k78417l51667R5868k96135M8502J63736j38197J86519
3761F93144K87824r6823r0078L87381j06738J27973l44707q3978j02872J63793
3751H34919J036J66259j13377j84754j5230L0030K22663l59857k9559M01555l07207
3740F46478l92606R6307L79411j48279J99n4877R7409j24280J45921K60969o8741
3729H37911r8426P8231K35448l4074K75543k89457k8906K63557k16367k03327
3719H20133j832J54370j11900J52737l3343K42784l50685K47159m16364l19176
$$ plain form
3793 855220 954502 658408 733603 787091 1102817 867187 1348613 1355965 982572 694250 826436
3782 826436 793053 1315566 1309351 1204952 662117 876136 880914 757953 1088030 1082758 698675
3771 698675 529674 1262935 984518 632851 728719 432584 481086 644822 506625 693144
3761 693144 980968 884145 794067 1181448 1074710 1202683 857976 773998 671126 834919
3751 834919 835955 1002214 888837 704083 688853 718883 941546 581689 552130 953685 646478
3740 646478 253872 350179 729590 581311 581510 526633 624042 499762 645683 906652 837911
3729 837911 739485 817716 1053164 1019090 1294633 1005176 976270 1239827 1023460 820133
3719 820133 818301 972671 860771 1013508 980165 1222949 872264 1119423 703059 383883
3709C83883M30210j39863p5516K77280l39156J5290K85898O150j74950q0179K29952
3698H18999j19187J7111M81572m06116K97292K63703o14962q4842R2327j62279
3688E83618K43575m7401M5903K40413o06473L53798J30064m94522J55853J02905
3678G07733l43557M18992k90746R6115N10498j69851k905j58416j95284K18331
3668G90910j89158J78192K90202l01660J82437K15499l60257j04683M84474k44534
3658I41422q2700Q7787o4022q4388q2641j86645k8644m0384M70005r7683m42920
3647C89187K05903J39032j45325n4052J66691K3890J41739K73220j77965l28347
3637F33973L27225J91457m48800L6656J60409p7683o23p4128J61027n03948L75617
$$ plain form
3709 383883 814093 674230 598714 875994 536838 552128 838026 844176 669226 589047 818999
3698 818999 699812 716923 1198495 792379 1089671 1353374 738412 653570 745897 583618
3688 583618 827193 779792 825695 1066108 459635 813433 943497 448975 604828 707733
3678 707733 364176 783168 492422 588537 1099035 929184 926279 767863 572579 790910
3668 790910 601752 779944 1070146 768486 950923 1166422 806165 701482 1185956 941422
3658 941422 858722 946509 882487 798099 715458 528813 500169 459785 929790 832107 389187
3647 389187 595090 734122 588797 534745 701436 725326 867065 1140285 962320 633973
3637 633973 961198 1152655 703855 740511 900920 823237 822614 748486 909513 405565 781182
3626G81182j86084k8537l62661Q8226P2257j80196L09788j86555l4818N67565
3616H40167l94545L64991n635l40978J9344K64167r910K68263l54679K76666K31162
3605A159013l6769J06600o20626L11961K53898l71307j9907J44510k4626L5725
3595I38472K59804k84256k84144N274p6726M41382p39524J7586K67116P9373n5707
3584E68650L33103l58298K30282J22028j28075k52035K2407K36955J11897R7453
3574I84367j1119l43386J50259L15125k88255o04151L23473M79198J40489k8203
3564A117797m28052j38404N2652K2635m047J45115k25571J90356N4703q8302L69946
3553A068828m35238N48696l9767j22108L1047l1561K73762m35614q8888N38301
$$ plain form
3626 781182 595098 566561 203900 292126 364383 184187 493975 307420 272602 840167
3616 840167 445622 810613 804978 464000 483344 747511 737601 1005864 651185 927851 1159013
3605 1159013 1122244 1228844 608218 920179 1174077 802770 782863 927373 902747 938472
3595 938472 1198276 914020 629876 635150 558424 999806 260282 277868 544984 624357 568650
3584 568650 901753 543455 773737 895765 767690 515655 538062 775017 886914 984367
3574 984367 973248 629862 780121 1095246 806991 202840 526313 1005511 1146000 1117797
3564 1117797 689745 551341 603993 626628 622581 767696 542125 732481 787184 698882 1068828
3553 1068828 633590 1182286 1142519 1020411 1051458 1019897 1293659 858045 769157 1307458
3543A307458j52159J20089K6403m43552K31165K36894N8130K75236k71146o7420
3533A321098j02144K22735p4022j3294J84368r5603J58555K15364Q9478j47775
3523A758760J46542Q927R1272j41136O01202j19744J1645p7651j0175J80550J35104
3512B585296l10955m8495r6061j05634J75819J54069p6693k40706J17562N19159
3502B673361j47178l65293j6764M45693J73910Q5217k78639M19328r6687M4501
3492B937449j33373K19117j00401K57181J44885N1574L9674Q3076l2083M7547
3482C514646n07527j15121M75768K0267k02855p8843L20810k92318q806K69734
3472C395755p2454j30124J58207k98134J4202J2265K23114J87725J99912k57909
$$ plain form
3543 1307458 1155299 1275388 1301791 858239 1089404 1326298 1384428 1659664 1388518 1321098
3533 1321098 1218954 1441689 1367667 1354373 1538741 1443138 1601693 1817057 1906535 1758760
3523 1758760 1905302 1914229 2005501 1864365 2465567 2345823 2357468 2279817 2269642 2450192 2585296
3512 2585296 2274341 2225846 2129785 2024151 2199970 2354039 2277346 2036640 2154202 2673361
3502 2673361 2526183 2160890 2144126 2589819 2763729 2848946 2570307 2989635 2892948 2937449
3492 2937449 2804076 3023193 2922792 3179973 3324858 3376432 3416106 3499182 3467099 3514646
3482 3514646 3007119 2891998 3367766 3388033 3185178 3106335 3427145 3134827 3126021 3395755
3472 3395755 3323301 3193177 3351384 3053250 3067452 3079717 3302831 3490556 3690468 3432559
3462C432559J95227j1054K39178P5629J53876j80181K0651J23095M79772L52346
3452D881098j50865N5320J75559k96303M6598r2831N04961k37529J58749L02191
3442E346948k12571J44054K83945Q0014K7514M09041J74240N94394K49569n23437
3432F573711Q5144O47801M23142n63027o6834j60179l09047M05907P2100J0226
3422G118944l03778k63508J70369R4172l70078J15873k01229K48168j53255n29250
3412E926428Q76164J76116R1593k49185l275Q73840P7457N29842L1351m21397
3402G908934o0721M68202k42444r15099n57098K24570j75849n36594l0912p59438
3392E323551L6083R3441l92929k69428M81153k72992j29477O58035r8620J80905
$$ plain form
3462 3432559 3627786 3616732 3855910 3931539 4085415 3905234 3925885 4048980 4528752 4881098
3452 4881098 4730233 4785553 4961112 4664809 4711407 4618576 5123537 4886008 5044757 5346948
3442 5346948 5134377 5278431 5562376 5642390 5669904 6078945 6253185 6847579 7097148 6573711
3432 6573711 6658855 7306656 7729798 7166771 7099937 6939758 6630711 7036618 7108718 7118944
3422 7118944 6815166 6551658 6722027 6816199 6446121 6561994 6360765 6608933 6455678 5926428
3412 5926428 6802592 6978708 7070301 6821116 6817841 7691681 7769138 8298980 8330331 7908934
3402 7908934 7848213 8316415 8073971 7158872 6601774 6826344 6650495 6113901 6082989 5323551
3392 5323551 5359634 5453075 5060146 4790718 5271871 4998879 4869402 5527437 5428817 5609722
3382E609722P26918N46997K38248j76848N53357P98567O40568N47812K62110L95909
3372A0143360J256028j79738l6452Q511p80464l17820r22464o31852n79875q23193
3362G136041k09433o19006j022381J78148k81138k23616K6156J43319o16010L8170
3352D550250L90131J19338o64670M59641J6140K11626p4589Q5687J48579L85958
3342E628091M47956k28075K13885N51822k93302n60285J51230m3135r25628l8176
3332D904383m3192q29452o11044o8083K4130n10605m0845k27139k11778L4463
3322B420838O5005n56200K16859K1604j86537K22584m43267j43763l25650L80831
3312A672304K93358q36154L7532L31301k22165O81K89509l34801L5012J13652
$$ plain form
3382 5609722 6336640 6883637 7121885 6945037 7498394 8296961 8937529 9485341 9747451 10143360
3372 10143360 11399388 11219650 11183198 11191709 10411245 10093425 9170961 8539109 7959234 7136041
3362 7136041 6926608 6307602 5285221 5463369 5182231 4958615 4984771 5128090 4512080 4550250
3352 4550250 4940381 5059719 4395049 4854690 4870830 5082456 5007867 5093554 5242133 5628091
3342 5628091 6076047 5847972 6061857 6613679 6320377 5760092 5911322 5868187 4942559 4904383
3332 4904383 4861191 4031739 3420695 3352612 3376742 2866137 2825292 2598153 2386375 2420838
3322 2420838 2485843 1929643 2146502 2168106 1981569 2204153 1760886 1617123 1291473 1672304
3312 1672304 1965662 1129508 1167040 1498341 1276176 1276857 1566366 1231565 1266577 1380229
3302A380229p1556l10975j55219K37297m89681K65454L56071m66352J92836N15444
3292A453548m30747l97062P82306k13724k30465J2811l470j3402K04050J3839
3282A177684K56131k71575n1540j18191j14354M1631n70803J02047L67190r1949
3272G26271k14383k9389M47682J3522o1776j70581o8750o6220N51550J96359j94972
3261A129313M1476J06254n4048k78327l9258J5403Q6440k66606N211n0610j04086
3250E91162O8351k23720N8936k83946j79945M83130K65389l68560l42527M00584
3240D68854k28455L96117l2868M6846o2629J00973R389k24762J80103q6919J57944
3229G24593L60911k79037n17041J78493K25084o43751O7930K32258J74396q9499
$$ plain form
3302 1380229 1308673 997698 842479 1079776 590095 855549 1211620 745268 938104 1453548
3292 1453548 1022801 625739 1408045 1194321 963856 976667 973197 959795 1163845 1177684
3282 1177684 1433815 1162240 1110700 992509 878155 919786 348983 451030 818220 726271
3272 726271 511888 482499 930181 943703 881927 711346 642596 576376 1127926 1324285 1129313
3261 1129313 1170789 1277043 1222995 944668 905410 920813 1007253 740647 745858 695248 591162
3250 591162 659513 435793 494729 210783 30838 513968 779357 410797 68270 468854
3240 468854 240399 636516 603648 650494 587865 688838 698227 473465 653568 566649 724593
3229 724593 1085504 806467 289426 467919 693003 49252 117182 349440 523836 434337
3219D34337n28411J64973P1934k7417J81990m5874l71281M53266l36278j13225
3209a15986K34221M6942j45401K23576O8433k96810P852N81339l8937n47094M12687
3198D30822J83268l77398L17116R9006o20682R6662J62312J5976q9685q2561k74871
3187a40035n5166O59903k32144o90305N66694L9765r9297M45658k93032m92155
3177b90114J67359K95858K86892j40592M41768K28313p53691L35491K29182l10759
3167D89707p9209L01814k46944l31147J29957L73715l4892l99186N3216l27921
3157g0890M34446K54632l50934n3969L50316J11457n48820M20721J08526p25522
3147g0037p6504Q13074j27733l39562O95724K45484j10404k14893k516J84282
$$ plain form
3219 434337 -94074 70899 142833 115416 297406 251532 -119749 333517 -2761 -115986
3209 -115986 118235 165177 19776 243352 311785 14975 22827 604166 565229 18135 430822
3198 430822 614090 236692 553808 652814 32132 128794 291106 307082 217397 134836 -140035
3187 -140035 -195201 464702 232558 -457747 108947 148712 49415 495073 202041 -290114
3177 -290114 -122755 173103 459995 319403 761171 989484 235793 571284 800466 489707
3167 489707 410498 712312 465368 134221 264178 637893 603001 203815 257031 -70890
3157 -70890 363556 618188 267254 213285 563601 675058 126238 546959 655485 -70037
3147 -70037 -146541 666533 538800 199238 894962 1140446 1030042 815149 812633 996915
3137I96915M30461n63033k21743p5391K7710P5790k63332N21523j9790k8045J43614
3126A024679K40918M38999p65929J15706K41715m21003q9633Q99368J60612K7924
3116A873356O6875r7208J48293K9749J30315l03187J64284L82869j72392J86120
3106B409074m6096j61707K12260P5591m08804J5612J0164j18420K66108j76898
3096B076884N37722m36647L81245o0418j84751M87452K03910R4334J7846q2511
3086C035066M32897k26955k1180L62053k28281o9166L98492j97521J32331k85482
3076C332254N7048n45931m96471N32462n27388k11381M0972L3509n51942K07193
3066A870325o7549j43918l4526O6515k5124o3144L9034j99503J21720L7983r1290
$$ plain form
3137 996915 1427376 864343 642600 567209 594919 670709 407377 928900 909110 881065 1024679
3126 1024679 1265597 1704596 938667 1054373 1296088 875085 785452 1684820 1845432 1873356
3116 1873356 1940231 1843023 1991316 2021065 2151380 1848193 2012477 2395346 2222954 2409074
3106 2409074 2362978 2201271 2413531 2489122 2080318 2095930 2106094 1987674 2253782 2076884
3096 2076884 2614606 2177959 2559204 2498786 2314035 2801487 3005397 3099731 3117577 3035066
3086 3035066 3467963 3241008 3219828 3581881 3353600 3284434 3682926 3485405 3617736 3332254
3076 3332254 3389302 2843371 2346900 2879362 2351974 2140593 2181565 2215074 1663132 1870325
3066 1870325 1802776 1658858 1624332 1690847 1665723 1602579 1641613 1442110 1563830 1601813 1510523
3055A510523M72421j51520J31631L679J02816K09128l33589j28821j75301j16618
3045A524349Q2005j06348J49758l9328p43090K13222J92744m10963N1007l09904
3035F03452Q8242j84992o3606r941j39342N14147o18749J3958K59248r5294J21322
3024D88445q2187q1259L11544q7968J08253O0129m04666p2172q5092M70864o9525
3013E56366j94223J05997j38002j55534q0575M8651l91159r885K75577j73989
3003a56776j20241M96860j86965j79520J22413J85849J83129k44517j40130O3929
2993B4031J15320J1622l57695L525J64409N05830k48548K13255k68321j88346
2983b4918J04666K88810J0383p60643K82202J24349l18144J85029r0082j48230
$$ plain form
3055 1510523 1982944 1831424 1963055 1966734 2069550 2278678 1945089 1816268 1640967 1524349
3045 1524349 1606354 1500006 1649764 1610436 867346 1080568 1273312 862349 913356 603452
3035 603452 691694 506702 443096 433155 293813 807960 189211 203169 462417 367123 488445
3024 488445 406258 324999 636543 548575 656828 716957 312291 240119 155027 625891 556366
3013 556366 362143 468140 330138 174604 94029 142680 -248479 -258364 17213 -156776
3003 -156776 -277017 219843 32878 -146642 -24229 161620 344749 100232 -39898 24031
2993 24031 139351 150973 -206722 -203197 -38788 467042 218494 431749 163428 -24918
2983 -24918 79748 368558 378941 -381702 -99500 24849 -293295 -108266 -198348 -346578
2973c46578k6628L60937q8601l38013J67517O3413K3514K31044J74912l59053
2963a37536P15246m69264j95698K96715L36328j11057k85144k39905J39582n5892
2953f625m7459r1492k22044K12613L24675m19582J14625k21417J68934q3037o3469
2942c34278k23519k4122L44584L27683m24965j59818L99435k10444J94456K89116
2932A78128j61558k51411N8305L34131j72876j36464K16294m0041j42360K21664
2922A03812j88047o56083O03290j11907n9382J18479P0827j93226L9933N5332
2912b16972l33083O310L79248j77493l6829k589L71207o9722j16489k32629J05056
2901c23985j82316M45654Q2035l68306P7732l1231M72053j90868j99503L70413
$$ plain form
2973 -346578 -373206 -12269 -100870 -438883 -271366 -207953 -184439 46605 221517 -137536
2963 -137536 577710 108446 -87252 209463 545791 434734 149590 -90315 49267 -6625
2953 -6625 -54084 -145576 -367620 -155007 169668 -249914 -135289 -356706 -187772 -270809 -334278
2942 -334278 -557797 -581919 -237335 90348 -334617 -494435 -95000 -305444 -110988 178128
2932 178128 16570 -234841 -176536 157595 -15281 -151745 64549 24508 -117852 103812
2922 103812 -84235 -740318 -137028 -248935 -308317 -189838 -119011 -312237 -272304 -216972
2912 -216972 -550055 -543745 -164497 -341990 -378819 -381408 -10201 -79923 -196412 -429041 -323985
2901 -323985 -506301 -60647 21388 -346918 -269186 -300417 171636 -19232 -218735 151678
2891A51678k82107K44617q9803k41685j26003k2491k64682M77820L11990p15411
2881e56077L89842o2307k34379K14119K69L88180M286m89889k34752K85025k7492
2870c23175K55046k43393k5244j36817l51535O37228m7902k85817J13492L34023
2860g4094k33544K15283j7085n1734q2229M441j29969R3604J22843j72655j79110
2849e04249K24319j04314Q3968M38911n8725k82714o566k44637N32416m67710
2839c89301q3201J34376j95757N22905J22497m51099m25410R1949J71352m9789
2829e51478J35599L55489j34640l6944K61646l04448R08J71387l00296j94044
2819e96821K16882q1984m53610P00577j00752o16051O20252M19705l50588K59257
$$ plain form
2891 151678 -130429 114188 24385 -217300 -343303 -365794 -630476 -152656 159334 -556077
2881 -556077 -166235 -228542 -462921 -248802 -248533 139647 143933 -345956 -580708 -295683 -323175
2870 -323175 -68129 -311522 -336766 -473583 -825118 -187890 -235792 -521609 -408117 -74094
2860 -74094 -307638 -92355 -109440 -161174 -243403 -238962 -368931 -275327 -152484 -325139 -504249
2849 -504249 -279930 -384244 -300276 138635 79910 -202804 -209370 -454007 78409 -389301
2839 -389301 -472502 -338126 -533883 -10978 111519 -339580 -764990 -673041 -501689 -551478
2829 -551478 -415879 -60390 -195030 -231974 29672 -274776 -273868 -102481 -402777 -596821
2819 -596821 -379939 -461923 -915533 -214956 -315708 -931759 -311507 108198 -242390 16867
2809A6867m08899L93183m1720j25647M69582m22744J47486R6015j61642K93457
2799B55938l55403k23787J78279L2293N0986J5563j45211L85916m05683n63534
2789g74643L86621L5389k344K13069k8299l15428M72725j70212j5374J57551j48507
2778a89452N6273j4256J19349j83261l21178M37385j11597j74039R0777M1415
2768b48584P246q812n1034K27502j86855L37075J61957n61669J30385k57128J32992
2757c16925J18103j55622q6080J9667J70168J26379j66163k51183J8492k2900
2747e46064O53213q3222o00400l8736O35361J39579o40261K27549L28813m34294
2737c58462K8339N45482m49988L3204M48027p12127J20627J67985k48838L32673
$$ plain form
2809 16867 -392032 1151 -40569 -166216 303366 -119378 28108 124123 -37519 255938
2799 255938 -99465 -323252 -144973 -112680 -61694 -46131 -191342 194574 -211109 -774643
2789 -774643 -388022 -352633 -354977 -141908 -170207 -485635 -12910 -183122 -198496 -40945 -189452
2778 -189452 -133179 -147435 -28086 -211347 -532525 -95140 -206737 -380776 -289999 -248584
2768 -248584 -241338 -250150 -301184 -73682 -260537 76538 238495 -323174 -192789 -449917 -316925
2757 -316925 -198822 -354444 -440524 -420857 -250689 -124310 -290473 -541656 -523164 -546064
2747 -546064 107149 23927 -576473 -615209 20152 159731 -480530 -252981 75832 -358462
2737 -358462 -330123 215359 -234629 -201425 246602 -465525 -344898 -176913 -425751 -93078
2727i3078p6194N4337k89889L92533K5289m52910j33683J78962j37955J87984
2717c44604j57085K01790M97396m40765L04376k808o08075O09155j48735P3954
2707a5401k38711n3569r2123J5752K25741k62493O4891L62372k70870l04407N61126
2696g692q7134l91919K43820K28507j88568p4464J81345j69841k07693j77597
2686f51236N2751K91197l58038J47205j27641M18976k18767K51826K87787j19507
2676b5447k20326J48656J44563j02501k64637O8701K34813R0350l65948K40224
2666e1552j60776R4604l32650M96432k62111l77332N83007o16825K33793J9208
2656c74202j77057Q2408L45654J72774m81959J53426J87528p8885n8560L66560
$$ plain form
2727 -93078 -169272 -114935 -404824 -12291 12998 -439912 -573595 -394633 -532588 -344604
2717 -344604 -501689 -299899 197497 -243268 61108 58300 -549775 59380 -89355 -15401
2707 -15401 -254112 -307681 -399804 -384052 -158311 -420804 -355913 6459 -264411 -568818 -7692
2696 -7692 -94826 -486745 -242925 -14418 -202986 -277450 -96105 -265946 -473639 -651236
2686 -651236 -598485 -307288 -665326 -518121 -645762 -226786 -445553 -193727 94060 -25447
2676 -25447 -245773 -97117 47446 -55055 -319692 -250991 -16178 74172 -291776 -51552
2666 -51552 -212328 -117724 -450374 46058 -216053 -593385 -10378 -627203 -393410 -374202
2656 -374202 -551259 -468851 -123197 49577 -432382 -278956 -91428 -170313 -228873 137687
2646A37687m02026K59257M88353n12516P7949l76679J78851n8445J78463j90032
2636b19138J10477l41141k16470P67309l35888n29259J93435m2477L19103k18447
2626e12496J97741k22256K84831j89102M6671L01914L11165n81424K19195L39822
2616A96061o82163J6617K87723K94143l70863m428o097J632p9594M6720L8237
$$ plain form
2646 137687 -264339 -5082 483271 -29245 48704 -327975 -149124 -207569 -29106 -219138
2636 -219138 -108661 -449802 -666272 101037 -234851 -764110 -570675 -613152 -294049 -512496
2626 -512496 -314755 -537011 -252180 -441282 -394611 -92697 218468 -362956 -143761 196061
2616 196061 -486102 -469485 -181762 112381 -258482 -262910 -269007 -267375 -346969 -300249 -262012
$$ [...]
##END NTUPLES=NMR SPECTRUM
##END=
