##TITLE=1H_DE-80H_X3
 200.13MHz, d2o
 8 sc
 
 19ns.26.2.2025
##JCAMPDX= 6.0         $$ Bruker NMR JCAMP-DX V2.0
##DATA TYPE= NMR SPECTRUM
##DATA CLASS= NTUPLES
##ORIGIN= UXNMR, Bruker Analytische Messtechnik GmbH
##OWNER= pz
$$ XWIN-NMR		Version 3.5
$$ Tue Jan 20 10:25:29 2026 Russian Standard Time (UT+4h)  Yarkov@DPX200
##.OBSERVE FREQUENCY= 200.1313
##.OBSERVE NUCLEUS= ^1H
##.ACQUISITION MODE= SIMULTANEOUS
##.ACQUISITION SCHEME= undefined
##.AVERAGES= 8
##.DIGITISER RES= 18
##SPECTROMETER/DATA SYSTEM= spect
##.PULSE SEQUENCE= zg30
##.SOLVENT NAME= CDCl3
##.SHIFT REFERENCE= (INTERNAL, CDCl3, 0, 15.4637)
##AUDIT TRAIL= $$ (NUMBER, WHEN, WHO, WHERE, WHAT)
$$ ##TITLE= Audit trail, XWIN-NMR		Version 3.5
$$ ##JCAMPDX= 5.01
$$ ##ORIGIN= Bruker BioSpin GmbH
$$ ##OWNER= Yarkov
$$ C:/Bruker/XWIN-NMR/data/yarkov2/nmr/H-C/1/pdata/1/auditp.txt
$$ ##AUDIT TRAIL=  $$ (NUMBER, WHEN, WHO, WHERE, WHAT)
(   1,<2026-01-20 10:24:40.50 +0400>,<Yarkov>,<DPX200>,
      <created by zg, POWCHK disabled, PULCHK disabled
       configuration hash MD5:
       00 E9 B6 7A A2 85 ED C7 34 08 36 98 17 FE 4E 26
       data hash MD5: 16K
       20 48 AE A5 29 EA 46 14 4D DA 6B 0D 23 93 64 4E>)
(   2,<2026-01-20 10:24:45.81 +0400>,<Yarkov>,<DPX200>,
      <Start of raw data processing
       efp BC_mod = 2 LB = 0.25 FT_mod = 6 PKNL = 1 PHC0 = -5297.497 PHC1 = 7.62193 SI = 16K 
       data hash MD5: 16K
       9D 91 E8 08 04 F4 2A 8D 73 2A F4 8F 5A 4A A0 09>)
$$ ##END=
$$ 
$$ hash MD5
$$ 9F 74 2E AA 6A C7 25 1B FA CD F3 49 80 B6 E1 AB
##$RELAX= 
##$RELAX= 
##$RELAX= 
##$RELAX= 
##$RELAX= 
##$RELAX= 
$$ Bruker specific parameters
$$ --------------------------
##$DU= <C:/Bruker/XWIN-NMR>
##$EXPNO= 1
##$NAME= <H-C>
##$PROCNO= 1
##$TYPE= <nmr>
##$USER= <yarkov2>
##$AMP= (0..31)
100 100 100 100 100 100 100 100 100 100 100 100 100 100 100 100 100 100 
100 100 100 100 100 100 100 100 100 100 100 100 100 100 
##$AQSEQ= 0
##$AQ_mod= 1
##$AUNM= <au_zg>
##$AUTOPOS= <>
##$BF1= 200.13
##$BF2= 200.13
##$BF3= 200.13
##$BF4= 200.13
##$BF5= 200.13
##$BF6= 200.13
##$BF7= 200.13
##$BF8= 200.13
##$BYTORDA= 1
##$CFDGTYP= 0
##$CFRGTYP= 5
##$CHEMSTR= <none>
##$CNST= (0..31)
1 1 145 1 1 1 1 1 1 1 1 1 1 1 1 1 1 1 1 1 1 1 1 1 1 1 1 1 1 1 1 1 
##$CPDPRG= <>
##$CPDPRG1= <>
##$CPDPRG2= <>
##$CPDPRG3= <>
##$CPDPRG4= <mlev>
##$CPDPRG5= <mlev>
##$CPDPRG6= <mlev>
##$CPDPRG7= <mlev>
##$CPDPRG8= <mlev>
##$CPDPRGB= <>
##$CPDPRGT= <>
##$D= (0..31)
0 0.7 0 0 0 0 0 0 0 0 0 0.03 0 0 0 0 0 0 0 0 0 0 0 0 0 0 0 0 0 0 0 0 
##$DATE= 1768890280
##$DBL= (0..7)
120 120 120 120 120 120 120 120 
##$DBP= (0..7)
150 150 150 150 150 150 150 150 
##$DBP07= 0
##$DBPNAM0= <>
##$DBPNAM1= <>
##$DBPNAM2= <>
##$DBPNAM3= <>
##$DBPNAM4= <>
##$DBPNAM5= <>
##$DBPNAM6= <>
##$DBPNAM7= <>
##$DBPOAL= (0..7)
0.5 0.5 0.5 0.5 0.5 0.5 0.5 0.5 
##$DBPOFFS= (0..7)
0 0 0 0 0 0 0 0 
##$DE= 6
##$DECBNUC= <off>
##$DECIM= 32
##$DECNUC= <off>
##$DECSTAT= 4
##$DIGMOD= 1
##$DIGTYP= 9
##$DL= (0..7)
0 120 120 120 120 120 120 120 
##$DP= (0..7)
$$ [...]
##$SUBNAM2= <"">
##$SUBNAM3= <"">
##$SUBNAM4= <"">
##$SUBNAM5= <"">
##$SUBNAM6= <"">
##$SUBNAM7= <"">
##$SUBNAM8= <"">
##$SUBNAM9= <"">
##$SW= 18.0517328524113
##$SWIBOX= (0..15)
0 0 2 0 0 0 0 0 0 0 0 0 0 0 0 0 
##$SW_h= 3612.71676300578
##$TD= 16384
##$TD0= 1
##$TE= 0
##$TE2= 300
##$TE3= 300
##$TEG= 300
##$TL= (0..7)
0 120 120 120 120 120 120 120 
##$TP= (0..7)
150 150 150 150 150 150 150 150 
##$TP07= 0
##$TPNAME0= <>
##$TPNAME1= <>
##$TPNAME2= <>
##$TPNAME3= <>
##$TPNAME4= <>
##$TPNAME5= <>
##$TPNAME6= <>
##$TPNAME7= <>
##$TPOAL= (0..7)
0.5 0.5 0.5 0.5 0.5 0.5 0.5 0.5 
##$TPOFFS= (0..7)
0 0 0 0 0 0 0 0 
##$TUNHIN= 0
##$TUNHOUT= 0
##$TUNXOUT= 0
##$USERA1= <user>
##$USERA2= <user>
##$USERA3= <user>
##$USERA4= <user>
##$USERA5= <user>
##$V9= 5
##$VALIST= <valist>
##$VCLIST= <CCCCCCCCCCCCCCC>
##$VD= 0
##$VDLIST= <DDDDDDDDDDDDDDD>
##$VPLIST= <PPPPPPPPPPPPPPP>
##$VTLIST= <TTTTTTTTTTTTTTT>
##$WBST= 1024
##$WBSW= 4
##$XGAIN= (0..3)
0 0 0 0 
##$XL= 0
##$YL= 0
##$YMAX_a= 331948
##$YMIN_a= -233212
##$ZGOPTNS= <>
##$ZL1= 120
##$ZL2= 120
##$ZL3= 120
##$ZL4= 120
##$ABSF1= 0
##$ABSF2= 0
##$ABSG= 0
##$ABSL= 0
##$ALPHA= 0
##$AQORDER= 0
##$ASSFAC= 0
##$ASSFACI= 0
##$ASSFACX= 0
##$ASSWID= 0
##$AUNMP= <proc_1d>
##$AZFE= 0.1
##$AZFW= 0.1
##$BCFW= 0
##$BC_mod= 2
##$BYTORDP= 0
##$COROFFS= 0
##$CY= -3
##$DATMOD= 1
##$DC= 0
##$DFILT= <>
##$DTYPP= 0
##$F1P= 0
##$F2P= 0
##$FCOR= 1
##$FTSIZE= 16384
##$FT_mod= 6
##$GAMMA= 0
##$GB= 0
##$INTBC= 1
##$INTSCL= 3.241238e-09
##$ISEN= 128
##$LB= 0.25
##$LEV0= 0
##$LPBIN= 0
##$MAXI= 10000
##$MC2= 0
##$MEAN= 0
##$ME_mod= 0
##$MI= 1.114404
##$NCOEF= 0
##$NC_proc= -6
##$NLEV= 6
##$NOISF1= 3.799351
##$NOISF2= 2.8
##$NSP= 0
##$NTH_PI= 0
##$NZP= 0
##$OFFSET= 15.46373
##$PC= 1
##$PHC0= -5297.497
##$PHC1= 7.62193
##$PH_mod= 1
##$PKNL= yes
##$PPARMOD= 0
##$PSCAL= 0
##$PSIGN= 0
##$REVERSE= no
##$SF= 200.13001160299
##$SI= 16384
##$SIGF1= 3
##$SIGF2= 2
##$SINO= 0.751879
##$SIOLD= 32768
##$SREGLST= <19F.Aceton>
##$SSB= 0
##$STSI= 16384
##$STSR= 0
##$SW_p= 3612.71676300578
##$SYMM= 0
##$S_DEV= 0
##$TDeff= 16384
##$TDoff= 0
##$TI= <>
##$TILT= no
##$TM1= 0
##$TM2= 0
##$TOPLEV= 0
##$USERP1= <user>
##$USERP2= <user>
##$USERP3= <user>
##$USERP4= <user>
##$USERP5= <user>
##$WDW= 1
##$XDIM= 16384
##$YMAX_p= 451241558
##$YMIN_p= -628847
$$ End of Bruker specific parameters
$$ ---------------------------------
##NTUPLES= NMR SPECTRUM
##VAR_NAME=  FREQUENCY,     SPECTRUM/REAL,   SPECTRUM/IMAG
##SYMBOL=    X,             R,               I
##VAR_TYPE=  INDEPENDENT,   DEPENDENT,       DEPENDENT
##VAR_FORM=  AFFN,          ASDF,            ASDF
##VAR_DIM=   16384,         16384,           16384
##UNITS=     HZ,            ARBITRARY UNITS, ARBITRARY UNITS
##FACTOR=    0.220516191357247, 1,           1
##FIRST=     3094.75643598678, 0,            0
##LAST=      -517.960327018998, 0,           0
##MIN=       -517.960327018998, -628847,     0
##MAX=       3094.75643598678, 451241558,    0
$$ Real data points
##PAGE= N=1
##DATA TABLE= (X++(R..R)), XYDATA
$$ [...]
$$ plain form
7217 236210 177681 257753 202213 340551 398856 366356 364402 268353 220972 192893 255337 244353
7205 244353 403296 315460 330128 439426 203129 487325 332617 353787 365544 364264 477693
7194 477693 421808 389760 346114 466511 296749 433634 430044 -24781 371075 319704 368023
7183 368023 559694 336203 318078 193813 386160 431372 411442 555183 487832 577328 619750
7172 619750 277841 295760 163081 362255 556899 569776 513241 419801 328308 494928 446468
7161 446468 347079 381930 337172 463401 671152 457539 551634 397370 259856 552038
7151 552038 518215 554796 457406 476374 498498 635039 601140 382471 310371 399201 523148
7140 523148 800914 633548 580629 381845 402073 525865 654873 537395 585203 579144 557470
$$ packed form
7217B36210n8529Q0072n5540J38338N8305l2500j954r6049m7381k8079O2444j0984
7205B44353J58943q7836J4668J09298k36297K84196j54708K1170J1757j280J13429
7194D77693n5885l2048m3646J20397j69762J36885l590m54825L95856n1371M8319
7183C68023J91671k23491j8125j24265J92347M5212j9930J43741o7351Q9496M2422
7172F19750l41909J7919j32679J99174J94644J2877n6535r3440r1493J66620m8460
7161D46468r9389L4851m4758J26229K07751k13613R4095j54264j37514K92182
7151E52038l3823L6581r7390J8968K2124J36541l3899k18669p2100Q8830J23947
7140E23148K77766j67366n2919j98784K0228J23792J29008j17478M7808o059k1674
$$ plain form
7129 557470 790280 655378 513410 416506 325269 673151 679595 665531 489785 430370 648623
7118 648623 638400 820087 330155 626882 682693 589047 932664 652878 605390 540703 542440
7107 542440 811377 680494 741582 658343 749844 667099 811575 773314 481325 676675 740629
7096 740629 778118 896161 806807 560232 601493 730910 920483 667980 740570 700397 666259
7085 666259 841420 973696 848875 636123 848483 949933 910214 1115546 819095 719828
7075 719828 930501 1056424 935688 972863 956535 814561 1066950 1049644 1151631 1128694
7065 1128694 1075447 1188652 1214024 1250346 1200576 1273046 1288122 1303158 1505429 1166906 1223739
7054 1223739 1138997 1190127 1345765 1264690 1284555 1006537 1076287 1336396 1128817 1184968 1197304
$$ packed form
7129E57470K32810j34902j41968r6904r1237L47882O444j4064j75746n9415K18253
7118F48623j0223J81687m89932K96727N5811r3646L43617k79786m7488o4687J737
7107E42440K68937j30883O1088q3239R1501q2745J44476l8261k91989J95350O3954
7096G40629L7489J18043q9354k46575M1261J29417J89573k52503P2590m0173l4138
7085F66259J75161J32276j24821k12752K12360J01450l9719K05332k96451r9267
7075G19828K10673J25923j20736L7175j6328j41974K52389j7306J01987k2937
7065A128694n3247J13205K5372L6322m9770P2470J5076J5036K02271l38523N6833
7054A223739q4742N1130J55638q1075J9865k78018O9750K60109k07579N6151J2336
$$ plain form
7043 1197304 1260540 1278486 1445833 1320712 1048620 1269818 1070807 1338829 1469930 1329042
7033 1329042 1165489 1265545 1199501 1201189 1337212 1281587 1323818 1312505 1403885 1495556 1331910
7022 1331910 1433138 1339829 1311795 1523943 1483064 1606366 1596614 1563917 1528941 1409246 1593749
7011 1593749 1587484 1617217 1826583 1660493 1718582 1659256 1796179 1647267 1791863 1951253
7001 1951253 1889885 1957676 2080077 2063338 1924283 2132592 2048649 2011855 2335264 2144403
6991 2144403 2196469 2266310 2273555 2342632 2460066 2603943 2442858 2439239 2536504 2575342 2640627
6980 2640627 2711341 2621129 2623680 2633698 2710526 2704003 2795630 2845586 2829522 2797332 2948733 2875678
6968 2875678 2867805 2984408 3007773 2954217 3130463 3202475 3158879 3175358 3247801 3253071 3465286
$$ packed form
7043A197304O3236J7946J67347j25121k72092K21198j99011K68022J31101j40888
7033A329042j63553J00056o6044J688J36023n5625M2231j1313R1380R1671j63646
7022A331910J01228r3309k8034K12148m0879J23302r752l2697l4976j19695J84503
7011A593749o265K9733K09366j66090N8089n9326J36923j48912J44596J59390
7001A951253o1368O7791J22401j6739j39055K08309q3943l6794L23409j90861
6991B144403N2066O9841P245O9077J17434J43877j61085l619R7265L8838O5285
6980B640627P0714r0212K551J0018P6828o523R1627M9956j6064l2190J51401p3055
6968B875678p873J16603K3365n3556J76246P2012m3596J6479P2443N270K12215
$$ plain form
6957 3465286 3531041 3653598 3705975 3414782 3762678 3475332 3688202 4033874 3773780 4030767
6947 4030767 4200708 4127503 4099647 4228280 4236812 4298287 4662034 4778329 4878600 4773414
6937 4773414 4938001 4952226 4899802 5264209 5461116 5567705 5831803 6004933 5663252 5823680
6927 5823680 6050753 6030846 6492756 6780615 6859220 7023583 7077181 7263623 7181938 7359919
6917 7359919 7798432 8034227 8429901 8793147 8872379 8869418 9236781 9650986 9722735 10412960
6907 10412960 10646812 10906102 11584126 11681983 12180440 12491867 12938394 13562824 13975160 14612878
6897 14612878 15258241 15816346 16293244 16949072 17756634 18418639 19395027 20355928 21306360
6888 21306360 22542800 23550088 24663632 26102123 27479938 29129219 30885072 32607469
$$ packed form
6957C465286O5755J22557N2377k91193L47896k87346K12870L45672k60094K56987
6947D030767J69941p3205k7856J28633Q532O1475L63747J16295J00271j05186
6937D773414J64587J4225n2424L64407J96907J06589K64098J73130l41681J60428
6927E823680K27073j9907M61910K87859P8605J64363N3598J86442q1685J77981
6917G359919M38513K35795L95674L63246P9232k961L67363M14205P1749O90225
6907A0412960K33852K59290O78024R7857M98457L11427M46527O24430M12336O37718
6897A4612878O45363N58105M76898O55828Q07562O62005R76388R60901R50432
6888B1306360J236440J007288J113544J438491J377815J649281J755853J722397
$$ plain form
6880 32607469 34851917 37172334 39672413 42533882 45497607 48597291 52156549 56163948
6872 56163948 60690808 65288346 70297057 75797939 81285437 87021852 92722471 97985799
6864 97985799 102871351 107143810 110389502 112267917 112927219 111896819 109385562 105797460
6856 105797460 101307021 96156609 90391144 84693491 78789640 73238345 68106842 62872274
6848 62872274 58280937 53872292 49935166 46460030 43039406 40220358 37476336 35030213
6840 35030213 32727912 30765329 28782364 26998623 25767313 24169531 22839978 21762546
6832 21762546 20525529 19556965 18495317 17756592 16941911 15996630 15632929 14806201 14105094
6823 14105094 13761312 12946409 12549073 12189055 11704188 11323094 10866944 10402639 10036379
$$ packed form
6880C2607469K244448K320417K500079K861469K963725L099684L559258M007399
6872E6163948M526860M597538N008711N500882N487498N736415N700619N263328
6864I7985799M885552M272459L245692J878415O59302j030400k511257l588102
6856A05797460m490439n150412n765465n697653n903851n551295n131503n234568
6848F2872274m591337m408645l937126l475136l420624k819048k744022k446123
6840C5030213k302301j962583j982965j783741j231310j597782j329553j077432
6832B1762546j237017r68564j061648p38725q14681r45281l63701q26728p01107
6823A4105094l43782q14903l97336l60018m84867l81094m56150m64305l66260
$$ plain form
6814 10036379 9982216 9618915 9322779 9057782 8745699 8570442 8139923 7984821 7605731 7440877
6804 7440877 7386541 7139677 7025988 6819481 6502412 6195168 6167278 5917812 5674550 5697277
6794 5697277 5331524 5314025 5245452 5191868 4832460 4614311 4680342 4373942 4492234 4355299
6784 4355299 4175921 4136568 4029012 3969806 3750634 3655420 3577778 3423171 3410368 3400998 3327137
6773 3327137 2945936 3033856 2970536 2966368 3128197 2905459 2784805 2726478 2601159 2822834
6763 2822834 2750179 2607593 2507866 2409850 2443198 2290197 2331812 2246103 2207709 2397522 2293581
6752 2293581 2170831 2092744 1829026 1883914 1840423 1883148 1905814 1777262 1774091 1597016 1464796
6741 1464796 1436359 1458918 1476241 1587451 1652015 1504340 1539914 1348326 1310258 1421413 1238507
$$ packed form
6814A0036379n4163l63301k96136k64997l12083j75257m30519j55102l79090j64854
6804G440877n4336k46864j13689k06507l17069l07244k7890k49466k43262K2727
6794E697277l65753j7499o8573n3584l59408k18149O6031l06400J18292j36935
6784D355299j79378l9353j07556n9206k19172r5214p7642j54607j2803r370p3861
6773C327137l81201Q7920o3320m168J61829k22738j20654n8327j25319K21675
6763B822834p2655j42586r9727r8016L3348j53001M1615q5709l8394J89813j03941
6752B293581j22750p8087k63718N4888m3491M2725K2666j28552l171j77075j32220
6741A464796k8437K2559J7323J11210O4564j47675L5574j91588l8068J11155j82906
$$ plain form
6730 1238507 1250332 1410699 1461713 1343889 1370384 1266451 1030699 1133516 1241415 1115116
6720 1115116 1129120 1159130 1060260 988881 1165671 922131 980692 1057089 981378 1059587 1081399
6709 1081399 972726 839717 956685 904055 992003 971099 974783 1012986 878497 958857 742721
6698 742721 784671 972418 889967 1073554 927329 734868 637589 713326 767169 828084 864292
6687 864292 739441 718381 782357 561027 458644 620088 588906 732443 1023489 712104
6677 712104 598148 580053 453901 503636 689848 697588 690403 827398 796630 627530 592302
6666 592302 600722 701057 852593 905626 850342 778427 805509 820786 779132 685520 714343
6655 714343 639028 775803 838798 544654 599902 322070 471338 561156 352553 613404
$$ packed form
6730A238507J1825J60367N1014j17824K6495j03933k35752J02817J07899j26299
6720A115116J4004L0010r8870p1379J76790k43540N8561P6397p5711P8209K1812
6709A081399j08673j33009J16968n2630Q7948k0904L684L8203j34489Q0360k16136
6698G42721M1950J87747q2451J83587j46225j92461r7279P5737N3843O0915L6208
6687H64292j24851k1060O3976k21330j02383J61444l1182J43537K91046l11385
6677G12104j13956j8095j26152M9735J86212P740p185J36995l0768j69100l5228
6666E92302Q420J00335J51536N3033n5284p1915K7082J5277m1654r3612K8823
6655G14343p5315J36775O2995k94144N5248k77832J49268Q9818k08603K60851
$$ plain form
6645 613404 337405 486131 612189 613938 511615 310864 469673 433266 478071 655998
6635 655998 406217 437879 527389 418014 447316 499838 230910 291749 351199 287147 438187
6624 438187 418139 332117 363455 303210 221390 221337 344552 436700 558229 611698 481677 209898
6612 209898 249937 350472 284338 521892 481080 341299 418104 506927 368858 308661 158951
6601 158951 204211 345201 440986 505185 361082 237556 316544 207712 364331 394131 106131
6590 106131 403327 347935 391900 552477 205179 158810 358045 317514 383872 569879 529126
6579 529126 427741 372107 338711 282007 316107 464175 378303 433556 348834 329549 311884
6568 311884 300344 244738 330957 308957 392409 602230 318098 383093 357507 271342 317171
$$ packed form
6645F13404k75999J48726J26058J749j02323k00751J58809l6407M4805J77927
6635F55998k49781L1662Q9510j09375K9302N2522k68928O0839N9450o4052J51040
6624D38187k0048q6022L1338o0245q1820n3J23215R2148J21529N3469j30021k71779
6612B09898M0039J00535o6134K37554m0812j39781P6805Q8823j38069o0197j49710
6601A58951M5260J40990R5785O4199j44103j23526P8988j08832J56619K9800k88000
6590A06131K97196n5392M3965J60577l47298m6369J99235m0531O6358J86007m0753
6579E29126j01385n5634l3396n6704L4100J48068q5872N5253q4722j9285j7665
6568C11884j1540n5606Q6219k2000Q3452K09821k84132O4995k5586q6165M5829
$$ plain form
6557 317171 353288 496471 391488 366096 413469 344158 464806 418438 455374 260483 481681
6546 481681 245585 288536 380386 212596 374771 319510 350483 395340 242929 348848 351824
6535 351824 271240 293893 445753 402799 310916 394469 222655 203645 363447 409415 218201
6524 218201 267416 339959 244390 301661 533384 304212 377754 387650 336310 277983 392853
6513 392853 293105 131191 382060 283711 -23396 417759 309738 153836 460403 165596
6503 165596 201673 400632 244668 220628 354767 275966 327616 331964 436189 284412 323710
6492 323710 430961 208887 279911 475086 197166 381040 267230 384211 343805 469389
6482 469389 553649 286596 414357 199632 385634 603702 367865 394662 377684 307037
$$ packed form
6557C17171L6117J43183j04983k5392M7373o9311J20648m6368L6936j94891K21198
6546D81681k36096M2951R1850j67790J62175n5261L0973M4857j52411J05919K976
6535C51824q0584K2653J51860m2954r1883Q3553j71814j9010J59802M5968j91214
6524B18201M9215P2543r5569N7271K31723k29172P3542R896n1340n8327J14870
6513C92853r9748j61914K50869r8349l07107M41155j08021j55902L06567k94807
6503A65596L6077J98959j55964k4040J34139p8801N1650M348J04225j51777L9298
6492C23710J07251k22074P1024J95175k77920J83874j13810J16981m0406J25584
6482D69389Q4260k67053J27761k14725J86002K18068k35837K6797j6978p0647
$$ plain form
6472 307037 493613 516701 440572 323557 442685 304624 644897 607639 355831 318785
6462 318785 508186 574244 584990 673834 720268 469062 801389 742985 523838 585728 599770
6451 599770 540040 718852 889019 561683 575149 547763 494463 580519 583038 628262 582806
6440 582806 658343 708771 493448 521960 475982 533052 641253 917650 650662 669868 717823
6429 717823 560072 748848 1082962 1112860 1197092 1178998 1092139 876281 697325 738483 631670
6418 631670 691530 892790 916923 795292 735428 741182 470837 602715 792976 666235 948825
6407 948825 884875 829238 707535 688714 747951 595528 795295 834313 852999 1116076 1008143
6396 1008143 999641 878572 1051055 1198750 1186898 1231316 1130721 940667 1004653 999688 884581
$$ packed form
6472C07037J86576K3088p6129j17015J19128j38061L40273l7258k51808l7046
6462C18785J89401O6058J0746Q8844M6434k51206L32327n8404k19147O1890J4042
6451E99770n9730J78812J70167l27336J3466k7386n3300Q6056K519M5224m5456
6440E82806P5537N0428k15323K8512m5978N7070J08201K76397k66988J9206M7955
6429G17823j57751J88776L34114K9898Q4232j8094q6859k15858j78956M1158j06813
6418F31670N9860K01260K4133j21631n9864N754k70345J31878J90261j26741K82590
6407I48825o3950n5637j21703j8821N9237j52423J99767L9018J8686K63077j07933
6396A008143q502j21069J72483J47695j1852M4418j00595j90054O3986m965j15107
$$ plain form
6385 884581 1010054 794590 913475 1130917 1017192 987350 902455 828512 904497 1126346
6375 1126346 1019801 896990 996734 760050 971141 917620 731563 865209 674170 784806
6365 784806 1015221 787023 908606 915272 881795 938769 948042 845337 865661 727347 920757
6354 920757 931656 847989 997658 770797 866382 875818 841640 897160 819551 930225 850995
6343 850995 770938 891199 746084 663344 902462 827090 779501 889032 656796 664801 588663
6332 588663 776591 654022 784166 963168 692923 761417 812333 720384 753742 727102 788533
6321 788533 664797 813510 798678 730768 847182 797494 788500 650577 842050 895516 782715
6310 782715 869291 747215 604106 770174 916278 932367 877394 996015 909631 1043025
$$ packed form
6385H84581J25473k15464J18885K17442j13725k9842q4895p3943P5985K21849
6375A126346j06545j22811R9744k36684K11091n3521j86057J33646j91039J10636
6365G84806K30415k28198J21583O666l3477N6974R273j02705K0324j38314J93410
6354I20757J0899q3667J49669k26861R5585R436l4178N5520p7609J10674p9230
6343H50995q0057J20261j45115q2740K39118p5372m7589J09531k32236Q005p6138
6332E88663J87928j22569J30144J79002k70245O8494N0916r1949L3358k6640O1431
6321G88533j23736J48713j4832o7910J16414m9688q994j37923J91473N3466j12801
6310G82715Q6576j22076j43109J66068J46104J6089n4973J18621q6384J33394
$$ plain form
6300 1043025 985810 961663 943641 943664 1100069 942241 941723 999036 754959 921334 959275 963597
6288 963597 1074515 1042871 1092578 894283 1077367 912278 884861 1098997 958408 1131636
6278 1131636 1205403 1045171 1190383 1050344 1126427 1115552 1154980 1270703 1180354 1070888
6268 1070888 1174508 1297339 1303102 1390543 1328797 1236011 1393653 1281115 1287873 1257330 1305287
6257 1305287 1255721 1322587 1525107 1214032 1373702 1433168 1264477 1542001 1513599 1331206
6247 1331206 1479441 1406357 1454283 1472656 1611860 1445472 1511487 1575498 1506490 1625820 1567538
6236 1567538 1594241 1847261 1736039 2027068 1949076 1663625 1816425 1784526 1824656 1930579
6226 1930579 1915504 1882466 1759266 1864703 1953344 1773311 1952507 1839297 1945553 2109991
$$ packed form
6300A043025n7215k4147j8022K3J56405j57828n18N7313k44077J66375L7941M322
6288I63597J10918l1644M9707j98295J83084j65089k7417K14136j40589J73228
6278A131636P3767j60232J45212j40039P6083j0875L9428J15723r0349j09466
6268A070888J03620J22831N763Q7441o1746r2786J57642j12538O758l0543M7957
6257A305287m9566O6866K02520l11075J59670N9466j68691K77524k8402j82393
6247A331206J48235p3084M7926J8373J39204j66388O6015O4011o9008J19330n8282
6236A567538K6703K53020j11222K91029p7992k85451J52800l1899M0130J05923
6226A930579j5075l3038j23200J05437Q8641j80033J79196j13210J06256J64438
$$ plain form
6216 2109991 2139465 2092146 1889534 2073505 2061519 2115056 2364101 2214068 2476422 2333431
6206 2333431 2628836 2538723 2455483 2686784 2579651 2879318 2883976 2968843 2814766 2705088
6196 2705088 2951941 2769349 3030192 3136825 3027346 3343978 3314009 3356328 3366605 3488855
6186 3488855 3762088 3928661 4072215 4310763 4319965 4509618 4634474 4660797 4546257 4743984
6176 4743984 4711002 4657192 5049747 4905817 4868824 5217403 5215178 5558607 5760082 5816972 5833830
6165 5833830 5798260 5925059 5918665 5927646 5940463 6020527 6036542 6353382 6451784 6553795 6832881
6154 6832881 7072933 7338798 7704194 8153782 8524808 8786936 9090168 9194856 9572317 9849134
6144 9849134 10034026 10475928 10728289 11255299 11675405 12127776 12794448 13341166 14197661 14882193
$$ packed form
6216B109991K9474m7319k02612J83971j1986N3537K49045j50033K62354j42991
6206B333431K95405r0113q3240K31301j07133K99667M658Q4867j54077j09678
6196B705088K46853j82592K60843J06633j09479L16632k9969M2319J0277J22250
6186C488855K73233J66573J43554K38548R202J89653J24856K6323j14540J97727
6176D743984l2982n3810L92555j43930l6993L48579k225L43429K01475N6890J6858
6165E833830l5570J26799o394Q981J2817Q0064J6015L16840R8402J02011K79086
6154F832881K40052K65865L65396M49588L71026K62128L03232J04688L77461K76817
6144I849134J84892M41902K52361N27010M20106M52371O66672N46718Q56495O84532
$$ plain form
6134 14882193 15814132 16958393 18559322 21437080 25717040 32467460 39649559 43466990
6126 43466990 43105115 39287077 34098594 29431101 25747033 23334221 21730946 20905882
6118 20905882 20578326 20057821 20316136 20964934 21579056 22544929 23456888 24541814 25822085
6109 25822085 27548732 29535706 31729005 34222500 37307309 40773906 45058615 50797923
6101 50797923 57147528 65040126 75407280 89807116 110671840 135722884 155067250
6094 155067250 158920436 148466344 130516038 111451158 95033932 81815461 71937627
6087 71937627 64292363 58451604 54040377 50878522 49455548 48619969 48791302 49871484
6079 49871484 51246979 53526503 56584968 60399896 65236405 71135464 77947289 85658338
$$ packed form
6134A4882193R31939J144261J600929K877758M279960O750420P182099L817431
6126D3466990l61875l818038n188483m667493l684068k412812j603275q25064
6118B0905882l27556n20505K58315O48798O14122R65873R11959J084926J280271
6109B5822085J726647J986974K193299K493495L084809L466597M284709N739308
6101E0797923O349605P892598J0367154J4399836K0864724K5051044J9344366
6094A55067250L853186j0454092j7950306j9064880j6417226j3218471r877834
6087G1937627p645264n840759m411227l161855j422974q35579J71333J080182
6079D9871484J375495K279524L058465L814928M836509N899059O811825P711049
$$ plain form
6071 85658338 94427912 104048223 113848133 123372666 132544903 142591901 155833930 173435076
6063 173435076 189462425 192823420 180215076 157942233 133001645 110797652 92983936
6056 92983936 79061070 68743023 60468282 54351734 49820132 46607674 44845068 43638097
6048 43638097 43490735 43846846 44816954 46181449 48243879 51075320 53732494 57088397 59743633
6039 59743633 61730570 63307185 63254276 62645063 61442743 60047530 60113705 62433145 65913770
6030 65913770 67331440 63972801 56444298 47864246 39691310 32848323 27876844 23895611
6022 23895611 20809174 18375615 16215448 14478111 13229542 12074910 11343497 10861394
6014 10861394 10149611 9655709 9145767 8657098 8277964 7724907 7377593 7073630 6772384
$$ packed form
6071H5658338Q769574R620311R799910R524533R172237J0046998J3242029J7601146
6063A73435076J6027349L360995j2608344k2272843k4940588k2203993j7813716
6056I2983936j3922866j0318047q274741o116548m531602l212458j762606j206971
6048D3638097j47362L56111R70108J364495K062430K831441K657174L355903K655236
6039E9743633J986937J576615n2909o09213j202320j395213O6175K319440L480625
6030F5913770J417670l358639p528503q580052q172936o842987m971479l981233
6022B3895611l086437k433559k160167j737337j248569j154632p31413m82103
6014A0861394p11783m93902n09942m88669l79134n53057l47314l03963l01246
$$ plain form
6005 6772384 6656756 6384628 6049556 5786574 5572435 5257323 5147637 5164633 4714702 4563525
5995 4563525 4549982 4135926 4141403 4025262 3846730 3785233 3698438 3689696 3559282 3365043 3189629
5984 3189629 3217122 3047223 3143666 3151487 2685045 2989039 2780966 2551380 2601944 2439612
5974 2439612 2272867 2320028 2523890 2256118 2220848 1966865 1957757 1849369 1893206 2293030
5964 2293030 1674065 1683749 1786351 1474728 1688211 1609133 1419935 1419026 1598934 1351366 1490820
5953 1490820 1430644 1282257 1266459 1179717 1333701 1314420 1298588 1297414 1130675 1084057 1271299
5942 1271299 1077540 1071715 1034952 895001 1029587 969134 897985 871643 878495 835060 708350
5931 708350 994359 751232 774750 727731 471678 712771 569180 581098 622428 378151
$$ packed form
6005F772384j15628k72128l35072k62982k14139l15112j09686J6996m49931j51177
5995D563525j3543m14056N477j16141j78532o1497q6795q742j30414j94239j75414
5984C189629K7493j69899R6443P821m66442L03994k08073k29586N0564j62332
5974B439612j66745M7161K03862k67772l5270k53983r108j08388M3837L99824
5964B293030o18965R684J02602l11623K13483p9078j89198r09J79908k47568J39454
5953A490820o0176j48387j5798q6742J53984j9281j5832j174j66739m6618J87242
5942A271299j93759n825l6763j39951J34586o0453p1149k6342O852m3435j26710
5931G08350K86009k43127K3518m7019k56053K41093j43591J1918M1330k44277
$$ plain form
5921 378151 485050 619503 546128 478440 565458 450403 600908 621714 446408 555466
5911 555466 401615 601758 581234 553645 511180 455175 353830 458794 612861 455732
5901 455732 409692 256637 294366 445779 208582 273002 94574 65871 305124 317527 369363
5890 369363 85698 25031 121199 223222 303343 203642 182929 31549 230440 405417 120897
5879 120897 202499 126892 31671 263435 278787 127819 58233 107435 222083 47219 226942
5868 226942 82170 -104092 150579 235886 130061 47526 121152 40657 -97899 141158
5858 141158 49017 -60089 207442 98550 110774 187902 78030 -9944 -52578 -27490 71218
5847 71218 40297 26838 97929 -27395 -15861 31277 -175904 23346 18869 48236 179729
$$ packed form
5921C78151J06899J34453p3375o7688Q7018j15055J50505K0806j75306J09058
5911E55466j53851K00143k0524k7589m2465n6005j01345J04964J54067j57129
5901D55732m6040j53055L7729J51413k37197O4420j78428k8703K39253J2403N1836
5890C69363k83665o0667R6168J02023Q0121r9701k0713j51380J98891J74977k84520
5879A20897Q1602p5607r5221K31764J5352j50968o9586M9202J14648j74864J79723
5868B26942j44772j86262K54671Q5307j05825q2535P3626q0495j38556K39057
5858A41158r2141j09106K67531j08892J2224P7128j09872q7974m2634K5088R8708
5847G1218l0921j3459P1091j25324J1534M7138k07181J99250m477K9367J31493
$$ plain form
5836 179729 -70328 45042 -76795 -87030 64750 84728 165417 -37410 136937 34205
5826 34205 -41205 123327 -5979 88417 10088 -80732 -49656 48328 42549 63062 69749 -48360
5814 -48360 44521 116908 109924 8362 -85476 -166809 -72533 112524 -85290 -71637 -129320
5803 -129320 -90246 60125 39802 132575 130443 92274 161116 44828 150531 181810 37126
5792 37126 166281 252710 378200 383160 289926 247605 37543 133268 227266 65367 335314
5781 335314 289164 261494 280817 242691 405932 179927 231654 352092 139256 248624 375828
5770 375828 304704 236033 308370 265612 360547 313035 408072 235537 371693 677795 608386
5759 608386 997974 880313 723918 673883 620479 829422 632407 685170 697515 547075
$$ packed form
5836A79729k50057J15370j21837j0235J51780J9978Q0689k02827J74347j02732
5826C4205p5410J64532j29306R4396p8329r0820L1076R7984n779K0513O687j18109
5814d8360R2881P2387o984j01562r3838q1333R4276J85057j97814J3653n7683
5803a29320L9074J50371k0323R2773k132l8169O8842j16288J05703L1279j44684
5792C7126J29155Q6429J25490M960r3234m2321k10062R5725R3998j61899K69947
5781C35314m6150k7670J9323l8126J63241k26005N1727J20438k12836J09368J27204
5770C75828p1124o8671P2337m2758R4935m7512R5037j72535J36156L06102o9409
5759F08386L89588j17661j56395n0035n3404K08943j97015N2763J2345j50440
$$ plain form
5749 547075 597455 585704 480485 530524 747823 862832 831770 779258 473495 533843 485144
5738 485144 462049 475502 324679 402125 447436 486666 303820 351143 303302 325532 633311
5727 633311 715409 936486 760696 605055 955164 549496 558083 527306 318408 585855
5717 585855 727455 843497 898552 981375 1111059 1212731 1333885 1113202 955916 563591
5707 563591 405486 511746 315854 258064 271325 129045 264288 347494 152922 149954 155696
5696 155696 258569 232427 347867 392422 302242 419409 339826 338902 287330 304282 463854
5685 463854 339804 625883 734078 916999 1300781 1123035 1059764 935231 648080 481332
5675 481332 445630 442097 372785 169875 55642 87037 91829 96634 123871 10523 5088 73719
$$ packed form
5749E47075N0380j1751j05219N0039K17299J15009l1062n2512l05763O0348m8699
5738D85144k3095J3453j50823P7446M5311L9230j82846M7323m7841K2230L07779
5727F33311Q2098K21077j75790j55641L50109m05668Q587l0777k08898K67447
5717E85855J41600J16042N5055Q2823J29684J01672J21154k20683j57286l92325
5707E63591j58105J06260j95892n7790J3261j42280J35243Q3206j94572k968N742
5696A55696J02873k6142J15440M4555r0180J17167p9583r24n1572J6952J59572
5685D63854j24050K86079J08195J82921L83782j77746o3271j24533k87151j66748
5675D81332l5702l533o9312k02910j14233L1395M792M805K7237j13348n435O8631
$$ plain form
5663 73719 84247 12483 -17212 27890 93815 146239 325677 45303 -18659 161716 -98596
5652 -98596 169906 367717 277176 488614 405027 357815 473079 209852 224654 114491 159020
5641 159020 207935 35943 37650 -43885 55030 -15095 21748 21221 -110978 274858 32795
5630 32795 -33958 37683 -87794 -78404 -69914 146900 -28708 80629 140702 -90406 143257
5619 143257 74022 -65969 9585 -73368 -9327 87894 -1401 25407 -35564 -115948 -12729
5608 -12729 -37881 -95389 -84109 -48870 -99566 -66297 26809 -49867 80429 -113646 -119238 60582
5596 60582 -168907 104325 -146276 -135463 86018 -133711 154933 -92348 -168202 -13410
5586 -13410 -146096 -18985 -91358 -8369 -126039 -191419 43706 -160647 -8034 49317 -280802
$$ packed form
5663G3719J0528p1764k9695M5102O5925N2424J79438k80374o3962J80375k60312
5652i8596K68502J97811r0541K11438q3587m7212J15264k63227J4802j10163M4529
5641A59020M8915j71992J707q1535R8915p0125L6843n27j32199L85836k42063
5630C2795o6753P1641j25477R390Q490K16814j75608J09337O0073k31108K33663
5619A43257o9235j39991P5554q2953O4041R7221q9295K6808o0971q0384J03219
5608a2729k5152n7508J1280L5239n0696L3269R3106p6676J30296j94075n592J79820
5596F0582k29489K73232k50601J0813K21481k19729K88644k47281p5854J54792
5586a3410j32686J27111p2373Q2989j17670o5380K35125k04353J52613N7351l30119
$$ plain form
5575 -280802 -97188 -122768 -121254 69286 -67797 85248 61294 -197831 60210 -99423
5565 -99423 -121316 -8626 62269 -31186 -177852 4201 -207960 -141819 -131373 -120518 -27065
5554 -27065 82003 156578 -60916 -11823 -73480 -152824 -50559 122284 25368 19785 83806
5543 83806 -135350 48863 -14413 71221 -137471 -165275 90927 -134082 36710 -69101
5533 -69101 -281012 71367 -123606 19559 113427 -108384 -9281 -39883 72598 8791 -179696
5522 -179696 -34871 -221873 -99686 37626 28198 -46640 -160986 99300 -61903 -65620 89615
5511 89615 -48630 -33294 139975 -107115 -67079 32317 -99059 2105 32713 -113161 -13082
5500 -13082 -189374 19464 192540 76289 7771 -40587 -207542 -2172 59228 -42142
$$ packed form
5575b80802J83614k5580J514J90540j37083J53045k3954k59125K58041j59633
5565i9423k1893J12690P0895r3455j46666J82053k12161O6141J0446J0855R3453
5554b7065J09068P4575k17494M9093o1657p9344J02265J72843r6916n583O4021
5543H3806k19156J84213o3276Q5634k08692k7804K56202k25009J70792j05811
5533f9101k11911L52379j94973J43165R3868k21811R9103l0602J12481o3807j88487
5522a79696J44825j87002J22187J37312r428p4838j14346K60286j61203l717J55235
5511H9615j38245J5336J73269k47090M0036R9396j31376J01164L0608j45874J00079
5500a3082j76292K08838J73076j16251o8518m8358j66955K05370O1400j01370
$$ plain form
5490 -42142 84129 -40767 33102 170009 -14772 -13036 6192 -141339 97468 120152 86796
5479 86796 105571 -117310 -68189 91218 -31405 4515 -68258 -39752 -111151 78713 121159
5468 121159 13186 51006 118086 -79030 -88088 192235 11785 39770 176828 -38823 -52487
5457 -52487 4093 21197 630 -13326 241273 -11776 14476 145214 -104907 -59823 103284
5446 103284 -38428 -38538 -63945 -26206 -74787 -54431 28977 -75879 -31586 74810 -148580
5435 -148580 -7796 -34538 -280090 21559 -64394 18242 185783 -88548 -66980 -9257 -134883
5424 -134883 49825 94323 -117038 -43065 135943 11774 41325 -75090 -104508 -68165 45175
5413 45175 130604 41392 -18270 -140999 -159964 -207261 66701 69032 -104673 155393 88080
$$ packed form
5490d2142J26271j24896P3869J36907j84781J736J9228j47531K38807K2684l3356
5479H6796J8775k22881M9121J59407j22623L5920p2773K8506p1399J89864M2446
5468A21159j07973L7820O7080j97116r058K80323j80450K7985J37058k15651j3664
5457e2487N6580J7104k0567j3956K54599k53049K6252J30738k50121M5084J63107
5446A03284j41712j10k5407L7739m8581K0356Q3408j04856M4293J06396k23390
5435a48580J40784k6742k45552L01649q5953Q2636J67541k74331K1568N7723j25626
5424a34883J84708M4498k11361P3973J79008j24169K9551j16415k9418L6343J13340
5413D5175Q5429q9212n9662j22729j8965m7297K73962K331j73705K60066o7313
$$ plain form
5402 88080 89788 229796 -172563 -163254 75247 -68770 134856 154831 24414 74580 24089
5391 24089 12704 -12834 8724 117070 92447 197053 143356 -117073 -85107 -26465 14237
5380 14237 -58825 9651 -58168 -188448 104762 52722 -43702 -28930 -89831 30409 72168
5369 72168 184199 49939 -167266 81912 -29512 36970 53565 -38810 7656 -28338 45361
5358 45361 93194 -90809 -7858 86016 -126244 -35520 63175 -115638 -79909 98056 3905
5347 3905 52998 -25143 -27642 138559 -35157 -13461 79221 -150426 167646 97554 -43308
5336 -43308 46985 -80543 -70079 7513 68659 37032 23104 154090 24392 145771 6911
5325 6911 -35949 -94737 -270763 87158 -53437 33513 48801 -127045 -10331 -20062 73181
$$ packed form
5402H8080J708J40008m02359R309K38501j44017K03626J9975j30417N0166n0491
5391B4089j1385k5538K1558J08346k4623J04606n3697k60429L1966N8642M0702
5380A4237p3062O8476o7819j30280K93210n2040r6424J4772o0901J20240M1759
5369G2168J12031j34260k17205K49178j11424O6482J6595r2375M6466l5994P3699
5358D5361M7833j84003Q2951R3874k12260R0724R8695j78813L5729J77965r4151
5347C905M9093p8141k499J66201j73716K1696R2682k29647L18072p0092j40862
5336d3308R0293j27528J0464P7592O1146l1627j3928J30986j29698J21379j38860
5325F911m2860n8788j76026L57921j40595Q6950J5288j75846J16714r731R3243
$$ plain form
5314 73181 21357 -104987 -55932 10848 -1170 -119385 144280 -32711 -61079 75305 44405
5303 44405 -48693 -13911 10864 -61244 60376 3751 44599 47765 84541 104722 -44632 64632
5291 64632 35424 44772 94306 -12156 -71774 -122480 -68926 -4579 18793 -18266 106454 -25474
5279 -25474 -15827 127589 7011 22780 111237 -165806 -27352 124904 12985 138960 -165725
5268 -165725 -165260 46484 32154 285418 84548 -14966 -12215 -43259 198857 -61305 -31143
5257 -31143 -120415 -170775 204763 173101 147531 67037 12691 38500 64216 170287 71949
5246 71949 -21301 50787 82709 17241 205574 -26411 -74441 114848 -46893 73737 137319
5235 137319 53753 114334 37058 68568 7756 -10498 109666 23632 200914 167345 49541
$$ packed form
5314G3181n1824j26344M9055O6780j2018j18215K63665j76991k8368J36384l0900
5303D4405r3098L4782K4775p2108J21620n6625M0848L166L6776K0181j49354J09264
5291F4632k9208R348M9534j06462n9618n0706N3554O4347K3372l7059J24720j31928
5279b5474R647J43416j20578J5769Q8457k77043J38454J52256j11919J25975l04685
5268a65725M65K11744j4330K53264k00870r9514K751l1044K42116k60162L0162
5257c1143q9272n0360L75538l1662k5570q0494n4346K5809K5716J06071r8338
5246G1949r3250P2088L1922o5468J88333k31985m8030J89289j61741J20630O3582
5235A37319q3566O0581p7276L1510o0812j8254J20164q6034J77282l3569j17804
$$ plain form
5224 49541 -56925 34886 58696 37265 225076 -1558 -78889 150091 124311 -34032 31481
5213 31481 54879 -5643 122106 21729 1092 22729 -1728 78259 113184 148484 -53732
5202 -53732 -25954 1567 -11970 78802 -36699 -78239 -62120 154065 78521 109236 169180
5191 169180 -160623 70580 182157 -17503 243717 244513 32024 131243 159976 -36301 -54672
5180 -54672 43574 -59715 39410 211222 52699 78872 44880 -132727 -31915 94652 86640
5169 86640 -44437 186663 69284 -54356 116244 -132250 -52999 2892 123131 116680 160252
5158 160252 266895 18155 99925 115964 -108810 99570 68776 195289 153166 127814 285312
5147 285312 -47971 47401 138992 47752 63678 175289 301394 47146 158113 348731
$$ packed form
5224D9541j06466R1811K3810k1431J87811k26634p7331K28980k5780j58343O5513
5213C1481K3398o0522J27749j00377k0637K1637k4457P9987L4925L5300k02216
5202e3732K7778K7521j3537R0772j15501m1540J6119K16185p5544L0715N9944
5191A69180l29803K31203J11577j99660K61220P96k12489R9219K8733j96277j8371
5180e4672R8246j03289R9125J71812j58523K6173l3992j77607J00812J26567q012
5169H6640j31077K31100j17379j23640J70600k48494P9251N5891J20239o451M3572
5158A60252J06643k48740Q1770J6039k24774K08380l0794J26513m2123k5352J57498
5147B85312l33283R5372R1591r1240J5926J11611J26105k54248J10967J90618
$$ plain form
5137 348731 -109309 33727 79377 -55164 237164 182647 175693 81601 62325 154739 -53544
5126 -53544 143469 147665 111459 98409 116804 129684 -25827 136723 102198 64911 57403 -19222
5114 -19222 237218 -7425 139738 154376 -20689 142638 96812 123781 97580 94073 141538
5103 141538 109231 124275 142057 140388 108703 93032 143783 92380 48370 170508 212784 74888
5091 74888 297111 162137 7338 122920 43511 213715 301088 174141 388490 37276
5081 37276 -18804 136828 -38093 216701 145915 305031 274377 170674 210957 -60263 99226
5070 99226 74937 122470 263353 258811 247712 -11998 313117 70244 134634 358714 65183
5059 65183 127827 195629 153935 111048 157749 59458 88512 273745 184843 188544 -40681 7513
$$ packed form
5137C48731m58040J43036M5650j34541K92328n4517o954r4092j9276R2414k08283
5126e3544J97013M196l6206j3050J8395J2880j55511J62550l4525l7287p508p6625
5114a9222K56440k44643J47163J4638j75065J63327m5826K6969k6201l507M7465
5103A41538l2307J5044J7782j669l1685j5671N0751n1403m4010J22138M2276j37896
5091G4888K22223j34974j54799J15582p9409J70204Q7373j26947K14349l51214
5081C7276n6080J55632j74921K54794p0786J59116l0654j03703M0283k71220J59489
5070I9226k4289M7533J40883m542j1099k59710L25115k42873O4390K24080k93531
5059F5183O2644O7802m1694m2887M6701r8291K9054J85233q8902L701k29225M8194
$$ plain form
5047 7513 139994 231097 349560 137758 243800 89436 183122 211760 83595 162248 256266
5036 256266 183666 328370 306105 141182 26629 9718 154293 148303 365848 297763 75387
5025 75387 334691 110388 149548 120679 57655 223044 341623 485181 399718 357446 206420
5014 206420 250311 338761 349638 439187 493141 453574 486974 321193 239594 267815 226801
5003 226801 427136 637439 580580 505243 320923 359889 393260 587944 432587 598514
4993 598514 729321 421283 645577 474026 450287 629335 557886 745167 843066 688581
4983 688581 684435 471265 598171 543532 686759 753853 709692 649784 582767 618742 620036
4972 620036 683073 764317 781694 883635 811892 1016870 830758 705356 902683 827853 1016970
$$ packed form
5047G513J32481R1103J18463k11802J06042j54364R3686K8638j28165P8653R4018
5036B56266p2600J44704k2265j64923j14553j6911J44575n990K17545o8085k22376
5025G5387K59304k24303L9160k8869o3024J65389J18579J43558q5463m2272j51026
5014B06420M3891Q8450J0877Q9549N3954l9567L3400j65781q1599K8221m1014
5003B26801K00335K10303n6859p5337j84320L8966L3371J94684j55357J65927
4993E98514J30807l08038K24294j71551k3739J79048p1449J87281R7899j54485
4983F88581m146k13170J26906n4639J43227O7094m4161n9908o7017L5975J294
4972F20036O3037Q1244J7377J01941p1743K04978j86112j25402J97327p4830J89117
$$ plain form
4961 1016970 1039729 1007833 948143 820061 837475 764497 663742 851356 783041 887626 880022
4950 880022 801543 692332 698568 619913 754393 824988 898108 797030 918952 731941 701096
4939 701096 769849 711660 957270 1035181 969397 959190 1031913 986445 1004320 1152055 1020318
4928 1020318 1043686 1057395 898284 1025408 971883 1012346 1026935 1052336 1287825 1357123 1176983
4917 1176983 1594065 1584186 1691103 1966061 1815320 1749271 1655699 1417653 1290699 1212864
4907 1212864 1050492 1072100 1123579 973105 1139713 1136345 867033 1116526 1028464 1134444
4897 1134444 1369676 1296988 1242375 1066572 1215398 995955 1047275 1399570 1217989 1514973
4887 1514973 1662056 1724644 1860288 1948343 2172102 2046511 2409278 2610173 2440236 2425626
$$ packed form
4961A016970K2759l1896n9690j28082J7414p2978j00755J87614o8315J04585p604
4950H80022p8479j09211O236p8655J34480P0595P3120j01078J21922j87011l0845
4939G01096O8753n8189K45610P7911o5784j0207P2723m5468J7875J47735j31737
4928A020318K3368J3709j59111J27124n3525M0463J4589K5401K35489O9298j80140
4917A176983M17082r879J06917K74958j50741o6049r3572k38046j26954p7835
4907A212864j62372K1608N1479j50474J66608l368k69312K49493q8062J05980
4897A134444K35232p2688n4613j75803J48826k19443N1320L52295j81581K96984
4887A514973J47083O2588J35644Q8055K23759j25591L62767K00895j69937j4610
$$ plain form
4877 2425626 2153110 1828563 1649333 1652829 1292836 1211992 1403303 1308570 1304670 1223293 1086683
4866 1086683 1007568 1025028 1248641 1132831 1143762 1183882 1028868 1039427 1232892 1142534 1131489
4855 1131489 1283241 1270241 1423822 1507757 1596763 1710920 1760987 2011197 1969356 1867791
4845 1867791 1818051 1588788 1502963 1577371 1496259 1328161 1235561 1316559 1182995 1326888 1520191
4834 1520191 1079961 1265533 1280326 1211333 1546465 1467394 1318960 1181596 1212493 1427662
4824 1427662 1243664 1434837 1406912 1527229 1605393 1726551 1671236 1513596 1666512 1479650
4814 1479650 1650106 1924492 1906032 1984570 1885199 2104685 2188387 2277843 2561724 2545485 2736725
4803 2736725 2850367 2876473 2674093 2507441 2660550 2459458 2209313 2490348 2154383 2303821
$$ packed form
4877B425626k72516l24547j79230L496l59993q0844J91311r4733l900q1377j36610
4866A086683p9115J7460K23613j15810J0931M0120j55014J0559J93465r0358j1045
4855A131489J51752j3000J53581Q3935Q9006J14157N0067K50210m1841j01565
4845A867791m9740k29263q5825P4408q1112j68098r2600Q0998j33564J43893J93303
4834A520191m40230J85572J4793o8993L35132p9071j48434j37364L0897K15169
4824A427662j83998J91173k7925J20317P8164J21158n5315j57640J52916j86862
4814A479650J70456K74386j8460P8538r9371K19486Q3702Q9456K83881j6239J91240
4803B736725J13642K6106k02380j66652J53109k01092k50145K81035l35965J49438
$$ plain form
4793 2303821 2363326 2280533 2434587 2363555 2390180 2313070 2365641 2476705 2562914 2751943 2644991
4782 2644991 2846843 2787601 3036602 3450021 3206355 3798817 4058733 4249520 4734456 4865240
4772 4865240 4797123 4636080 4633758 4393494 4250715 4388691 3828907 3780728 3768394 3651859
4762 3651859 3757469 3694910 3617834 3523979 3600917 3832666 3810888 3850154 3870533 4022678 4044666
4751 4044666 4252263 4445756 4536418 4748310 4966563 5161351 5296807 5592131 5688112 5934994
4741 5934994 6016747 6185845 6302209 6210079 6359102 6331653 6274307 6660589 6483632 6766010
4731 6766010 7078577 7110891 7534157 7811313 8056155 8383859 8698845 9133765 9405135 10011653
4721 10011653 10568986 10952451 11668653 12407161 13063578 14027457 15050760 15933563 17172162
$$ packed form
4793B303821N9505q2793J54054p1032K6625p7110N2571J11064Q6209J89029j06952
4782B644991K01852n9242K49001M13419k43666N92462K59916J90787M84936J30784
4772D865240o8117j61043k322k40264j42779J37976n59784m8179j2334j16535
4762C651859J05610o2559p7076r3855P6938K31749k1778L9266K0379J52145K1988
4751D044666K07597J93493R0662K11892K18253J94788J35456K95324R5981K46882
4741E934994Q1753J69098J16364r2130J49023k7449n7346L86282j76957K82378
4731F766010L12567L2314M23266K77156K44842L27704L14986M34920K71370O06518
4721A0011653N57333L83465P16202P38508O56417R63879J023303Q82803J238599
$$ plain form
4712 17172162 18590201 20115628 22063372 24165721 26653270 29646524 33140355 37158087
4704 37158087 41279278 45994950 50515770 54191054 57209880 58642040 58168244 56628459
4696 56628459 54146201 51157512 48057542 45237019 42340432 40150894 38741754 37426340
4688 37426340 37032019 36846450 37003972 37955563 39073758 40933458 43227355 46333728 50013369
4679 50013369 54377228 59725503 65702981 72769493 80753102 88859487 96316557 102387354
4671 102387354 105343329 105030377 101775691 95854265 88575786 80849999 73086083 65603991
4663 65603991 59088567 53240584 48145901 44213353 40835595 38243355 36157748 34835540
4655 34835540 34023808 33640085 33668532 33865831 34547692 35739417 37319484 39456295 41946786
$$ packed form
4712A7172162J418039J525427J947744K102349K487549K993254L493831M017732
4704C7158087M121191M715672M520820L675284L018826J432160m73796j539785
4696E6628459k482258k988689l099970k820523k896587k189538j409140j315414
4688C7426340l94321j85569J57522R51591J118195J859700K293897L106373L679641
4679E0013369M363859N348275N977478P066512P983609Q106385P457070O070797
4671A02387354K955975l12952l254686n921426p278479p725787p763916p482092
4663F5603991o515424n847983n094683l932548l377758k592240k085607j322208
4655C4835540q11732l83723K8447J97299O81861J191725J580067K136811K490491
$$ plain form
4646 41946786 44938843 47904714 50321475 51807558 52171456 50872003 48316012 45032514
4638 45032514 41048203 36901102 32954320 29044716 25605465 22645355 20012487 18038241
4630 18038241 16102280 14537056 13364441 12173580 11212172 10502540 9610377 9033730 8390146
4621 8390146 7921400 7329815 6967583 6678537 6181303 6087619 5828005 5489194 5324961 4947516
4611 4947516 4780080 4434616 4511376 4329868 4054308 4134545 3687870 3585537 3538673 3351278
4601 3351278 3181049 3074199 2962279 2956941 2895237 2960188 2857424 2569622 2513098 2265529
4591 2265529 2321152 2399858 2250610 2344899 2047569 2334399 2161278 2050808 1995640 1687009
4581 1687009 1728568 1710571 2003319 1754928 1654419 1558226 1404703 1646104 1502539 1512799
$$ packed form
4646D1946786K992057K965871K416761J486083L63898j299453k555991l283498
4638D5032514l984311m147101l946782l909604l439251k960110k632868j974246
4630A8038241j935961j565224j172615j190861r61408p09632q92163n76647o43584
4621H390146m68746n91585l62232k89046m97234r3684k59614l38811j64233l77445
4611D947516j67436l45464P6760j81508k75560Q0237m46675j02333m6864j87395
4601C351278j70229j06850j11920n338o1704O4951j02764k87802n6524k47569
4591B265529N5623P8706j49248R4289k97330K86830j73121j10470n5168l08631
4581A687009M1559j7997K92748k48391j00509r6193j53523K41401j43565J0260
$$ plain form
4571 1512799 1487149 1429673 1513630 1584246 1522140 1161013 1223521 1230622 1251760 1285938 1193842
4560 1193842 957589 1261655 1329882 1163196 1172822 1059510 898348 917439 1119953 1168925
4550 1168925 955801 989866 832175 933850 1045973 959317 954808 780273 847522 971144
4540 971144 1052227 972203 891306 820470 808825 996648 929956 686935 687106 709510 787652 685329
4528 685329 880804 732793 479199 688089 796611 635093 782069 642550 547752 653188
4518 653188 826023 729873 587535 619366 646188 684126 758847 830730 688865 566090 636322
4507 636322 628852 767464 711173 621015 557587 766514 1072097 746975 834194 678482 792598
4496 792598 965834 898029 1288570 1074780 1361857 2150991 2609980 3033860 2787479 2324020
$$ packed form
4571A512799k5650n7476Q3957P0616o2106l61127O2508P101K1138L4178r2096
4560A193842k36253L04066O8227j66686R626j13312j61162J9091K02514M8972
4550A168925k13124L4065j57691J01675J12123q6656m509j74535O7249J23622
4540I71144Q1083q0024q0897p0836j1645J87823o6692k43021J71K2404P8142j02323
4528F85329J95475j48011k53594K08890J08522j61518J46976j39519r4798J05436
4518F53188J72835r6150j42338L1831K6822L7938P4721P1883j41865j22775P0232
4507F36322p470J38612n6291r0158o3428K08927L05583l25122Q7219j55712J14116
4496G92598J73236o7805L90541k13790K87077P89134M58989M23880k46381m63459
$$ plain form
4486 2324020 1891849 1776460 1426631 1163360 905571 758994 765075 690891 932532 609468
4476 609468 480479 655446 521459 793195 703177 472360 491548 519490 440333 661106
4466 661106 617436 354384 476453 410960 388911 518382 555518 464043 461854 619588 493011
4455 493011 525923 684853 456251 428456 548914 535817 450528 589016 460259 407100 419185
4444 419185 493135 521378 460133 608832 418303 464720 510097 373089 528573 488354 645756
4433 645756 524332 656869 686561 543948 701088 509641 759142 783768 778957 766657 700054
4422 700054 736727 563974 692422 655611 692449 810724 741287 830930 594039 519347 507568
4411 507568 591549 791669 883704 875340 907128 958819 848385 891939 826657 768930 967458
$$ packed form
4486B324020m32171j15389l49829k63271k57789j46577O081p4184K41641l23064
4476F09468j28989J74967j33987K71736r0018k30817J9188K7942p9157K20773
4466F61106m3670k63052J22069o5493k2049J29471L7136r1475k189J57734j26577
4455D93011L2912J58930k28602k7795J20458j3097q5289J38488j28757n3159J2085
4444D19185P3950K8243o1245J48699j90529M6417M5377j37008J55484m0219J57402
4433F45756j21424J32537K9692j42613J57140j91447K49501K4626m811j2300o6603
4422G00054L6673j72753J28448l6811L6838J18275o9437Q9643k36891p4692j1779
4411E07568Q3981K00120R2035q364L1788N1691j10434M3554o5282n7727J98528
$$ plain form
4400 967458 1065973 1066262 1200209 1112191 873286 851073 898189 1269685 1238124 1185432 1239943
4389 1239943 870827 1040648 860699 925091 933290 904163 1224897 1131381 1366157 1271490 942192
4378 942192 1061013 1058508 1340650 1419021 1460976 1296489 1158801 1339349 1250879 1268988 1274019
4367 1274019 1089029 1256142 1276172 1236419 1209599 853003 895800 1001124 1076218 1086473 1061231
4356 1061231 934696 846591 938409 1021280 1056872 924312 1118106 1052889 1110773 1386203 989706
4345 989706 1024421 1271023 1345962 1354491 1547578 1453948 1231952 1451460 1386373 1472423 1447526
4334 1447526 1547600 1653430 1556569 1782107 1477250 1343545 1306958 1467222 1454000 1603224
4324 1603224 1763455 1307287 1470175 1517910 1496053 1550683 1558427 1601366 1479214 1688655 1510190
$$ packed form
4400I67458R8515K89J33947q8018k38905k2213M7116L71496l1561n2692N4511
4389A239943l69116J69821j79949O4392Q199k9127L20734r3516K34776r4667l29298
4378I42192J18821k505K82142P8371M1955j64487j37688J80548q8470J8109N031
4367A274019j84990J67113K0030l9753k6820l56596M2797J05324P5094J0255k5242
4356A061231j26535q8105R1818Q2871L5592j32560J93794o5217N7884K75430l96497
4345I89706L4715K46602P4939Q529J93087r3630k21996K19508o5087Q6050k4897
4334A447526J00074J05830r6861K25538l04857j33705l6587J60264j3222J49224
4324A603224J60231m56168J62888M7735k1857N4630P744M2939j22152K09441j78465
$$ plain form
4313 1510190 1503689 1462627 1318352 1523495 1566397 1789551 1772202 1645050 1666377 1690986 1859668
4302 1859668 1876910 1837733 1850490 1776205 1944581 1981284 1937670 1990047 2037106 2016359 2271625
4291 2271625 2434460 2286463 2321896 2429641 2457533 2565990 2506820 2457999 2371032 2459114 2663385
4280 2663385 2669116 2606205 2665720 2736501 2868131 3020165 3012398 3002976 3072752 3263422 3428446
4269 3428446 3451089 3410709 3409237 3615906 3774236 3708221 3858317 3756112 3713651 3812670 3926073
4258 3926073 3923111 4072215 4225659 4149753 4335703 4721230 4561676 4692002 4878560 4970564
4248 4970564 5103001 5389937 5620361 5767816 5997649 6072089 6315800 6601895 6790751 7037396
4238 7037396 7024569 7309179 7659887 7990510 8292586 8690777 9168254 9138899 9547152 9955801
$$ packed form
4313A510190o501m1062j44275K05143M2902K23154j7349j27152K1327K4609J68682
4302A859668J7242l9177J2757p4285J68376L6703m3614N2377M7059k0747K55266
4291B271625J62835j47997L5433J07745K7892J08457n9170m8821q6967Q8082K04271
4280B663385N731o2911N9515P0781J31630J52034p767r422O9776J90670J65024
4269C428446K2643m0380j472K06669J58330o6015J50096j02205m2461R9019J13403
4258C926073k962J49104J53444p5906J85950L85527j59554J30326J86558R2004
4248D970564J32437K86936K30424J47455K29833P4440K43711K86095J88856K46645
4238G037396j2827K84610L50708L30623L02076L98191M77477k9355M08253M08649
$$ plain form
4228 9955801 10157585 10805734 11702605 12061696 12880103 13708337 14310809 15172949 15896172 16924670
4218 16924670 17843733 19019774 20549253 21825583 24056292 26228491 28476154 30815654
4210 30815654 33514946 37123843 40951866 45679616 51674710 59491781 70005972 84999164
4202 84999164 107463719 146202668 217363070 325851207 424521837 451241558 407541232
4195 407541232 331455407 251894861 185712210 137223195 103199645 78577684 59727423
4188 59727423 45323293 35484692 30074683 26754301 24432686 22920583 21534067 19945539
4180 19945539 18190229 16789452 15234851 13863472 12800143 11546355 10661362 9836151
4172 9836151 8961194 8223457 8119555 7879008 7778245 7795516 7388787 7067749 6681842 6444778
$$ packed form
4228I955801K01784O48149Q96871L59091Q18407Q28234O02472Q62140P23223J028498
4218A6924670R19063J176041J529479J276330K230709K172199K247663K339500
4210C0815654K699292L608897L828023M727750N995094P817071J0514191J4993192
4202H4999164K2464555L8738949P1160402J08488137R8670630K6719721m3700326
4195D07541232p6085825p9560546o6182651m8489015l4023550k4621961j8850261
4188E9727423j4404130r838601n410009l320382k321615j512103j386516j588528
4180A9945539j755310j400777j554601j371379j063329j253788q84993q25211
4172I836151q74957p37737j03902k40547j00763J7271m06729l21038l85907k37064
$$ plain form
4162 6444778 6090552 5630155 5408461 4974595 5067303 4939252 4824009 4796637 4390697 4380043
4152 4380043 4246390 3860181 3980084 3691397 3609033 3839912 3658613 3620442 3409506 3180774
4142 3180774 3099386 3179586 3186663 3195329 3060913 2850475 2982071 2841509 2639573 2528376 2117134
4131 2117134 2130635 1976985 2057874 1928887 1805250 1689022 1580543 1793597 1848040 1705203
4121 1705203 1609193 1667525 1738618 1909732 1821707 1503129 1424447 1434475 1573688 1649333 1546404
4110 1546404 1343137 1308144 1295151 1396770 1361116 1126741 1196292 1002979 1088902 1370985
4100 1370985 1264882 1231341 1162460 1177061 1279670 1333556 1274436 1166469 1105284 1225504 1271976
4089 1271976 1170194 1213679 1151012 1167773 1360631 1407672 1398492 1427408 1244196 1344789 1518213
$$ packed form
4162F444778l54226m60397k21694m33866R2708j28051j15243k7372m05940j0654
4152D380043j33653l86209J19903k88687q2364K30879j81299l8171k10936k28732
4142C180774q1388Q0200P077Q666j34416k10438J31596j40562k01936j11197m11242
4131B117134J3501j53650Q0889j28987j23637j16228j08479K13054N4443j42837
4121A705203r6010N8332P1093J71114q8025l18578p8682J0028J39213P5645j02929
4110A546404k03267l4993j2993J01619l5654k34375O9551j93313Q5923K82083
4100A370985j06103l3541o8881J4601J02609N3886n9120j07967o1185J20220M6472
4089A271976j01782M3485o2667J6761J92858M7041r180K8916j83212J00593J73424
$$ plain form
4078 1518213 1495350 1568695 1693252 1702915 1854705 2178618 2189394 2492277 2993461 3608384
4068 3608384 4718090 6205115 8088598 10178219 11003957 10646007 9374079 7435049 6005826
4059 6005826 4765455 3820384 3367391 2800763 2495333 2224797 2314598 2489962 2473924 2580768
4049 2580768 2681722 2834301 3059842 3607493 4406287 5455607 7146236 9032970 10517890
4040 10517890 10640706 9719951 8342699 6818084 5423448 4298531 3280668 2461412 2240168
4031 2240168 1668152 1347562 1235603 1003819 1031716 960012 824609 844770 697081 770941
4021 770941 789476 819865 756879 833154 560684 440307 645436 428112 347095 366187 211598
4010 211598 443549 463961 498490 417096 138513 427139 370554 296608 447284 58477 116810
$$ packed form
4078A518213k2863P3345J24557R663J51790L23913J0776L02883N01184O14923
4068C608384J109706J487025J883483K089621Q25738l57950j271928j939030j429223
4059F005826j240371r45071m52993n66628l05430k70536Q9801J75364j6038J06844
4049B580768J00954J52579K25541N47651P98794J049320J690629J886734J484920
4040A0517890J22816r20755j377252j524615j394636j124917j017863q19256k21244
4031B240168n72016l20590j11959k31784K7897p1704j35403K0161j47689P3860
4021G70941J8535L0389o2986P6275k72470j20377K05129k17324q1017J9092j54589
4010B11598K31951K0412L4529q1394k78583K88626n6585p3946J50676l88807N8333
$$ plain form
3999 116810 377354 199766 318068 107522 -40402 83228 147885 151278 949 -111161
3989 -111161 -33846 73403 172015 215954 122348 20349 30948 122266 214706 112367 181294
3978 181294 70527 -98991 68128 77925 63284 37809 -119674 92729 62648 75603 93500
3967 93500 -244256 -12051 173263 79574 63150 -20684 -241513 20381 164944 63740
3957 63740 78660 -107748 -45840 173883 -41615 205476 59683 -8443 2680 195730 -23499
3946 -23499 -56259 156765 -131467 146447 74295 4960 -38404 -333651 -59872 -33530 5159
3935 5159 222217 163511 67843 81531 8936 -101943 16720 -79764 133945 37211 187200
3924 187200 277739 -102937 -51696 -94346 57161 206991 193928 205121 -113076 77143 70655
$$ packed form
3999A16810K60544j77588J18302k10546j47924J23630O4657L393j50329j12110
3989a11161P7315J07249R8612M3939r3606j01999J0599R1318R2440j02339O8927
3978A81294j10767j69518J67119R797j4641k5475j57483K12403l0081J2955J7897
3967I3500l37756K32205J85314r3689j6424q3834k20829K61894J44563j01204
3957F3740J4920j86408O1908K19723k15498K47091j45793o8126J1123J93050k19229
3946b3499l2760K13024k88232K77914p2152o9335m3364k95247K73779K6342L8689
3935E159K17058n8706r5668J3688p2595j10879J18663r6484K13709r6734J49989
3924A87200R0539l80676N1241m2650J51507J49830j3063J1193l18197J90219o488
$$ plain form
3913 70655 168932 161196 128447 180629 359834 581143 529696 794538 915700 1653387 2433895
3902 2433895 2389648 2331440 1634953 1157710 887922 553749 482362 138520 165113 146905
3892 146905 163934 147977 -31417 -25695 5625 -50516 245882 137167 -4125 117891 -125372
3881 -125372 -1337 -26028 124961 192808 -35581 320522 127797 55258 164574 -198610
3871 -198610 7170 84841 154220 91783 36435 79939 49933 92547 131225 110322 124301
3860 124301 -3933 63791 43516 90418 30586 -50052 36035 25325 90121 194720 109802
3849 109802 51958 21207 47189 31121 124136 86412 -53651 178790 123324 91947 23845
3838 23845 -28990 -959 -34195 115957 226579 107728 67182 -68009 -31825 159231 284016
$$ packed form
3913G0655R8277p736l2749N2182J79205K21309n1447K64842J21162P37687P80508
3902B433895m4247n8208o96487m77243k69788l34173p1387l43842K6593j8208
3892A46905J7029j5957j79394N722L1320n6141K96398j08715j41292J22016k43263
3881a25372J24035k4691J50989O7847k28389L56103j92725p2539J09316l63184
3871a98610K05780P7671O9379o2437n5348M3504l0006M2614L8678k0903J3979
3860A24301j28234O7724k0275M6902n9832q0638Q6087j0710O4796J04599q4918
3849A09802n7844l0751K5982j6068R3015l7724j40063K32441n5466l1377o8102
3838B3845n2835K8031l3236J50152J10622j18851m0546j35191L6184J91056J24785
$$ plain form
3827 284016 137141 70088 78757 121887 246774 197543 196342 46269 122586 229902 137908
3816 137908 178948 102195 123790 147094 238658 319300 97269 259774 152893 222427 235425
3805 235425 149229 188099 174841 444888 496245 623628 797610 731363 589036 546977 644717
3794 644717 426807 322495 360280 263386 211824 234767 221539 128232 312866 356078 307610
3783 307610 226077 405475 150661 228317 392393 263971 467761 432176 400781 477488 421495
3772 421495 570861 601021 793032 908839 1254006 1549097 1598484 1425669 1128928 980423
3762 980423 657833 711079 754161 525076 532285 335538 333981 508261 579054 502719 316076
3751 316076 460790 452583 423257 575734 418463 236577 395102 487227 481657 408386 388151
$$ packed form
3827B84016j46875o7053Q669M3130J24887m9231j201j50073P6317J07316r1994
3816A37908M1040p6753K1595K3304R1564Q0642k22031J62505j06881O9534J2998
3805B35425q6196L8870j3258K70047N1357J27383J73982o6247j42327m2059R7740
3794F44717k17910j04312L7785r6894n1562K2943j3228r3307J84634M3212m8468
3783C07610q1533J79398k54814P7656J64076j28422K03790l5585l1395P6707n5993
3772D21495J49366L0160J92011J15807L45167K95091M9387j72815k96741j48505
3762I80423l22590N3246M3082k29085P209j96747j557J74280P0793p6335j86643
3751C16076J44714q207k9326J52477j57271j81886J58525R2125n570p3271k0235
$$ plain form
3740 388151 302346 431011 755375 733044 820204 802423 984007 941754 702158 901702 601165
3729 601165 574757 619474 483926 503435 310149 350471 440255 533297 599868 451996 311559
3718 311559 294102 476649 459261 564853 635389 342738 416613 681367 554624 483048 352029
3707 352029 215220 462436 549018 665454 530850 409561 416966 414049 477050 629402 488986
3696 488986 293183 602336 617440 436364 728837 433185 343053 604358 609920 596664 656843
3685 656843 562943 351189 766448 796478 777512 772971 569573 523909 632706 732271 685784
3674 685784 597529 710549 558565 522060 718116 428723 482767 782178 551674 689151
3664 689151 717399 658393 557514 716680 747470 605062 908821 747314 772283 877012
$$ packed form
3740C88151q5805J28665L24364k2331Q7160j7781J81584m2253k39596J99544l00537
3729F01165k6408M4717j35548J9509j93286M0322Q9784R3042O6571j47872j40437
3718C11559j7457J82547j7388J05592P0536k92651P3875K64754j26743p1576j31019
3707C52029j36809K47216Q6582J16436j34604j21289P405k917O3001J52352j40416
3696D88986j95803L09153J5104j81076K92473k95652r0132K61305N562j3256O0179
3685F56843r3900k11754M15259L0030j8966m541k03398m5664J08797R9565m6487
3674F85784q8255J13020j51984l6505J96056k89393N4044K99411k30504J37477
3664F89151K8248n9006j00879J59166L0790j42408L03759j61507K4969J04729
$$ plain form
3654 877012 780611 938454 902010 922485 974131 965555 866295 971094 914262 961318 928815
3643 928815 787333 930007 734047 843840 951699 661593 1117712 940070 797612 901362
3633 901362 767752 941987 953127 1143225 915296 857833 1123678 980854 1139618 1120924
3623 1120924 1035646 1040762 1229414 1403982 1360100 1343323 1310407 1197922 1208285 1385739 1212914
3612 1212914 1257265 1411924 1289411 1559261 1497850 1369214 1384990 1371451 1517866 1550632
3602 1550632 1717685 1701378 1671463 1555238 1666361 1602834 1512296 1838357 1693024 1716751
3592 1716751 1867851 1817115 1791901 1802583 1978300 1978224 2092474 2149927 2142176 2146747 2210687 2195926
3580 2195926 2200227 2245963 2302678 2439282 2382262 2456801 2410144 2422108 2562064 2673484 2882237
$$ packed form
3654H77012r6401J57843l6444K0475N1646q576r9260J04799n6832M7056l2503
3643I28815j41482J42674j95960J09793J07859k90106M56119j77642j42458J03750
3633I01362j33610J74235J1140J90098k27929n7463K65845j42824J58764j8694
3623A120924q5278N116J88652J74568m3882j6777l2916j12485J0363J77454j72825
3612A212914M4351J54659j22513K69850o1411j28636J5776j3539J46415L2766
3602A550632J67053j6307k9915j16225J11123o3527r0538L26061j45333K3727
3592A716751J51100n0736k5214J0682J75717p6J14250N7453p751M571O3940j4761
3580B195926M301M5736N6715J36604n7020P4539m6657J1964J39956J11420K08753
$$ plain form
3569 2882237 2932278 2914079 2926862 2729280 2797813 2950805 2912992 3191081 3236415 3272591 3419763
3558 3419763 3481795 3697007 3783641 3818074 3950175 3990017 4409508 4465412 4535905 4522318 4359638
3547 4359638 4844134 5030818 4938639 5299871 5173095 5431713 5878428 5993101 6160724 6404791
3537 6404791 6609128 7110202 7475638 7829776 8096170 8224971 8676590 9219671 9774166 10506729
3527 10506729 11048553 11994601 13027802 14508507 15886055 17343133 19124521 21462586
3519 21462586 24713853 29187489 35657122 46887072 67024974 96934992 119723842 120424086
3511 120424086 105823735 85885066 67091124 52064278 41379893 34052354 28619209
3504 28619209 24818208 22187259 20442508 19789217 19393241 19307188 19498285 19898650 20349840
$$ packed form
3569B882237N0041j8199J2783j97582O8533J52992l7813K78089M5334L6176J47172
3558C419763O2032K15212Q6634L4433J32101L9842M19491N5904P0493j3587j62680
3547D359638M84496J86684r2179L61232j26776K58618M46715J14673J67623K44067
3537F404791K04337N01074L65436L54138K66394J28801M51619N43081N54495P32563
3527A0506729N41824R46048J033201J480705J377548J457078J781388K338065
3519B1462586L251267M473636O469633J1229950K0137902K9910018K2788850P00244
3511A20424086j4600351j9938669j8793942j5026846j0684385p327539n433145
3504B8619209l801001k630949j744751o53291l95976q6053J91097M00365M51190
$$ plain form
3495 20349840 21100572 22200526 23638279 25808229 28098682 30837840 33404715 37164415
3487 37164415 41858552 48694571 58895806 75777269 106330688 159605636 216693016
3480 216693016 234167766 213629790 176433967 136226826 102287913 77668609 60036756
3473 60036756 47410557 38166279 30818347 26007003 23095629 21099911 19928156 18687942
3465 18687942 17972305 17157709 16555395 16573986 16690427 17136006 17900579 18554221 19639726
3456 19639726 20807368 22704541 25510501 29514389 36347131 48394730 69591931 98577276
3448 98577276 116482631 112878308 96789125 76471456 58006890 43668495 33457233
3441 33457233 26263099 21004677 16686173 13704151 11600472 10140126 9316116 8778654
$$ packed form
3495B0349840P50732J099954J437753K169950K290453K739158K566875L759700
3487C7164415M694137O836019J0201235J6881463L0553419N3274948N7087380
3480B16693016J7474750k0537976l7195823m0207141l3938913k4619304j7631853
3473F0036756j2626199r244278p347932m811344k911374j995718j171755j240214
3465A8687942p15637q14596o02314J8591J16441M45579P64573O53642J085505
3456A9639726J167642J897173K805960M003888O832742J2047599K1197201K8985345
3448I8577276J7905355l604323j6089183k0317669j8464566j4338395j0211262
3441C3457233p194134n258422m318504k982022k103679j460346q24010n37462
$$ plain form
3433 8778654 7808106 7383368 6640336 6281503 6104410 5662496 5518720 5011248 4800364 4654815
3423 4654815 4362030 4373693 4186955 4371054 4329146 4621590 4802711 4355655 4155614 3597558
3413 3597558 3250166 3103251 2987763 2792240 2668583 2502142 2258894 2381194 2174290 2141888
3403 2141888 2150700 1869588 2015574 2030807 1873516 1768373 1798313 1652387 1693531 1681743 1657758
3392 1657758 1624002 1320558 1518187 1383746 1221984 1364546 1254519 1140753 1147182 1330663
3382 1330663 1088155 969917 1131613 671434 941211 977811 982838 1007279 980130 1008355 753337
3371 753337 751080 892851 643785 724152 880753 780215 641400 608623 529980 420542 544482
3360 544482 766327 581411 627183 540573 336462 643568 355207 525728 506448 296054
$$ packed form
3433H778654r70548m24738p43032l58833j77093m41914j43776n07472k10884j45549
3423D654815k92785J1663j86738J84099m1908K92444J81121m47056k00041n58056
3413C597558l47392j46915j15488j95523j23657j66441k43248J22300k06904l2402
3403B141888Q812k81112J45986J5233j57291j05143K9940j45926M1144j1788k3985
3392A657758l3756l03444J97629j34441j61762J42562j10027j13766O429J83481
3382A330663k42508j18238J61696m60179K69777L6600N027K4441k7149K8225k55018
3371G53337k257J41771k49066Q0367J56601j00538j38815l2777p8643j09438J23940
3360E44482K21845j84916M5772q6610k04111L07106k88361J70521j9280k10394
$$ plain form
3350 296054 676007 514853 440378 673261 379574 406089 402891 487119 451439 359692 325336
3339 325336 151337 318124 279465 195757 228148 94074 316748 352453 279288 257142 78714
3328 78714 178795 405738 386129 330291 336288 133235 170526 314468 279887 286725 357189
3317 357189 291085 303666 416588 425841 179523 263062 177343 158543 214127 37069 28356
3306 28356 -71429 -128887 -87313 -297215 -93851 -81943 -115764 196680 76409 9393 -2332
3295 -2332 -102793 -5145 -68108 82708 75394 -141507 149817 -60893 40489 134446 -146181
3284 -146181 -51931 -40768 -16903 966 -102237 -66042 -238853 -238747 -93445 -145051 -187781
3273 -187781 -10651 -51464 -113685 -96160 -168429 -224174 -121387 5796 -55910 -27482 21372
$$ packed form
3350B96054L79953j61154p4475K32883k93687K6515l198Q4228l5680r1747l4356
3339C25336j73999J66787l8659q3708L2391j34074K22674L5705p3165k2146j78428
3328G8714J00081K26943j9609n5838N997k03053L7291J43942l4581O838P0464
3317C57189o6104J2581J12922R253k46318Q3539q5719j8800N5584j77058q713
3306B8356r9785n7458M1574k09902K03364J1908l3821L12444j20271o7016j1725
3295b332j00461R7648o2963J50816p314k16901K91324k10710J01382R3957k80627
3284a46181R4250J1163K3865J7869j03203L6195j72811J06J45302n1606m2730
3273a87781J77130m0813o2221J7525p2269n5745J02787J27183o1706K8428M8854
$$ plain form
3262 21372 -169068 -216783 -104952 -176871 -137225 -83285 -223893 -99126 -210093 -240987 -69542
3251 -69542 -210168 -123854 -53230 -95797 5403 -67316 -116156 -91024 -81590 -157016 -42658
3240 -42658 -55487 -154038 -8824 -171332 -282999 -107616 -154599 -67016 -19577 -69684 -50260
3229 -50260 -89501 -78273 68585 240 267504 513608 577151 584210 385917 270448 137253
3218 137253 145264 101150 150643 167780 35532 152797 29241 53518 64622 -144305 48315
3207 48315 195903 142136 40140 -25307 -163532 -31305 87635 237409 220163 -8077
3197 -8077 91083 -60957 264973 569923 516950 1029713 1187101 1178880 1179903 878386 583343
3186 583343 506700 516856 426944 609120 279995 39427 294868 152737 397672 438163
$$ packed form
3262B1372j90440m7715J11831p1919L9646N3940j40608J24767j10967l0894J71445
3251f9542j40626Q6314P0624m2567J01200p2719m8840K5132R434p5426J14358
3240d2658j2829r8551J45214j62508j11667J75383m6983Q7583M7439n0107J9424
3229e0260l9241J1228J46858o8345K67264K46104O3543P059j98293j15469j33195
3218A37253Q011m4114M9493J7137j32248J17265j23556K4277J1104k08927J92620
3207D8315J47588n3767j01996o5447j38225J32227J18940J49774j7246k28240
3197h077R9160j52040L25930L04950n2973N12763J57388q221J023l01517k95043
3186E83343p6643J0156q9912J82176l29125k40568K55441j42131K44935M0491
$$ plain form
3176 438163 431936 513223 432838 530971 368273 245960 229905 169944 587877 443829 570431
3165 570431 297376 92866 486202 307137 630066 676328 764850 1070042 850206 1013215
3155 1013215 798822 550688 593536 676787 879433 987341 1030704 846352 840974 862765 755136
3144 755136 590284 568888 400199 313176 595902 261894 208315 400865 63635 272822
3134 272822 411464 185746 223173 131600 3623 182206 109112 225703 126603 -38163
3124 -38163 243313 97566 372607 354144 103887 452421 208250 368191 376494 225471
3114 225471 174170 28957 235334 -9585 273943 195279 -15370 330166 73317 -13155
3104 -13155 35484 -8290 -56886 121737 161219 -60039 139223 -45389 -75580 7868 -25619
$$ packed form
3176D38163o227Q1287q0385R8133j62698j22313j6055n9961M17933j44048J26602
3165E70431k73055k04510L93336j79065L22929M6262Q8522L05192k19836J63009
3155A013215k14393k48134M2848Q3251K02646J07908M3363j84352n378K1791j07629
3144G55136j64852k1396j68689q7023K82726l34008n3579J92550l37230K09187
3134B72822J38642k25718L7427r1573j27977J78583p3094J16591r9100j64766
3124c8163K81476j45747K75041j8463k50257L48534k44171J59941Q303j51023
3114B25471n1301j45213K06377k44919K83528p8664k10649L45536k56849q6472
3104a3155M8639m3774m8596J78623L9482k21258J99262j84612l0191Q3448l3487
$$ plain form
3093 -25619 -127200 -20078 47397 -82635 28085 -261945 -240253 -222183 -272096 34334 -163229
3082 -163229 -58990 -185746 -278200 -76485 -133901 -45819 -127686 -111839 -212265 -150244 -98160
3071 -98160 -179063 -206166 -264945 -136779 -140302 -189047 -125141 -224785 -264118 -193460 -168092 -207334
3059 -207334 -162967 -268494 -263662 -260918 -223994 -32801 -211714 -229007 -327301 -401891 -154868
3048 -154868 -325278 -162241 -235766 -342052 -140053 -273635 -135982 -214135 -364939 -251168
3038 -251168 -183698 -157232 7678 -151746 -396289 -61912 -216788 -283911 -170556 -386191
3028 -386191 -357814 -214019 -100623 -235317 -326342 -339230 -281582 -279268 -193466 -219005 -365507
3017 -365507 -284914 -156556 -288737 -363985 -265040 -302914 -269954 -84129 -133204 -207118 -363270
$$ packed form
3093b5619j01581J07122O7475j30032J10720k90030K1692J8070m9913L06430j97563
3082a63229J04239j26756r2454K01715n7416Q8082q1867J5847j00426O2021N2084
3071i8160q0903k7103n8779J28166l523m8745O3906r9644l9333P0658K5368l9242
3059b07334M4367j05527M832K744L6924J91193j78913j7293r8294p4590K47023
3048a54868j70410J63037p3525j06286K01999j33582J37653p8153j50804J13771
3038b51168O7470K6466J64910j59424k44543L34377j54876o7123J13355k15635
3028c86191K8377J43795J13396j34694r1025j2888N7648K314Q5802k5539j46502
3017c65507Q0593J28358j32181p5248R8945l7874L2960J85825m9075p3914j56152
$$ plain form
3006 -363270 -237974 -256427 -249172 58 -373777 -312124 -284071 -270471 -264258 -277548 -201576
2995 -201576 -328041 -245909 45933 -268218 -252517 -386265 -420027 -232792 -159445 -115888 -379565
2984 -379565 -338254 -244193 -343080 -174193 -428422 -354996 -346576 -189677 -13689 -327048 -252845
2973 -252845 -358728 -335804 -235962 -106150 -261810 -250726 -220490 -230023 -55027 -271130 -369750
2962 -369750 -458724 -299091 -90196 -170389 -161086 -451615 -328390 -404862 -113280 -207737 -402149
2951 -402149 -197166 -400603 -179710 -129529 -269944 -142199 -393483 -268086 -142937 -180967
2941 -180967 -199250 -296959 -248594 -153337 -143011 -194850 -187827 -257347 -282111 -183895 -259011 -292102
2929 -292102 -210489 -289203 -229841 -191724 -132404 -306786 -255934 -257772 -350456 -131044 -235419
$$ packed form
3006c63270J25296j8453P255K49230l73835O1653K8053J3600O213j3290P5972
2995b01576j26465Q2132K91842l14151J5701j33748l3762J87235P3347M3557k63677
2984c79565M1311R4061r8887J68887k54229P3426Q420J56899J75988l13359P4203
2973b52845j05883K2924R9842J29812j55660J1084L0236r533J74996k16103r8620
2962c69750q8974J59633K08895q0193R303k90529J23225p6472K91582r4457j94412
2951d02149K04983k03437K20893N0181j40415J27745k51284J25397J25149l8030
2941a80967j8283r7709M8365R5257J0326n1839P023o9520k4764R8216p5116l3091
2929b92102Q1613p8714N9362L8117N9320j74382N0852j838r2684K19412j04375
$$ plain form
2918 -235419 -160068 -169273 -251413 -272401 -330595 -190902 -177289 -96054 -175959 -257177 -220869 -468659
2906 -468659 -242976 -194129 -299432 -96700 -199363 -288385 -242044 -254169 -288331 -231219 -146114
2895 -146114 -184424 -215562 -204124 -129022 -309131 -281133 -264222 -391955 -87179 -131823 -250314
2884 -250314 -162458 -323216 -455433 -265843 -165585 -330856 -237775 -235409 -280496 -243280 -138320
2873 -138320 -307111 -457455 -13055 -99837 -108580 -3089 -303304 -347659 -147268 -163323 -171980
2862 -171980 -159198 -236360 -153530 -357179 -324387 -152834 -303505 -318369 -156789 -90096 -368996
2851 -368996 -122792 -225999 -437697 -181727 -333732 -207029 -44900 -36990 -177546 -248744
2841 -248744 -330870 -397736 -121611 -312274 -45643 -293003 -203957 -48636 -300130 -185993
$$ packed form
2918b35419P5351r205q2140k0988n8194J39693J3613Q1235p9905q1218L6308k47790
2906d68659K25683M8847j05303K02732j02663q9022M6341j2125l4162N7112Q5105
2895a46114l8310l1138J1438P5102j80109K7998J6911j27733L04776m4644j18491
2884b50314Q7856j60758j32217J89590J00258j65271R3081K366m5087L7216J04960
2873a38320j68791j50344M44400q6782q743J05491l00215m4355K00391j6055q657
2862a71980J2782p7162Q2830k03649L2792J71553j50671j4864J61580O6693k78900
2851c68996K46204j03207k11698K55970j52005J26703J62129P910j40556p1198
2841b48744q2126o6866K76125j90663K66631k47360Q9046J55321k51494J14137
$$ plain form
2831 -185993 -370246 -286061 -147221 15971 -112575 -242171 -258049 -429905 -265890 -194872
2821 -194872 -171211 -144817 -136098 -218735 -310837 -220071 -310952 -155892 -163282 -10701 -32749 -265646
2809 -265646 -123089 -166266 -481597 -25117 -225438 -347272 -54061 -129334 -155708 -244973
2799 -244973 -223868 -275835 -311503 -116033 -134001 -154886 -168646 -83685 -273390 -338101 -115771
2788 -115771 -408802 -298836 -135325 -219298 -201196 -168425 -300282 -281405 -275825 -95325 -320356
2777 -320356 -37322 11353 -321366 -213757 -290533 -456000 -242680 -139881 -243032 -300884
2767 -300884 -201355 -226361 -170309 -255896 -322191 -224576 -301237 -9517 -79727 -273425 -220836
2756 -220836 -309680 -461434 -171330 -176683 -191137 -180346 -170912 -72257 -175653 -236865 -312571
$$ packed form
2831a85993j84253Q4185J38840J63192j28546j29596j5878j71856J64015P1018
2821a94872K3661K6394Q719q2637r2102R0766r0881J55060p390J52581k2048k32897
2809b65646J42557m3177l15331M56480k00321j21834K93211p5273k6374q9265
2799b44973K1105n1967l5668J95470j7968k0885j3760Q4961j89705o4711K22330
2788a15771k93031J09966J63511q3973J8102L2771j31857J8877N580J80500k25031
2777c20356K83034M8675l32719J07609p6776j65467K13320J02799j03151n7852
2767c00884R9529k5006N6052q5587o6295R7615p6661K91720p0210j93698N2589
2756b20836q8844j51754K90104n353j4454J0791R434R8655j03396o1212p5706
$$ plain form
2745 -312571 -334232 -246184 -169597 -214565 -356090 -126460 -328448 -418228 -178207 -377335 -235670
2734 -235670 71586 -168229 -86827 -144517 -457670 -176373 -302750 -167405 -187881 -211678
2724 -211678 -122292 -296039 -48467 -142024 -274345 -220441 -471100 -58415 -162331 -118183
2714 -118183 -19274 -438464 -85707 -107095 -348218 2817 -293663 -161741 -111138 -254483
2704 -254483 -21019 -240066 -192087 -251166 -149661 -170653 -203864 -88028 -298485 -53197
2694 -53197 -28261 -378834 -27657 -274489 -262675 24758 -218484 -294520 -4420 -181643
2684 -181643 -144730 -141075 -189314 -252696 -148446 -11064 -188739 -39672 -73149 -286006 -144845
2673 -144845 -118500 -129201 -289043 -319908 -71736 -175155 -112418 -95213 -203451 -225087 84964
$$ packed form
2745c12571k1661Q8048P6587m4968j41525K29630k01988q9780K40021j99128J41665
2734b35670L07256k39815Q1402n7690l13153K81297j26377J35345k0476k3797
2724b11678Q9386j73747K47572r3557j32321N3904k50659M12685j03916M4148
2714a18183R8909m19190L52757k1388k41123L51035k96480J31922N0603j43345
2704b54483K33464k19047M7979n9079J01505k0992l3211J15836k10457K45288
2694e3197K4936l50573L51177k46832J1814K87433k43242p6036K90100j77223
2684a81643L6913L655m8239o3382J04250J37382j77675J49067l3477k12857J41161
2673a44845K6345j0701j59842l0865K48172j03419O2737J7205j08238k1636L10051
$$ plain form
2662 84964 -138451 -227841 -13168 -333232 -301126 -36673 -315649 -30987 -169952 -308214
2652 -308214 -167406 -297976 -166945 -153543 -303129 -39479 -141473 -217757 -158135 -280533
2642 -280533 -243546 -210525 -83878 -117162 -147924 -99368 -96851 -180003 -111728 -285243 -250867
2631 -250867 42291 -45581 -29655 74898 -297752 -164176 -253975 -178439 -71328 -77800 58543
2620 58543 176364 74667 185192 154138 130262 236442 358848 414115 327776 243289 -97188
2609 -97188 -140956 -1370 -176744 -115369 35785 -47547 63963 -31902 -129122 -219609 -217864
2598 -217864 -73454 -95760 -73034 -34193 -103217 -135888 -169301 -162549 -249289 -24057 50504
2587 50504 73969 43628 -122232 -277080 -130094 -173126 -64998 54525 -98438 21439
$$ packed form
2662H4964k23415q9390K14673l20064L2106K64453k78976K84662j38965j38262
2652c08214J40808j30570J31031J3402j49586K63650j01994p6284N9622j22398
2642b80533L6987L3021J26647l3284l0762M8556K517q3152O8275j73515L4376
2631b50867K93158q7872J5926J04553l72650J33576q9799P5536J07111o472J36343
2620E8543J17821j01697J10525l1054k3876J06180J22406N5267q6339q4487l40477
2609i7188m3768J39586j75374O1375J51154q3332J11510r5865r7220r0487J745
2598b17864J44410k2306K2726L8841o9024l2671l3413O752q6740K25232P4561
2587E0504K3465l0341j65860j54848J46986m3032J08128J19523j52963J19877
$$ plain form
2577 21439 -99623 -242334 -89560 -167480 -129486 107692 -32177 -133268 -52130 -153088
2567 -153088 -264863 2954 -90898 -131771 100884 25138 -140936 -102205 -91173 -176514 -89377
2556 -89377 -92523 -34413 -1083 -50607 92614 -195388 -85392 -136445 -249348 98102 32472
2545 32472 89031 84654 -106594 -202549 -64759 5500 -156623 -125223 51218 -2286 -64046
2534 -64046 4756 -239536 -213405 107633 -4858 86834 -40022 -66176 -76626 16077 172667
2523 172667 -37907 2650 62401 -211279 122360 -36642 -108214 27006 -38893 178924
2513 178924 107396 -50067 -194612 -148178 -23465 -130967 32587 -99044 -212245 103765
2503 103765 -160415 -36454 64853 -54211 -28888 34693 83196 25604 100152 36444 63706
$$ packed form
2577B1439j21062j42711J52774p7920L7994K37178j39869j01091Q1138j00958
2567a53088j11775K67817r3852m0873K32655p5746j66074L8731J1032q5341Q7137
2556h9377l146N8110L3330m9524J43221k88002J09996n1053j12903L47450o5630
2545C2472N6559m377j91248r5955J37790P0259j62123L1400J76441n3504o1760
2534f4046O8802k44292K6131L21038j12491R1692j26856k6154j0450R2703J56590
2523A72667k10574M0557N9751k73680L33639j59002p1572J35220o5899K17817
2513A78924p1528j57463j44545M6434J24713j07502J63554j31631j13201L16010
2503A03765k64180J23961J01307j19064K5323O3581M8503n7592P4548o3708K7262
$$ plain form
2492 63706 102628 -36431 11540 -69378 200491 78176 163101 192547 -215264 115667 -67956
2481 -67956 39829 208526 -63156 121373 -41927 29992 152013 -161622 157991 160880
2471 160880 85498 179456 143374 94027 144077 301330 124096 90780 146159 38842 61985
2460 61985 115342 161721 63415 160400 312821 302807 181873 99677 234793 225322 371474
2449 371474 326694 184114 173245 223211 307432 367042 261858 251114 221120 270115 477292
2438 477292 288014 229412 345729 192286 416527 543431 299983 237027 293344 279691
2428 279691 369069 590051 267266 228142 534794 418843 686083 570312 414520 557885
2418 557885 554240 747251 620320 549994 502207 498696 646503 537977 742310 480196 560376
$$ packed form
2492F3706L8922j39059M7971q0918K69869j22315Q4925K9446m07811L30931j83623
2481f7956J07785J68697k71682J84529j63300P1919J22021l13635L19613K889
2471A60880p5382R3958l6082m9347N0050J57253j77234l3316N5379j07317K3143
2460F1985N3357M6379r8306R6985J52421j0014j20934q2196J35116r471J46152
2449C71474m4780j42580j0869M9966Q4221N9610j05184j0744k9994M8995K07177
2438D77292j89278n8602J16317j53443K24241J26904k43448o2956N6317j3653
2428B79691Q9378K20982l22785l9124L06652j15951K67240j15771j55792J43365
2418E57885l645J93011j26931p0326m7787l511J47807j08526K04333k62114Q0180
$$ plain form
2407 560376 835677 681611 831730 818714 683621 882710 942639 975120 919782 968807 968968
2396 968968 1021965 1149825 1178130 1134160 1254158 1341075 1343444 1352793 1365731 1424955 1528776
2385 1528776 1674508 1827181 1748131 1896273 1976072 1925900 2232592 2299932 2325729 2581704
2375 2581704 2601626 2940677 3049587 3393283 3647756 3673596 4210978 4688272 5039410 5869845
2365 5869845 6664439 7588742 8290168 8530295 8702997 9378734 9950975 10930622 12104622
2356 12104622 14205736 16895427 20754987 26124076 34709374 51691901 80381828 106172563
2348 106172563 105494934 87857498 65839493 47960303 35911541 27224840 20956102 16246939
2340 16246939 12448472 9972549 8336703 7407101 7194248 7148704 7445224 7129905 6337627
$$ packed form
2407E60376K75301j54066J50119j3016j35093J99089N9929L2481n5338M9025J61
2396I68968N2997J27860K8305m3970J19998Q6917K369R349J2938N9224J03821
2385A528776J45732J52673p9050J48142P9799n0172L06692O7340K5797K55975
2375B581704J9922L39051J08910L43696K54473K5840N37382M77294L51138Q30435
2365E869845P94594R24303P01426K40127J72702O75737N72241R79647J174000
2356A2104622K101114K689691L859560N369089Q585298J6982527K8689927K5790735
2348A06172563o77629j7637436k2018005j7879190j2048762q686701o268738m709163
2340A6246939l798467k475923j635846r29602k12853m5544K96520l15319p92278
$$ plain form
2331 6337627 5429240 4790761 4177861 3782398 3604404 3108493 2813778 2527407 2202476 2236614
2321 2236614 2069455 2007980 2075373 1773645 1888425 1805612 1452503 1679667 1512101 1330663
2311 1330663 1563643 1319964 1070578 1263530 942661 1055441 1245116 1221611 1066098 937801
2301 937801 871550 707031 792438 927866 896871 941787 831658 1001084 667392 657266 683521
2290 683521 427323 721722 741724 721390 628761 435181 490980 246581 404373 369218 381022
2279 381022 280172 389230 329830 223625 315172 188460 223335 219309 316046 156768 271109
2268 271109 401836 114122 228772 76093 257616 246581 230182 283515 17187 275824
2258 275824 63766 147024 63575 -43371 230876 104638 242709 184874 -89467 76180
$$ packed form
2331F337627r08387o38479o12900l95463j77994m95911k94715k86371l24931L4138
2321B236614j67159o1475O7393l01728J14780q2813l53109K27164j67566j81438
2311A330663K32980k43679k49386J92952l20869J12780J89675k3505j55513j28297
2301I37801o6251j64519Q5407J35428l0995M4916j10129J69426l33692j0126K6255
2290F83521k56198K94399K0002k0334r2629j93580N5799k44399J57792l5155J1804
2279C81022j00850J09058n9400j06205R1547j26712L4875m026R6737j59278J14341
2268B71109J30727k87714J14650j52679J81523j1035j6399N3333k66328K58637
2258B75824k12058Q3258q3449j06946K74247j26238J38071n7835k74341J65647
$$ plain form
2248 76180 128780 106040 189357 58575 -104431 19758 46741 3182 -91160 -151475 -4603
2237 -4603 -42767 102096 -25374 -234090 -97581 -72920 -139996 54448 -40586 -310422 -73278
2226 -73278 26083 -232794 -23825 -226887 -215959 54121 -123496 33207 -106097 -274960
2216 -274960 -94788 -29783 -49788 -69193 -123241 -377004 -104501 -36623 -359180 -89746 -344832
2205 -344832 -166835 67834 -64975 -45643 -215039 -247547 -40965 -75265 -212425 -116149
2195 -116149 -160080 -103146 131907 -94064 -224612 -205392 -199652 -158569 -71345 -127054 -210340
2184 -210340 -80101 -252945 -120761 -173107 -196341 -316752 -421347 -154415 -297521 -240059
2174 -240059 -43029 -298456 -153149 -159448 -314116 -237928 -174516 -50712 -172390 -129934 -155661
$$ packed form
2248G6180N2600k2740Q3317j30782j63006J24189K6983m3559r4342o0315J46872
2237d603l8164J44863j27470k08716J36509K4661o7076J94444r5034k69836K37144
2226g3278R9361k58877K08969k03062J0928K70080j77617J56703j39304j68863
2216b74960J80172O5005k0005j9405n4048k53763K72503O7878l22557K69434k55086
2205c44832J77997K34669j32809J9332j69396l2508K06582l4300j37160R6276
2195a16149m3931N6934K35053k25971j30548J9220N740M1083Q7224n5709q3286
2184b10340J30239j72844J32184n2346k3234j20411j04595K66932j43106N7462
2174b40059J97030k55427J45307o299j54668P6188O3412J23804j21678M2456k5727
$$ plain form
2163 -155661 -275081 -176063 -229016 -362726 -221620 -145452 -115988 21436 -93398 -189752 -217393
2152 -217393 -349734 -280305 -321270 -182853 -171411 -214651 -177177 -264499 -353326 -273635 -290631
2141 -290631 -240467 -159577 -112200 -189465 -170933 -182942 -305400 -238604 -231830 -333371 -91983
2130 -91983 -85977 -175894 -243876 -350111 -315263 -302558 -208317 -109053 -147378 -137960 -214963 -351398
2118 -351398 -262475 -329201 -350859 -158340 -284156 -128264 -51214 -347276 -239719 -273601 -274844
2107 -274844 -232437 -158367 -283907 -339534 -166494 -364398 -196715 -189348 -275936 -219630 -175174
2096 -175174 -154120 -258235 -93393 -215501 -206993 -170239 -208147 5691 -63738 -79327 -137574
2085 -137574 -284044 7498 -135143 8794 277486 199401 470731 327785 113093 127345
$$ packed form
2163a55661j19420R9018n2953j33710J41106P6168K9464J37424j14834r6354k7641
2152b17393j32341O9429m0965J38417J1442m3240L7474q7322q8827P9691j6996
2141b90631N0164Q0890M7377p7265J8532j2009j22458O6796O774j01541K41388
2130i1983O006q9917o7982j06235L4848J2705R4241R9264l8325R418p7003j36435
2118c51398Q8923o6726k1658J92519j25816J55892P7050k96062J07557l3882j243
2107b74844M2407P4070j25540n5627J73040j97904J67683P367q6588N6306M4456
2096a75174K1054j04115J64842j22108Q508L6754l7908K13838o9429j5589n8247
2085a37574j46470K91542j42641J43937K68692p8085K71330j42946k14692J4252
$$ plain form
2075 127345 -152449 -126675 -52766 -179709 -18086 58358 -163271 -329214 -257707 -338229 -267984
2064 -267984 -59026 -55864 -180799 -86612 -223791 -266965 -345103 -349786 -104334 -363588 -9490
2053 -9490 -38909 -353382 -104296 -396524 -335655 -336516 -323129 -142458 -200263 88353 -312716
2042 -312716 -396981 -242627 -520765 -235779 -162406 -227756 -207544 -168509 -194331 -282791 -181998
2031 -181998 -370803 -317582 -162105 -92011 -203115 -154315 -285414 -310233 -365061 -171611 -148122
2020 -148122 -240698 -156830 -322623 -388415 -204399 -355917 -303065 -168016 -290180 -253761 -135415
2009 -135415 -293659 -301959 -223112 -305826 -235629 -166016 -117742 -258474 -176634 -330249 -218432
1998 -218432 -122256 -217282 -668 -210676 -104085 -104111 -375681 -80204 -381893 -275350 -251740
$$ packed form
2075A27345k79794K5774P3909j26943J61623P6444k21629j65943P1507q0522P0245
2064b67984K08958L162j24935R4187j37179m3174p8138m683K45452k59254L54098
2053i490k9419l14473K49086k92228O0869q61J3387J80671n7805K88616m01069
2042c12716q4265J54354k78138K84986P3373o5350K0212L9035k5822q8460J00793
2031a81998j88805N3221J55477P0094j11104M8800j31099k4819n4828J93450K3489
2020a48122r2576Q3868j65793o5792J84016j51518N2852J35049j22164L6419J18346
2009a35415j58244q300P8847q2714P0197O9613M8274j40732Q1840j53615J11817
1998b18432R6176r5026K16614k10008J06591k6k71570K95477l01689J06543K3610
$$ plain form
1987 -251740 -354759 -80478 -100389 -154620 -211604 -399970 -460467 -314979 -267756 -225611 -27392
1976 -27392 -232053 -179353 -236776 -411335 -332915 -443530 -160661 -99852 -156625 -147374 -294615
1965 -294615 -348910 -367606 -440783 -232908 -326370 -169608 25566 -164753 -241826 -304950 -474070
1954 -474070 -266250 -134083 -67780 -104768 -231688 -245903 -315397 -179292 -284698 -233998 -304262
1943 -304262 -209261 -45375 -100864 -211074 -409155 -248150 -168038 -239516 -47069 -276903
1933 -276903 -182370 -210327 -141347 -379162 -316887 -33524 -350973 -15207 -197674 -392696
1923 -392696 -170320 -333828 -178141 -260667 -190019 -188438 -349093 -149203 -288477 -189735 -274424
1912 -274424 -231700 -17244 -136656 -61680 -109657 -403257 -332631 -128634 -290328 -203003 -97590
$$ packed form
1987b51740j03019K74281j9911n4231n6984j88366o0497J45488M7223M2145J98219
1976b7392k04661N2700n7423j74559P8420j10615K82869O0809n6773R251j47241
1965b94615n4295j8696p3177K07875r3462J56762J95174j90319p7073o3124j69120
1954d74070K07820J32167O6303l6988j26920j4215o9494J36105j05406N0700p0264
1943c04262R5001J63886n5489j10210j98081J61005Q0112p1478J92447k29834
1933b76903R4533k7957O8980k37815O2275K83363l17449L35766j82467j95022
1923c92696K22376j63508J55687q2526P0648J581j60655J99890j39274R8742q4689
1912b74424M2724K14456j19412P4976m7977k93600P0626K03997j61694Q7325J05413
$$ plain form
1901 -97590 -224142 -211607 -281310 -245546 -413942 -309188 -193729 -319408 -191668 -202013 -273999
1890 -273999 -307803 -209026 -359800 -321580 -140644 -288025 -200024 -234056 -182061 -165489 -283122
1879 -283122 -112502 -301860 -250708 -291549 -279427 -202663 -212303 -82481 -257111 -283616 -223427
1868 -223427 -276135 -153724 -170762 -111758 -274774 -91503 -127890 -400494 -104470 -313358
1858 -313358 -287783 -142505 -127773 -77548 -176649 -241913 -278712 -234536 -171891 -146535 -200011
1847 -200011 -263291 -94066 -260208 -192531 -251602 -369318 -246087 -187220 -273338 -204527 -210888
1836 -210888 -301437 -230819 -101045 -250266 -167561 -116830 -158183 -192387 -248541 -276054 -470308
1825 -470308 -323755 -24319 -109419 -199286 -226970 -370348 -402663 -162385 -171729 -240316 -178760
$$ packed form
1901i7590j26552J2535o9703L5764j68396J04754J15459j25679J27740j0345p1986
1890b73999l3804R8777j50774L8220J80936j47381Q8001l4032N1995J6572j17633
1879b83122J70620j89358N1152m0841J2122P6764r640J29822j74630k6505O0189
1868b23427n2708J22411j7038N9004j63016J83271l6387k72604K96024k08888
1858c13358K5575J45278J4732N0225r9101o5264l6799M4176O2645K5356n3476
1847b00011o3280J69225j66142O7677n9071j17716J23231N8867q6118O8811o361
1836b10888r0549P0618J29774j49221Q2705N0731m1353l4204n6154k7513j94254
1825d70308J46553K99436q5100q9867k7684j43378l2315K40278r344o8587O1556
$$ plain form
1814 -178760 -129742 -77355 -226218 -100919 -411294 -423266 -182211 -160781 -59477 -189283
1804 -189283 -409670 -374157 -474139 -181636 -217336 -214124 -67272 -132924 -187280 -125409 -212533
1793 -212533 -430317 -357543 -327274 -171336 -70355 -72695 -208193 -320987 -273676 -389249 -253470
1782 -253470 -58771 -231638 -61739 -169357 -204260 -301659 -359157 -269768 -251987 1131 -127689
1771 -127689 -226229 -82217 -417930 -234904 -261663 -303007 -189057 -236328 -86864 -238848
1761 -238848 -315157 -316538 -495998 -179715 -114109 3890 -133901 -240516 -177184 -266479 44539
1750 44539 -120041 -112888 -280238 -433412 -105323 -146702 -241011 -57981 -340350 -278233 -191276
1739 -191276 -74016 -417486 -277450 -254410 -366613 -6103 -115050 -202152 -119931 -217465
$$ packed form
1814a78760M9018N2387j48863J25299l10375j1972K41055K1430J01304j29806
1804a89283k20387L5513r9982K92503l5700L212J46852o5652n4356O1871q7124
1793b12533k17784P2774L0269J55938J00981k340j35498j12794M7311j15573J35779
1782b53470J94699j72867J69899j07618l4903r7399n7498Q9389J7781K53118j28820
1771a27689r8540J44012l35713J83026k6759m1344J13950m7271J49464j51984
1761b38848p6309j381j79460L16283O5606J17999j37791j06615O3332q9295L11018
1750D4539j64580P153j67350j53174L28089m1379r4309J83030k82369O2117Q6957
1739a91276J17260l43470J40036K3040j12203L60510j08947q7102Q2221r7534
$$ plain form
1729 -217465 -116888 -318543 -297788 -158905 -430490 -138146 14446 -183622 -171681 -174398
1719 -174398 -319898 -348750 -104361 -84549 -300078 14539 -219472 -225487 -160294 -332498 -229071
1708 -229071 -106059 -95816 -72521 -214118 -235150 -220150 -237076 -247190 -266743 -299053 -126029
1697 -126029 -245434 -60111 -19835 -119647 -123728 -361876 -166803 -130439 -127027 -156272 -270014
1686 -270014 -139854 -147855 -133263 -191974 -246374 -111868 -378591 -48885 -120156 -181619 -91697
1675 -91697 -133202 -294093 -330310 -230804 -338766 -247700 -147240 -215582 -78847 -127578 -259802
1664 -259802 -314266 -267278 -276866 -322050 -72068 -107238 -131414 -209638 -242693 -128224 -230595
1653 -230595 -214642 -188073 -60834 -59304 -158323 -86253 -390204 -145449 -226825 -187610 -162383
$$ packed form
1729b17465J00577k01655K0755J38883k71585K92344J52592j98068J1941k717
1719a74398j45500k8852K44389J9812k15529L14617k34011o015O5193j72204J03427
1708b29071J23012J0243K3295j41597k1032J5000j6926j0114j9553l2310J73024
1697a26029j19405J85323M0276r9812m081k38148J95073L6364L412k9245j13742
1686b70014J30160q001J4592n8711n4400J34506k66723L29706p1271o1463Q9922
1675i1697m1505j60891l6217R9506j07962R1066J00460o8342J36735m8731j32224
1664b59802n4464M6988r588m5184K49982l5170k4176p8224l3055J14469j02371
1653b30595J5953K6569J27239J530r9019P2070l03951K44755q1376L9215K5227
$$ plain form
1642 -162383 -213192 -266662 -341348 -153410 -356416 -279177 -161763 -248114 -45450 -40205 -229518
1631 -229518 -231737 -320275 -220587 -101886 -8126 -106650 -349617 -399497 -218114 -253294 -279693
1620 -279693 -201695 -155156 -147652 -80834 -171421 -334353 -363197 -287596 -301981 -29342 -131676
1609 -131676 -312810 -250734 -396011 -278686 -367045 -316849 -265529 -207023 19300 -135334 -330239
1598 -330239 -344436 -313845 -364782 -173298 -46222 -194004 -46855 -168374 -257813 -336625 -220908
1587 -220908 -253121 -298322 51265 -164595 -101855 -142056 -399437 -270455 -348808 -190982 -108930
1576 -108930 -281390 -87402 -194581 -376258 -171738 -273882 -317129 -226921 -232086 -168954 -230760
1565 -230760 -269119 -308342 -290611 -109109 -110812 -94370 -290124 -392820 -383700 -268272 -140895
$$ packed form
1642a62383n0809n3470p4686J87938k03006P7239J17414q6351K02664N245j89313
1631b29518k219q8538R9688J18701R3760r8524k42967m9880J81383l5180k6399
1620b79693P7998M6539P504O6818r0587j62932k8844P5601j4385K72639j02334
1609a31676j81134O2076j45277J17325q8359N0196N1320N8506K26323j54634j94905
1598c30239j4197L0591n0937J91484J27076j47782J47149j21519q9439p8812J15717
1587b20908l2213m5201L49587k15860O2740m0201k57381J28982p8353J57826Q2052
1576a08930j72460J93988j07179j81677K04520j02144m3247R0208n165O3132o1806
1565b30760l8359l9223J7731J81502j703J6442j95754j02696R120J15428J27377
$$ plain form
1554 -140895 -125027 -208741 -138480 -218416 -299889 -463215 -384251 -313846 -262083 -21948 -220528
1543 -220528 -167448 -177996 -392314 -249427 -197051 -282897 -316806 -162163 -91890 -188716 -193960
1532 -193960 -265562 -444640 -330870 -69346 -162842 -101618 -173868 -159958 -255136 -165863 -268343
1521 -268343 -505134 -146274 -84856 -36565 13273 -137363 -350452 -420787 -99507 -198004 -59600
1510 -59600 -154890 -244564 -242100 -286608 -109682 -293818 -210677 -172617 -21042 -110453 -108061 -222789
1498 -222789 -435639 -153988 -164935 -173535 -236242 -287674 -156483 -212909 -94738 -65022 -254923
1487 -254923 -191774 -126704 -179627 -238316 -251063 -362483 -241008 -97537 -205014 -185200 -266161
1476 -266161 -358456 -154016 -223851 -141464 -179777 -205926 -114207 -128847 -16713 -229311 -364837
$$ packed form
1554a40895J5868q3714P0261p9936q1473j63326P8964P0405N1763K40135j98580
1543b20528N3080j0548k14318J42887N2376q5846l3909J54643P0273r6826n244
1532a93960p1602j79078J13770K61524r3496O1224p2250J3910r5178Q9273j02480
1521b68343k36791L58860O1418M8291M9838j50636k13089p0335L21280r8497J38404
1510e9600r5290q9674K464m4508J76926j84136Q3141L8060J51575q9411K392j14728
1498b22789k12850K81651j0947q600o2707n1432J31191n6426J18171K9716j89901
1487b54923O3149O5070n2923n8689j2747j11420J21475J43471j07477J9814q0961
1476b66161r2295K04440o9835Q2387l8313k6149R1719j4640J12134k12598j35526
$$ plain form
1465 -364837 -211263 -234392 -137377 -141486 -111536 -179966 -185589 -86695 -254673 -246692 -233666 -305050
1453 -305050 -72394 -22600 -236957 -208479 -288217 -219906 -166858 -103336 -227748 -303178 -218504
1442 -218504 -103811 -124668 -192835 -270289 -277988 -288505 -114502 -32753 -137181 -312492 -266074
1431 -266074 -257200 -208794 -48177 -264593 -257386 -233390 -215102 -157957 -255895 -228591 -210729 -151412
1419 -151412 -3371 -187505 -258004 -376649 -155188 -78581 -158322 -175388 -198830 -357159 -227870
1408 -227870 31622 -256821 -180165 -129574 -331789 -31285 -35860 -209190 -182857 -150764 -134141
1397 -134141 -172801 -92661 -264888 -267456 -257349 -174184 -203891 -285325 -394744 -288857 -251291
1386 -251291 -89593 -46682 -256708 -42107 -232948 -237393 62824 -179903 -138598 -148177 -101937
$$ packed form
1465c64837J53574k3129R7015m109K9950o8430n623R8894j67978P981J3026p1384
1453c05050K32656M9794k14357K8478p9738O8311N3048O3522j24412p5430Q4674
1442b18504J14693k0857o8167p7454p699j0517J74003Q1749j04428j75311M6418
1431b66074Q874M8406J60617k16416P207K3996J8288N7145r7938K7304J7862N9317
1419a51412J48041j84134p0499j18645K21461P6607p9741j7066k3442j58329J29289
1408b27870K59492k88443P6656N0591k02215L00504m575j73330K6333L2093J6623
1397a34141l8660Q0140j72227k568J0107Q3165k9707q1434j09419J05887L7566
1386b51291J61698M2911k10026K14601j90841m445L00217k42727M1305r579M6240
$$ plain form
1375 -101937 -61673 -79052 -78719 -267639 -118820 -203118 -109644 -128273 -271622 -137283 -158559
1364 -158559 -292624 -46238 -194105 -301164 -218015 -278795 -121824 -71049 -268469 -197236
1354 -197236 -211327 -347977 -124753 -227822 -346626 -108823 -270641 -239382 -90908 -283446
1344 -283446 -206202 -280807 -114036 -138035 -200304 -108151 -141889 -193698 -34694 -281265 -228162
1333 -228162 -200749 -277912 -129209 -151946 -145704 -219731 -19720 -129181 -176918 -57562 -446552
1322 -446552 -160996 107515 -147727 60931 -125340 -277818 -217538 -187508 -194712 -128312 -225757
1311 -225757 -161864 -111361 -218888 -61569 -305498 -413858 -43898 -265816 -222641 -169076
1301 -169076 -178509 -264086 -196956 -75852 -295966 -243291 -264340 -206053 -82316 -170787 -142838
$$ packed form
1375a01937M0264j7379L33j88920J48819q4298R3474j8629j43349J34339k1276
1364a58559j34065K46386j47867j07059Q3149o0780J56971N0775j97420P1233
1354a97236j4091j36650K23224j03069j18804K37803j61818L1259J48474j92538
1344b83446P7244p4605J66771k3999o2269R2153l3738n1809J59004k46571N3103
1333b28162K7413p7163J48703k2737O242p4027K00011j09461m7737J19356l88990
1322d46552K85556K68511k55242K08658j86271j52478O0280L0030p204O6400r7445
1311b25757O3893N0503j07527J57319k43929j08360L69960k21918M3175N3565
1301a69076r433q5577O7130J21104k20114N2675k1049N8287J23737q8471K7949
$$ plain form
1290 -142838 -274511 -269565 -108443 -207519 -188655 -220636 -116824 -119172 -13228 -140416 -191393
1279 -191393 -250825 -255590 -48427 -180691 -125241 -210420 -436997 -144558 -177804 -120912 -193011
1268 -193011 -182537 -157216 -282935 -80830 -195130 -212215 -121534 -219925 -206920 -156807 -233221
1257 -233221 -284048 -261129 -187029 -226093 -145589 -102023 -293960 -250965 -330387 -273673 -41567
1246 -41567 -196042 -150566 -308417 -221632 -223524 -240016 -88740 -331321 -198395 -207792 -226306
1235 -226306 -106795 -232745 -126515 -368901 -138983 -307387 -308250 -49324 -220287 5996
1225 5996 -302846 -202610 -256919 -487632 -116825 -380523 -160856 -127709 -259849 -138282
1215 -138282 -370627 -85106 -316041 -243606 -189924 -318186 -148815 -243841 -260188 -330823 -408679
$$ packed form
1290a42838j31673M946J61122r9076J8864l1981J03812k348J05944j27188n0977
1279a91393n9432m765K07163j32264N5450q5179k26577K92439l3246N6892p2099
1268a93011J0474K5321j25719K02105j14300j7085R0681r8391J3005N0113p6414
1257b33221n0827K2919P4100l9064Q0504M3566j91937M2995p9422N6714K32106
1246d1567j54475M5476j57851Q6785j892j6492J51276k42581J32926r397j8514
1235b26306J19511j25950J06230k42386K29918j68404q63K58926j70963K26283
1225E996l08842J00236n4309k30713L70807k63698K19667L3147j32140J21567
1215a38282k32345K85521k30935P2435N3682j28262J69371r5026j6347p0635p7856
$$ plain form
1204 -408679 -180161 -234841 -212388 -268025 -272668 -266993 -188874 -134889 -197519 -204267 -263119 -260753
1192 -260753 -242238 -161863 -101059 -275719 -258421 -164576 -169275 -140839 -118198 -143386 -268163
1181 -268163 -165961 -169635 -290674 -65466 -130173 -283543 -78775 -314599 -301717 -108673
1171 -108673 -211049 -302203 -215114 -232533 -227312 -121486 -97114 -267917 -220267 -176549 -147821
1160 -147821 -188990 -143611 -229825 -250354 -118018 -78542 -290439 -148841 -205792 -304179 -174740
1149 -174740 -162211 -243205 -253525 -221159 -267291 -105843 -212551 -239473 -231095 -233509 -119374
1138 -119374 -141950 -117528 -258409 -263583 -196983 -249114 -84411 -205707 -82204 -200203 -44986
1127 -44986 -160763 -318119 -77800 -303448 -193317 -110768 -130438 -253160 -283302 -202801 -399476
$$ packed form
1204d08679K28518n4680K2453n5637m643N675P8119N3985o2630o748n8852K366
1192b60753J8515Q0375O0804j74660J7298R3845m699K8436K2641k5188j24777
1181b68163J02202l674j21039K25208o4707j53370K04768k35824J2882J93044
1171a08673j02376r1154Q7089j7419N221J05826K4372j70803M7650M3718K8728
1160a47821m1169M5379q6214k0529J32336L9476k11897J41598n6951r8387J29439
1149a74740J2529q0994j0320L2366m6132J61448j06708k6922Q378k414J14135
1138a19374k2576K4422j40881n174O6600n2131J64703j21296J23503j17999J55217
1127d4986j15777j57356K40319k25648J10131Q2549j9670j22722l0142Q0501j96675
$$ plain form
1116 -399476 -116818 -151370 -316322 -58596 -150660 -128156 -79389 -180886 -202154 -313840 -159641
$$ packed form
1116c99476K82658l4552j64952K57726r2064K2504M8767j01497k1268j11686J54199
$$ [...]
##END NTUPLES=NMR SPECTRUM
##END=
