##TITLE=1H_DE-80H_X3
 200.13MHz, d2o
 8 sc
 
 19ns.26.2.2025
##JCAMPDX= 6.0         $$ Bruker NMR JCAMP-DX V2.0
##DATA TYPE= NMR SPECTRUM
##DATA CLASS= NTUPLES
##ORIGIN= UXNMR, Bruker Analytische Messtechnik GmbH
##OWNER= pz
$$ XWIN-NMR		Version 3.5
$$ Fri Jan 16 10:40:57 2026 Russian Standard Time (UT+4h)  Yarkov@DPX200
##.OBSERVE FREQUENCY= 200.1313
##.OBSERVE NUCLEUS= ^1H
##.ACQUISITION MODE= SIMULTANEOUS
##.ACQUISITION SCHEME= undefined
##.AVERAGES= 8
##.DIGITISER RES= 18
##SPECTROMETER/DATA SYSTEM= spect
##.PULSE SEQUENCE= zg30
##.SOLVENT NAME= CDCl3
##.SHIFT REFERENCE= (INTERNAL, CDCl3, 0, 15.4472)
##AUDIT TRAIL= $$ (NUMBER, WHEN, WHO, WHERE, WHAT)
$$ ##TITLE= Audit trail, XWIN-NMR		Version 3.5
$$ ##JCAMPDX= 5.01
$$ ##ORIGIN= Bruker BioSpin GmbH
$$ ##OWNER= Yarkov
$$ C:/Bruker/XWIN-NMR/data/yarkov2/nmr/H-C/1/pdata/1/auditp.txt
$$ ##AUDIT TRAIL=  $$ (NUMBER, WHEN, WHO, WHERE, WHAT)
(   1,<2026-01-16 10:40:00.70 +0400>,<Yarkov>,<DPX200>,
      <created by zg, POWCHK disabled, PULCHK disabled
       configuration hash MD5:
       00 E9 B6 7A A2 85 ED C7 34 08 36 98 17 FE 4E 26
       data hash MD5: 16K
       4E D7 68 27 38 DB EC E3 A6 42 79 E8 62 40 07 5D>)
(   2,<2026-01-16 10:40:09.42 +0400>,<Yarkov>,<DPX200>,
      <Start of raw data processing
       efp BC_mod = 2 LB = 0.25 FT_mod = 6 PKNL = 1 PHC0 = -5301.897 PHC1 = 7.62193 SI = 16K 
       data hash MD5: 16K
       FD D5 DD AF 41 2A 63 F6 8E CD 1F EB 61 D9 73 B8>)
(   3,<2026-01-16 10:40:23.31 +0400>,<Yarkov>,<DPX200>,
      <pk PHC0 = 4.4 PHC1 = 0 
       data hash MD5: 16K
       6E 3D 5D 49 50 AC CD 2E 03 7D D2 F8 B9 80 61 76>)
$$ ##END=
$$ 
$$ hash MD5
$$ 98 FF 53 4F AD 9C 08 79 F5 20 01 B9 CB 87 90 86
##$RELAX= 
##$RELAX= 
##$RELAX= 
##$RELAX= 
##$RELAX= 
##$RELAX= 
$$ Bruker specific parameters
$$ --------------------------
##$DU= <C:/Bruker/XWIN-NMR>
##$EXPNO= 1
##$NAME= <H-C>
##$PROCNO= 1
##$TYPE= <nmr>
##$USER= <yarkov2>
##$AMP= (0..31)
100 100 100 100 100 100 100 100 100 100 100 100 100 100 100 100 100 100 
100 100 100 100 100 100 100 100 100 100 100 100 100 100 
##$AQSEQ= 0
##$AQ_mod= 1
##$AUNM= <au_zg>
##$AUTOPOS= <>
##$BF1= 200.13
##$BF2= 200.13
##$BF3= 200.13
##$BF4= 200.13
##$BF5= 200.13
##$BF6= 200.13
##$BF7= 200.13
##$BF8= 200.13
##$BYTORDA= 1
##$CFDGTYP= 0
##$CFRGTYP= 5
##$CHEMSTR= <none>
##$CNST= (0..31)
1 1 145 1 1 1 1 1 1 1 1 1 1 1 1 1 1 1 1 1 1 1 1 1 1 1 1 1 1 1 1 1 
##$CPDPRG= <>
##$CPDPRG1= <>
##$CPDPRG2= <>
##$CPDPRG3= <>
##$CPDPRG4= <mlev>
##$CPDPRG5= <mlev>
##$CPDPRG6= <mlev>
##$CPDPRG7= <mlev>
##$CPDPRG8= <mlev>
##$CPDPRGB= <>
##$CPDPRGT= <>
##$D= (0..31)
0 0.7 0 0 0 0 0 0 0 0 0 0.03 0 0 0 0 0 0 0 0 0 0 0 0 0 0 0 0 0 0 0 0 
##$DATE= 1768545600
##$DBL= (0..7)
120 120 120 120 120 120 120 120 
##$DBP= (0..7)
150 150 150 150 150 150 150 150 
##$DBP07= 0
##$DBPNAM0= <>
##$DBPNAM1= <>
##$DBPNAM2= <>
##$DBPNAM3= <>
##$DBPNAM4= <>
##$DBPNAM5= <>
##$DBPNAM6= <>
##$DBPNAM7= <>
##$DBPOAL= (0..7)
0.5 0.5 0.5 0.5 0.5 0.5 0.5 0.5 
##$DBPOFFS= (0..7)
0 0 0 0 0 0 0 0 
$$ [...]
##$SUBNAM2= <"">
##$SUBNAM3= <"">
##$SUBNAM4= <"">
##$SUBNAM5= <"">
##$SUBNAM6= <"">
##$SUBNAM7= <"">
##$SUBNAM8= <"">
##$SUBNAM9= <"">
##$SW= 18.0517328524113
##$SWIBOX= (0..15)
0 0 2 0 0 0 0 0 0 0 0 0 0 0 0 0 
##$SW_h= 3612.71676300578
##$TD= 16384
##$TD0= 1
##$TE= 0
##$TE2= 300
##$TE3= 300
##$TEG= 300
##$TL= (0..7)
0 120 120 120 120 120 120 120 
##$TP= (0..7)
150 150 150 150 150 150 150 150 
##$TP07= 0
##$TPNAME0= <>
##$TPNAME1= <>
##$TPNAME2= <>
##$TPNAME3= <>
##$TPNAME4= <>
##$TPNAME5= <>
##$TPNAME6= <>
##$TPNAME7= <>
##$TPOAL= (0..7)
0.5 0.5 0.5 0.5 0.5 0.5 0.5 0.5 
##$TPOFFS= (0..7)
0 0 0 0 0 0 0 0 
##$TUNHIN= 0
##$TUNHOUT= 0
##$TUNXOUT= 0
##$USERA1= <user>
##$USERA2= <user>
##$USERA3= <user>
##$USERA4= <user>
##$USERA5= <user>
##$V9= 5
##$VALIST= <valist>
##$VCLIST= <CCCCCCCCCCCCCCC>
##$VD= 0
##$VDLIST= <DDDDDDDDDDDDDDD>
##$VPLIST= <PPPPPPPPPPPPPPP>
##$VTLIST= <TTTTTTTTTTTTTTT>
##$WBST= 1024
##$WBSW= 4
##$XGAIN= (0..3)
0 0 0 0 
##$XL= 0
##$YL= 0
##$YMAX_a= 608514
##$YMIN_a= -480909
##$ZGOPTNS= <>
##$ZL1= 120
##$ZL2= 120
##$ZL3= 120
##$ZL4= 120
##$ABSF1= 0
##$ABSF2= 0
##$ABSG= 0
##$ABSL= 0
##$ALPHA= 0
##$AQORDER= 0
##$ASSFAC= 0
##$ASSFACI= 0
##$ASSFACX= 0
##$ASSWID= 0
##$AUNMP= <proc_1d>
##$AZFE= 0.1
##$AZFW= 0.1
##$BCFW= 0
##$BC_mod= 2
##$BYTORDP= 0
##$COROFFS= 0
##$CY= -3
##$DATMOD= 1
##$DC= 0
##$DFILT= <>
##$DTYPP= 0
##$F1P= 0
##$F2P= 0
##$FCOR= 1
##$FTSIZE= 16384
##$FT_mod= 6
##$GAMMA= 0
##$GB= 0
##$INTBC= 1
##$INTSCL= 3.241238e-09
##$ISEN= 128
##$LB= 0.25
##$LEV0= 0
##$LPBIN= 0
##$MAXI= 10000
##$MC2= 0
##$MEAN= 0
##$ME_mod= 0
##$MI= 1.114404
##$NCOEF= 0
##$NC_proc= -5
##$NLEV= 6
##$NOISF1= 3.799351
##$NOISF2= 2.8
##$NSP= 0
##$NTH_PI= 0
##$NZP= 0
##$OFFSET= 15.4472
##$PC= 1
##$PHC0= -5297.497
##$PHC1= 7.62193
##$PH_mod= 1
##$PKNL= yes
##$PPARMOD= 0
##$PSCAL= 0
##$PSIGN= 0
##$REVERSE= no
##$SF= 200.130014910505
##$SI= 16384
##$SIGF1= 3
##$SIGF2= 2
##$SINO= 0.751879
##$SIOLD= 32768
##$SREGLST= <19F.Aceton>
##$SSB= 0
##$STSI= 16384
##$STSR= 0
##$SW_p= 3612.71676300578
##$SYMM= 0
##$S_DEV= 0
##$TDeff= 16384
##$TDoff= 0
##$TI= <>
##$TILT= no
##$TM1= 0
##$TM2= 0
##$TOPLEV= 0
##$USERP1= <user>
##$USERP2= <user>
##$USERP3= <user>
##$USERP4= <user>
##$USERP5= <user>
##$WDW= 1
##$XDIM= 16384
##$YMAX_p= 366979799
##$YMIN_p= -428479
$$ End of Bruker specific parameters
$$ ---------------------------------
##NTUPLES= NMR SPECTRUM
##VAR_NAME=  FREQUENCY,     SPECTRUM/REAL,   SPECTRUM/IMAG
##SYMBOL=    X,             R,               I
##VAR_TYPE=  INDEPENDENT,   DEPENDENT,       DEPENDENT
##VAR_FORM=  AFFN,          ASDF,            ASDF
##VAR_DIM=   16384,         16384,           16384
##UNITS=     HZ,            ARBITRARY UNITS, ARBITRARY UNITS
##FACTOR=    0.220516191357247, 1,           1
##FIRST=     3091.44833059678, 0,            0
##LAST=      -521.268432409005, 0,           0
##MIN=       -521.268432409005, -428479,     0
##MAX=       3091.44833059678, 366979799,    0
$$ Real data points
##PAGE= N=1
##DATA TABLE= (X++(R..R)), XYDATA
$$ [...]
9683 -204754 -241872 -276395 -302210 -285982 -258487 -256992 -250892 -242283 -254468 -275757 -277732 -304999
9671 -304999 -311309 -287775 -257183 -250328 -248380 -187710 -217815 -178639 -158389 -208742 -218156 -220051 -199454
9658 -199454 -189585 -149098 -152978 -148754 -172442 -184493 -153898 -163777 -205958 -297592 -345852 -280980
9646 -280980 -245854 -171773 -162629 -178557 -211844 -275539 -243310 -173179 -170736 -197292 -212872 -228758
9634 -228758 -179327 -182152 -188615 -176834 -221167 -236240 -310285 -311867 -296634 -256486 -215126 -204996
9622 -204996 -196578 -242813 -291881 -321690 -300774 -278835 -272777 -326326 -377823 -333865 -293870 -232148
9610 -232148 -221680 -221097 -225004 -332964 -359575 -403713 -406981 -355474 -316193 -271472 -187225 -115666
9598 -115666 -127371 -154927 -232569 -285678 -329308 -348669 -320011 -253523 -106541 -69528 -101776
9587 -101776 -175847 -239099 -247534 -284084 -284260 -290151 -306875 -276102 -267752 -206510 -219325 -196193 -290163
9574 -290163 -329627 -307271 -263287 -201071 -185831 -171330 -153558 -181887 -228806 -200900 -194054 -215980
9562 -215980 -184627 -227806 -250489 -211260 -226780 -223456 -242170 -230791 -236034 -296780 -326918 -303943
9550 -303943 -270856 -246573 -260392 -274841 -282101 -280323 -264758 -256093 -269709 -269997 -298363 -289334 -269697
9537 -269697 -206313 -170484 -221113 -239105 -215255 -180703 -159602 -179594 -187424 -149097 -159418 -236685
9525 -236685 -255301 -284952 -229235 -178181 -163386 -178155 -183336 -206129 -243030 -179335 -186885 -227928
9513 -227928 -280673 -325770 -258211 -213976 -180846 -175444 -182698 -178574 -194098 -157873 -174460 -134537
9501 -134537 -161006 -195981 -246885 -237278 -168051 -149780 -186338 -183916 -154309 -170103 -211661 -248569
9489 -248569 -280240 -272759 -269814 -309797 -284152 -266235 -223984 -220471 -148215 -82880 -132617 -200890
9477 -200890 -228606 -191764 -136843 -115683 -124791 -145358 -140463 -133791 -159945 -160550 -123893 -102351 -64461
9464 -64461 -61755 -17958 -27369 -18310 36240 59210 55025 49317 37327 52719 87902 126661 166290
9451 166290 130263 14279 -12900 -18847 -101472 -119543 -101858 -62263 -26484 -25578 -41894 -20664
9439 -20664 -49517 -132105 -156078 -119904 -90079 -59432 -9406 9519 7450 24050 -34085 -47789
9427 -47789 -21115 5736 25425 44402 84460 138559 144099 128599 118072 59463 39693 7239
9415 7239 33778 72719 110609 85735 25554 -34921 -78485 -129137 -169687 -145903 -116056 -101934
9403 -101934 -102922 -70922 -47708 -88662 -157895 -243364 -310988 -282613 -234701 -190138 -167801 -181763
9391 -181763 -159472 -190373 -301478 -350268 -307539 -222828 -177430 -164455 -150979 -153995 -225839 -244817
9379 -244817 -210516 -219100 -228060 -228724 -223999 -146113 -122104 -162019 -174916 -203923 -221240 -267162 -269013
9366 -269013 -225902 -182472 -188721 -205667 -207212 -206889 -165487 -184674 -173538 -155676 -160458 -194240 -212711
9353 -212711 -182015 -118516 -59506 -42206 -27720 -37361 -55745 -54020 -70623 -43406 -51660 -71443
9341 -71443 -103405 -133499 -95232 -70066 -62894 -69780 -101600 -116571 -122730 -90020 -21229 -19456 -60818
9328 -60818 -110723 -134944 -170525 -134974 -89332 -89783 -82458 -114622 -120171 -138049 -128195 -138115 -162300
9315 -162300 -178547 -196477 -171934 -135860 -95520 -87048 -133316 -133234 -94254 -82383 -101433 -67378
9303 -67378 -31697 -81424 -106516 -121527 -95680 -97305 -59051 -96077 -126698 -150300 -162785 -147938
9291 -147938 -107111 -107057 -132141 -129577 -155756 -131916 -109120 -97832 -71485 -83673 -118831 -121275 -143447
9278 -143447 -86565 -49733 -17161 -31023 -31501 -62408 -76024 -33459 11501 34343 3097 -19542
9266 -19542 -14866 27992 93753 79046 14447 -1893 5132 57426 90608 79466 92460 113807
9254 113807 98990 118462 159556 209578 234128 221234 271719 290339 319774 339290 444922
9243 444922 523376 551935 559113 515179 498126 455220 454619 432719 413279 400014 390302 371398
9231 371398 358880 405017 418077 325476 317427 309633 354339 394368 449789 478055 474676 501770
9219 501770 448411 499642 539968 576645 615048 631046 652991 632043 663171 629462 639375 667274
9207 667274 667826 661485 653269 647647 653119 592880 562105 527285 537778 529911 581180 610976 574612
9194 574612 544140 485088 502032 550896 622723 648256 685831 671765 648752 628600 628738 662766
9182 662766 685599 712569 714483 712136 712441 676332 646334 618757 618113 596157 615888 649043 646033
9169 646033 647202 589580 533644 515338 514363 553043 560403 637573 679811 662101 621663 573557
9157 573557 583173 632187 650911 689379 744588 776451 800299 811668 825165 840222 844684 867160
9145 867160 834586 733562 737655 743748 704385 638039 650419 636267 592883 563283 571552 601060
9133 601060 546386 484477 480154 515414 603611 677104 688505 711643 726386 733848 753790 757441
9121 757441 745414 726514 700856 721944 748717 760206 738894 685792 703676 680197 668717 629071
9109 629071 602613 647161 699326 747178 761358 783444 716564 681408 670985 682506 710890 734473
9097 734473 750519 781772 826205 834916 812106 760059 716865 753615 797554 883917 908885 955146
9085 955146 1033421 1044202 1056201 1098460 1121203 1078652 1094770 1169077 1182648 1174695 1177041 1100517
9073 1100517 1099783 1152564 1149732 1127184 1071450 1101282 1106412 1125949 1173883 1171735 1154253 1158068 1148243
9060 1148243 1209434 1229346 1270492 1275527 1274622 1279530 1325306 1353202 1319677 1360472 1342435 1350524
9048 1350524 1406142 1437957 1497457 1561848 1565047 1609792 1605374 1621032 1603294 1624581 1693960 1711387
9036 1711387 1749604 1747130 1699380 1697545 1708734 1717695 1754203 1790937 1786002 1818115 1866785 1844731
9024 1844731 1802512 1740514 1684123 1718521 1785566 1839671 1868759 1901082 1861721 1823128 1796727
9013 1796727 1836462 1891518 1975563 2090257 2157452 2195210 2252397 2285690 2344637 2403461 2468508
9002 2468508 2478407 2478078 2515175 2583318 2622828 2602599 2587811 2567896 2575249 2563932 2588453 2623087
8990 2623087 2602287 2624629 2638607 2678898 2728584 2783973 2814867 2825936 2888444 2910298 2915245 2947122
8978 2947122 3089305 3183998 3258917 3330303 3380529 3414575 3456783 3491830 3574496 3685515 3764189
8967 3764189 3829382 3939495 4044911 4159401 4229585 4248614 4298729 4366285 4496122 4544417 4591611
8956 4591611 4615118 4644025 4693916 4707255 4790599 4882971 4976320 5023255 5099676 5211772 5356884
8945 5356884 5474608 5502158 5615889 5774453 5972919 6169418 6350806 6493195 6645741 6847928
8935 6847928 7056324 7266232 7522808 7862477 8363492 8972930 9855236 11037710 12578629
8926 12578629 13854499 14217678 13841340 13095980 12280895 11572527 11052166 10682367 10484003
8917 10484003 10370197 10299363 10281563 10343620 10527915 10735863 10966769 11235316 11478543 11789550
8907 11789550 12165612 12582110 12996855 13449922 13941922 14519875 15115236 15787363 16511603
8898 16511603 17219297 18000946 18868574 19882902 21035392 22337237 23884624 25686961 27860826
8889 27860826 30489146 33770942 37886190 43187285 49715278 57118063 64578015 71225958
8881 71225958 76659073 80966217 84728333 88591741 92580492 95942629 97597148 96898536
8873 96898536 93612230 88223706 81502048 74525842 68342589 63367590 59730559 57151657
8865 57151657 55656314 55269294 55925427 57653648 60022088 62763939 65465597 68046976
8857 68046976 70336623 72607056 75332135 78858406 83492817 89289600 96120141 103305159
8849 103305159 109966097 115433540 119537311 122887599 126248252 130030155 134044286 137283942
8841 137283942 138452312 136493329 131179506 123062667 113318471 103269735 94262672 86957822
8833 86957822 81462021 77578805 75324029 74770234 76040952 79224840 83847514 89144196
8825 89144196 94171118 98058329 100408244 101050186 100435046 99006166 97248717 95261618
8817 95261618 92761427 89569257 85471960 80572752 74958844 68986588 63194812 57790799
8809 57790799 53019575 48844038 45354227 42452633 40082789 38168279 36685326 35634287
8801 35634287 34903660 34521566 34475101 34879575 35688119 36946832 38903379 41705281 45602953
8792 45602953 50301464 55279471 59839081 63427718 65831772 66905125 66933834 66228134 65131900
8783 65131900 63715060 61821315 59321811 56122621 52210374 47694469 42999164 38424782
8775 38424782 34282110 30642044 27556636 25070241 23010316 21328659 19838044 18585938
8767 18585938 17532468 16653398 15904017 15183244 14586899 14004502 13450637 13029985 12676950
8758 12676950 12383260 12086325 11851761 11496486 11245685 11069364 10916580 10796107 10607445
8749 10607445 10528952 10449257 10401760 10306320 10215929 10103802 9964793 9857388 9716532 9612090
8739 9612090 9495776 9371889 9229026 9136052 9026262 8905753 8826659 8718764 8699757 8684543
8729 8684543 8693073 8700722 8653503 8684896 8745213 8824412 8838179 8899961 8996295 8997965 9081667 9109771
8717 9109771 9218831 9333622 9427559 9574244 9687117 9845535 9882673 10008708 10079122 10190962
8707 10190962 10258851 10362530 10587734 10749928 10959922 11117260 11383691 11605747 11924754 12405559
8697 12405559 12892223 13550182 14232577 14887848 15476812 16030570 16553947 17112336 17696304
8688 17696304 18123657 18457956 18646006 18824537 18970066 19073023 19345477 19683369 20229678
8679 20229678 20857642 21608748 22530494 23541809 24717885 25999759 27592758 29383749 31577972
8670 31577972 34174452 37393737 41448518 46411467 52166865 58082719 63937708 69483258
8662 69483258 74517397 78769667 81613485 82864815 82248567 80120820 76553014 71787545
8654 71787545 66360387 60612326 55222447 50327194 46185371 42773933 40184735 38346639
8646 38346639 37202739 36709331 36725698 37242544 38044577 39153814 40505684 42044811 43959593
8637 43959593 46301083 49507593 53649844 59061092 65769174 73421599 81399000 88968750
8629 88968750 96009739 102279463 107488165 110749788 111453697 109720332 105735243 99916203
8621 99916203 92512979 84375323 76387844 69324561 63421881 58660926 55115780 52594322
8613 52594322 51070164 50192178 50000963 50371087 51217395 52568511 54487698 57255461 60922530
8604 60922530 65826959 72105528 79898637 89171687 99353954 109883612 119728378 128131173
8596 128131173 134567166 138799630 140797905 140359566 137516494 132130840 124676231 115651267
8588 115651267 105647020 95307318 85156539 75858052 67730734 60975467 55521384 51120367
8580 51120367 47686220 44974115 42989976 41513749 40406303 39710188 39347116 39280610 39557607
8571 39557607 40245317 41398764 43136269 45448375 48679146 52802695 57878831 63549890
8563 63549890 69356461 74854471 79418282 82786212 84736599 85189962 84098475 81473737
8555 81473737 77634877 72619232 66934998 60810871 54631428 48766946 43399889 38770969
8547 38770969 34817997 31526848 28767171 26529652 24654536 23097155 21810511 20719333
8539 20719333 19899676 19205800 18673093 18285111 18070499 17938546 17899111 17994466 18184462 18450566
8529 18450566 18731818 19051828 19316704 19567408 19630501 19363816 18906611 18246354 17568665 16812558
8519 16812558 15986376 15218521 14403781 13707338 12998536 12410156 11969446 11605582 11315256
8510 11315256 11048621 10878448 10735618 10659566 10600835 10604949 10615469 10586938 10605621 10528420 10460137
8499 10460137 10416799 10445848 10532111 10691221 11069822 11484936 11909025 12175401 12311612 12383388
8489 12383388 12248636 12131722 11984323 11831429 11564488 11240194 10845053 10385711 9892489
8480 9892489 9320235 8747896 8188572 7717582 7289413 6944525 6620098 6295852 6055630 5779122
8470 5779122 5586013 5450644 5416732 5436656 5402282 5371972 5332792 5321168 5202335 5062097 4937534
8459 4937534 4851262 4824142 4741678 4657278 4523385 4424660 4263001 4137486 4085413 4018370 3985116
8448 3985116 3890589 3842761 3768507 3733061 3669850 3542456 3483282 3374448 3327126 3194500 3100279
8437 3100279 3024875 2929136 2900919 2848078 2874109 2855674 2821301 2688038 2644368 2664151 2600525
8426 2600525 2548363 2515846 2529971 2564796 2542139 2493345 2412916 2430579 2391394 2364847 2282947
8415 2282947 2249964 2197309 2141299 2093521 2043701 2074807 1997531 1967840 1924439 1916011 1921248 1822775
8403 1822775 1805777 1774880 1758526 1759221 1744535 1817039 1772066 1814023 1765713 1793917 1805302 1792583
8391 1792583 1794500 1696564 1710152 1744382 1762485 1731682 1690709 1703766 1725141 1729649 1708014 1722013
8379 1722013 1695400 1665470 1580845 1540485 1540675 1536509 1601408 1585973 1639980 1654376 1610089 1532870
8367 1532870 1422469 1444291 1437466 1473577 1451651 1489580 1528544 1534963 1543095 1487860 1515664 1484365
8355 1484365 1464441 1454874 1436410 1452305 1402979 1422605 1391233 1442095 1476612 1425775 1472511 1456989
8343 1456989 1485495 1446230 1444489 1462857 1489617 1504309 1431674 1391787 1359389 1424998 1476353 1488387
8331 1488387 1534542 1550366 1662829 1719616 1794917 1894022 2009099 2156523 2356262 2624389
8321 2624389 2876709 3128484 3255655 3293498 3292442 3232997 3097510 2881724 2744170 2573309
8311 2573309 2416110 2267394 2165449 2111706 2015020 1945249 1892316 1901913 1828453 1707848 1637337
8300 1637337 1564256 1639551 1682082 1685851 1716203 1737760 1749392 1791904 1850922 1910449 1990622 2053980
8288 2053980 2186389 2467353 2710345 2946194 2965899 2837302 2691312 2577506 2499045 2448958
8278 2448958 2406011 2330323 2247597 2078193 1920499 1809292 1644142 1496219 1421557 1384747
8268 1384747 1405164 1372034 1361103 1432454 1499295 1496853 1459601 1345402 1343498 1347015 1384790 1414045
8256 1414045 1395061 1439688 1400916 1360338 1386592 1409255 1394593 1290730 1257312 1247562 1335678
8245 1335678 1375852 1310437 1259699 1257887 1279986 1317047 1353512 1425715 1478899 1447604 1417639 1427872
8233 1427872 1439855 1437527 1394705 1362553 1378172 1385026 1383638 1353347 1336930 1385865 1345851 1293752
8221 1293752 1222020 1171956 1145947 1133551 1144213 1141528 1117502 1048973 979739 1024487 1085600 1098565
8209 1098565 1071470 1044176 1076076 1145573 1203654 1205251 1154294 1145249 1155740 1197671 1221736 1310135
8197 1310135 1390984 1369167 1360387 1311241 1204465 708381 820266 953017 979862 1085475 1125573
8186 1125573 1188602 1208063 1229582 1114002 980551 956987 1002780 1044739 1084186 1159154 1253616
8175 1253616 1289663 1255651 1135099 1083693 1095943 1104913 1097057 1148635 1159418 1187081 1133458 1125227
8163 1125227 1105370 1067540 1026312 973949 979496 1039502 1114614 1144053 1124920 1092470 1021957 968525
8151 968525 893708 881663 885856 929449 905325 936237 1003795 1030369 981044 883542 888118 865690
8139 865690 815242 820828 880014 924284 926048 902939 843165 830956 787585 726116 728510 771427
8127 771427 801627 776756 717087 659266 619624 629369 636572 649662 652630 665666 690802 691948
8115 691948 720304 694042 636512 561675 553879 613746 687511 711526 675812 625491 621492 640316
8103 640316 605283 583625 615227 604215 587817 619149 608312 664209 687606 686352 746215 780728
8091 780728 771176 720302 703641 686500 709251 693290 721426 719743 764991 795636 820790 763734
8079 763734 718883 689992 674434 682454 720393 826482 862498 824731 832311 834874 870130 876534
8067 876534 879930 908144 925259 918940 949762 993850 996025 969314 899476 855194 860483 840373
8055 840373 836035 866724 917161 1015401 1079262 1062582 968238 980191 1000067 980493 941602 957520
8043 957520 1028996 1122417 1178254 1172705 1162813 1081858 966550 914482 948029 931174 928690 939093
8031 939093 924093 912228 847836 851021 836394 803386 841801 869779 889577 902749 912627 951356
8019 951356 982051 966304 934562 960188 979610 985907 978885 991212 1010033 984337 985417 1002870
8007 1002870 1032034 1023966 923816 833852 807579 834768 825160 863071 926473 936311 904843 900326
7995 900326 850222 820485 814719 819867 818100 854433 841914 906187 955088 923445 868465 786194
7983 786194 753859 773795 808786 829540 878830 894869 915057 941330 918898 946114 996312 1011418
7971 1011418 1018059 1005913 994165 1027525 1079990 1123764 1143689 1153741 1204962 1207715 1231392 1306846
7959 1306846 1363455 1367184 1355362 1342836 1384670 1422026 1412491 1403277 1487310 1537070 1621667 1612422
7947 1612422 1629777 1702307 1765044 1770875 1752519 1774249 1804783 1838430 1895087 1943391 1883132 1895490
7935 1895490 1856332 1820327 1874613 1940068 1925370 1880986 1847047 1805988 1819531 1784200 1732854
7924 1732854 1697762 1622236 1616464 1593479 1592824 1605881 1598196 1563115 1497055 1458206 1414365 1273539
7912 1273539 1244569 1284100 1280167 1257537 1242467 1223087 1201258 1154471 1089408 1000711 918636 868378
7900 868378 820882 841181 882875 913191 883673 884313 773378 692423 761333 744277 726833 679236
7888 679236 693006 745671 746063 738901 702647 682032 644962 633735 595761 579077 584570 577627 578971
7875 578971 567889 540087 521797 512928 509175 496772 481359 467470 477623 472423 474941 512695
7863 512695 540755 466766 403324 372892 347960 341892 369021 366869 377108 389244 360347 322073
7851 322073 331579 337841 323452 276654 275963 318049 271778 260275 256431 285453 382879 417223 433419
7838 433419 369199 312178 302559 274547 232748 227042 284391 312762 348335 298883 275395 228146
7826 228146 112975 111690 140115 188791 284373 348143 390454 360882 314043 236936 168117 173727
7814 173727 254179 272577 304916 359438 442259 430363 330274 253450 316288 291858 177907
7803 177907 219035 268635 352678 371443 338306 309363 287427 211165 175762 169288 215673 251406
7791 251406 305015 337018 314545 303101 299352 272729 203511 218402 264333 261009 322293 349522
7779 349522 344134 322196 258715 169824 157315 156534 150154 173155 229165 273390 293186 293340 246701
7766 246701 233260 174343 116648 117028 155818 211136 291085 266031 241768 169994 172861 182629
7754 182629 199627 190304 182739 157437 143729 131301 115370 129839 141045 174254 181689 159104
7742 159104 106464 51905 75864 101767 125373 147149 174019 220814 197903 218756 195545 180412
7730 180412 95014 48752 75578 166482 189755 152361 116298 68002 87095 82494 71866 87322
7718 87322 71210 36530 53949 110180 93216 95231 89604 43046 73854 120127 96581 92308
7706 92308 78840 44103 69094 79688 88918 117359 104329 85267 88968 39979 49083 62012
7694 62012 63264 116343 171981 171242 139395 113844 137377 130193 127383 173699 159086 133200 128298
7681 128298 94709 127542 156961 154403 190232 170275 157432 156662 141002 149642 155551 167978 145359
7668 145359 176852 203325 205918 197349 210970 163409 134834 213956 263594 286731 286515 296179 207832
7655 207832 173147 122137 121841 129313 154754 171639 141280 169549 148765 134827 113682 108406
7643 108406 102524 71708 95715 96566 133194 131447 116345 144434 95094 104312 84053 95244 76184
7630 76184 37066 20434 25550 40628 132682 173294 173745 162641 84386 17609 11567 -2427 21157
7617 21157 35795 58589 78276 77857 86973 42614 16754 -14367 -17881 -12052 -2191 32644 38839
7604 38839 39127 36789 22779 30817 30620 23766 33625 114673 77710 72428 72462 125185 146163 162072
7590 162072 201770 189635 182853 168859 100971 108357 128664 145939 107404 95032 92841 134729
7578 134729 99633 86790 90324 48792 58257 35945 72532 121188 125066 153854 123852 120729
7566 120729 123025 82389 71053 52202 70778 85308 120247 96181 94701 76422 56363 32695
7554 32695 11072 58460 72527 126173 117720 106410 109573 29191 -24001 -64342 12679 20374
7542 20374 58592 89589 72819 90149 25115 -8207 -35610 2156 54544 58081 78350 130640
7530 130640 181578 119234 104350 72188 111571 112845 124544 185514 227802 233296 190379 132253
7518 132253 89806 79243 94890 96700 144777 161888 203341 131182 63709 78993 93649 134119
7506 134119 105893 130846 191279 180456 173303 148483 139580 148415 92619 39353 26206 90203
7494 90203 60944 50817 26582 73506 60576 -4377 -11550 -7879 22875 -36306 -1025 26204
7482 26204 56162 78074 57255 6659 8514 -6752 -48314 16565 69302 119583 99436 62008
7470 62008 2704 -5349 7182 -29068 -6871 62933 80991 58016 41980 63901 54418 60855
7458 60855 8755 43531 101650 119367 143159 94866 89643 49639 21608 23031 43512 135822
7446 135822 174209 154240 148733 139186 151163 96270 109831 148729 201458 219037 220365 204920
7434 204920 163281 148241 114946 99499 120440 117402 92105 71434 54698 90350 112063 36285
7422 36285 24198 30700 33949 30412 47217 62339 24101 58779 40914 89144 118216 88239
7410 88239 81792 92388 131861 120155 135162 98195 90769 80087 38274 50475 -1287 24985
7398 24985 38683 50629 75437 89990 111407 53466 34746 83418 84413 126093 120083 102989
7386 102989 113732 104106 66258 60285 67150 78788 109190 83204 115280 162200 117468 70826
7374 70826 29558 65413 131413 154685 112742 140124 174919 146971 119199 101099 97466 107216
7362 107216 105948 90283 122571 107673 75659 60651 40070 135948 153948 126857 78718 11327
7350 11327 56232 117502 167448 192138 191755 231645 231644 216517 196814 161967 139542 122721 149669
7337 149669 217303 271522 281841 235380 183258 112945 83536 116407 144319 203838 230825 266262
7325 266262 262746 227743 243456 202969 200110 199713 184746 201066 210721 279408 273481 256940 211294
7312 211294 185074 171177 155203 200930 175783 142172 187384 155969 118508 125908 172111 202472
7300 202472 198018 143550 74503 54757 107581 153554 186436 228016 234537 179075 162738 154754
7288 154754 165342 144708 102199 95708 143059 160118 203593 171960 170691 150141 76450 88748
7276 88748 140770 175814 212927 275356 252599 199744 189347 171880 162103 193081 252316 246457
7264 246457 198125 239022 274342 264402 284166 255802 242995 205365 203881 265844 319064 356706
7252 356706 354906 362126 340882 300679 261350 261400 240345 235168 244177 258871 309444 339892 344699
7239 344699 320028 289774 285697 248785 303380 337791 336613 338934 299235 266682 260408 264719 276506
7226 276506 313745 317170 307677 345173 354117 370183 379255 361512 322463 336566 306296 274239
7214 274239 255247 328028 413589 419278 395708 353062 335292 364464 350367 375119 375795 338722
7202 338722 329599 346803 375569 391708 409139 408704 429403 469177 500828 510066 516880 463575 457150
7189 457150 436695 461379 527061 503933 507689 500792 513743 508062 454185 457192 446342 467070
7177 467070 478705 512296 482664 454591 476903 498339 513117 459582 483419 552604 569578 608737
7165 608737 602144 560238 480757 406329 435890 492748 605794 621333 622181 627778 629408 592376
7153 592376 549318 558644 571872 591133 570189 600809 628513 648516 643197 654753 623820 626435
7141 626435 654203 634104 690782 673036 658072 625059 612486 630022 686653 768399 765638 785677
7129 785677 798373 751874 785090 777564 838005 893670 900540 881416 867143 901971 892883 942558
7117 942558 931296 990028 986761 933847 932767 968903 1017534 1029086 1042071 1075129 1090030 1117811
7105 1117811 1144583 1143318 1168298 1174966 1139242 1132261 1184725 1229633 1240863 1214161 1201087 1223874
7093 1223874 1296885 1307379 1278521 1302594 1347336 1405424 1354244 1358751 1384413 1360673 1341500 1323892
7081 1323892 1386846 1402379 1408185 1439817 1466342 1529412 1556000 1532083 1499576 1493845 1548676 1541196
7069 1541196 1515316 1524014 1590765 1659589 1676875 1700045 1720698 1732903 1652802 1655656 1674858 1665780
7057 1665780 1706576 1752312 1762928 1765314 1804244 1799225 1782561 1843422 1823292 1829233 1813627 1825840
7045 1825840 1853409 1908568 1928409 1930536 1992645 2060650 2063975 2008179 2067647 2136786 2183602 2173759
7033 2173759 2158264 2155683 2232633 2265540 2278562 2339961 2344423 2318431 2316208 2358497 2476076 2529362
7021 2529362 2550916 2571526 2599585 2681935 2711095 2774797 2819708 2903194 2960525 3000465 3046354
7010 3046354 3105195 3194202 3223394 3251901 3309927 3364771 3389004 3411510 3461845 3577196 3620809
6999 3620809 3635149 3686795 3806955 3915789 3977853 4035086 4080250 4136700 4186439 4226571 4367816
6988 4367816 4489874 4614183 4713632 4757098 4815485 4915578 5038238 5127373 5238845 5315042
6978 5315042 5415461 5508413 5656264 5860280 6029248 6157349 6240885 6379952 6525638 6674222
6968 6674222 6789576 6915583 7095283 7253510 7459510 7679691 7921128 8151513 8306502 8454993
6958 8454993 8605307 8774525 8974251 9185343 9446864 9730088 9986350 10201033 10444229 10712797
6948 10712797 11003143 11314207 11683334 12059047 12406465 12795850 13193538 13644771 14085558
6939 14085558 14522960 15010182 15540110 16149983 16782738 17430937 18071102 18721822 19435349
6930 19435349 20144266 21027625 22019753 23020692 24052751 25106078 26216743 27461238 28826010
6921 28826010 30305925 31924298 33599429 35400065 37387756 39444285 41592061 43901856
6913 43901856 46363549 48909127 51610865 54414758 57298369 60200156 62974048 65677048
6905 65677048 68222582 70543851 72488041 74075647 75260410 75987502 76151512 75693802 74734900
6896 74734900 73205815 71335254 69200770 66706758 64026328 61205684 58336813 55460124
6888 55460124 52640033 49906921 47276010 44731763 42258599 39963048 37885185 35967426
6880 35967426 34144930 32388359 30753512 29198146 27796525 26484340 25250226 24149296
6872 24149296 23102058 22113375 21195704 20372772 19551902 18795735 18041857 17391331 16767242
6863 16767242 16122324 15523805 14992200 14557682 14142733 13676296 13192461 12754523 12376373
6854 12376373 12028627 11682101 11309134 10984578 10654972 10317827 10056894 9734679 9524398
6845 9524398 9264682 8968876 8752096 8516819 8343535 8100002 7902415 7643160 7405175 7206851
6835 7206851 7018177 6883514 6750177 6672397 6510461 6367856 6228078 6106227 5991372 5771404
6825 5771404 5609715 5517051 5417930 5314866 5229181 5168571 5071865 4949014 4771963 4630753
6815 4630753 4545164 4456204 4365474 4285183 4254769 4194102 4082725 3976249 3874349 3786733 3699076
6804 3699076 3619354 3532030 3541598 3488055 3439985 3395896 3332597 3274047 3184403 3088592 3000130 2946144
6792 2946144 2885439 2865043 2859753 2817449 2845895 2811606 2798734 2727915 2634545 2550898 2441254
6781 2441254 2404170 2385652 2361150 2332267 2299358 2317762 2299298 2284752 2196829 2146931 2068084
6770 2068084 1999953 2002191 1985673 2040244 1992867 1970590 1946778 1906776 1893642 1887918 1857419 1819807
6758 1819807 1786857 1838369 1844100 1785151 1736080 1708512 1681983 1692911 1667181 1644662 1599412 1579403
6746 1579403 1596394 1571083 1536363 1489566 1434788 1446586 1465427 1471162 1400668 1342499 1321469 1352532
6734 1352532 1331263 1343141 1374897 1336852 1354019 1301740 1272462 1268904 1215297 1142762 1097724 1134946
6722 1134946 1194699 1224885 1175453 1108377 1111646 1047493 1018256 1008108 1044255 1089406 1069468 1049894
6710 1049894 1062401 1067374 1018444 1022530 1017406 1054400 1056718 1018246 981309 984813 978931 980147 954279
6697 954279 912857 871513 871645 932501 927318 922656 916302 824715 792439 822025 850651 838934 785522
6684 785522 801374 807729 798942 807794 808936 796781 775150 732326 716553 730413 775659 757077
6672 757077 707472 625521 624121 682910 693459 695966 722266 734008 681208 636441 620641 631934
6660 631934 663163 641586 620922 644032 627020 616455 596922 597903 623121 596463 542906 515057
6648 515057 563758 582699 567101 551499 505890 518790 487859 462128 506234 559758 597759 521829
6636 521829 428372 430211 449666 462041 436964 416548 460017 507916 482526 472451 508522 459536
6624 459536 387316 378340 373566 398902 391476 351083 360579 338103 335459 333954 341060 363627 404864
6611 404864 408034 380036 425089 469461 447771 430626 399488 435388 485025 509493 484543 465839
6599 465839 506866 490519 476062 415491 349428 350940 342395 403227 410824 420578 378194 384577 465598
6586 465598 441437 443753 405826 365465 338646 366336 406399 414058 447401 427505 388829 391304
6574 391304 352691 350318 340025 310758 362152 347919 375632 346670 299932 259176 261797 292128
6562 292128 305239 320786 299815 298428 300373 286450 309229 304028 252980 244048 247609 292629 289100
6549 289100 267674 221149 211405 276134 313734 332822 308754 263526 277058 232500 243520 288689
6537 288689 300081 308965 339229 392118 396927 358921 278570 258915 244431 230270 278820 296528
6525 296528 307925 356081 310193 297197 243020 233893 235860 239054 318108 367446 363961 316834
6513 316834 281885 229087 222173 231902 238618 275430 330672 312735 341408 314010 330612 293642
6501 293642 211793 225566 271846 306737 364128 401846 402568 375997 353672 318983 310392 296343
6489 296343 275774 255756 261833 318802 330047 305005 306923 305092 347726 312368 286688 287338 261500
6476 261500 281412 293317 312486 341503 371489 416593 417657 388700 363730 342312 314676 286790
6464 286790 332083 363518 373099 352740 339432 342363 300105 328122 356989 386220 442671 392472
6452 392472 433214 417944 386550 409800 429145 429431 445756 479464 484905 455749 479680 451548
6440 451548 404388 414336 400641 414051 396917 391266 416253 455719 515730 498234 526699 546899
6428 546899 588109 637787 659710 668502 637034 632240 637256 640188 635711 604461 596669 568666 618725
6415 618725 650823 655530 657295 575250 558373 524386 512328 552765 538572 552125 573638 634175
6403 634175 672791 684847 668100 623299 616168 582510 598616 613766 700827 693892 656362 688253
6391 688253 736455 738044 650651 606688 629947 657684 626641 592358 590885 591300 655960 644317
6379 644317 669664 676634 632912 643912 628845 635878 674826 671808 603877 574210 598999 669720
6367 669720 689933 649058 675174 663234 678231 727423 747921 764832 736810 708009 722376 759321
6355 759321 781587 738054 692455 679854 686601 714647 691576 730718 714422 721113 699406 651735
6343 651735 619319 578912 555739 538512 536771 596327 635251 599904 616753 583839 612588 579716
6331 579716 486115 513951 553894 594673 564962 593050 617144 622299 674706 662423 687511 660098
6319 660098 622534 594632 538804 547902 546213 580193 569438 574488 600460 595646 614018 597040
6307 597040 580606 549892 495968 456066 493955 598555 680764 743977 661408 643195 669927
6296 669927 634433 676195 710948 719393 728023 683122 730202 786586 750320 735280 699925 737581
6284 737581 755326 762803 797389 795565 761836 756482 751634 762114 780347 807217 796247 846157
6272 846157 871287 815272 758810 724119 820362 881004 862857 864829 845556 868946 875396 850707
6260 850707 846660 880762 901575 876537 918811 994257 1003833 919679 809800 818532 858516 885709
6248 885709 901524 924938 972433 962090 964466 953432 953954 992674 988515 987175 1022818 1058361 1066895
6235 1066895 1069029 1056612 1105182 1130062 1129827 1098109 1094452 1170022 1211004 1207650 1169341 1163425 1132516
6222 1132516 1144383 1164885 1224205 1269184 1240257 1235173 1245396 1320265 1404237 1387210 1355436 1297588
6210 1297588 1323055 1350119 1414678 1490314 1563259 1596787 1552071 1580577 1605762 1635036 1620528
6199 1620528 1573386 1594563 1640088 1703017 1750630 1782811 1934268 2010693 1937177 1863660 1841467
6188 1841467 1859264 1930882 1944870 1988757 2043714 2085600 2136759 2180185 2209035 2271867 2300568
6177 2300568 2275126 2333269 2415945 2507146 2581983 2602020 2679098 2743133 2828845 2936084 3011464
6166 3011464 3127578 3168067 3183944 3276397 3461323 3634800 3778662 3983157 4139015 4296407
6156 4296407 4426722 4660862 5002387 5345520 5719937 6024648 6328036 6656046 6926065 7210238
6146 7210238 7433263 7562585 7706238 7764767 7767619 7816454 7794925 7737570 7653217 7563864 7565013
6135 7565013 7727889 7960914 8304773 8812304 9392489 9873370 10115991 10168013 10041223 9996614
6125 9996614 10002567 10053822 10283379 10604346 10982863 11472179 12008363 12636619 13213465 13736822
6115 13736822 14258627 14730327 15085362 15305625 15424051 15450975 15400463 15366869 15266215 15263246
6105 15263246 15296257 15361435 15637322 16189800 17148736 18519169 20238383 21919579 22908336
6096 22908336 23141777 22781736 22178694 21705406 21527466 21672843 22126882 22874010 23868459
6087 23868459 25104214 26544975 28166686 30009304 31973503 34072600 36253558 38407160
6079 38407160 40477351 42296156 43680762 44661851 45246910 45422151 45270898 44962143 44562279
6070 44562279 44164492 43899003 44026252 44657864 45526435 46108161 45985003 45395667 44675008
6061 44675008 44133402 44067923 44468108 45350478 46817093 48799700 51298947 54269493 57633100
6052 57633100 61284568 65013326 68535319 71682587 74087323 75575612 76054314 75503680
6044 75503680 74014774 71683219 68610873 65140779 61480804 57877659 54474372 51308583
6036 51308583 48584910 46364131 44564203 43100348 41754964 40519949 39384943 38518238
6028 38518238 37935665 37722325 37862617 38261448 38883150 39670399 40540963 41365364 41961761
6019 41961761 42349756 42335601 41950770 41081674 39762601 38137523 36209033 34097665 31869382
6010 31869382 29648018 27482419 25374639 23402661 21567189 19930938 18471477 17160318
6002 17160318 15966063 14914245 13984952 13071276 12334064 11672691 11046893 10494170 9958524
5993 9958524 9472663 9065353 8691728 8351445 8028390 7747034 7464301 7168985 6930068 6716149
5983 6716149 6459288 6302418 6110080 5930304 5753621 5591956 5481245 5353674 5226833 5016573
5973 5016573 4827611 4652665 4526024 4435185 4311909 4227101 4092990 4005442 3907972 3800724
5963 3800724 3729640 3609547 3496599 3368120 3274125 3243966 3215588 3205973 3179069 3147772 3081794
5952 3081794 2997256 2871516 2786806 2767877 2746603 2743522 2656819 2627666 2581012 2490892 2425216
5941 2425216 2364461 2279811 2143846 2090597 2048334 2137140 2158338 2134947 2055175 2013567 1958839
5930 1958839 1891060 1880452 1867214 1851758 1850115 1837777 1868366 1859425 1883362 1807065 1728592 1640703
5918 1640703 1570728 1584933 1534968 1554895 1593258 1629075 1633980 1593403 1515467 1448805 1464284 1420369
5906 1420369 1394501 1383682 1349942 1377526 1399258 1497213 1494325 1415819 1289647 1209757 1164845
5895 1164845 1174148 1186012 1222653 1233750 1192069 1198741 1209481 1170313 1143917 1063215 1037664 1044492
5883 1044492 1047017 1076195 1138699 1153427 1123649 1067453 989700 987093 953835 955034 980992 988427
5871 988427 989966 927742 876909 893441 884365 822974 770672 745520 758935 754408 765432 822226
5859 822226 825779 795680 801219 777538 764078 758898 738263 757310 690978 680723 706546 721263
5847 721263 763966 758485 755289 738767 703309 667877 643383 666694 670678 605354 565560 579657
5835 579657 617122 619268 623157 634280 627948 608901 576355 591568 620016 556117 502272 456531
5823 456531 498341 547424 580425 641870 604006 588078 520771 445440 412088 390846 421024 438588
5811 438588 469063 557183 584790 567333 515990 493131 467595 441579 421042 442544 539366 572514
5799 572514 583029 588755 557563 524323 531582 489602 503484 481303 513547 517218 466418 451429
5787 451429 482355 465999 419616 449213 439623 464473 435587 427171 476804 476523 470348 477717 462369
5774 462369 457736 444402 432849 469386 521876 565962 590626 592288 629370 641472 624598 602804
5762 602804 552296 585794 601355 594332 626612 650541 638033 632376 600309 550618 531852 548951
5750 548951 544095 527908 530911 567751 548952 549460 557105 579723 652726 703106 772532 797842 814995
5737 814995 789619 790947 817663 825182 791444 735058 767742 780019 760220 728286 680282 719804
5725 719804 673893 612348 609808 622728 560631 540579 546035 533816 591739 594362 628632 636136
5713 636136 652409 694826 680960 710376 763298 889776 1041493 1171785 1154566 1133859 1103017
5702 1103017 992902 877572 765412 664831 631320 599980 601786 672593 669767 599904 585996
5691 585996 518172 459493 457799 487919 507931 518892 512637 474721 476715 525253 528557 524985 510705
5678 510705 600560 731759 885357 1005074 1017981 1012857 907899 830224 733665 715370 684072
5667 684072 574456 488158 448120 406235 391573 384342 394997 421210 397213 326591 278507 259578
5655 259578 273315 268644 266031 327198 345994 368115 354659 355037 389722 402692 419967 382420
5643 382420 445317 496736 531399 493982 404264 348258 298335 315018 293546 284644 266795 214871
5631 214871 149190 85935 158354 200236 206056 196425 260130 268438 220349 204767 199420 213827
5619 213827 180475 134102 149503 228531 292452 222359 207638 223273 218175 187341 164257 138302
5607 138302 137316 169897 104284 117436 141946 151403 173914 182298 164577 159812 112751 20089 34490
5594 34490 105963 133199 141423 132252 181330 177044 203822 209657 173728 186126 133738 155232 190497
5581 190497 248685 319687 289263 246336 163782 166794 168339 180930 178007 157378 187120 152401
5569 152401 163676 181480 237016 229146 186242 111718 68167 106111 118210 177316 203211 224247
5557 224247 213606 170726 165667 133647 128959 133139 103374 106592 127292 174754 197253 275201
5545 275201 251801 199345 146933 118048 132335 142830 209405 138224 121035 113051 85817 80930
5533 80930 57155 71949 70175 86097 39810 24271 60281 46546 76425 47842 74976 111125
5521 111125 136847 177136 168687 222575 228041 201960 192149 165319 132821 157492 172791 182091
5509 182091 233752 207574 147005 134723 117621 129376 58628 46139 68290 126953 180925 185991
5497 185991 205850 198342 166379 125817 152935 161392 174614 165301 134949 132151 118913 162888
5485 162888 146021 75271 94861 165864 173101 124101 173261 154668 160286 150889 146930 173654
5473 173654 199198 182418 120352 88720 74507 64734 22287 40950 88696 113443 121748 79688
5461 79688 80966 76357 22731 11854 1238 108523 140774 135747 152760 203879 233389 152210
5449 152210 109610 81974 85391 42521 44291 126062 96447 72512 18143 17310 46339 94607
5437 94607 113060 66387 61288 99168 106490 79830 77200 118666 190901 203434 146381 135965
5425 135965 123202 61925 18614 17425 99404 42862 23991 57733 124274 99476 46726 21025
5413 21025 30775 32937 20621 41797 72776 82278 162933 168674 106117 75420 118054 79363 8861
5400 8861 -51378 6084 110651 68546 74919 61638 146739 112053 56915 51301 48849 67320
5388 67320 67671 129026 174477 217503 181602 132704 136112 96687 97789 -56 -18633 44214 59928
5375 59928 58575 64035 126174 149134 104096 80958 109601 148958 159835 127917 120095 268116
5363 268116 281987 191163 165361 157241 174298 127121 75287 66553 95336 116698 73084 38612
5351 38612 8911 49992 6839 -60024 -99713 -64148 21884 -27880 12552 41920 53095 1394
5339 1394 -23965 723 14175 51287 -1477 -7921 16946 25482 13999 -27184 63489 139982
5327 139982 110959 36650 10878 46894 29377 55847 36172 44400 52906 4385 -2429 33689
5315 33689 88524 33923 33704 13933 38223 53672 39034 46644 9128 46179 47276 83988 144118
5302 144118 198187 253214 142245 144042 147206 175030 178770 167815 229517 263872 292815 177123
5290 177123 186950 181617 155921 153420 80361 124777 90470 81623 56637 76732 89822 -17235
5278 -17235 -10876 -19271 48597 98581 133585 97235 75939 109616 75269 84728 93254 101290 82199
5265 82199 -7736 3870 41093 96962 91999 67774 28202 -10946 -43500 -85696 -99668 -138413
5253 -138413 -78531 -64352 -26478 63096 49243 30700 -83051 -125765 -101108 -58479 -50222 -42766
5241 -42766 63438 91476 84927 35261 16893 8832 14135 32717 -16608 46149 64259 23062
5229 23062 17226 45614 87755 17240 25426 31537 93421 132320 126903 114278 61709 90276 51777
5216 51777 59682 160272 203218 183305 79690 43329 77368 124504 127107 131010 98960 100722
5204 100722 97340 36343 99254 122239 86821 120847 95531 146141 143295 113831 101838 182227
5192 182227 186651 145506 97061 82088 164419 125108 152699 80891 85729 145371 111075 105867
5180 105867 78454 87948 78555 38646 74721 144607 216088 147259 155793 191618 167950 199016
5168 199016 154266 152323 78478 56411 27008 18978 72265 134074 127255 70854 94099 50763
5156 50763 55338 24423 30485 77796 83690 69109 71993 122451 146283 176672 200948 159977 138398
5143 138398 119680 161142 129889 128414 98307 66243 69442 53473 110446 140216 99291 77444
5131 77444 33032 11720 3680 47507 63921 62933 40851 5609 49134 64511 142514 108999
5119 108999 106403 162313 145420 165159 171179 214729 236385 174676 126648 154805 210707 237783
5107 237783 301940 270937 256197 233246 123223 110895 158664 211515 208442 160375 145912 164429
5095 164429 174804 205818 246273 236638 244998 225863 257324 269530 302263 307970 259641 277354
5083 277354 276112 258412 260610 289203 321488 297895 286636 222977 198778 225865 243951 218956
5071 218956 155057 205544 199767 205083 233020 278907 304702 248424 231290 215642 232916 261961
5059 261961 203540 190271 192859 242830 274633 264864 232928 232627 191311 132282 128584 140362 153847
5046 153847 196411 238550 236268 241607 230151 273388 291153 313860 366953 321059 306132 274351
5034 274351 283422 298236 268980 297317 288140 275182 267360 280432 322026 319940 264348 217749
5022 217749 255324 296653 308809 365650 375908 396745 376800 384027 417166 474020 474570 481691
5010 481691 464426 462684 421497 371964 398726 423433 456371 459561 452321 438515 487813 534691
4998 534691 563019 595581 553985 511898 513806 546671 614625 669183 677770 680218 690243 735064
4986 735064 772838 754456 712669 712475 652586 619898 644684 658380 692471 692085 689762 679992 667245
4973 667245 646984 628294 652958 685830 689839 704993 718672 730021 799852 878405 909457 876579
4961 876579 881158 914931 941375 980788 995195 1028148 996342 989943 963596 959856 954275 928764
4949 928764 898335 895011 934151 925434 909190 935866 930060 885739 810389 805120 861766 899455
4937 899455 953091 1015041 1076781 1090938 1086773 1056336 1030379 1021093 1023954 1016878 1019827 1049772 1067139
4924 1067139 1107230 1102782 1064930 1098827 1061229 1003415 1060862 1118535 1187512 1192770 1220918 1286430
4912 1286430 1303138 1319043 1307670 1291347 1341923 1326060 1276235 1347684 1459043 1504446 1478564
4901 1478564 1460258 1442742 1418443 1451666 1530108 1677442 1830444 1982771 2127536 2342423
4891 2342423 2621320 2861843 3065291 3259515 3478760 3663470 3823347 4008477 4144513 4247424
4881 4247424 4232315 4128828 3965800 3775931 3580782 3260764 3047483 2883450 2762086 2658002
4871 2658002 2575825 2570765 2639507 2720785 2725835 2706424 2688229 2753311 2826555 2945305 3189340
4860 3189340 3488613 3748737 4027167 4447292 4847154 5231610 5548975 5805112 6025862 6227894
4850 6227894 6420056 6476976 6455211 6350698 6119733 5713110 5241855 4878211 4506985 4086335
4840 4086335 3781092 3546295 3364260 3190414 3075273 2917673 2827922 2784487 2679886 2633265
4830 2633265 2676491 2799231 2925257 2996531 3114907 3283498 3508143 3699203 3876743 4053745
4820 4053745 4147178 4262209 4310203 4382196 4485638 4461866 4352052 4170766 3945020 3711085
4810 3711085 3447557 3214679 3077167 2966261 2810256 2716196 2672526 2669927 2655234 2600881 2524841
4799 2524841 2531680 2530326 2479092 2481591 2505405 2570068 2595183 2598052 2644000 2690318 2787483 2806044
4787 2806044 2949004 3039878 3142958 3230062 3355358 3493945 3676610 3838389 3891494 3949882
4777 3949882 4030198 4058992 4023541 3965936 3938539 3883461 3852138 3814199 3801139 3804053 3801161 3782339
4765 3782339 3796472 3835762 3861840 3930280 4055123 4242544 4408062 4550004 4649296 4865620
4755 4865620 5097145 5328315 5541095 5796592 6087601 6384862 6591768 6773335 6888536 6964065
4745 6964065 6945297 6848755 6723733 6635825 6584707 6469805 6419772 6439220 6476211 6524592 6559878
4734 6559878 6621620 6676841 6836262 6953582 7071615 7270951 7506514 7785369 8037071 8329852
4724 8329852 8622590 8893423 9202772 9528340 9934595 10392991 10800957 11196005 11655341 12111924
4714 12111924 12527962 12964001 13414151 13954928 14617490 15299276 16066727 16963494 17925662
4705 17925662 18976805 20168248 21508252 23045224 24756807 26713178 28881755 31238466
4697 31238466 33719062 36155182 38391942 40361992 41939464 43014176 43440330 43375849 42897761
4688 42897761 42068859 41027387 39973360 38975881 38115709 37396128 36841434 36622390 36616409
4679 36616409 36902395 37425800 38236091 39405315 40931757 42788801 45090766 47828827 50970008
4670 50970008 54589948 58528339 62699431 66914612 70772837 73867848 75893421 76585330
4662 76585330 75929674 74025095 71129528 67583148 63664682 59562427 55592982 51833769
4654 51833769 48445894 45473650 42872486 40684223 38828407 37400984 36217217 35345559
4646 35345559 34826013 34601411 34628158 34840940 35272024 35892039 36733719 37668324 38577304 39382054
4636 39382054 39911247 40077093 39722044 38920033 37647460 35998958 34059211 31890117 29751442
4627 29751442 27590897 25483402 23523240 21743011 20169448 18689382 17371992 16131990
4619 16131990 15055170 14168117 13355284 12639628 11968013 11292652 10708434 10190953 9753051
4610 9753051 9320999 8866842 8435905 8058249 7752631 7522927 7270158 7049368 6826471 6637237
4600 6637237 6449719 6235604 6059643 5912715 5795014 5648507 5562352 5466593 5344865 5275744
4590 5275744 5164042 5079157 5003928 4903315 4852536 4839938 4917175 5010367 5158282 5275056 5368781
4579 5368781 5448307 5427412 5336775 5164343 4972821 4699718 4441135 4250241 4053826 3876901
4569 3876901 3668112 3507799 3397771 3266009 3187130 3132334 3065599 3017293 3014029 2970483 2955618
4558 2955618 2859637 2795258 2725171 2642282 2583544 2586459 2607601 2572461 2558040 2579597 2581849 2537821
4546 2537821 2436753 2400344 2416562 2472666 2453163 2461991 2507169 2444550 2450433 2411241 2352522 2321707
4534 2321707 2275830 2250047 2239460 2228172 2222571 2178359 2072224 2033891 2077408 2064157 2081995
4523 2081995 2057843 2073766 2115702 2091628 2100648 2061402 2044542 2041908 2059229 2075560 2096895 2101446
4511 2101446 2096809 2106415 2072727 2069733 2018566 1933068 1867006 1836124 1799463 1862196 1904519 1897725
4499 1897725 1851080 1870953 1920893 1961805 2022686 2047995 2044342 2160755 2185729 2175892 2094576 2000463
4487 2000463 1943387 1927277 1882582 1841460 1847657 1893937 1935240 1933649 1906870 1872596 1807447 1751340
4475 1751340 1719765 1776154 1836315 1842666 1827063 1858671 1872981 1839946 1761460 1697508 1675428 1674503
4463 1674503 1715158 1741440 1786936 1773895 1774536 1786741 1781570 1791878 1791852 1818371 1826525 1839273 1871268
4450 1871268 1860855 1851685 1850247 1846161 1842773 1807633 1823047 1880812 1897193 1936559 1995571 1978661
4438 1978661 1963518 1949682 1909283 1904754 1900449 1885556 1920049 1963117 1976518 2069435 2082974 2066004
4426 2066004 2040459 2021477 2052439 2107162 2174437 2254130 2271752 2343719 2419033 2481213 2538509
4415 2538509 2558912 2604324 2678769 2758650 2806687 2819758 2795647 2815032 2844102 2861734 2896968
4404 2896968 2936154 3047486 3148323 3278773 3409023 3537481 3676905 3798784 3895050 3946458
4394 3946458 3926531 3909427 3902117 3922892 3897217 3885989 3816338 3721911 3672101 3688777 3761716 3813753
4382 3813753 3874260 3939342 3977189 4067428 4147416 4268156 4396843 4505143 4620691 4741250
4372 4741250 4830853 4905017 4991783 5023429 5069785 5124333 5201080 5312909 5412644 5516599 5641275
4361 5641275 5752223 5810772 5917282 6061752 6240023 6435800 6620463 6850357 7092432 7311793
4351 7311793 7490889 7614408 7792331 7919835 8033465 8101222 8178130 8295018 8446597 8556792
4341 8556792 8683941 8800368 8919699 9070392 9255771 9451304 9631803 9799092 10067436 10361000
4331 10361000 10631197 10852387 11196133 11596423 12042445 12624871 13241098 13919936 14621608
4322 14621608 15335659 16056453 16706277 17316979 18050819 18920320 19923405 21062797 22266848
4313 22266848 23621474 25158299 27120077 29378479 31868858 34612682 37521248 40640285
4305 40640285 44144499 48184316 52862594 58421582 65489361 74899802 87727203 105635672
4297 105635672 131009628 169023769 222767828 282972383 331636283 359836794 366979799
4290 366979799 354461325 321989188 275338814 226410953 183918864 149069476 120341112
4283 120341112 97626141 80376839 67303837 56971250 49099910 43370857 38991128
4276 38991128 35495454 32490593 29802657 27568889 25494636 23682461 22132376 20789125
4268 20789125 19557462 18359105 17283787 16390025 15600683 14911356 14294764 13760745 13399861
4259 13399861 13043694 12809449 12704445 12592478 12448947 12177405 11869846 11505891 11125026
4250 11125026 10692359 10240511 9893829 9579318 9317080 9063917 8836811 8612641 8370639
4241 8370639 8179217 7855292 7562226 7258432 7072025 6904775 6739956 6607547 6468484 6368141
4231 6368141 6321398 6325983 6326880 6252619 6271807 6298484 6423947 6456595 6457575 6493133 6521750 6576869
4219 6576869 6698064 6820825 6990459 7159966 7329245 7462524 7587736 7793576 8139420 8546419
4209 8546419 9088060 9785613 10725833 12106275 14004737 16850550 21305730 27826841 35385557
4200 35385557 40937552 42118539 39334146 34258449 28491632 23251670 18930676 15502839
4192 15502839 12801978 10678876 9145522 8007601 7174391 6558406 6110765 5790963 5482973
4183 5482973 5187142 4888568 4695874 4461139 4314525 4172810 4040472 3929115 3720120 3585368
4173 3585368 3456019 3335561 3199037 3048666 2983292 2919977 2946744 2946820 2926696 2926881 2911924 2884905
4161 2884905 2818552 2775714 2753806 2747105 2723296 2657380 2634142 2574803 2479182 2462196 2444465 2433817
4149 2433817 2433076 2365868 2258831 2188667 2150734 2122632 2051649 2007960 1974282 1946165 1881466 1867306
4137 1867306 1852700 1823617 1833678 1831372 1842352 1878676 1855134 1844877 1801659 1817779 1827003 1795381
4125 1795381 1812995 1809932 1796524 1766669 1653347 1576331 1524861 1482835 1434253 1410377 1379985
4114 1379985 1330755 1228907 1146305 1125565 1122041 1125224 1093452 1074485 1106160 1111237 1125032 1106961
4102 1106961 1041238 1060987 1076555 1081265 1135099 1197528 1223096 1177327 1149748 1149359 1140829 1117053
4090 1117053 1092014 1140136 1184367 1219890 1237725 1289879 1376851 1430529 1460107 1420528 1423492 1462214
4078 1462214 1480878 1582159 1707352 1900308 2041729 2136542 2342378 2761048 3227187 3675989
4068 3675989 3955404 3971503 3845386 3599533 3287571 2970762 2748651 2545952 2407266 2339568
4058 2339568 2404617 2440738 2432757 2364853 2312753 2224145 2140618 2043750 1989552 2050258 2143244 2290478
4046 2290478 2451498 2734353 3135985 3536673 3835035 3892585 3792445 3527960 3198536 2827743
4036 2827743 2514279 2247152 1991835 1724643 1544705 1497786 1490581 1508281 1523256 1537878 1595979
4025 1595979 1604385 1611868 1634575 1640595 1581257 1489494 1428236 1367645 1339495 1283695 1276291 1261732
4013 1261732 1218563 1196893 1161232 1202610 1321410 1478091 1647014 1842605 2104234 2309445
4003 2309445 2492563 2568866 2605444 2551343 2400325 2221701 2049065 1888476 1700392 1480650
3993 1480650 1300867 1138833 1041845 980893 937894 863269 841506 783258 748693 648659 605785
3982 605785 619846 624114 623919 640708 689797 728464 779407 776528 754668 751720 666554 595404 575988
3969 575988 617196 658920 643429 655494 652030 659406 591589 508675 506477 465359 416092 392520
3957 392520 436843 475161 518438 574693 568341 554036 518222 437820 424167 476862 571973 619738
3945 619738 600788 609501 602961 585634 496813 464981 458831 471963 471561 471792 534053 597090 559576
3932 559576 506811 509437 504316 528046 483399 484327 493385 553714 551344 552042 574063 581253 555324
3919 555324 525018 559957 549797 490067 446880 402286 423854 483671 511399 553521 524318 551067
3907 551067 602263 626587 655663 689412 660532 615691 587560 599111 638620 630358 538760 487735
3895 487735 457396 432342 430176 371193 340960 383424 342457 324806 316681 369281 352054 309480
3883 309480 269167 266794 319081 279718 303744 368653 411361 470735 426552 420971 399362 379730
3871 379730 439633 449584 479839 457197 441247 402324 359971 334909 288704 252511 236560 263468
3859 263468 296998 309254 299945 297426 272588 278192 296693 355120 437508 450119 411028 352247
3847 352247 360422 379060 375983 338063 348794 386881 362298 351139 361436 364332 380444 365473
3835 365473 329031 314503 327284 359430 378705 395591 384424 425922 447218 469684 490643 448457
3823 448457 375014 355491 362546 382911 410673 451545 481924 532397 491818 398151 383598 396232
3811 396232 391277 389243 401922 431634 462875 473464 508737 595936 567327 570282 537187 512788
3799 512788 532912 501243 508333 448137 442577 473322 492472 517985 536339 528875 471710 412734
3787 412734 392807 403245 423473 471074 541866 573065 509547 488404 433049 366593 410218 392906
3775 392906 405599 438822 463655 510009 540617 569402 570670 505934 439240 355301 329272 377808
3763 377808 443665 445952 430048 414050 436072 448465 437976 389297 367762 300544 273610 308961
3751 308961 396591 465894 470447 480903 410223 418797 386661 333269 343080 353804 450362 497020
3739 497020 486615 504684 477424 461310 381407 354382 404725 387725 418653 409577 451795 446895
3727 446895 467649 437445 403882 456016 519105 562660 576080 552235 566870 559866 569258 586805
3715 586805 548467 524693 487628 483116 502539 499552 494578 461558 414373 412323 399898 400977 453740
3702 453740 508908 527277 519174 484023 487079 548108 518585 528724 511007 487148 548849 577793
3690 577793 610707 629787 613153 578811 524717 518631 495349 492565 537345 572395 580990 542083
3678 542083 545700 514982 506831 539122 502332 523182 481985 504211 505915 506421 526636 466646 446681
3665 446681 421552 446477 480535 503966 478540 479452 467265 497082 523326 556480 531924 527670
3653 527670 456469 469221 535612 549628 553177 560425 567336 559343 507402 466291 425873 385632
3641 385632 409302 449423 480225 491029 497480 475831 419104 391923 380971 416908 443888 522086
3629 522086 559409 565349 585669 534080 498085 466397 470467 530541 511052 521475 488314 486300
3617 486300 514736 526436 510974 469550 447922 469597 492460 543422 546223 561757 538534 580242
3605 580242 645835 612479 606463 545270 520894 559281 586067 633861 662148 665791 627229 605869
3593 605869 616503 596738 577605 623148 673936 720747 780802 763948 698875 699382 734982 692263
3581 692263 720648 742547 764280 746765 767509 798773 791545 785658 754312 749425 798617 832138
3569 832138 844605 801150 793380 807375 857891 886083 919252 977197 962301 965285 971737 962149
3557 962149 986141 943930 924745 958660 1024927 1101633 1123431 1123270 1122557 1115870 1149378 1171126 1213346
3544 1213346 1282573 1314351 1352813 1384330 1427124 1446578 1446254 1526862 1597914 1644079 1677651 1748396
3532 1748396 1847969 1948388 2072169 2134902 2239401 2392715 2533686 2735899 2968026 3270813
3522 3270813 3607766 4095726 4808655 5875300 7380132 9311809 11106405 11788196 11423399
3513 11423399 10369049 9048580 7939024 6981315 6259179 5638565 5127072 4743598 4489779
3504 4489779 4293404 4156065 4061874 4005932 3965707 3898961 3875077 3962987 4054011 4148050 4337555
3493 4337555 4599885 4941310 5341975 5870389 6636362 7676914 9230831 11703364 15340380
3484 15340380 19244170 21555401 21556927 19803796 17203098 14536511 12147860 10241943 8669535
3475 8669535 7424672 6444730 5662122 5041472 4586914 4320212 4020473 3768525 3573686
3466 3573686 3363580 3238245 3157756 3201095 3252804 3295127 3412487 3493954 3678652 3947413
3456 3947413 4390050 4969747 5904043 7341324 9168901 10688127 11136026 10582718 9505560
3447 9505560 8280740 7224899 6414411 5717405 4992298 4388479 3840386 3428535 3105931
3438 3105931 2826795 2532219 2318301 2116806 1917620 1826318 1756824 1657442 1555921 1509387
3428 1509387 1497585 1463038 1395770 1298543 1264860 1193302 1153402 1132891 1084636 1113124 1199139
3417 1199139 1300438 1398942 1515157 1578360 1622939 1677512 1654319 1592583 1542116 1438752 1361028
3406 1361028 1313880 1279030 1218055 1125201 992085 895154 880232 860485 841657 809219 809515 791924
3394 791924 731651 727651 732281 664316 637934 640607 643425 691285 712550 723763 699351 659789
3382 659789 640043 564555 550679 576388 573086 573961 603373 649022 674489 622335 598608 578683
3370 578683 531724 509613 523648 483774 552571 593421 609075 623113 573558 567289 491515 468479
3358 468479 456703 475505 494128 516229 543084 559928 581850 634910 667778 698006 737779 723695
3346 723695 669226 676880 702983 711382 626721 555765 518943 542604 544883 537736 507224 466411
3334 466411 421701 381974 420270 437465 430107 471303 428951 451278 442025 462034 456948 468613
3322 468613 486264 478826 523413 536963 588754 640277 737485 758717 764806 816868 836921 833793
3310 833793 801137 736515 690167 573712 491554 453583 484965 515962 471959 450002 416246
3299 416246 461501 446834 454122 437818 452471 426100 436977 484581 455830 465552 411958 368685
3287 368685 345150 398669 478050 482855 532976 537049 536709 543198 536254 545798 520213 471141 451468
3274 451468 486028 498974 511173 462195 384751 385347 350798 281219 217536 242316 287660 324865
3262 324865 359439 304401 261790 238599 239355 269897 292381 285629 268933 252099 261916 330333
3250 330333 426706 428145 358797 296533 318679 320037 348943 327700 281941 255697 195227 229380
3238 229380 250055 252209 249998 252803 262621 279091 321684 310834 329148 361681 378063 329833
3226 329833 284870 314436 362389 445252 443212 430924 409783 317568 294042 284647 322759 364291
3214 364291 401181 360653 350057 398033 399084 336723 287404 274059 304350 304149 367702 438606
3202 438606 441456 417459 373057 330327 354229 392592 399384 438004 493358 514295 502595 503334
3190 503334 494602 513438 470401 431777 444029 412277 436120 443995 437057 436857 414868 472204 538628
3177 538628 593480 599903 585281 611182 585056 587482 568600 539245 487918 516127 552612 556612
3165 556612 587943 580214 625157 672964 680084 665466 602769 594165 613558 633395 670375 673504
3153 673504 628779 589050 590030 572094 572929 505129 455461 434915 506058 581164 647709 688717
3141 688717 590661 521262 443109 416064 412778 402252 467272 467897 524558 517163 479077 452145
3129 452145 375843 324517 314776 344415 335678 330560 340436 316133 304527 279670 251934 211062
3117 211062 207799 184955 180510 230670 258645 292976 266093 275768 287904 274786 236766 159927
3105 159927 151777 131937 196931 234531 212900 212477 208396 200950 191285 201770 178362 114678 140436
3092 140436 175711 197971 201857 193995 164172 188789 191231 194059 180513 131235 127378 115064 169689
3079 169689 221572 204687 181752 168296 167605 214854 233580 216321 195940 198691 198001 149961 116625
3066 116625 125741 171903 188435 184955 219675 226931 211844 176834 150480 122178 129503 74054
3054 74054 49249 69708 106108 156837 174188 184622 177690 166323 118890 106875 90573 135087
3042 135087 159865 183017 230846 232075 214787 186732 190649 148408 144331 198316 207521 237001
3030 237001 277539 262956 226214 190140 165305 182970 186691 131291 177458 199207 198491 235916
3018 235916 234184 233566 199344 179670 139750 147279 189620 209535 206472 163597 102188 105857 156150
3005 156150 176179 174251 169046 156803 116763 95520 82902 135070 155313 161126 105335 112465
2993 112465 112090 104251 111021 78278 38621 -4106 -19238 8942 50769 45869 57353 22641 -39779
2980 -39779 -52980 -37247 5960 21579 22104 -12744 -47738 -23299 10215 10038 -3311 -10733 -66086
2967 -66086 -78502 -33620 50162 68273 68668 55811 -22 -25739 -46507 -45601 -17413 51387 84165
2954 84165 79770 93021 113217 120970 83859 64207 69298 75073 54777 87700 188301 210173
2942 210173 191388 125656 61745 86772 111644 104592 126480 162253 155688 127813 170451 157468
2930 157468 128281 64330 44261 54699 74778 117065 163238 154868 151193 148112 143432 125294
2918 125294 124637 160353 187828 190256 164764 166947 148458 164320 163408 151669 144680 89574 32138
2905 32138 -776 47072 85899 51376 9099 19589 63957 92961 114825 102963 135102 108919
2893 108919 105526 112468 125551 176459 148545 82346 49830 48033 78976 90613 98556 130290
2881 130290 134639 83133 82041 75349 108366 116032 107475 66254 35369 40643 39869 27795 55290
2868 55290 71551 68803 60049 55854 100888 102823 42562 -23326 -37639 3397 36162 94698 108602
2855 108602 91289 37406 6616 -47838 -77342 -46672 12110 38202 69477 127843 130411 95917
2843 95917 45609 32817 -17421 -60179 -90587 -60728 18878 61594 46544 6629 -19007 -64025
2831 -64025 -103536 -100724 -52741 -2962 8332 8913 60794 95835 103115 61915 10195 14768 24175
2818 24175 70865 105618 111559 115246 111432 75370 82906 107487 48990 100271 106739 104146 136781
2805 136781 83129 82967 92552 139322 171814 176988 143864 145892 128234 149131 134798 175923 201184
2792 201184 159989 129166 138086 159789 176611 156189 175064 198725 203608 171639 113303 79000
2780 79000 75730 107749 84491 134564 155466 141647 107187 60358 43166 20643 114 -11387
2768 -11387 604 58222 87669 52445 32435 30722 34275 8109 -13315 -16310 15937 1907
2756 1907 6677 30458 39041 24591 -29760 -69097 -65476 -10127 -22777 -66432 -76037 -25205 -4975
2743 -4975 -1765 -13051 -25628 13371 -9559 -40785 -26575 14663 3009 -1787 12991 66824
2731 66824 117165 72658 7354 -1952 21483 47554 79666 86989 73080 54667 58737 29145
2719 29145 49199 49065 87012 78356 113642 172316 115873 121961 84978 92209 121266 141610 173237
2706 173237 161196 181242 181649 157535 138897 79148 77419 44554 68744 85991 126083 115774
2694 115774 102253 121316 127015 151195 139271 93361 120125 171145 148379 155765 161778 110183
2682 110183 61089 25484 50908 78477 31839 34680 32330 44559 55037 43859 23255 15356
2670 15356 35533 49111 18123 31183 65484 103638 98584 85916 56183 73560 54194 64004
2658 64004 88038 21626 1944 -56384 -68493 -27891 -17140 -47309 -91123 -48565 -52789 -17344
2646 -17344 -13344 1019 -5753 -26086 -12617 29936 71583 99921 140108 181942 195687 192829
2634 192829 160169 177303 205898 247353 275139 228627 203823 139063 101979 73647 62067 53934
2622 53934 59984 53291 44629 95215 144176 161538 73896 116190 78482 81202 155682 164912 182437
2609 182437 137407 126615 150970 122990 119852 89161 53956 34266 59423 90066 99708 118806
2597 118806 112168 155333 139044 60561 55683 59010 94428 77376 99829 134284 93138 112204
2585 112204 99698 81796 42748 -9387 -69602 16375 94612 133817 179027 182650 82010 45355
2573 45355 679 21745 65812 67286 80481 90427 120298 128004 132898 157534 100549 84313 54839
2560 54839 39510 74559 136158 171423 168017 126710 90973 76728 63686 6928 39465 53545
2548 53545 20903 50388 80562 100468 101126 90786 89786 33379 67285 83407 108636 140565
2536 140565 157989 118615 56654 57358 107564 117178 106676 121069 111211 79872 37830 63265
2524 63265 50844 37864 34377 66631 109772 105416 112174 164254 180874 142484 86039 96997
2512 96997 117696 160745 187959 217660 184845 138515 115553 120561 118604 94070 76044 22060
2500 22060 38857 116752 149220 151964 102983 82692 70668 120434 132602 160509 146153 152724
2488 152724 151825 147800 144096 149370 175975 181527 176056 151771 140117 114405 156298 196242 162799
2475 162799 175678 181112 162010 201771 257474 283805 314267 274883 232331 186489 213379 266341
2463 266341 267099 245154 250858 234564 226399 228507 225341 243581 269618 294372 334835 369112 393833
2450 393833 372513 358371 402568 349480 323035 380272 444308 457331 443931 380011 318893 288012
2438 288012 315046 343472 391280 392378 381676 316945 262403 265644 340623 371858 357198 366636
2426 366636 414917 444903 455183 496340 498060 497259 511637 460207 439667 494284 520931 522344
2414 522344 509204 493115 499717 523018 505632 518949 541947 560732 485599 488738 553029 637543
2402 637543 691274 709874 765414 812818 830995 898044 940408 969250 1006907 1043937 1172932
2391 1172932 1292898 1376320 1459371 1496867 1488586 1562044 1733783 1913327 2144499 2482618 2796191
2380 2796191 3090577 3207000 3354812 3569419 3829169 4194923 4658553 5292992 6216359 7404977
2370 7404977 9006805 11146428 14240370 18588152 24047297 28226034 28600081 25835424
2362 25835424 21603548 17484477 13975143 11267663 9192218 7625853 6453734 5535078
2354 5535078 4847303 4366707 4124774 3959294 3836562 3571286 3195160 2843535 2550630 2338475
2344 2338475 2159234 2035201 1965159 1914218 1815613 1690872 1588136 1512799 1437474 1321768
2334 1321768 1281446 1269502 1254875 1234166 1197127 1213849 1166301 1098939 1037711 921207 917797
2323 917797 947280 965794 986252 1030080 961951 856557 822530 827093 857344 786009 716060 693970
2311 693970 670079 669949 675599 643313 611241 576154 512445 489015 476421 480550 520284 509971
2299 509971 566462 602684 587449 530370 502268 518695 498197 462901 437820 431966 428696 445761
2287 445761 410105 373079 378058 312755 297835 272869 275900 328114 292802 285764 313220 297365
2275 297365 311457 283299 263807 257161 232396 189478 173920 229730 263930 273385 231829 212448
2263 212448 183329 163965 153808 145462 181552 206733 209476 200053 238887 269276 235459 178714
2251 178714 136492 137045 119043 117987 67696 50824 158316 185869 149767 137598 150651 177061
2239 177061 138885 104402 115333 152685 172528 177731 192886 296487 350362 268769 231034 190454
2227 190454 194644 192106 187577 212766 181281 210697 212963 213801 177850 168555 109040 87812 124190
2214 124190 184299 219427 177963 169435 147055 157945 123331 102331 119749 146519 166472 151957
2202 151957 135638 134239 93307 106946 117358 141813 136278 73991 36153 40485 86811 115588
2190 115588 94188 33873 34998 73916 73997 96826 85033 41204 -24244 -23152 -17491 -8049 -416
2177 -416 -24252 -70281 -65216 -27450 40142 39580 16609 21742 -20600 -8184 39536 103029 110615
2164 110615 160850 168902 169213 126057 68085 45415 13306 45126 59946 50359 61892 59442 49336
2151 49336 24811 -6296 -19834 496 15302 34287 113899 142397 115322 56862 -1217 34683
2139 34683 104025 143319 194581 179556 140558 99265 52774 45387 47319 67199 75510 81060 82803
2126 82803 77282 88377 78042 74011 87156 72265 120258 103994 106640 104855 93941 76514 58937
2113 58937 73977 75716 107311 104660 111131 92680 39465 23100 53968 62894 87471 98260 60191
2100 60191 58239 71064 119743 148234 189766 206099 198548 179002 137850 163025 143914 114041
2088 114041 85749 6077 29346 64633 89221 97563 63035 7936 3509 14957 8302 9100 -39107
2075 -39107 -73671 -109097 -103347 -41436 30937 73252 107366 64346 13993 -28181 -46676 -45738
2063 -45738 -62368 -61623 -24677 4039 -4821 -43149 -53022 -65792 -45345 -45919 -86975 -76493 -59895
2050 -59895 -14138 38246 72154 58900 43558 60784 81944 116580 105778 70021 45956 11212
2038 11212 24048 44349 79622 86648 46844 37727 30474 30383 23598 -6450 -42018 -39813 80117
2025 80117 112322 101261 98885 57983 55800 39488 67202 93877 102461 99422 113171 129210 157341
2012 157341 121876 72176 83672 69208 46018 32224 41689 63509 85195 108483 95934 74807
2000 74807 -509 -53981 -86321 -67286 1118 1110 53864 35653 51298 71146 69218 63204 2480
1987 2480 -23120 -5720 23809 39208 74089 77861 38726 17546 12546 40385 24438 7690
1975 7690 22104 48721 68533 23648 26535 42688 64604 65632 31583 45208 45140 37180 38754
1962 38754 51821 39591 -25171 -58208 -67843 -82831 -69464 -66490 -67115 -61306 11107 42519 77547
1949 77547 57434 41851 16682 -14487 -8506 2751 78740 77926 71951 66990 46654 17983 -23410
1936 -23410 -77060 -95590 -81900 -116802 -106150 -17920 8094 109353 76662 73172 86311 44596
1924 44596 11127 -28628 839 39342 84853 51411 53436 84529 43089 -6951 -26141 13989
1912 13989 33732 14535 22392 45700 74630 94058 88145 47303 3976 -25769 7070 64776
1900 64776 49802 58238 39353 15293 34354 51185 21308 -24782 -66522 -81970 -32051 -37688
1888 -37688 6143 17406 -41627 -26104 -38328 -45767 -73549 -65187 -49897 -82398 -32472 15617
1876 15617 10535 -29703 -71179 -64758 -63180 -44523 -77217 -38543 8679 14820 34815 -19507 -48635
1863 -48635 -102487 -63230 -100 49734 113698 121120 101208 96428 100821 64470 13087 -9937
1851 -9937 -40435 -6307 78808 141667 135831 63198 -28632 -62887 -26328 21295 -17910 -30887
1839 -30887 -23730 62938 112230 86240 55744 49106 76648 83947 41795 71672 74945 47619 53576
1826 53576 68795 81406 36705 39523 8544 14366 11357 -18483 -31774 -50818 -46653 -46864 -6754
1813 -6754 22098 6461 -20966 -50507 -59810 -15830 8333 -6282 -6456 -51594 -18987 7014 12905
1800 12905 23504 22207 72370 66144 -14743 4424 49609 25941 -7623 56943 31516 56143
1788 56143 24890 -2033 51861 15198 14189 -19998 -2118 79204 122333 119997 73221 28513
1776 28513 8795 -46895 -23480 874 53300 52957 65225 20231 19389 28450 -23432 -18389 -26107
1763 -26107 -50444 -32013 -10850 -13387 45824 26150 -6195 -31861 21398 77876 62931 36334
1751 36334 -11068 -57330 -66904 -74972 -47298 -22690 7745 -44522 -82050 -79128 -91926 -91277 -136605
1738 -136605 -83735 -62675 -48626 -33861 -29859 18724 25808 42722 56254 45169 14578 -5187
1726 -5187 43146 29837 61255 65011 -8950 -21792 -47216 14687 35415 -10634 -36335 -49672
1714 -49672 246 36410 41604 33962 -17834 -39699 -41394 6794 92072 99303 49885 23153 31089
1701 31089 47145 6741 1014 -20731 -22876 -11616 -28484 -6763 2224 52851 34046 20945
1689 20945 60373 22593 12728 -6038 30376 49739 58950 34028 -1960 -7136 -5263 41889 34823
1676 34823 18531 20890 -38913 -16828 46949 65228 36980 -11580 -51686 -62560 -25135 -4201
1664 -4201 6960 -12536 -14744 -3076 -19675 -25745 -24815 -70234 -85552 -59181 -34767 40529 58288
1651 58288 36691 38711 40337 30323 -32638 -1807 9453 57724 99455 41826 58557 87230
1639 87230 92340 93341 87763 81772 5380 -16721 -60119 -30556 1883 -3495 22866 551 600
1626 600 4587 -7029 1026 -6963 2739 -730 19994 46078 78910 86498 34170 -6161 -25149
1613 -25149 -19535 2363 10800 12595 18497 -11006 -57994 -49991 -20152 -4708 642 3184 -5169
1600 -5169 -16638 -44337 -44651 -7094 10105 12289 7160 330 19767 -43312 -95230 -90498 -54414
1587 -54414 -76310 -67248 -88721 -39800 17876 -13802 13246 13554 4026 24768 38584 58710 65730
1574 65730 40138 17831 -2672 45437 43130 36005 10274 -17749 -29190 -24297 -651 -19727
1562 -19727 -31301 5911 -15131 -23822 -14737 13932 2159 -34798 644 78701 77855 31119 -8051
1549 -8051 9040 28696 54342 44048 -6048 8665 64610 86201 46964 31321 -37292 -92442
1537 -92442 -116507 -81894 29887 29735 8516 -9791 20545 29142 -33576 -74712 -78295 -118962
1525 -118962 -74754 -63730 -27442 8641 -4727 -6442 10551 8141 34391 2656 -50454 -30476
1513 -30476 1969 19517 36280 2879 -65744 -71404 -97654 -92417 -48439 -46644 29991 69353
1501 69353 128161 149043 74270 42566 -28064 32905 74233 73678 70365 112589 126113 57058
1489 57058 78377 52284 31953 5941 -70465 -57187 -62162 -39742 -13339 -23167 -31894 -46168
1477 -46168 -18954 -13270 -18471 4891 2498 -17612 -44256 -53359 -75027 -37409 -22777 -5404 8522
1464 8522 -10412 -88758 -109554 -109350 -96748 -83592 -107501 -122503 -129037 -94160 -26359 -31886 33622
1451 33622 34550 -38261 -61435 -53433 -5284 36355 16136 -1132 -9127 -43656 -16134 -3092 -2123
1438 -2123 -10357 -48522 -45975 9090 33487 83714 61963 24049 47119 73 -54011 -14377
1426 -14377 65502 129817 202039 200815 160609 123398 44488 -7391 -69334 -41347 -9727 -22988
1414 -22988 -24942 -18662 20402 27921 -5534 -56261 -85299 -57497 -27750 -5376 -12270 -16990 -90509
1401 -90509 -79025 -42389 -15010 4718 -21919 -20547 1527 15968 -43053 -67185 -82325 -42136
1389 -42136 -36328 -48467 10789 50789 30453 40395 -35709 -33980 -50430 -33558 -10468 -10229 -2492
1376 -2492 21545 -41930 -82219 -58759 -21821 34264 43588 36981 14894 28592 42749 55464
1364 55464 23920 35128 20544 -23037 40664 128499 173417 200556 100426 26413 7803 -9929
1352 -9929 -16560 -13970 -31676 -11539 -28764 -24452 29255 10632 -7925 -41337 -109022 -100464 -73396
1339 -73396 -38039 15157 46736 32304 23874 -19558 16628 -10509 -42640 -24519 -62527 -67165
1327 -67165 -61496 -44798 -21966 -13870 421 -48532 -102194 -130638 -84802 -20186 59495 78173
1315 78173 49353 30809 23600 13603 7136 -24928 -76898 -77795 -19561 19655 87053 67730 41024
1302 41024 32183 -55547 -81553 -41337 -26368 -2472 17187 11296 7222 19172 6450 -23398
1290 -23398 -23301 -6469 517 -25435 3634 -3075 -4778 -80160 -51047 -54043 -56255 -38247 -55910
1277 -55910 -11789 -14354 -56204 -77290 -84091 -53515 -56322 -60078 -77880 -72624 -85740 -55729 -32942
1264 -32942 -3623 25305 -21385 -66791 -132202 -121851 -89371 -90368 -32513 -22388 61266 62136 33310
1251 33310 -19651 -47220 -42383 -81390 -30734 15973 60784 63496 40803 -347 6205 53772
1239 53772 46949 88552 96759 115403 108305 52994 42378 11163 47877 34104 56993 86539
1227 86539 60932 8723 -32584 -27203 -37898 -67465 -107383 -116087 -66817 -49039 -401 13961
1215 13961 14650 7126 -53117 -12192 29411 53221 49691 18617 16148 57360 44267 -1465 -4461
1202 -4461 -52519 -44936 -29268 -38494 -44012 -68275 -75505 -86359 -74475 -51645 -57940 -83415 -100087
1189 -100087 -19306 -28053 34243 25061 14303 -1857 -6791 15177 -7180 2020 370 6663 -30024
1176 -30024 -60131 -14902 -56571 -4143 12824 26877 40899 -5825 4715 -20839 -3791 8821
1164 8821 30647 33466 40758 30715 52753 90791 43601 -28147 -72569 -112374 -69909 -60923 -10154
1151 -10154 11695 22520 25209 38927 32106 16035 -5277 -33649 -73666 -84538 -56588 -8679
1139 -8679 50885 111666 84668 116091 40453 19452 -1203 -45646 -71546 -50954 6648 2367
1127 2367 51419 7930 -40650 -97170 -114040 -102046 -144161 -116706 -67098 -15730 19790 -14550
1115 -14550 -37718 -67718 -102572 -151765 -136394 -51115 -2721 13786 -24208 -23421 -31274 -35797 -61088
1102 -61088 -91077 -46013 -50768 -46991 -13927 -11809 -36800 -81420 -70043 -83756 -74981 -50556 -78299
1089 -78299 -35200 -15635 57813 47001 49762 16465 27254 5874 1998 34205 106669 116515
1077 116515 77686 93406 39466 33416 14239 -33589 12694 67833 88935 82616 62615 44009
1065 44009 45896 -2905 -57198 -2538 26130 68028 151478 159942 154332 113271 80964 54611
1053 54611 5513 7725 36343 53727 47393 10242 -5820 -24198 -88997 -111206 -111132 -122963 -80754
1040 -80754 -62616 -36844 -68289 -73609 -28866 607 -25651 -23321 -36105 -56940 -35049 -46467
1028 -46467 -13478 -25285 -51136 -51345 -61355 -72370 -73634 -57317 -108818 -109319 -66562 -48070 -17002
1015 -17002 -17907 25573 8612 31849 32903 -11437 -31073 -46548 -33741 -4873 46798 31119
1003 31119 7454 -3737 12580 3130 -25894 -54624 -84222 -30934 25961 61148 65723 69875
991 69875 11208 -35324 -82710 -97565 -19957 58456 40534 55622 29497 38481 -6060 -78506
979 -78506 -76970 -100607 -152056 -113819 -67348 -47512 -12461 -20274 -100401 -122009 -160839 -173236
967 -173236 -161911 -102730 -44207 -37039 -11326 2817 8564 -32745 -61787 -57241 -80300 -42894
955 -42894 -27594 -12546 33389 57568 68071 37995 23996 753 -28010 -72107 -83733 -76619
943 -76619 -64307 -31501 17898 80952 92268 21433 -76200 -123933 -99112 -52970 21424 54061
931 54061 114557 99145 116025 126377 61155 25443 29683 39258 31875 48345 66531 86391 27175
918 27175 -12762 3797 -34431 -40405 -17575 -31195 20689 -17362 -84130 -71754 -59831 -23774
906 -23774 -25324 -19744 17882 -48300 -65916 -64708 -45002 -19084 -5330 -47759 -114811 -120646 -84628
893 -84628 -43569 -38541 -45270 -85395 -133925 -140317 -99351 -94816 -61458 -100046 -73989 -25516 -23526
880 -23526 -24082 -6403 -11251 -31389 -82523 -70266 -47691 28725 109705 170831 141262 56113 -90990
867 -90990 -169125 -165126 -86340 -23134 34916 39403 60779 62364 37631 14145 14791 10929 10419 18384
853 18384 45445 99699 134558 148378 111511 38427 -404 30220 12398 -3552 -24169 -20055
841 -20055 -46695 -52746 22452 42262 39488 29022 4825 -3282 -7838 1584 -8347 36567 28142
828 28142 4882 -22778 -33811 -13391 -24133 -12601 -38143 -58841 -36900 -19626 -45144 -65147
816 -65147 -83785 -111471 -125184 -161035 -100939 -74645 -101249 -55152 -3838 -44940 -86609 -115215
804 -115215 -87833 -25510 -30817 -56491 -62599 -11894 44873 -9795 -31267 -40530 -37844 -79571 -81020
791 -81020 -74702 -33911 -13636 -70006 -96989 -47854 -43258 -32850 -70962 -34160 -23024 -25573 -25323
778 -25323 -8895 22247 21971 -24531 5862 5462 23170 13344 1613 26551 6346 -44623 -65955
765 -65955 -121530 -76080 -676 -5997 20431 -37561 -63214 -86040 -79065 -51198 -7916 -9397 342
752 342 16655 46595 49892 -10455 -57879 -12124 136 20641 -2212 -2010 26157 41944 -7321
739 -7321 -51096 -82010 -56858 -41674 -50052 -17072 24633 -23718 -53698 -85231 -95942 -17593
727 -17593 -11561 -19386 -53734 -46508 -23546 -70521 -63238 -32906 -20019 -37691 -26767 -28489 -35617
714 -35617 -24175 -102459 -86685 -38720 -42708 -25151 -16430 -3782 -5041 -14417 -55982 -44984 -20758
701 -20758 -8164 -21517 -17950 -1946 -37587 1914 25480 48924 36143 -9097 -55645 -89467
689 -89467 -71213 -42138 -16350 -16344 -6186 8094 -28715 -46753 -74909 -95887 -112885 -143662 -73906
676 -73906 -16914 62160 55976 40738 52762 -14492 -63960 -72461 -32909 38142 39299 19866 22682
663 22682 -18341 -73653 -79316 -49948 -47630 -56184 -41488 -51833 -64346 -86759 -58194 -95202 -77039
650 -77039 -53904 -42973 -19254 7957 31475 28347 -36942 -89336 -91392 -2338 62817 29261
638 29261 5130 -12419 -86647 -125525 -113003 -78314 19776 30390 -26756 -24911 31167 35439
626 35439 25745 24106 26290 -9170 8455 58097 130311 209643 151209 122048 80304 62480 46336
613 46336 -14318 -7966 -35623 4099 7591 -21223 -15714 13937 25180 -3954 -30764 -47278 -45098
600 -45098 -4814 7237 44613 18428 1749 -60446 -61173 -41324 -10673 33965 8360 -30818
588 -30818 -29586 -32255 -58131 -34460 -22949 -67583 -81075 -117424 -76164 -89486 -110954 -132469
576 -132469 -143893 -109685 -124267 -97587 -154865 -154154 -157506 -168840 -146758 -114351 -71356 -35619
564 -35619 -12505 -17526 -51159 -104682 -129173 -136788 -54094 23526 25963 -38668 -77823 -81939 -50007
551 -50007 -52107 -23613 -21575 10376 39480 70651 81369 49448 -16236 -59693 -48192 7306
539 7306 88528 110871 121986 116840 87986 16265 2304 -10861 7871 26271 7353 21284
527 21284 69080 72404 81913 77511 90755 107389 70938 58343 62070 103638 154810 139670 134802
514 134802 122533 102668 49265 36567 37519 38338 13260 16798 15431 4204 23332 -41040 -78755
501 -78755 -111687 -121360 -102353 -28201 48774 68836 28803 -43082 -91362 -93531 -57753 -60005 -48721
488 -48721 1048 3832 -55451 -108798 -117667 -87373 -120024 -181144 -200918 -166778 -126244 -101997
476 -101997 -89814 -86127 -92184 -136404 -152850 -114049 -50489 24637 -30756 -57827 -83566 -74354
464 -74354 -70849 -15185 69895 105659 67976 -65111 -120079 -93225 -37065 18080 -11913 4696
452 4696 192 -14356 -76496 -73924 -32622 -2908 4795 -2852 63584 132826 91498 50013 -3770
439 -3770 7128 -26703 -15342 34586 92078 160712 135954 125086 31741 3827 -32315 -55378
427 -55378 -34417 13493 8697 -26582 -3660 16575 40795 -12310 -83785 -83051 -76269 -49804 -27551
414 -27551 -5272 -39286 -39598 -87349 -90071 -2812 12902 -148 -24348 -69277 -42519 -52141 -87300
401 -87300 -114207 -99787 -99857 -93752 -104372 -125488 -64289 -54723 -62370 -73989 -112661 -131923 -157627
388 -157627 -83197 -47707 5182 -23782 -42082 -69677 -58439 40364 35575 3294 -67167 -54799
376 -54799 -49455 -77511 -44857 -60079 2426 3892 10290 43552 99227 58508 10874 -2518 -43174
363 -43174 1173 -14503 61457 131233 121595 83220 -20466 -33746 -39474 -29583 6375 53807
351 53807 79071 -7396 -43668 -82226 -58813 -59848 -57294 -20220 -6991 73452 76917 136502 140644
338 140644 49672 -1763 -40736 -8836 10545 123931 117139 59157 -538 -36769 -20891 -75126
326 -75126 -61978 -76969 -100124 -142611 -158017 -104978 -67355 -55509 -64782 -76341 -112714 -138718
314 -138718 -96216 -40675 43599 63268 10007 -49351 -75834 -43556 -70902 -44024 -76434 -67264
302 -67264 -48054 -30648 24652 -27924 -19224 -110352 -130241 -133195 -89546 -27652 -26521 38466 -3338
289 -3338 -23404 -76918 -95604 -62203 -18487 -11375 -68313 -51194 -56332 -28988 -7520 -35344 -25057
276 -25057 -34565 -41062 -38890 41338 67175 -11456 -82700 -162481 -164242 -83686 -1289 -24801 -42008
263 -42008 -38664 -78380 -94988 -129770 -83820 -51172 -58616 -81413 -59099 -68754 -90159 -68157 -72940
250 -72940 -25110 -62452 -88615 -42049 -51865 20353 -4640 -79392 -140171 -104368 -41959 -10040
238 -10040 1828 -40322 -45242 -47429 -72294 -19826 13094 9649 -87568 -63779 -85126 -65457 -17114
225 -17114 -16027 9721 13369 -23634 -68711 -77327 -57673 -44052 -22231 -58167 -57007 -41317 -58904
212 -58904 -29231 -6672 -1374 -27290 -25260 -73667 -31327 -25561 -2609 -20993 -56273 -64435 -54728
199 -54728 -45152 -63354 -34258 -84806 -145659 -136856 -140611 -55116 -54960 -55435 -85975 -129712 -109920
186 -109920 -131004 -47355 -26023 1591 20557 -4724 39666 21865 -13510 -77302 -111230 -101785
174 -101785 -44865 -11603 10454 -36482 -64792 -91657 -131316 -132283 -106883 -74367 -42338 -65494
162 -65494 -65749 -75246 -84711 -75959 -64237 -72865 -47228 -3401 -4224 -17522 -3326 -27580 -51122 -95964
148 -95964 -108390 -72517 -44333 -44511 -88886 -107642 -135739 -191632 -199447 -179773 -144278 -143458 -143921
135 -143921 -177971 -184971 -209941 -207637 -137154 -112512 -119680 -143689 -160641 -144299 -135053 -108974 -114212
122 -114212 -122722 -187082 -220831 -202347 -211675 -203162 -201978 -213202 -219744 -213470 -160111 -135370 -156894
109 -156894 -174751 -238765 -233247 -218582 -190921 -141220 -113866 -122852 -139768 -160719 -161237 -138261 -115461
96 -115461 -99077 -82528 -159254 -167462 -161747 -121232 -122995 -138990 -136684 -156532 -152552 -166405 -197901
83 -197901 -190266 -190700 -169216 -132603 -71375 -52275 -45412 -69637 -137863 -154976 -181235 -167750 -140389
70 -140389 -111202 -96729 -109306 -133288 -195106 -246299 -277521 -244458 -253023 -235448 -215533 -181608
58 -181608 -174272 -195158 -193548 -204700 -202090 -220210 -210993 -160558 -153279 -177783 -215951 -227716 -276320
45 -276320 -263070 -233519 -225426 -227584 -302257 -353075 -365327 -355182 -327414 -328557 -290529 -268025 -250817
32 -250817 -266675 -288461 -279897 -269934 -244013 -256366 -247001 -253346 -221737 -172523 -192791 -236609 -303108
19 -303108 -337871 -330279 -279436 -239713 -242522 -279778 -318741 -350855 -350334 -310388 -302408 -299321 -294890
6 -294890 -280174 -245984 -230280 -222972 -252201 -283727
0 -283727
$$ Imaginary data points
##PAGE= N=2
##DATA TABLE= (X++(I..I)), XYDATA
16383 -332909 -270865 -254071 -236301 -240539 -273307 -281079 -288256 -273659 -224795 -197431 -156789 -134847
16371 -134847 -108108 -119422 -87933 -93345 -85684 -85537 -79567 -30897 18265 73573 82309 57762 9945
16358 9945 -8894 -6608 22374 82706 120770 136294 138191 139142 128324 111772 133235 138051 181795
16345 181795 198481 219326 246620 257835 267552 272118 289353 279100 307040 336418 381938 434522
16333 434522 438472 409871 347976 341515 372124 398852 442018 454355 472598 470920 480349 476862
16321 476862 508967 528555 538946 523500 504740 539825 575237 585262 609366 619351 605808 643259
16309 643259 640851 632535 674455 699170 688112 686589 680338 712183 749833 763686 788176 793663
16297 793663 801039 806416 829523 843415 837709 842134 821352 872078 876394 933546 960807 981878
16285 981878 961574 939399 902668 900214 906987 918258 968935 1009124 1030521 983857 943884 940896
16273 940896 934146 944238 951088 982838 1012829 1070984 1113506 1131431 1114492 1067448 993094 958494
16261 958494 980341 1042318 1101500 1122848 1107908 1141773 1141802 1154805 1162138 1134294 1131225 1140597 1114290
16248 1114290 1129420 1199024 1222132 1231152 1251926 1257740 1251509 1218354 1233006 1225520 1252947 1312868
16236 1312868 1273774 1302971 1310299 1331566 1356830 1355072 1370717 1379613 1410750 1417159 1419897 1428631
16224 1428631 1407187 1335146 1310987 1346880 1410552 1472732 1461316 1457672 1452044 1407254 1388061 1391370
16212 1391370 1374583 1385789 1451860 1504185 1535446 1573622 1577754 1556039 1559412 1550423 1533012 1535014
16200 1535014 1539393 1548465 1545276 1559613 1525409 1430994 1412420 1410273 1455540 1510199 1522060 1548278
16188 1548278 1525234 1546102 1573727 1601619 1595819 1572698 1528492 1573386 1623730 1674315 1657305
16177 1657305 1677461 1683843 1655991 1631596 1574333 1542478 1520907 1519518 1561456 1645898 1683850 1651402
16165 1651402 1628574 1625575 1649239 1622197 1625044 1639041 1696586 1780653 1811288 1739703 1708094 1678434
16153 1678434 1638405 1647163 1671464 1724228 1738980 1735551 1717676 1694344 1675822 1663429 1712896 1733853
16141 1733853 1769036 1756785 1739573 1779277 1815154 1770293 1766158 1785547 1794861 1785993 1789433 1762097
16129 1762097 1778325 1787653 1769200 1781096 1799879 1855429 1900954 1872995 1871872 1842970 1796284 1721345
16117 1721345 1722930 1772681 1826819 1850740 1833273 1864722 1817129 1827016 1817655 1812106 1798615 1827843
16105 1827843 1817315 1762230 1790338 1837976 1828062 1843815 1844773 1828441 1860393 1852493 1796752 1796205
16093 1796205 1794755 1803610 1781003 1796117 1834492 1850392 1833594 1829143 1805466 1798272 1821643 1807763
16081 1807763 1768976 1817735 1811920 1776766 1724556 1738577 1790076 1811489 1850916 1862041 1842488
16070 1842488 1828768 1795314 1773401 1763440 1790656 1770782 1748562 1713947 1705317 1729007 1752518 1755277
16058 1755277 1761239 1768251 1829165 1842484 1870216 1850201 1811032 1740657 1734746 1793537 1865635 1886653
16046 1886653 1859930 1882676 1864159 1829420 1800820 1748247 1761129 1773606 1761961 1781216 1789787
16035 1789787 1796359 1810743 1771911 1778096 1801969 1822752 1845248 1860677 1900770 1904072 1925868 1872105
16023 1872105 1810339 1840870 1847932 1868751 1847513 1855182 1904680 1852514 1845366 1887193 1911982 1904951
16011 1904951 1881438 1853480 1848593 1859515 1836119 1850560 1920812 1924614 1916520 1879077 1858581 1860825
15999 1860825 1879521 1867492 1887670 1907812 1928250 1918165 1948898 1992822 2002999 1980175 1941602
15988 1941602 1934765 1937406 1915290 1913850 1867151 1847208 1813917 1860091 1929626 1977854 1980586 1926112
15976 1926112 1902345 1871468 1894158 1888108 1882828 1924930 1954975 1961384 1927294 1921654 1865333 1863714
15964 1863714 1869723 1844446 1849914 1809826 1783174 1821603 1790065 1810172 1781358 1718786 1730416 1765650
15952 1765650 1843616 1864058 1842313 1862835 1855582 1843033 1811302 1819986 1813812 1798370 1800189 1785946
15940 1785946 1765010 1810450 1848940 1842511 1804518 1767143 1714345 1707170 1691241 1755085 1793882 1817032
15928 1817032 1847948 1845690 1893775 1912172 1940091 1991692 1956279 1940285 1917841 1880148 1939771
15917 1939771 1913067 1946832 1905869 1876403 1887861 1855252 1892221 1891114 1874477 1847623 1833326
15906 1833326 1849528 1879188 1907524 1939207 1971803 1964670 1947638 1937511 1949086 1997740 2017726
15895 2017726 2018115 2009170 1923112 1867530 1865529 1863042 1836377 1869821 1856757 1874676 1883186 1928246
15883 1928246 1938184 1935455 1900262 1873432 1907446 1914413 1922587 1905610 1942203 1947681 1908773 1902792
15871 1902792 1900936 1921314 1891566 1862100 1834572 1807628 1813415 1801126 1825225 1863897 1855194 1799706
15859 1799706 1781456 1825995 1825561 1849716 1857490 1892516 1908368 1893807 1864617 1916488 1882884 1831097
15847 1831097 1792454 1810832 1887472 1930288 1947575 1939734 1864820 1812407 1749734 1736784 1789789
15836 1789789 1863193 1917831 1950218 1954907 1946652 1944946 1878144 1858480 1876685 1853303 1884254 1852593
15824 1852593 1891785 1923910 1980682 2007954 1946382 1938420 1886980 1881305 1914998 1935130 2020794 2034857
15812 2034857 2008500 1966657 1987348 1992755 1936720 1894556 1837916 1895984 1902761 1965982 1981167 1993283
15800 1993283 2031339 1998533 1920172 1882881 1901927 1938640 1993979 1996782 2004465 2041265 2016002 1969419
15788 1969419 1896326 1892510 1856597 1837437 1827558 1876092 1954588 1908240 1872935 1840626 1841809 1850925
15776 1850925 1845045 1901298 1953692 1984810 1886014 1883496 1879567 1889591 1902003 1884203 1895598 1941017
15764 1941017 1952491 1930524 1902690 1895033 1881250 1857848 1798692 1778246 1792537 1813637 1883769
15753 1883769 1913562 1951026 1924180 1880872 1856637 1890771 1917134 1868267 1827714 1812873 1881650
15742 1881650 1900702 1931367 1957148 1994409 1989426 1923467 1860682 1857388 1901112 1940952 1938283 1947966
15730 1947966 1923817 1972685 1956181 1895900 1880192 1891638 1885170 1838386 1901991 1927005 1968823
15719 1968823 1972428 1922581 1921359 1888210 1904292 1906697 1943649 1979224 1982733 1930350 1870302 1908719
15707 1908719 1888639 1870619 1831939 1816550 1852586 1872623 1886237 1929201 1967162 1916041 1870550
15696 1870550 1846577 1838505 1853826 1846907 1885226 1896697 1932347 1967466 1956603 1951164 1960972 1996961
15684 1996961 1969288 1933328 1913343 1911302 1879572 1855626 1895133 1872934 1882806 1825599 1841377 1896544
15672 1896544 1917078 1934746 1925044 1933319 1969270 1977366 2001021 1974561 1964158 1971901 1954751 1959377
15660 1959377 2044607 2080884 2047307 2023542 1955365 1922441 1865120 1834003 1840893 1861533 1906509
15649 1906509 1883880 1920643 1954564 2031564 2054598 2028156 1962352 1919575 1919276 1924690 1972716 1987967
15637 1987967 2032537 2018113 1969199 1965828 1957467 1937294 1872439 1844887 1853738 1872651 1917491 1912913
15625 1912913 1947506 1932322 1899384 1909903 1868786 1903906 1932022 1975565 1995115 1988490 1981431 1944627
15613 1944627 1925643 1909791 1912495 1888509 1865554 1895194 1892461 1924674 1913002 1932236 1931665 1892764
15601 1892764 1831233 1850554 1901138 1949075 1990315 1997841 2003604 2028870 2049481 2041625 2009080 1997127
15589 1997127 1975081 1973866 1941124 1909399 1911100 1904744 1892303 1939007 1993621 1964308 1936713 1960111
15577 1960111 2005167 2002223 1949106 1922876 1943582 1950801 1962848 1959375 1978251 1985667 2003778 2007248
15565 2007248 2032055 2020512 1998632 1963855 1917006 1916486 1965080 1987305 1978898 1970328 1992020 1991304
15553 1991304 1995172 1994403 2007749 1978878 1980570 1924943 1924383 1952969 1971561 1964985 1930441 1973312 1988840
15540 1988840 1964724 1950466 1920362 1951132 1943010 1916576 1877171 1923147 1956869 1963843 1990030 1980883
15528 1980883 2000214 1992733 1948531 1995010 1983173 1996888 1953030 1953639 1940095 1938357 1920015 1950412
15516 1950412 1986656 1985473 1978164 1984236 2038047 2043542 2038100 1991250 1929464 1913195 1926842 1927889
15504 1927889 1932791 1994015 1992684 1982160 1968219 1957295 2013652 2037794 2019518 2010423 1981777 1934380
15492 1934380 1924375 1943676 1966334 2013579 2026461 1986201 1993715 2022335 2039222 1980914 1963918
15481 1963918 1951743 1997937 2000462 2006658 2021848 1985401 2005974 1984542 1919745 1920140 1916084 1948175
15469 1948175 1931733 1936506 1939282 1952159 1894193 1865855 1952103 1997353 1983837 1987063 1997836 2032725
15457 2032725 1981584 1927804 1895377 1920942 1951542 2006140 2034718 2091037 2116884 2078783 2020407
15446 2020407 1969444 2033749 1998698 1976190 1960021 1991000 2024141 1985741 2010966 2013299 2056759
15435 2056759 2063508 2017331 2025255 2055675 2088075 2075120 2048489 2062305 2044187 2049693 2004909 2029573
15423 2029573 2087485 2096261 2088438 2081952 2068259 1981168 1982245 1972273 1999170 1991564 1933113 1943937
15411 1943937 1980457 2090690 2093182 2094995 2086815 2071970 2062542 2041591 2032057 2039551 2070185 2064646
15399 2064646 2011671 2016813 2016617 1989469 1935879 1902205 1900679 1969363 1947910 1981176 2040977 2061965
15387 2061965 2064094 2015637 1963115 1951507 2036286 2050629 2066495 2109966 2106237 2129455 2089641 2056901
15375 2056901 2051979 2007133 1984884 1903261 1928331 1955096 2010184 2020767 2022214 2035561 1995503 2003789
15363 2003789 1965406 1927908 1940422 1982278 1998642 2035542 2081812 2094786 2085603 2026339 2004485
15352 2004485 1973544 1908700 1906181 1924351 1944796 1957945 1964874 1970285 1958335 1987392 1941261 1957390
15340 1957390 1942523 1961662 1979979 2005653 2052367 2065678 2050350 2018006 1989779 1960775 1975807
15329 1975807 1998348 1970508 2032409 2052174 2043290 1998138 1982251 1989459 1953934 1978570 1976359 2026924
15317 2026924 2083891 2077240 2102188 2072564 2096036 2063702 2062241 2110249 2148146 2158043 2134981 2111126
15305 2111126 2078014 2074796 2050305 2042131 2038410 2060802 2066383 2053391 2041278 2032474 2072821 2063864
15293 2063864 2099804 2136463 2133055 2144173 2138745 2123838 2082606 2088293 2086856 2040992 2051535 1978946
15281 1978946 1998118 1995879 2027542 2021786 2027420 2050159 2062027 2087915 2070668 2073305 2042860 1963745
15269 1963745 1957056 1973064 2026124 2072783 2134561 2196957 2166343 2121163 2078686 2099934 2036437
15258 2036437 2005375 1996157 2038470 2067958 2069751 2072319 2128369 2121478 2076230 2055741 2039677 2023101
15246 2023101 2057085 2067154 2088058 2081947 2068752 2024462 2030175 1996031 1965438 1986158 2021617 2057629
15234 2057629 2063900 2053366 2104533 2086737 2022694 1973406 1974480 2002666 2068591 2071898 2097316 2138670
15222 2138670 2112828 2088951 2023247 1968836 1980401 1986148 2020470 2022898 2092905 2069209 2062257 2082089
15210 2082089 2059714 2042404 1987790 2027458 2023272 2059967 2068275 2022894 2060217 2038663 2035976 2032187
15198 2032187 2019192 2037106 2099892 2122792 2106045 2132946 2136224 2106228 2087356 2085508 2088507 2104628
15186 2104628 2084483 2092674 2139108 2141230 2166453 2160989 2115653 2115831 2081933 2048691 1999230 2018055
15174 2018055 2058084 2100699 2133363 2132958 2206102 2160054 2122415 2098893 2086888 2144523 2134074 2137052
15162 2137052 2065557 2074887 2080543 2081102 2084391 2076985 2104947 2093321 2021186 2013436 2047903 2059910 2051505
15149 2051505 2083189 2085484 2078360 2052418 2041401 2039551 2096747 2089624 2038100 2005958 2040952 2037958
15137 2037958 2022618 2041713 2033647 2065567 2043118 1995017 2002214 2020433 2002590 1981011 1991621 2018615
15125 2018615 2009362 2018898 1993005 2067357 2099709 2108226 2076965 2082369 2116897 2115240 2147016 2114715
15113 2114715 2119073 2108069 2065100 2076425 2091349 2079165 2076070 2071048 2071360 2116085 2154079 2145374
15101 2145374 2120769 2136616 2131994 2118615 2122855 2120488 2156986 2171111 2122131 2090897 2069539 2077300
15089 2077300 2102007 2107618 2172171 2164416 2148048 2052157 2016409 2000268 2043986 2091566 2108576 2179898
15077 2179898 2228833 2248007 2233711 2181681 2114937 2057335 2030095 2031069 2096611 2160228 2177738 2167386
15065 2167386 2143163 2174753 2133762 2064513 2032503 2000961 2041916 2051071 2124279 2157980 2198025
15054 2198025 2175875 2158499 2152409 2143990 2153980 2072284 2092471 2104898 2088261 2060657 2049554 2092441
15042 2092441 2112532 2129207 2138969 2125693 2112910 2128674 2126256 2136717 2156026 2154494 2154530 2120317
15030 2120317 2091043 2109626 2126126 2132642 2079092 2073255 2073269 2040795 2006739 2001169 2069640 2071832 2053839
15017 2053839 1987211 2004719 2048576 2065930 2066991 2093965 2179878 2188947 2153968 2194592 2186191 2190809
15005 2190809 2161971 2163282 2146439 2168146 2190463 2174863 2165926 2174650 2159247 2136115 2125307 2129873
14993 2129873 2151475 2150887 2122864 2109963 2101241 2177767 2161060 2199995 2254822 2258956 2226100 2195432
14981 2195432 2206558 2197155 2180723 2107353 2112995 2129297 2126927 2165971 2167234 2181305 2132379 2119012
14969 2119012 2085331 2073807 2081502 2105315 2144629 2127649 2147472 2198049 2199005 2210585 2153173 2136014
14957 2136014 2109228 2088714 2089898 2119995 2140879 2122352 2127051 2104785 2079261 2060376 2095863 2067084
14945 2067084 2090500 2120874 2115788 2102665 2141234 2182921 2161948 2151491 2169815 2126990 2169969
14934 2169969 2192958 2219522 2223464 2216898 2157219 2083254 2084707 2117153 2128021 2137726 2131494 2127015
$$ [...]
##END NTUPLES=NMR SPECTRUM
##END=
