##TITLE=1H_DE-80H_X3
 200.13MHz, d2o
 8 sc
 
 19ns.26.2.2025
##JCAMPDX= 6.0         $$ Bruker NMR JCAMP-DX V2.0
##DATA TYPE= NMR SPECTRUM
##DATA CLASS= NTUPLES
##ORIGIN= UXNMR, Bruker Analytische Messtechnik GmbH
##OWNER= pz
$$ XWIN-NMR		Version 3.5
$$ Wed Dec 24 10:38:33 2025 Russian Standard Time (UT+4h)  Yarkov@DPX200
##.OBSERVE FREQUENCY= 200.1313
##.OBSERVE NUCLEUS= ^1H
##.ACQUISITION MODE= SIMULTANEOUS
##.ACQUISITION SCHEME= undefined
##.AVERAGES= 8
##.DIGITISER RES= 18
##SPECTROMETER/DATA SYSTEM= spect
##.PULSE SEQUENCE= zg30
##.SOLVENT NAME= CDCl3
##.SHIFT REFERENCE= (INTERNAL, CDCl3, 0, 15.4803)
##AUDIT TRAIL= $$ (NUMBER, WHEN, WHO, WHERE, WHAT)
$$ ##TITLE= Audit trail, XWIN-NMR		Version 3.5
$$ ##JCAMPDX= 5.01
$$ ##ORIGIN= Bruker BioSpin GmbH
$$ ##OWNER= Yarkov
$$ C:/Bruker/XWIN-NMR/data/yarkov2/nmr/H-C/1/pdata/1/auditp.txt
$$ ##AUDIT TRAIL=  $$ (NUMBER, WHEN, WHO, WHERE, WHAT)
(   1,<2025-12-24 10:37:43.17 +0400>,<Yarkov>,<DPX200>,
      <created by zg, POWCHK disabled, PULCHK disabled
       configuration hash MD5:
       00 E9 B6 7A A2 85 ED C7 34 08 36 98 17 FE 4E 26
       data hash MD5: 16K
       8B 2E CB 96 E8 D2 14 17 6D 65 39 0C 1F FB 1F 32>)
(   2,<2025-12-24 10:37:51.82 +0400>,<Yarkov>,<DPX200>,
      <Start of raw data processing
       efp BC_mod = 2 LB = 0.25 FT_mod = 6 PKNL = 1 PHC0 = -5299.955 PHC1 = 10.82193 SI = 16K 
       data hash MD5: 16K
       7C FE 01 1E F5 49 86 A5 CE 4A CB 0B A0 64 B6 15>)
$$ ##END=
$$ 
$$ hash MD5
$$ 3E B4 52 18 95 91 C7 F4 62 F3 CE 15 CC 2C 4D 77
##$RELAX= 
##$RELAX= 
##$RELAX= 
##$RELAX= 
##$RELAX= 
##$RELAX= 
$$ Bruker specific parameters
$$ --------------------------
##$DU= <C:/Bruker/XWIN-NMR>
##$EXPNO= 1
##$NAME= <H-C>
##$PROCNO= 1
##$TYPE= <nmr>
##$USER= <yarkov2>
##$AMP= (0..31)
100 100 100 100 100 100 100 100 100 100 100 100 100 100 100 100 100 100 
100 100 100 100 100 100 100 100 100 100 100 100 100 100 
##$AQSEQ= 0
##$AQ_mod= 1
##$AUNM= <au_zg>
##$AUTOPOS= <>
##$BF1= 200.13
##$BF2= 200.13
##$BF3= 200.13
##$BF4= 200.13
##$BF5= 200.13
##$BF6= 200.13
##$BF7= 200.13
##$BF8= 200.13
##$BYTORDA= 1
##$CFDGTYP= 0
##$CFRGTYP= 5
##$CHEMSTR= <none>
##$CNST= (0..31)
1 1 145 1 1 1 1 1 1 1 1 1 1 1 1 1 1 1 1 1 1 1 1 1 1 1 1 1 1 1 1 1 
##$CPDPRG= <>
##$CPDPRG1= <>
##$CPDPRG2= <>
##$CPDPRG3= <>
##$CPDPRG4= <mlev>
##$CPDPRG5= <mlev>
##$CPDPRG6= <mlev>
##$CPDPRG7= <mlev>
##$CPDPRG8= <mlev>
##$CPDPRGB= <>
##$CPDPRGT= <>
##$D= (0..31)
0 0.7 0 0 0 0 0 0 0 0 0 0.03 0 0 0 0 0 0 0 0 0 0 0 0 0 0 0 0 0 0 0 0 
##$DATE= 1766558262
##$DBL= (0..7)
120 120 120 120 120 120 120 120 
##$DBP= (0..7)
150 150 150 150 150 150 150 150 
##$DBP07= 0
##$DBPNAM0= <>
##$DBPNAM1= <>
##$DBPNAM2= <>
##$DBPNAM3= <>
##$DBPNAM4= <>
##$DBPNAM5= <>
##$DBPNAM6= <>
##$DBPNAM7= <>
##$DBPOAL= (0..7)
0.5 0.5 0.5 0.5 0.5 0.5 0.5 0.5 
##$DBPOFFS= (0..7)
0 0 0 0 0 0 0 0 
##$DE= 6
##$DECBNUC= <off>
##$DECIM= 32
##$DECNUC= <off>
##$DECSTAT= 4
##$DIGMOD= 1
##$DIGTYP= 9
##$DL= (0..7)
0 120 120 120 120 120 120 120 
##$DP= (0..7)
$$ [...]
##$SUBNAM2= <"">
##$SUBNAM3= <"">
##$SUBNAM4= <"">
##$SUBNAM5= <"">
##$SUBNAM6= <"">
##$SUBNAM7= <"">
##$SUBNAM8= <"">
##$SUBNAM9= <"">
##$SW= 18.0517328524113
##$SWIBOX= (0..15)
0 0 2 0 0 0 0 0 0 0 0 0 0 0 0 0 
##$SW_h= 3612.71676300578
##$TD= 16384
##$TD0= 1
##$TE= 0
##$TE2= 300
##$TE3= 300
##$TEG= 300
##$TL= (0..7)
0 120 120 120 120 120 120 120 
##$TP= (0..7)
150 150 150 150 150 150 150 150 
##$TP07= 0
##$TPNAME0= <>
##$TPNAME1= <>
##$TPNAME2= <>
##$TPNAME3= <>
##$TPNAME4= <>
##$TPNAME5= <>
##$TPNAME6= <>
##$TPNAME7= <>
##$TPOAL= (0..7)
0.5 0.5 0.5 0.5 0.5 0.5 0.5 0.5 
##$TPOFFS= (0..7)
0 0 0 0 0 0 0 0 
##$TUNHIN= 0
##$TUNHOUT= 0
##$TUNXOUT= 0
##$USERA1= <user>
##$USERA2= <user>
##$USERA3= <user>
##$USERA4= <user>
##$USERA5= <user>
##$V9= 5
##$VALIST= <valist>
##$VCLIST= <CCCCCCCCCCCCCCC>
##$VD= 0
##$VDLIST= <DDDDDDDDDDDDDDD>
##$VPLIST= <PPPPPPPPPPPPPPP>
##$VTLIST= <TTTTTTTTTTTTTTT>
##$WBST= 1024
##$WBSW= 4
##$XGAIN= (0..3)
0 0 0 0 
##$XL= 0
##$YL= 0
##$YMAX_a= 27316
##$YMIN_a= -15528
##$ZGOPTNS= <>
##$ZL1= 120
##$ZL2= 120
##$ZL3= 120
##$ZL4= 120
##$ABSF1= 0
##$ABSF2= 0
##$ABSG= 0
##$ABSL= 0
##$ALPHA= 0
##$AQORDER= 0
##$ASSFAC= 0
##$ASSFACI= 0
##$ASSFACX= 0
##$ASSWID= 0
##$AUNMP= <proc_1d>
##$AZFE= 0.1
##$AZFW= 0.1
##$BCFW= 0
##$BC_mod= 2
##$BYTORDP= 0
##$COROFFS= 0
##$CY= -3
##$DATMOD= 1
##$DC= 0
##$DFILT= <>
##$DTYPP= 0
##$F1P= 0
##$F2P= 0
##$FCOR= 1
##$FTSIZE= 16384
##$FT_mod= 6
##$GAMMA= 0
##$GB= 0
##$INTBC= 1
##$INTSCL= 3.241238e-09
##$ISEN= 128
##$LB= 0.25
##$LEV0= 0
##$LPBIN= 0
##$MAXI= 10000
##$MC2= 0
##$MEAN= 0
##$ME_mod= 0
##$MI= 1.114404
##$NCOEF= 0
##$NC_proc= -9
##$NLEV= 6
##$NOISF1= 3.799351
##$NOISF2= 2.8
##$NSP= 0
##$NTH_PI= 0
##$NZP= 0
##$OFFSET= 15.48025
##$PC= 1
##$PHC0= -5299.955
##$PHC1= 10.82193
##$PH_mod= 1
##$PKNL= yes
##$PPARMOD= 0
##$PSCAL= 0
##$PSIGN= 0
##$REVERSE= no
##$SF= 200.130008294747
##$SI= 16384
##$SIGF1= 3
##$SIGF2= 2
##$SINO= 0.751879
##$SIOLD= 32768
##$SREGLST= <19F.Aceton>
##$SSB= 0
##$STSI= 16384
##$STSR= 0
##$SW_p= 3612.71676300578
##$SYMM= 0
##$S_DEV= 0
##$TDeff= 16384
##$TDoff= 0
##$TI= <>
##$TILT= no
##$TM1= 0
##$TM2= 0
##$TOPLEV= 0
##$USERP1= <user>
##$USERP2= <user>
##$USERP3= <user>
##$USERP4= <user>
##$USERP5= <user>
##$WDW= 1
##$XDIM= 16384
##$YMAX_p= 390105754
##$YMIN_p= -783013
$$ End of Bruker specific parameters
$$ ---------------------------------
##NTUPLES= NMR SPECTRUM
##VAR_NAME=  FREQUENCY,     SPECTRUM/REAL,   SPECTRUM/IMAG
##SYMBOL=    X,             R,               I
##VAR_TYPE=  INDEPENDENT,   DEPENDENT,       DEPENDENT
##VAR_FORM=  AFFN,          ASDF,            ASDF
##VAR_DIM=   16384,         16384,           16384
##UNITS=     HZ,            ARBITRARY UNITS, ARBITRARY UNITS
##FACTOR=    0.220516191357247, 1,           1
##FIRST=     3098.06263266768, 0,            0
##LAST=      -514.654130338096, 0,           0
##MIN=       -514.654130338096, -783013,     0
##MAX=       3098.06263266768, 390105754,    0
$$ Real data points
##PAGE= N=1
##DATA TABLE= (X++(R..R)), XYDATA
$$ [...]
$$ plain form
5269 2568043 2949351 3138086 3035831 3070159 2959826 2429843 2593944 2889572 2621589 2758006
5259 2758006 2515094 2622561 2312098 2846175 3175344 3024351 2842372 2878870 2911673 2628481
5249 2628481 2525151 2392424 2262056 2262269 2245312 2603398 2312848 2008446 2400822 2395705 2378311
5238 2378311 2523925 2758026 2152041 2574286 2974818 2940276 2731432 3394791 3379010 2828791
5228 2828791 3034694 3319354 2970585 3480642 3515494 3645261 3389823 3210049 3695238 3570094
5218 3570094 3298958 3243456 3394082 3233039 3080637 3273627 3171578 3355371 2846114 2061918
5208 2061918 1879553 2472968 3237895 3520040 3515903 3691908 3011791 2876830 2689953 2539417
5198 2539417 3085962 3477147 3424374 2836316 2961472 3447408 3564297 3240036 3360229 2612827
$$ packed form
5269B568043L81308J88735j02255L4328j10333n29983J64101K95628k67983J36417
5259B758006k42912J07467l10463N34077L29169j50993j81979L6498L2803k83192
5249B628481j03330j32727j30368K13j6957L58086k90550l04402L92376n117j7394
5238B378311J45614K34101o05985M22245M00532l4542k08844O63359j5781n50219
5228B828791K05903K84660l48769N10057L4852J29767k55438j79774M85189j25144
5218C570094k71136n5502J50626j61043j52402J92990j02049J83793n09257p84196
5208B061918j82365N93415P64927K82145m137J76005o80117j34961j86877j50536
5198B539417N46545L91185n2773n88058J25156M85936J16889l24261J20193p47402
$$ plain form
5188 2612827 2756875 2951314 2492602 3175408 3541316 2937012 3593585 3388884 3451894 3108960
5178 3108960 2931081 3011077 3288406 2639635 3122268 3131056 2917747 3059123 3011263 3007820 2657349
5167 2657349 2299356 2553198 2992686 2454077 2305990 2511069 2780488 2941072 2997181 2987839
5157 2987839 2714699 2665354 2346326 2184830 2678447 2351064 2624517 3256566 3479881 3379184
5147 3379184 3109244 3021563 2872092 2856277 3319259 3144012 3064064 3075825 2803318 3099079
5137 3099079 3492087 3565313 3524643 3023136 2982251 2960409 3179766 3218502 3202583 3310015 3463594
5126 3463594 3579550 3609486 3110153 2912979 3344052 3585770 3949194 4007050 3510207 3775458
5116 3775458 3849365 3896545 3516188 3479811 3630916 3438393 2753940 2952422 3000444 3475010
$$ packed form
5188B612827J44048J94439m58712O82806L65908o04304O56573k04701O3010l42934
5178C108960j77879P9996K77329o48771M82633Q788k13309J41376m7860l443l50471
5167B657349l57993K53842M39488n38609j48087K05079K69419J60584N6109r342
5157B987839k73140m9345l19028j61496M93617l27383K73453O32049K23315j00697
5147C379184k69940q7681j49471j5815M62982j75247p9948J1761k72507K95761
5137C099079L93008P3226m0670n01507m0885k1842K19357L8736j5919J07432J53579
5126C463594J15956K9936m99333j97174M31073K41718L63424N7856m96843K65251
5116C775458P3907M7180l80357l6377J51105j92523o84453J98482M8022M74566
$$ plain form
5106 3475010 3922868 3906826 3780184 3835294 3736640 3207406 3571494 3520218 3388823 3112584
5096 3112584 3654960 4115308 4044718 4011185 3784663 3781009 3812196 3570593 3010083 3308177
5086 3308177 3655790 3736604 3719681 3802030 4060378 4325924 4344049 3981440 3549720 3035606
5076 3035606 3051938 3562082 3741130 3415755 3986224 4267043 3830429 3792774 3965807 3605683
5066 3605683 3668418 3756753 4217806 3735315 3674292 3644131 3886519 3926474 3905693 4131594 3715029
5055 3715029 3944109 3743506 3500850 3217171 3263762 4300262 4484802 4570003 4441870 4675936
5045 4675936 4967693 4899663 4678541 4877019 4662915 4879208 5275157 5591718 5712998 5446988
5035 5446988 5054704 5181171 5138237 5681808 5239679 4095944 4625230 4668251 4607696 4863402
$$ packed form
5106C475010M47858j6042j26642N5110r8654n29234L64088n1276j31395k76239
5096C112584N42376M60348p0590l3533k26522l654L1187k41603n60510K98094
5086C308177L47613Q0814j6923Q2349K58348K65546J8125l62609m31720n14114
5076C035606J6332N10144J79048l25375N70469K80819m36614l7655J73033l60124
5066C605683O2735Q8335M61053m82491o1023l0161K42388L9955k0781K25901m16565
5055C715029K29080k00603k42656k83679M6591J036500J84540Q5201j28133K34066
5045D675936K91757o8030k21122J98478k14104K16293L95949L16561J21280k66010
5035E446988l92284J26467m2934N43571m42129j143735N29286M3021o0555K55706
$$ plain form
5025 4863402 5203412 5285550 5404857 5417591 5379172 5442656 6213341 6668386 7151043 6999684
5015 6999684 7067317 6926139 6547684 6215281 5308181 5818159 5679988 5991069 6483166 6378575
5005 6378575 6513376 6191982 5867563 5884071 6180240 6511901 6935056 6403047 7247701 7317906
4995 7317906 7127609 7278050 7153044 8145061 9162765 9562535 9681892 9364735 9169587
4986 9169587 9213266 9289003 9197364 9438729 9891042 10411348 10222426 9792504 9900602 9852510
4976 9852510 9281502 9651925 10036414 10058189 10450262 10309028 10349135 10241137 10666361 11446512
4966 11446512 12280052 13227342 13851837 14533465 15248791 15595727 15995431 16547634 16687569
4957 16687569 17130055 17053676 16571956 16348956 16272665 16210965 15566614 14845424 14820762 15464598
$$ packed form
5025D863402L40010Q2138J19307J2734l8419O3484P70685M55045M82657j51359
5015F999684O7633j41178l78455l32403r07100N09978j38171L11081M92097j04591
5005F378575J34801l21394l24419J6508K96169L31661M23155n32009Q44654P0205
4995G317906j90297J50441j25006R92017J017704L99770J19357l17157j95148
4986I169587M3679P5737r1639K41365M52313N20306j88922m29922J08098m8092
4976I852510n71008L70423L84489K1775L92073j41234M0107j07998M25224P80151
4966A1446512Q33540R47290O24495O81628P15326L46936L99704N52203J39935
4957A6687569M42486p6379m81720k23000p6291o1700o44351p21190k4662O43836
$$ plain form
4947 15464598 15104282 15267971 16131830 16814366 17403986 17838527 18738151 19082199 19685492
4938 19685492 20734067 20624261 20792728 21319056 21959021 22448183 22207124 22758670 23204602
4929 23204602 24273141 24843250 25228323 25780632 26035811 25732956 25821957 26223572 26073785
4920 26073785 25318957 24696801 24665134 24478600 23523739 23080283 22838549 22625458 22826605 23029920
4910 23029920 23488989 23029227 23183365 23551229 23410077 21943763 21620931 21178352 20136272
4901 20136272 19069426 18482427 17596978 17172839 16257039 16296969 16555953 16844416 17342135
4892 17342135 17677163 17610503 17470188 17030661 15922724 15449332 14375363 14067047 14169572
4883 14169572 14358551 14045944 13575415 13192421 13465688 13322709 13155188 12961065 12621650
$$ packed form
4947A5464598l60316J63689Q63859O82536N89620M34541Q99624L44048O03293
4938A9685492J048575j09806J68467N26328O39965M89162k41059N51546M45932
4929B3204602J068539N70109L85073N52309K55179l02855Q9001M01615j49787
4920B6073785p54828o22156l1667j86534r54861m43456k41734k13091K01147K03315
4910B3029920M59069m59762J54138L67864j41152j466314l22832m42579j042080
4901B0136272j066846n86999q85449m24139r15800L9930K58984K88463M97719
4892A7342135L35028o6660j40315m39527j107937m73392j073969l08316J02525
4883A4169572J88979l12607m70529l82994K73267j42979j67521j94123l39415
$$ plain form
4874 12621650 11877328 11467879 11507429 11734481 11702219 11929590 11647602 11760657 11735365 11785455
4864 11785455 11922698 11658995 11373966 11397882 11764122 12731221 13056013 12943256 13324845 13523046
4854 13523046 14161883 14103947 13396079 13196425 13737294 13814233 13596840 13130803 13071054 13154711
4844 13154711 12868902 12520530 11973962 11783889 11199492 11196079 11435208 11334026 10960725 10415660
4834 10415660 10703182 10699096 10583025 10579765 11113924 10948926 11302509 11454632 11586665 12185055
4824 12185055 12506599 12883593 12998530 12466888 11954637 12127340 11814733 11475306 11585056
4815 11585056 11766597 11813033 11043327 10356981 10170838 10249975 10450462 10400607 9959558 9906755
4805 9906755 10206694 10490613 10570683 10778579 10939012 10447165 10184355 10063917 10478649 10338212
$$ packed form
4874A2621650p44322m09449L9550K27052l2262K27371k81988J13055k5292N0090
4864A1785455J37243k63703k85029K3916L66240R67099L24792j12757L81589J98201
4854A3523046O38837n7936p07868j99654N40869P6939k17393m66037n9749Q3657
4844A3154711k85809l48372n46568j90073n84397l413K39129j01182l73301n45065
4834A0415660K87522m086j16071l260N34159j64998L53583J52123J32033N98390
4824A2185055L21544L76994J14937n31642n12251J72703l12607l39427J09750
4815A1585056J81541M6436p69706o86346j86143P9137K00487m9855m41049n2803
4805I906755K99939K83919Q0070K07896J60433m91847k62810j20438M14732j40437
$$ plain form
4795 10338212 9746055 9567542 9343759 8924684 9714959 9862058 9805576 9871018 9633426 9430541
4785 9430541 9021400 8919531 8605352 9442379 9443998 9505957 9417851 9866722 10462630 10684047
4775 10684047 10621438 10236293 10783960 10829907 10001460 10159471 10065327 9897929 9068663 9242535
4765 9242535 9203271 9198031 9029039 8887201 8986380 8576644 8438117 8146363 8915157 8956973
4755 8956973 8832018 9045130 9183666 9225079 9449331 9325079 9480634 9660144 9731426 9521167
4745 9521167 9637309 9992870 9931209 9677915 9748008 9515429 9104143 8793345 8623764 8459484
4735 8459484 8925822 8842306 8915988 8990758 8962560 9146943 9026561 8850358 8982158 8565873
4725 8565873 8511683 8474471 8568479 9199167 9111274 9343056 9770400 9770221 9569087 9780546 10271326
$$ packed form
4795A0338212n92157j78513k23783m19075P90275J47099n6482O5442k37592k02885
4785I430541m09141j01869l14179Q37027J619O1959q8106M48871N95908K21417
4775A0684047o2609l85145N47667M5947q28447J58011r4144j67398q29266J73872
4765I242535l9264n240j68992j41838R9179m09736j38527k91754P68794M1816
4755H956973j24955K13112J38536M1413K24252j24252J55555J79510P1282k10259
4745I521167J16142L55561o1661k53294P0093k32579m11286l10798j69581j64280
4735H459484M66338q3516P3682P4770k8198J84383j20382j76203J31800m16285
4725H565873n4190l7212R4008O30688q7893K31782M27344j79k01134K11459M90780
$$ plain form
4714 10271326 10318711 9770132 9439206 9638759 9983475 10613674 10688366 10517607 10193058 10434263
4704 10434263 10928515 10757138 11150759 11306016 10748234 10979265 11369011 11770086 12854767
4695 12854767 13584646 13702484 14460776 14994190 15697664 16035510 16458828 16002130 15716650
4686 15716650 16331420 16151579 16416384 16477990 16625870 17074097 17317099 17397615 17534106 17671170
4676 17671170 17225261 16373394 15942266 16210874 16344321 16102379 16447275 17023048 17455117
4667 17455117 17804306 17931904 18518484 19227672 20066238 21379262 23004537 25783814 29854072
4658 29854072 35016315 40510045 43649358 44077885 43580294 41350291 37179980 32263742
4650 32263742 27804615 24390620 22160386 20290135 18718224 18431092 19007819 19369062 19746806
$$ packed form
4714A0271326M7385n48579l30926J99553L44716O30199P4692j70759l24549K41205
4704A0434263M94252j71377L93621J55257n57782K31031L89746M01075J084681
4695A2854767P29879J17838P58292N33414P03474L37846M23318m56698k85480
4686A5716650O14770j79841K64805O1606J47880M48227K43002Q0516J36491J37064
4676A7671170m45909q51867m31128K68608J33447k41942L44896N75773M32069
4667A7455117L49189J27598N86580P09188Q38566J313024J625275K779277M070258
4658B9854072N162243N493730L139313M28527m97591k230003m170311m916238
4650C2263742m459127l413995k230234j870251j571911k87132N76727L61243L77744
$$ plain form
4641 19746806 19553421 20607990 21878630 22439092 22855739 22329298 21759407 22395942 22638514
4632 22638514 23273042 24913386 27025467 28651564 30621510 32165832 32018192 30798173
4624 30798173 29454204 27775008 25470311 23491001 21839252 20065705 19024545 17844264
4616 17844264 16851763 17147565 16872837 17160925 17283020 17002158 17041725 17295921 17506305 17552882
4606 17552882 17620681 17425170 17252952 16983764 17288091 17080979 16406712 16334686 15909215 15613492
4596 15613492 15235769 15153233 14505314 14128534 13966977 13474948 13403234 14350423 14815423 14156141
4586 14156141 13937247 13485027 13598869 14124560 14187668 14296005 14254335 14435505 14986596 15353359
4576 15353359 15312807 15267377 14699043 13594933 13290753 13184761 13005578 12327355 11794209 11642109
$$ packed form
4641A9746806j93385J054569J270640N60462M16647n26441n69891O36535K42572
4632B2638514O34528J640344K112081J626097J969946J544322j47640j220019
4624C0798173j343969j679196k304697j979310j651749j773547j041160j180281
4616A7844264r92501K95802k74728K88088J22095k80862L9567K54196K10384M6577
4606A7552882O7799j95511j72218k69188L04327k07112o74267p2026m25471k95723
4596A5613492l77723q2536o47919l76780j61557m92029p1714R47189M65000o59282
4586A4156141k18894m52220J13842N25691O3108J08337m1670J81170N51091L66763
4576A5353359m0552m5430n68334j104110l04180j05992j79183o78223n33146j52100
$$ plain form
4566 11642109 10995430 10716411 10062821 9921314 10415596 10264406 9965745 9514918 9745647
4557 9745647 10020850 10022991 10054552 9809791 9477569 9926301 9937490 9787363 9830120 10067832
4547 10067832 9761970 9880022 9736185 9684957 9299830 9280601 9614378 9444427 9893693 10007949
4537 10007949 9988933 9752219 10074804 9672757 8752416 8323094 7891594 8518158 8721180 8686656
4527 8686656 9025810 8560801 8734759 8879424 8550634 8545598 8268876 7817556 8067135 8599188
4517 8599188 8664464 9073566 8814602 8184001 8186644 8232075 8622879 8563723 8210710 8149334 8525253
4506 8525253 8745015 8731619 8743556 8425040 8373112 8346328 8309443 8723637 8781855 9009953 9191544
4495 9191544 9217857 9170857 9395212 9996634 10436814 10204304 10729441 12121370 13401583 14071391
$$ packed form
4566A1642109o46679k79019o53590j41507M94282j51190k98661m50827K30729
4557I745647K75203K141L1561k44761l32222M48732J1189j50127M2757K37712
4547A0067832l05862J18052j43837n1228l85127j9229L33777j69951M49266J14256
4537A0007949j9016k36714L22585m02047r20341m29322m31500O26564K03022l4524
4527H686656L39154m65009J73958J44665l28790n036k76722m51320K49579N32053
4517H599188O5276M09102k58964o30601K643M5431L90804n9156l53013o1376L75919
4506H525253K19762j3396J1937l18516n1928k6784l6885M14194N8218K28098J81591
4495I191544K6313m7000K24355O01422M40180k32510N25137J391929J280213O69808
$$ plain form
4485 14071391 14468032 14675081 14123691 12934127 12587290 12293597 12407903 12731500 12819864
4476 12819864 12302239 12706777 13398665 13416993 13411921 14089140 13769567 13300274 12647956 12413755
4466 12413755 12307190 12428638 12500585 12312325 11756802 11881820 12267183 12877656 13626277 14049261
4456 14049261 15289571 16351085 16997262 18555070 21093855 24002686 28268107 32578310
4448 32578310 36615358 40643163 42425801 42542616 41608845 38720642 34875877 29879280
4440 29879280 25525262 22792695 20245297 18752457 17909447 16724995 15986201 15367749 15690049
4431 15690049 14915176 14701929 14701359 14415233 13975726 13439144 13608616 13364505 13117832 13050830
4421 13050830 12969020 12677453 12633712 12952971 13345826 13589759 13602937 13762037 13462889 13774871
$$ packed form
4485A4071391L96641K07049n51390j189564l46837k93693J14306L23597Q8364
4476A2819864n17625M04538O91888J8328n072O77219l19573m69293o52318k34201
4466A2413755j06565J21448P1947j88260n55523J25018L85363O10473P48621M22984
4456A4049261J240310J061514O46177J557808K538785K908831M265421M310203
4448C2578310M037048M027805J782638J16815r33771k888203l844765m996597
4440B9879280m354018k732567k547398j492840q43010j184452p38794o18452L22300
4431A5690049p74873k13247n70k86126m39507n36582J69472k44111k46673o7002
4421A3050830q1810k91567m3741L19259L92855K43933J3178J59100k99148L11982
$$ plain form
4411 13774871 13991082 14139276 13794621 14532110 14770690 14524573 14420158 14054781 13754617
4402 13754617 13673043 13571774 13537395 12962569 12740207 12269938 11804540 12088865 12077903 12040015
4392 12040015 12302441 12007342 11922350 11971902 12215865 12302538 12068068 11879771 12117811 11621217
4382 11621217 11520153 11737817 11814725 11810702 11696219 11280405 10951996 11378784 11832235 11911714
4372 11911714 11788463 11969086 11570850 12379919 12638543 13070957 13430748 14930260 16341813
4363 16341813 18017827 20855977 23560000 25953221 28286213 28776318 28984253 29375730 27732496
4354 27732496 26248877 24233733 22207554 19462747 18060317 16320263 14967639 14402641
4346 14402641 13596040 12783255 12274775 12283788 11959557 11507809 11960074 11661342 11279869 11492113
$$ packed form
4411A3774871K16211J48194l44655P37489K38580k46117j04415l65377l00164
4402A3754617q1574j01269l4379n74826k22362m70269m65398K84325j0962l7888
4392A2040015K62426k95099q4992M9552K43963Q6673k34470j88297K38040m96594
4382A1621217j01064K17664P6908m023j14483m15814l28409M26788M53451P9479
4372A1911714j23251J80623l98236Q09069K58624M32414L59791J499512J411553
4363A6341813J676014K838150K704023K393221K332992M90105K07935L91477j643234
4354B7732496j483619k015144k026179k744807j402430j740054j352624n64998
4346A4402641q06601q12785n08480R013l24231m51748M52265k98732l81473K12244
$$ plain form
4336 11492113 11472735 11456279 11364183 10901432 10784942 11032388 10905192 11255241 10923911 10517155
4326 10517155 10635234 10754148 10631568 10470115 10007238 10460290 10656311 11321624 11252789 12017215
4316 12017215 12334346 12880351 13086683 14091412 14671861 14538201 13855983 13085949 12029385
4307 12029385 11128194 10201447 9917312 9682239 9792511 10357958 9898235 10074974 10181808
4298 10181808 10477900 10629746 10671368 10846588 10965850 10943532 11704464 11628326 11931362 11479470
4288 11479470 11378004 10917667 9526226 8970156 8901957 8372371 8008617 8113142 7466040
4279 7466040 7186455 7385401 7133714 7166904 6284544 5584450 6403305 6075224 5930480 5868137
4269 5868137 5618701 5534365 5186016 5625229 5330179 4706032 4858429 4877966 5168175 4573488
$$ packed form
4336A1492113j9378j6456r2096m62751j16490K47446j27196L50049l31330m06756
4326A0517155J18079J18914j22580j61453m62877M53052J96021O65313o8835P64426
4316A2017215L17131N46005K06332J004729N80449j33660o82218p70034j056564
4307A2029385r01191r26747k84135k35073J10272N65447m59723J76739J06834
4298A0181808K96092J51846M1622J75220J19262k2318P60932p6138L03036m51892
4288A1479470j01466m60337j391441n56070o8199n29586l63754J04525o47102
4279G466040k79585J98946k51687L3190q82360p00094Q18855l28081j44744o2343
4269E868137k49436q4336l48349M39213k95050o24147J52397J9537K90209n94687
$$ plain form
4259 4573488 4953762 5387889 5146995 4771424 5237779 5198683 4896714 5001747 4797880 4704175
4249 4704175 4638199 4353868 4522555 4115821 4045774 4671963 4550914 4829657 5042627 5112449
4239 5112449 5053031 5628881 5469344 5425995 5530209 4895790 4007232 4085590 4087235 3662025
4229 3662025 3697178 3546785 4261724 4303174 4462880 4807135 4796008 5184085 4671950 4633831
4219 4633831 4210629 3524427 3875329 4100091 3860737 3924656 3386436 3919850 3815831 3746589
4209 3746589 3319030 3104638 3169642 3562310 3604204 3543978 3769979 4006939 3679055 3607514
4199 3607514 3860060 3898088 3860800 4308810 4485451 4368498 4210524 3638404 3831016 3621790
4189 3621790 3185620 2265708 2059884 2777594 3069568 3097806 3492749 3658879 3562479 3162373
$$ packed form
4259D573488L80274M34127k40894l75571M66355l9096l01969J05033k03867r3705
4249D704175o5976k84331J68687m06734p0047O26189j21049K78743K12970O9822
4239E112449n9418N75850j59537m3349J04214o34419q88558P8358J645m25210
4229C662025L5153j50393P14939M1450J59706L44255j1127L88077n12135l8119
4219D633831m23202o86202L50902K24762k39354O3919n38220N33414j04019o9242
4209C746589m27559k14392O5004L92668M1894o0226K26001K36960l27884p1541
4199C607514K52546L8028l7288M48010J76641j16953j57974n72120J92612k09226
4189C621790m36170r19912k05824P17710K91974K8238L94943J66130r6400m00106
$$ plain form
4179 3162373 3030421 3450576 3507423 3242483 3758623 3545183 2886206 2760602 2987676 2842208
4169 2842208 2582362 2453832 2722097 2966073 2551119 2811835 2570522 1822262 1417576 1850729
4159 1850729 2516994 2876697 2826171 2803680 2992485 2751656 2854706 2830753 2395564 2721368
4149 2721368 2966182 2612009 2692216 2963063 2739853 2873666 2496498 2356372 3199829 3134450
4139 3134450 3570789 3317752 2975389 3461536 3426132 2634779 2780448 2198549 2498291 2954650
4129 2954650 2542021 2209201 2294895 2301370 2623429 2898601 2594068 2951903 2734644 2331084
4119 2331084 2376919 2385688 2169951 2361837 2647958 2358169 1754204 2007393 2112206 2003191
4109 2003191 2431009 2361115 2653887 2479188 2500995 3055331 2506999 2056184 2578072 2954481
$$ packed form
4179C162373j31952M20155N6847k64940N16140k13440o58977j25604K27074j45468
4169B842208k59846j28530K68265K43976m14954K60716k41313p48260m04686M33153
4159A850729O66265L59703n0526k2491J88805k40829J03050k3953m35189L25804
4149B721368K44814l54173Q0207K70847k23210J33813l77168j40126Q43457o5379
4139C134450M36339k53037l42363M86147l5404p91353J45669n81899K99742M56359
4129B954650m12629l32820Q5694O475L22059K75172l04533L57835k17259m03560
4119B331084M5835Q769k15737J91886K86121k89789o03965K53189J04813j09015
4109B003191M27818o9894K92772j74699K1807N54336n48332m50815N21888L76409
$$ plain form
4099 2954481 2443702 2522748 2532502 2293556 2281127 2257497 2311005 2276701 2165999 2524387 2391844
4088 2391844 2515037 2230646 2230932 2121093 1581847 1782451 2076718 2265392 1898976 2053224
4078 2053224 2721027 2230691 2842525 2985085 2722866 3361907 3433894 3351693 3007475 2898550
4068 2898550 2959465 2982581 2362874 3010980 3045274 3189004 3713606 3297156 3084119 3013874
4058 3013874 3185401 2859193 2985999 2863084 2746545 2969310 2835650 2821010 2918178 2856615
4048 2856615 2826490 2675875 2590879 2554849 2580540 3165952 2932719 2891019 2840405 2303514 2869684
4037 2869684 2835115 2223979 2229150 2281109 2340656 2891926 2857442 2717084 2958877 2792306 2963717
4026 2963717 2892538 2305723 2360586 2595629 2667731 2706036 3092507 2941822 2961755 3488802
$$ packed form
4099B954481n10779P9046R754k38946j2429k3630N3508l4304j10702L58388j32543
4088B391844J23193k84391K86j09839n39246K00604K94267J88674l66416J54248
4078B053224O67803m90336O11834J42560k62219O39041P1987q2201l44218j08925
4068B898550O0915K3116o19707O48106L4294J43730N24602m16450k13037p0245
4058C013874J71527l26208J26806j22915j16539K22765j33660j4640R7168o1563
4048B856615l0125j50615q4996l6030K5691N85412k33233m1700n0614n36891N66170
4037B869684l4569o11136N171N1959N9547N51270l4484j40358K41793j66571J71411
4026B963717p1179n86815N4863K35043P2102L8305L86471j50685J9933N27047
$$ plain form
4016 3488802 3753229 3498974 2993202 3270106 3233284 3240589 2822353 2684581 2377626 2415776
4006 2415776 2440977 2442614 2465786 3010269 3345993 3143989 3146097 2929126 2798765 2669812 2994252
3995 2994252 2907952 3149075 3322219 2993463 2783969 2666994 2800352 3183800 3150644 3288235
3985 3288235 3243401 3639555 3710393 3579730 3874257 3783166 3637069 3761492 3719167 3380597
3975 3380597 3508991 3736296 3434067 3068879 3728558 4028180 3867864 3882577 4209627 4103220
3965 4103220 3926628 3642419 3760501 4251718 4283075 4013677 4394769 4012487 4130347 4098198
3955 4098198 3856084 3589255 4346788 4214569 4132730 4403635 4201316 4279219 4294957 4390782
3945 4390782 4491016 4461808 3986476 4521301 4016210 4430478 4784591 5168908 4878683 4395056
$$ packed form
4016C488802K64427k54255n05772K76904l6822P305m18236j37772l06955L8150
4006B415776K5201J637K3172N44483L35724k02004K108k16971j30361j28953L24440
3995B994252q6300K41123J73144l28756k09494j16975J33358L83448l3156J37591
3985C288235m4834L96154P0838j30663K94527r1091j46097J24423m2325l38570
3975C380597J28394K27305l02229l65188O59679K99622j60316J4713L27050j06407
3965D103220j76592k84209J18082M91217L1357k69398L81092l82282J17860l2149
3955D098198k42114k66829P57533j32219q1839K70905k02319P7903J5738R5825
3945D390782J00234k9208m75332N34825n05091M14268L54113L84317k90225m83627
$$ plain form
3935 4395056 4283920 4637228 4740226 5357293 5292043 5154401 4907376 4796657 5265555 5112995
3925 5112995 5201581 5328252 5361149 5289765 4779096 5507340 5964980 6218171 6701122 5877387
3915 5877387 5195444 5698501 5511257 5307623 5245047 5602319 6294237 5822205 5732651 5644007
3905 5644007 5910742 6484144 6347815 5980267 6248311 6515098 6431493 6148810 6095638 6689097
3895 6689097 6688429 6386461 6704099 6764592 7033858 7243646 6516480 6406223 6695946 6984624
3885 6984624 7187381 7428709 7297602 7210502 7770985 7731028 7450209 8086149 8051121 7496887
3875 7496887 8173609 8468001 8908609 8275133 7725135 8048363 8441057 8117537 8599590 8489694
3865 8489694 8364309 8867463 8911049 9072070 8900995 8729189 9476961 9744634 9625318 9647315
$$ packed form
3935D395056j11136L53308J02998O17067o5250j37642k47025j10719M68898j52560
3925E112995Q8586J26671L2897p1384n10669P28244M57640K53191M82951q23735
3915E877387o81943N03057j87244k03634o2576L57272O91918m72032q9554q8644
3905E644007K66735N73402j36329l67548K68044K66787q3605k82683n3172N93459
3895F689097o68l01968L17638O0493K69266K09788p27166j10257K89723K88678
3885F984624K02757K41328j31107q7100N60483l9957k80819O35940l5028n54234
3875G496887O76722K94392M40608o33476n49998L23228L92694l23520M82053j09896
3865H489694j25385N03154M3586J61021j71075j71806P47772K67673j19316K1997
$$ plain form
3855 9647315 9504286 9679770 9602787 9052372 9317687 9656506 8981358 9069254 9046891 9014943
3845 9014943 9243345 9097174 9358217 9119345 8899847 9400790 9272198 8967834 9183018 9663189
3835 9663189 9776793 9559932 9299763 9494506 9197563 9348900 9896976 9873376 9955166 9978801
3825 9978801 9378453 9386131 9686896 9164575 9070436 9242007 8724017 8761478 8680485 8860652
3815 8860652 9274274 9203154 8888380 8616534 8097953 8753975 8905797 8909294 9374934 8955155
3805 8955155 8801168 8554529 8096120 7978163 8472164 7886245 8118156 8253304 7752415 7451596
3795 7451596 7411096 7219020 7069932 6698328 7425368 7642173 7204334 6809147 6411456 6488140
3785 6488140 6525046 6639807 6777433 6434657 6011115 6276791 6463110 6200231 5883146 6197534
$$ packed form
3855I647315j43029J75484p6983n50415K65315L38819o75148Q7896k2363l1948
3845I014943K28402j46171K61043k38872k19498N00943j28592l04364K15184M80171
3835I663189J13604k16861k60169J94743k96943J51337N48076k3600Q1790K3635
3825I978801o00348P678L00765n22321r4139J71571n17990L7461q0993J80167
3815H860652M13622p1120l14774k71846n18581O56022J51822L497M65640m19779
3805H955155j53987k46639m58409j17957M94001n85919K31911J35148n00889l00819
3795G451596m0500j92076j49088l71604P27040K16805m37839l95187l97691P6684
3785F488140L6906J14761J37626l42776m23542K65676J86319k62879l17085L14388
$$ plain form
3775 6197534 6475496 6143972 6287166 5665809 5617653 5889269 5689465 6025784 6044058 5864798
3765 5864798 5493813 6068968 6017673 5432308 5167874 4888947 4888902 5374761 5770339 5584345
3755 5584345 5030836 4511119 4145116 4543586 4448559 4405349 4520207 4579763 4240002 3677704
3745 3677704 4182027 4440246 4556310 4139980 4028710 4037402 4475647 4750425 4169818 4427466
3735 4427466 4640124 4939047 3902665 3556285 4036082 4557458 4795716 3850428 3556789
3726 3556789 3773187 4101558 4069559 3750218 3904228 3830084 3710935 3663678 3222820 3080387
3716 3080387 2956232 3356170 4299308 4312248 3620205 3705236 3528360 3453774 3287722 3248824
3706 3248824 3771109 3486935 3567101 3700625 3419590 3382493 3140236 3288447 3745148 3375398
$$ packed form
3775F197534K77962l31524J43194o21357m8156K71616j99804L36319J8274j79260
3765E864798l70985N75155n1295n85365k64434k78927m5M85859L95578j85994
3755E584345n53509n19717l66003L98470r5027m3210J14858N9556l39761n62298
3745C677704N04323K58219J16064m16330j11270Q692M38245K74778n80607K57648
3735D427466K12658K98923j036382l46380M79797N21376K38258r45288k93639
3726C556789K16398L28371l1999l19341J54010p4144j19149m7257m40858j42433
3716C080387j24155L99938R43138J2940o92043Q5031j76876p4586j66052l8898
3706C248824N22285k84174Q0166J33524k81035l7097k42257J48211M56701l69750
$$ plain form
3696 3375398 3121705 3580906 3706583 3127436 2668073 2741881 3013845 2969326 3139172 3158065
3686 3158065 2961153 3562158 3275561 2713191 2293377 2566640 2938316 2720618 3265786 2706740
3676 2706740 2513997 3187168 2970266 2518149 2655793 2306703 2447143 2912273 2787335 2666114
3666 2666114 2875270 3040364 3073795 3257203 3242749 3143492 3059339 2876311 2757529 2659873
3656 2659873 2912675 3192113 3330772 2781706 2507080 2529521 2518157 2599446 3024388 3206178
3646 3206178 2672778 2335150 2086081 2322966 1892848 2213515 3094134 3538404 3541181 3350205
3636 3350205 2848223 2637192 2491781 1933165 2069198 2508608 2477079 2913516 2706380 2758976
3626 2758976 3190638 3406384 3428916 2951483 2995449 2934348 3057291 2889062 2658486 2852898
$$ packed form
3696C375398k53693M59201J25677n79147m59363P3808K71964m4519J69846J8893
3686C158065j96912O01005k86597n62370m19814K73263L71676k17698N45168n59046
3676B706740j92743O73171k16902m52117J37644l49090J40440M65130j24938j21221
3666B666114K09156J65094L3431J83408j4454r9257q4153j83028j18782r7656
3656B659873K52802K79438J38659n49066k74626K2441j1364Q1289M24942J81790
3646C206178n33400l37628k49069K36885m30118L20667Q80619M44270K777j90976
3636C350205n01982k11031j45411n58616J36033M39410l1529M36437k07136N2596
3626B758976M31662K15746K2532m77433M3966o1101J22943j68229k30576J94412
$$ plain form
3616 2852898 2871496 3111035 3254037 2724731 2745618 2925835 2427815 2437151 2827709 2555372
3606 2555372 2749607 2637479 3000974 2188108 2641435 2701035 2813035 3400849 3063467 2709881
3596 2709881 2675733 2792951 2800456 2779601 2970639 2530087 2526233 3154940 2774129 3073731 3150854
3585 3150854 3292068 2847719 3374326 3443659 3267880 2991466 2754547 2810187 3148081 3508950
3575 3508950 3722842 3667393 3167111 3308888 3881039 3942029 3329480 3034412 3080092 2676795
3565 2676795 2689294 2975351 3819236 3759395 3492123 2927023 2972640 3389601 3559716 3928730
3555 3928730 3570689 3428685 3359349 3442939 3132099 3281030 3551730 3673606 4173698 4092828
3545 4092828 3667922 3636533 4006022 3616325 3295865 2315552 3011571 3464812 3541359 3466808
$$ packed form
3616B852898J8598K39539J43002n29306K0887J80217m98020R336L90558k72337
3606B555372J94235j12128L63495q12866M53327N9600J12000N87814l37382l53586
3596B709881l4148J17218P505k0855J91038m40552l854O28707l80811K99602P7123
3585C150854J41214m44349N26607O9333j75779k76414k36919N5640L37894L60869
3575C508950K13892n5449n00282J41777N72151O0990o12549k95068M5680m03297
3565B676795J2499K86057Q43885n9841k67272n65100M5617M16961J70115L69014
3555C928730l58041j42004o9336Q3590l10840J48931K70700J21876N00092q0870
3545D092828m24906l1389L69489l89697l20460r80313O96019M53241P6547p4551
$$ plain form
3535 3466808 3918677 4349250 3574554 3588323 3463148 3927891 4144231 4425527 3934720 3410745
3525 3410745 3850506 4028014 3935401 3785627 4101970 4572705 4598914 4059546 4393150 4639339
3515 4639339 4532633 4568084 4968518 5184877 5185882 5235902 5467080 5320268 5063412 5198858
3505 5198858 5315135 5435529 5861814 5698582 5640280 5784025 6203032 6158455 6456263 6676141
3495 6676141 7184945 7464537 7063107 7573714 8250476 8733890 8421800 8733342 8787306 9137935
3485 9137935 8782636 9200972 9312795 10030008 10750370 11456707 12264976 12342251 13680366 15634511
3475 15634511 16183826 16648488 17998226 20150511 22050190 23165390 23342218 23722699 23188644
3466 23188644 22377847 21696319 21283858 20649999 21120571 21802750 22312489 23249831 25657082
$$ packed form
3535C466808M51869M30573p74696J3769j25175M64743K16340K81296m90807n23975
3525C410745M39761J77508r2613j49774L16343M70735K6209n39368L33604K46189
3515D639339j06706L5451M00434K16359J005N0020K31178j46812k56856J35446
3505E198858J16277J20394M26285j63232n8302J43745M19007m4577K97808K19878
3495F676141N08804K79592m01430N10607O76762M83414l12090L11542N3964L50629
3485I137935l55299M18336J11823P17213P20362P06337Q08269P7275J338115J954145
3475A5634511N49315M64662J349738K152285J899679J115200J76828L80481n34055
3466B3188644q10797o81528m12461o33859M70572O82179N09739R37342K407251
$$ plain form
3457 25657082 29957435 36168236 45335230 53387229 57767443 60867270 62631883 63491325
3449 63491325 61161223 56482637 52194001 48092423 44225234 40806653 38254294 36100395
3441 36100395 33611547 31624699 29696569 28211074 26783102 25801242 25057445 24806222 25487717
3432 25487717 25262430 26328602 28425984 32629036 39984735 48467363 54563741 57841890
3424 57841890 59524455 60359295 60303396 56676188 51827957 47089527 42026558 36643720 30882953
3415 30882953 25919266 22200716 20040189 17825388 15856788 14445636 14077930 13297475
3407 13297475 12318196 11862883 11132761 10810015 10594454 9886244 9370779 8792687 8840769 8662346
3397 8662346 7873251 7439327 7603134 7331395 7523452 7826948 7119941 6963177 7141324 6629294
$$ packed form
3457B5657082M300353O210801R166994Q051999M380214L099827J764613Q59442
3449F3491325k330102m678586m288636m101578l867189l418581k552359k153899
3441C6100395k488848j986848j928130j485495j427972r81860p43797k51223O81495
3432B5487717k25287J066172K097382M203052P355699Q482628O096378L278149
3424E7841890J682565Q34840n5899l627208m848231m738430n062969n382838n760767
3415C0882953m963687l718550k160527k214801j968600j411152l67706p80455
3407A3297475r79279m55313p30122l22746k15561p08210n15465n78092M8082j78423
3397H662346p89095m33924J63807k71739J92057L03496p07007j56764J78147n12030
$$ plain form
3387 6629294 6916363 6853299 6623554 6007098 5782925 5976246 6414517 6527485 6729105 6697741
3377 6697741 6117505 5991692 6086421 5904176 6293401 6503785 5453025 5062889 4887594 5295061
3367 5295061 5942660 6272080 6258975 5910733 5970295 5913843 5627763 5216753 5214464 4955321
3357 4955321 4772385 4633384 4992492 4860890 4739887 4737061 4453697 4104122 4066740 3998807
3347 3998807 3713462 3424661 3817344 3863731 3947824 3263961 3193752 3792382 4376889 4475452
3337 4475452 4371753 4915549 4788538 4309304 4416622 4411699 4519015 4812943 4928997 5164350
3327 5164350 4894580 4791547 5067265 4893377 4163636 3638455 3280460 3213391 3624566 3711098
3317 3711098 3375656 3248563 3307942 3694484 3439137 3365790 3546992 3589235 3359481 3923955
$$ packed form
3387F629294K87069o3064k29745o16456k24173J93321M38271J12968K01620l1364
3377F697741n80236j25813R4729j82245L89225K10384j050760l90136j75295M07467
3367E295061O47599L29420j3105l48242N9562n6452k86080m11010k289k59143
3357D955321j82936j39001L59108j31602j21003k826k83364l49575l7382o7933
3347C998807k85345k88801L92683M6387Q4093o83863p0209N98630N84507R8563
3337D475452j03699N43796j27011m79234J07318m923J07316K93928J16054K35353
3327E164350k69770j03033K75718j73888p29741n25181l57995o7069M11175Q6532
3317C711098l35442j27093N9379L86542k55347p3347J81202M2243k29754N64474
$$ plain form
3307 3923955 3845626 3945475 4390442 3850931 3815433 3701851 3145565 3330076 3122189 3071963
3297 3071963 3256495 3074861 2584879 3190908 3771035 3586120 3027483 2994459 2978728 3125634
3287 3125634 2667347 2478203 2733465 3179876 2902604 3312765 2772349 2252167 2644558 2505313
3277 2505313 2205704 2268307 2231776 2290378 2034589 2284675 1604291 712806 1479978 2223378
3267 2223378 2454616 2772031 3120670 2966586 3264473 2615738 2361889 1654801 1579890 1281450
3257 1281450 1437731 1681443 1561234 1783029 1318426 960057 1730158 2291236 2562599 2234089
3247 2234089 1673381 1808151 1784829 1552444 1634849 1518516 1592572 1707113 1861368 2000820
3237 2000820 1569845 1872793 2025882 1875332 1871447 1734641 1852559 1598291 1739712 1993479
$$ packed form
3307C923955p8329R9849M44967n39511l5498j13582n56286J84511k07887n0226
3297C071963J84532j81634m89982O06029N80127j84915n58637l3024j5731J46906
3287C125634m58287j89144K55262M46411k77272M10161n40416n20182L92391j39245
3277B505313k99609O2603l6531N8602k55789K50086o80384q91485P67172P43400
3267B223378K31238L17415L48639j54084K97887o48735k53849p07088p4911k98440
3257A281450J56281K43712j20209K21795m64603l58369P70101N61078K71363l28510
3247B234089n60708J34770k3322k32385Q2405j16333P4056J14541J54255J39452
3237B000820m30975L02948J53089j50550l885j36806J17918k54268J41421K53767
$$ plain form
3227 1993479 1612027 1438384 1145793 1851433 2281951 1792491 1830990 1801260 1659229 1425331
3217 1425331 1254791 1606627 1911160 1722609 1803159 1443302 1200392 1543514 1520403 1383283
3207 1383283 1444136 2149528 2114817 1746958 1223399 1513843 902951 1479998 1810731 2041980
3197 2041980 1720257 1452046 1655655 1485340 1221176 1161464 1236797 1366827 1576662 1278128
3187 1278128 1595539 1409026 1334054 1227433 1768138 1386800 1523953 1697372 1289751 1496980
3177 1496980 1219311 1561942 1833603 1782195 1917405 1741632 1839799 1745702 1544488 1250113
3167 1250113 1751161 1813684 1844527 1858047 1933123 1843743 2086470 1399310 1323648 1886017 2138595
3156 2138595 1696359 1839860 2202701 2250443 2157318 1824104 1628124 1530287 1272493 2238899
$$ packed form
3227A993479l81452j73643k92591P05640M30518m89460L8499k9730j42031k33898
3217A425331j70540L51836L04533j88551Q0550l59857k42910L43122k3111j37120
3207A383283O0853P05392l4711l67859n23559K90444o10892N77047L30733K31249
3197B041980l21723k68211K03609j70315k64164n9712P5333J30030K09835k98534
3187A278128L17411j86513p4972j06621N40705l81338J37153J73419m07621K07229
3177A496980k77669L42631K71661n1408J35210j75773R8167r4097k01214k94375
3167A250113N01048O2523L0843J3520P5076q9380K42727o87160p5662N62369K52578
3156B138595m42236J43501L62841M7742r3125l33214j95980r7837k57794R66406
$$ plain form
3146 2238899 2329020 2057200 2064343 1945490 1167695 829097 1196747 1681051 2170892 2014527
3136 2014527 2484121 2156630 1846532 1821979 2695366 2553531 1707692 1754639 1887988 1693150
3126 1693150 1982950 2007527 1574365 1541380 2079214 1831033 1555296 1331740 1584464 1740588
3116 1740588 1244702 1339409 1379370 1911968 2487161 2063905 1887902 2388931 2098317 2165030
3106 2165030 2177956 2178016 2709451 1930851 2149184 2374879 2058732 2407116 2308061 1886563 1704680
3095 1704680 1451072 1327359 1482259 1945620 2202926 2361885 2540899 2507139 2385703 2184129
3085 2184129 2318956 2135084 2299716 2365578 2369434 1458202 1929545 2328406 2380822 2032537
3075 2032537 1447355 1443650 1119251 1268560 1546280 1619103 2040765 1528217 1164526 1107270
$$ packed form
3146B238899R0121k71820P143j18853p77795l38598L67650M84304M89841j56365
3136B014527M69594l27491l10098k4553Q73387j41835q45839M6947J33349j94838
3126A693150K89800K4577m33162l2985N37834k48181k75737k23556K52724J56124
3116A740588m95886R4707L9961N32598N75193m23256j76003N01029k90614O6713
3106B165030J2926O0N31435p78600K18333K25695l16147L48384r9055m21498j81883
3095A704680k53608j23713J54900M63361K57306J58959J79014l3760j21436k01574
3085B184129J34827j83872J64632O5862L856r11232M71343L98861N2416l48285
3075B032537n85182l705l24399J49309K77720P2823M21662n12548l63691n7256
$$ plain form
3065 1107270 996569 1402338 961044 711793 1265473 1966228 1731877 956752 1065527 1125342
3055 1125342 883953 1540405 1113356 967817 789609 895942 593360 780496 822515 986132
3045 986132 553269 596155 720502 508198 688974 981148 727870 1121205 774771 1062274
3035 1062274 756817 443502 1316345 1494705 1366847 841146 1117303 1329899 934572 653742
3025 653742 875238 1147230 825332 1127675 1006462 790540 830062 1159386 1615562 1571880
3015 1571880 1266397 868350 682426 434776 984897 1493399 1176318 964624 1355700 1257244
3005 1257244 1103902 807444 1220939 619258 120132 389511 1078932 1629138 2018109 1689559
2995 1689559 985169 523907 360487 535943 677955 1062941 1047087 373062 668856 548923
$$ packed form
3065A107270j10701M05769m41294k49251N53680P00755k34351p75125J08775N9815
3055A125342k41389O56452m27049j45539j78208J06333l02582J87136M2019J63617
3045I86132m32863M2886J24347k12304J80776K92174k53278L93335l46434K87503
3035A062274l05457l13315Q72843J78360j27858n25701K76157K12596l95327k80830
3025F53742K21496K71992l21898L02343j21213k15922L9522L29324M56176m3682
3015A571880l05483l98047j85924k47650N50121N08502l17081k11694L91076r8456
3005A257244j53342k96458M13495o01681m99126K69379O89421N50206L88971l28550
2995A689559p04390m61262j63420J75456J42012L84986j5854o74025K95794j19933
$$ plain form
2985 548923 800554 636948 414376 454334 204936 895281 1045934 662727 743223 724232
2975 724232 665853 851787 902163 395512 181330 99577 457470 290941 203600 -240353
2965 -240353 240129 800927 951985 609801 808802 1362087 1358916 1030437 401859 474475
2955 474475 787506 1186478 1515488 1337220 603883 649827 401754 940587 460610 639451
2945 639451 1146590 1074909 876811 966444 388239 69887 -129041 -153117 362583 585096
2935 585096 825774 773176 566006 599415 689986 649833 867968 1005208 994486 634463 620248
2924 620248 1213282 1185142 1196173 1236088 723219 356301 529146 487338 435090 117336 241634
2913 241634 362528 506401 604279 983159 1145946 658404 880896 569473 101479 529273
$$ packed form
2985E48923K51631j63606k22572L9958k49398O90345J50653l83207Q0496j8991
2975G24232n8379J85934N0376n06651k14182q1753L57893j66529q7341m43953
2965b40353M80482N60798J51058l42184J99001N53285l171l28479o28578P2616
2955D74475L13031L98972L29010j78268p33337M5944k48073N38833m79977J78841
2945F39451N07139p1681j98098Q9633n78205l18352j98928k4076N15700K22513
2935E85096K40678n2598k07170L3409R0571m0153K18135J37240j0722l60023j4215
2924F20248N93034k8140J1031L9915n12869l66918J72845m1808n2248l17754J24298
2913B41634J20894J43873R7878L78880J62787m87542K22492l11423m67994M27794
$$ plain form
2903 529273 581145 528647 673325 1015568 445276 16347 288744 520534 438788 786065
2893 786065 1473459 1204541 708965 957087 1154954 1020164 858326 289802 230288 232804
2883 232804 333410 390678 418728 233809 393369 365209 905870 283345 723386 1233515
2873 1233515 1172522 973152 807172 884411 854697 1022868 534878 222701 628796 397482
2863 397482 309727 648397 1021949 1272827 1332191 1465445 1358791 703970 1045821 1263834
2853 1263834 1610160 1199409 1062065 1066338 1358436 1063112 647256 471232 598215 -149418
2843 -149418 -1828 415190 253309 367879 316276 203595 226742 660432 614709 1061335
2833 1061335 901785 920633 509132 346590 240751 874303 1027407 1241518 944807 774242
$$ packed form
2903E29273N1872n2498J44678L42243n70292m28929K72397K31790q1746L47277
2893G86065O87394k68918m95576K48122J97867j34790j61838n68524n9514K516
2883B32804J00606N7268K8050j84919J59560k8160N40661o22525M40041N10129
2873A233515o0993j99370j65980P7239k9714J68171m87990l12177M06095k31314
2863C97482q7755L38670L73552K50878N9364J33254j06654o54821L41851K18013
2853A263834L46326m10751j37344M273K92098k95324m15856j76024J26983p47633
2843a49418J47590M17018j61881J14570n1603j12681K3147M33690m5723M46626
2833A061335j59550J8848m11501j62542j05839O33552J53104K14111k96711j70565
$$ plain form
2823 774242 1197103 934569 495068 713284 367718 627191 657479 707036 789462 875953
2813 875953 993004 641369 983744 1094229 639777 983681 957083 551262 184692 681319
2803 681319 326346 526903 503591 702038 470707 115163 340176 760241 1111587 636841
2793 636841 606654 726580 762105 704837 803504 802660 405383 129682 681377 1239330 1368711
2782 1368711 1221017 686337 586102 798955 511612 786277 1235642 1005852 941969 946301
2772 946301 981516 1394847 934597 730512 580994 575808 878176 870286 686422 521606 909555
2761 909555 881551 999306 511183 352532 82540 264460 346532 178251 406602 71514
2751 71514 244530 14261 -164896 26515 259654 400094 493107 903007 1036224 975931
$$ packed form
2823G74242M22861k62534m39501K18216l45566K59473L0288M9557Q2426Q6491
2813H75953J17051l51635L42375J10485m54452L43904k6598m05821l66570M96627
2803F81319l54973K00557k3312J98447k31331l55544K25013M20065L51346m74746
2793F36841l0187J19926L5525n7268R8667q44l97277k75701N51695N57953J29381
2782A368711j47694n34680j00235K12853k87343K74665M49365k29790o3883M332
2772I46301L5215M13331m60250k04085j49518n186L02368p890j83864j64816L87949
2761I09555k8004J17755m88123j58651k69992J81920Q2072j68281K28351l35088
2751G1514J73016k30269j79157J91411K33139J40440R3013M09900J33217o0293
$$ plain form
2741 975931 982266 918855 399127 67277 516224 609861 381079 350880 705634 482951 714578
2730 714578 615776 365728 251092 595444 434006 409068 64724 368982 1054686 1057907
2720 1057907 613029 651981 960295 1116638 1000222 257130 130250 473060 129900 92762
2710 92762 1244509 1106061 744998 811507 882271 464531 257162 325265 631084 739062
2700 739062 929769 809612 739560 1105536 946824 1279475 1639878 907778 648829 463903
2690 463903 319784 757315 852258 840153 805654 641281 397241 540193 169742 416650
2680 416650 992179 668447 155728 187786 445247 1277314 1334070 1273569 343124 180285
2670 180285 395808 686018 634650 657597 998521 1336356 474501 226095 525123 567699
$$ packed form
2741I75931O335o3411n19728l31850M48947R3637k28782l0199L54754k22683K31627
2730G14578r8802k50048j14636L44352j61438k4938l44344L04258O85704L221
2720A057907m44878L8952L08314J56343j16416p43092j26880L42810l43160l7138
2710I2762J151747j38448l61063O6509P0764m17740k07369O8103L05819J07978
2700G39062J90707j20157p0052L65976j58712L32651L60403p32100k58949j84926
2690D63903j44119M37531R4943j2105l4499j64373k44040J42952l70451K46908
2680D16650N75529l23732n12719L2058K57461Q32067N6756o0501r30445j62839
2670A80285K15523K90210n1368K2947L40924L37835q61855k48406K99028M2576
$$ plain form
2660 567699 1192916 911374 355350 353892 671825 452781 590317 555775 623031 760391
2650 760391 427507 665760 1116555 707343 802232 184802 174945 481336 878030 833379
2640 833379 820807 934652 1183345 1001715 650035 636334 305840 465077 780408 842458
2630 842458 766394 573598 630052 1058071 1033731 667066 187070 344438 644391 939474
2620 939474 1017298 823257 881987 1288424 601094 334608 731095 1135818 690018 333098
2610 333098 561135 766519 1129994 1012849 1310889 1616332 1866261 2245492 2773445 2846816
2600 2846816 2641114 2298627 2494944 2037224 1591643 1347256 1241938 1087684 994220 960920
2590 960920 741522 507596 138342 -297279 39967 259521 -58787 219507 720979 255611
$$ packed form
2660E67699O25217k81542n56024j458L17933k19044J37536l4542O7256J37360
2650G60391l32884K38253M50795m09212R4889o17430r857L06391L96694m4651
2640H33379j2572J13845K48693j81630l51680j3701l30494J59237L15331O2050
2630H42458p6064j92796N6454M28019k4340l66665m79996J57368K99953K95083
2620I39474P7824j94041N8730M06437o87330k66486L96487M04723m45800l56920
2610C33098K28037K05384L63475j17145K98040L05443K49929L79231N27953P3371
2600B846816k05702l42487J96317m57720m45581k44387j05318j54254r3464l3300
2590I60920k19398k33926l69254m35621L37246K19554l18308K78294N01472m65368
$$ plain form
2580 255611 654726 1064875 1021768 1114337 897385 888563 1131180 1231868 1318778 1675923 989696
2569 989696 855011 1103265 925244 1020280 1118152 891287 740121 388000 653829 724338
2559 724338 132571 780004 798536 1171613 1141241 1356038 2014120 1333373 1445584 1295202
2549 1295202 1300646 1423411 1724794 764536 544819 712530 250579 499718 784972 1559695
2539 1559695 1040014 755828 1255470 1230605 1347320 1488708 1207596 667348 987250 1441782
2529 1441782 1616515 1224296 1372520 1380081 1183362 1001342 493311 525297 716856 1221161
2519 1221161 1694149 1603738 936032 1117138 1366111 1169728 704880 947794 861805 955768
2509 955768 917309 999885 528167 825630 1646264 1203032 1291860 1655644 1941234 1797864
$$ packed form
2580B55611L99115M10149m3107R2569k16952q822K42617J00688Q6910L57145o86227
2569I89696j34685K48254j78021R5036R7872k26865j51166l52121K65829P0509
2559G24338n91767O47433J8532L73077l0372K14797O58082o80747J12211j50382
2549A295202N444J22765L01383r60258k19717J67711m61951K49139K85254P74723
2539A559695n19681k84186M99642k4865J16715J41388k81112n40248L19902M54532
2529A441782J74733l92219J48224P561j96719j82020n08031L1986J91559N04305
2519A221161M72988r0411o67706J81106K48973j96383m64848K42914q5989R3963
2509I55768l8459Q2576m71718K97463Q20634m43232Q8828L63784K85590j43370
$$ plain form
2499 1797864 1218646 1391496 1290100 1392464 1585994 1367726 1213034 1417097 997330 784176
2489 784176 983410 953430 1074644 1264220 1202154 1489871 1404654 1542803 2229833 2336290
2479 2336290 2185604 1793950 1414129 1529507 1805784 1704648 1894141 2252541 2118460 1344047
2469 1344047 1418331 1565050 1984136 1938385 1630204 1627615 1429250 1842386 2076469 1913682
2459 1913682 1570184 2514548 2611262 2310960 1804872 1688974 2094589 2136707 2017054 1702496
2449 1702496 1976981 1891756 1838935 1999380 2142266 1984683 2222574 1893397 2117984 1658573
2439 1658573 1327247 1970840 1912270 2058099 2560997 2968168 2916840 2442082 2491570 2866497
2429 2866497 2826431 2296092 2846328 2366011 2851511 2882933 2703776 2349327 3090760 2946349
$$ packed form
2499A797864n79218J72850j01396J02364J93530k18268j54692K04063m19767k13154
2489G84176J99234k9980J21214J89576o2066K87717q5217J38149O87030J06457
2479B336290j50686l91654l79821J15378K76277j01136J89493L58400j34081p74413
2469A344047P4284J46719M19086m5751l08181k589j98365M13136K34083j62787
2459A913682l43498R44364R6714l00302n06088j15898M05615M2118j19653l14558
2449A702496K74485q5225n2821J60445J42886j57583K37891l29177K24587m59411
2439A658573l31326O43593n8570J45829N02898M07171n1328m74758M9488L74927
2429B866497m0066n30339N50236m80317M85500L1422j79157l54449P41433j44411
$$ plain form
2419 2946349 2715623 2553084 2489759 3312645 3690395 3048809 2898525 2800490 3057587 2833851
2409 2833851 2561475 2978371 3405165 3432419 3182994 3186606 3413265 3283283 3443089 3870717
2399 3870717 3713956 3446386 4121508 4188610 3994515 4230023 4590772 4512256 4250184 4420607
2389 4420607 4367874 4024092 4042879 4517096 4344072 4067214 4322309 4579020 4777726 4977057
2379 4977057 5738104 5495815 6169086 6884677 6754572 6752312 7252544 6918262 6466763 6948584
2369 6948584 7234240 7574119 7819858 8074910 7957872 8244260 8812926 9302355 8751253 9000681
2359 9000681 9630871 10115387 11095707 11987277 13796152 14984749 16508533 18978386 21884137
2350 21884137 23680790 24316798 25743072 26967313 27667122 27677492 30480618 34679313 41145483
$$ packed form
2419B946349k30726j62539o3325Q22886L77750o41586j50284r8035K57097k23736
2409B833851k72376M16896M26794K7254k49425L612K26659j29982J59806M27628
2399C870717j56761k67570O75122O7102j94095K35508L60749p8516k62072J70423
2389D420607n2733l43782J8787M74217j73024k76858K55095K56711J98706J99331
2379D977057P61047k42289O73271P15591j30105k260N00232l34282m51499M81821
2369F948584K85656L39879K45739K55052j17038K86388N68666M89429n51102K49428
2359I000681O30190M84516R80320Q91570J808875J188597J523784K469853K905751
2350B1884137J796653O36008J426274J224241O99809J0370K803126M198695O466170
$$ plain form
2341 41145483 50098752 63480182 85702315 134112012 229570561 343303078 381148362
2334 381148362 390105754 380581778 333136724 267950051 197699841 142512766 103604667
2327 103604667 79521648 62532592 52388933 44905416 41089042 39288760 39668220 38051113
2319 38051113 36153966 34080386 31442568 27530632 24498853 21728335 20126743 18398177
2311 18398177 18262718 17247463 16762880 15438328 15053303 14366589 14143297 13471113 12881450
2302 12881450 12177101 11763407 11156975 10859691 10504496 10662297 10143662 9881929 9474451
2293 9474451 9542793 9141024 9112619 8931671 8959650 8743960 8539838 8288170 8140314 8194452
2283 8194452 7859712 7717523 7125593 6978610 6556402 6420135 6770975 6600309 6412177 5845255
$$ packed form
2341D1145483Q953269J3381430K2222133M8409697R5458549J13732517L7845284
2334C81148362Q957392r523976m7445054o5186673p0250210n5187075l8908099
2327A03604667k4083019j6989056j0143659p483517l816374j800282L79460j617107
2319C8051113j897147k073580k637818l911936l031779k770518j601592j728566
2311A8398177j35459j015255m84583j324552l85025o86714k23292o72184n89663
2302A2881450p04349m13694o06432k97284l55195J57801n18635k61733m07478
2293I474451O8342m01769k8405j80948K7979k15690k04122k51668j47856N4138
2283H194452l34740j42189n91930j46983m22208j36267L50840j70666j88132n66922
$$ plain form
2273 5845255 5744011 5018205 5430321 5336428 4989692 4626964 4894925 4902033 4479918 4212236
2263 4212236 4667950 4788886 4663115 4812118 4484453 4305550 4494090 4115334 4322812 3868520
2253 3868520 3822956 3597115 3159250 3023218 3403819 3754040 3369008 3291332 3619862 3598731
2243 3598731 3044598 3349181 3279306 3235262 3030830 3069411 2880665 2699430 3415303 3314956
2233 3314956 3166491 2533545 2817398 2676174 2307407 2702262 3107479 2880419 2409919 2928556
2223 2928556 2187622 2002635 2378710 2182839 2126253 1816307 2224001 2931354 2896749 2437064
2213 2437064 2099754 2015529 2060166 2028126 1671766 1621413 1661996 1648139 1727397 2184934 2019843
2202 2019843 1993076 2037529 2076882 1391241 1448854 1146350 1563271 1500153 1904883 1924617 1552986
$$ packed form
2273E845255j01244p25806M12116r3893l46736l62728K67961P108m22115k67682
2263D212236M55714J20936j25771J49003l27665j78903J88540l78756K07478m54292
2253C868520m5564k25841m37865j36032L80601L50221l85032p7676L28530k1131
2243C598731n54133L04583o9875m4044k04432L8581j88746j81235P15873j00347
2233C314956j48465o32946K83853j41224l68767L94855M05217k27060m70500N18637
2223B928556p40934j84987L76075j95871n6586l09946M07694P07353l4605m59685
2213B437064l37310q4225M4637l2040l56360n0353M0583j3857P9258M57537j65091
2202B019843k6767M4453L9353o85641N7613l02504M16921o3118M04730J9734l71631
$$ plain form
2191 1552986 1262866 1125214 1117171 1100173 1157330 1486122 1538169 2082915 1641157 1239735
2181 1239735 1321559 1585305 1329161 1672423 1600365 1274712 1076073 1172600 990354 331377
2171 331377 783974 1133034 452615 737282 828574 1093722 1229122 794082 1088851 774691
2161 774691 1023283 1263076 1363675 1003939 1137040 1664357 1912386 1626491 1495989 1411678
2151 1411678 1059624 1461285 1246792 1238530 1209303 769027 1334715 1668989 1161075 865249
2141 865249 489293 616916 1271091 813727 748794 957807 982409 757084 494270 755566
2131 755566 1003708 845287 506025 1059198 1966337 1600444 910444 578099 846212 977717
2121 977717 860143 628312 984047 1206150 1020482 757640 724681 1010626 1018262 1255791
$$ packed form
2191A552986k90120j37652q043j6998N7157L28792N2047N44746m41758m01422
2181A239735Q1824K63746k56144L43262p2058l25653j98639R6527j82246o58977
2171C31377M52597L49060o80419K84667R1292K65148J35400m35040K94769l14160
2161G74691K48592K39793J00599l59736J33101N27317K48029k85895j30502q4311
2151A411678l52054M01661k14493q262k9227m40276N65688L34274n07914k95826
2141H65249l75956J27623O54175m57364o4933K09013K4602k25325k62814K61296
2131G55566K48142j58421l39262N53173R07139l65893o90000l32345K68113J31505
2121I77717j17574k31831L55735K22103j85668k62842l2959K85945P636K37529
$$ plain form
2111 1255791 605581 587977 927450 899708 865354 999708 871586 862489 784380 947686 939153
2100 939153 889985 600356 666713 1376723 726767 708302 1004951 684789 486259 1154217
2090 1154217 1658094 1226603 896534 823996 1082350 759282 783494 841922 1026589 1106713
2080 1106713 1112207 1335054 794616 1243027 1497001 1101576 1287799 1503199 1286910 1369394
2070 1369394 1488784 1595303 1880849 1848649 1484821 2139642 2367901 2680266 2479288 2140065
2060 2140065 1824274 1521869 1380469 1486516 1161471 982896 1012544 848182 1011728 867679
2050 867679 840112 819234 833416 525625 443052 665808 337187 792721 1119915 800938
2040 800938 683434 -24148 574763 778427 424081 1191438 519834 734628 436197 34593
$$ packed form
2111A255791o50210j7604L39473k7742l4354J34354j28122r097p8109J63306q533
2100I39153m9168k89629O6357P10010o49956j8465K96649l20162j98530O67958
2090A154217N03877m31491l30069p2538K58354l23068K4212N8428J84667Q0124
2080A106713N494K22847n40438M48411K53974l95425J86223K15400k16289Q2484
2070A369394J19390J06519K85546l2200l63828O54821K28259L12365k00978l39223
2060B140065l15791l02405j41400J06047l25045j78575K9648j64362J63546j44049
2050H67679k7567k0878J4182l07791q2573K22756l28621M55534L27194l18977
2040H00938j17504p07582N98911K03664l54346P67357o71604K14794k98431m01604
$$ plain form
2030 34593 196875 728103 1058083 1305871 834154 824198 705059 323380 49287 -83938
2020 -83938 -2688 299281 806071 400460 82726 290077 1065607 1263718 934583 1043965
2010 1043965 1014164 978255 293600 476484 453058 683937 819372 1019916 1226082 1187612
2000 1187612 743379 274929 534031 719139 885340 754610 925865 772784 985125 1039646
1990 1039646 1001340 585701 460335 491383 1493834 1321813 786910 632173 826882 1340184
1980 1340184 1401802 872238 691884 212864 395792 453580 594542 672488 304035 42888
1970 42888 270288 236006 -280384 -66317 675425 1036644 1049963 1284942 1222465 472505
1960 472505 268529 1122703 1137624 235646 561086 664051 908414 989718 1489369 1549271
$$ packed form
2030C4593J62282N31228L29980K47788m71717r956j19139l81679k74093j33225
2020h3938Q1250L01969N06790m05611l17734K07351P75530J98111l29135J09382
2010A043965k9801l5909o84655J82884k3426K30879J35435K00544K06166l8470
2000A187612m44233m68450K59102J85108J66201j30730J71255j53081K12341N4521
1990A039646l8306m15639j25366L1048J002451j72021n34903j54737J94709N13302
1980A340184O1618n29564j80354m79020J82928N7788J40962P7946l68453k61147
1970D2888K27400l4282n16390K14067P41742L61219J3319K34979o2477p49960
1960D72505k03976Q54174J4921r01978L25440J02965K44363Q1304M99651N9902
$$ plain form
1950 1549271 1086598 1543725 1428553 820689 317761 497864 809315 451139 662815 486435
1940 486435 138099 148344 120475 16868 544135 329880 87231 689506 1129689 665211
1930 665211 600642 1051840 1267776 835709 697505 525479 281407 237527 432903 387321
1920 387321 55167 625085 170899 328812 252186 514681 706549 1093967 607863 496124
1910 496124 531384 451446 356122 712087 783999 645474 503477 89154 456886 345609
1900 345609 740390 427773 27519 673468 781276 693845 168056 504555 820298 1095837
1890 1095837 1331377 838205 923070 409584 382349 457339 643459 289285 325158 767670
1880 767670 167545 -101610 -4466 521241 1372969 808876 739774 1175588 1011368 615338
$$ packed form
1950A549271m62673M57127j15172o07864n02928J80103L11451l58176K11676j76380
1940D86435l48336J0245k7869j03607N27267k14255k42649O02275M40183m64478
1930F65211o4569M51198K15936m32067j38204j72026k44072m3880J95376m5582
1920C87321l32154N69918m54186J57913p6626K62495J91868L87418m86104j11739
1910D96124L5260p9938r5324L55965P1912j38525j41997m14323L67732j11277
1900C45609L94781l12617m00254O45949J07808q7431n25789L36499L15743K75539
1890A095837K35540m93172Q4865n13486k7235P4990J86120l54174L5873M42512
1880G67670o00125k69155R7144N25707Q51728n64093o9102M35814j64220l96030
$$ plain form
1870 615338 415095 624861 849437 626351 230181 -141583 -350783 554307 1435756 1357093
1860 1357093 549968 452845 422638 823888 1080693 1531715 1358420 631146 295937 673492
1850 673492 1186062 1044821 575531 749508 1036854 799749 806549 763857 979775 820898
1840 820898 873162 478853 610381 811881 939309 703783 495271 704245 615340 809282
1830 809282 1195413 1276144 1196473 1150295 1172238 1489588 938630 1028471 1695337 1184263 863705
1819 863705 1434425 850864 858722 733922 301996 221951 470105 44275 327352 918515
1809 918515 1422542 1257751 445391 838190 613775 139572 313776 199448 -25258 255678
1799 255678 191616 227340 138559 185880 164462 272458 847586 267537 366490 434945 427056
$$ packed form
1870F15338k00243K09766K24576k23086l96170l71764k09200R05090Q81449p8663
1860A357093q07125r7123l0207M01250K56805M51022j73295p27274l35209L77555
1850F73492N12570j41241m69290J73977K87346k37105O800m2692K15918j58877
1840H20898N2264l94309J31528K01500J27428k35526k08512K08974q8905J93942
1830H09282L86131Q0731p9671m6178K1943L17350n50958Q9841O66866n11074l20558
1819H63705N70720n83561P858j24800m31926q0045K48154m25830K83077N91163
1809I18515N04027j64791q12360L92799k24415m74203J74204j14328k24706K80936
1799B55678o4062L5724q8781M7321k1418J07996N75128n80049R8953O8455p889
$$ plain form
1788 427056 1050493 1094648 655321 362628 532112 633249 471348 612275 413452 487612
1778 487612 1018774 833698 624334 778037 858553 462715 163902 530824 894575 976854
1768 976854 983580 912396 798109 530737 471532 241933 70664 302576 180316 270004 383213
1757 383213 514998 775918 801094 1038099 705811 1109955 906820 606325 1105185 1062497
1747 1062497 1801532 1351066 996496 1046977 687460 859252 605743 358267 172530 460532
1737 460532 615319 453559 287175 27645 -190294 414926 500908 771240 385499 144631
1727 144631 409501 701925 943454 371509 557044 797254 -361679 -308687 136616 702785
1717 702785 500493 75556 -23461 290898 688749 1404612 1198136 657356 392943 -206241
$$ packed form
1788D27056O23437M4155m39327k92693J69484J01137j61901J40927j98823P4160
1778D87612N31162j85076k09364J53703Q0516l95838k98813L66922L63751Q2279
1768I76854O726p1184j14287k67372n9205k29599j71269K31912j22260Q9688J13209
1757C83213J31785K60920K5176K37005l32288M04144k03135l00495M98860m2688
1747A062497P39035m50466l54570N0481l59517J71792k53509k47476j85737K88002
1737D60532J54787j61760j66384k59530k17939O05220Q5982K70332l85741k40868
1727A44631K64870K92424K41529n71945J85535K40210j158933N2992M45303N66169
1717G02785k02292m24937r9017L14359L97851P15863k06476n40780k64413n99184
$$ plain form
1707 -206241 -102973 126072 440903 69785 208604 322174 153091 21030 573962 585881
1697 585881 370556 316599 801598 597346 -169184 -11076 289815 482748 936325 463345
1687 463345 712823 974564 941293 957978 1145940 1295847 696728 779678 -90939 527864
1677 527864 511487 649993 547940 605651 652300 35416 617199 448728 61233 11777
1667 11777 344022 7686 549879 194943 187038 736873 283163 270312 293135 411304 -111519
1656 -111519 -65145 155597 534408 1064876 820303 473941 1075562 1042176 816434 709143
1646 709143 638828 959621 945477 835608 208620 160306 358129 489524 101303 362785
1636 362785 66105 -56453 397450 681005 537937 825801 1035286 626276 159125 -54618
$$ packed form
1707b06241J03268K29045L14831l71118J38819J13570j69083j32061N52932J1919
1697E85881k15325n3957M84999k04252p66530J58108L00891J92933M53577m72980
1687D63345K49478K61741l3271J6685J87962J49907n99119Q2950q70617O18803
1677E27864j6377J38506j02053N7711M6649o16884N81783j68471l87495m9456
1667A1777L32245l36336N42193l54936p905N49835m53710j2851K2823J18169n22823
1656a11519M6374K20742L78811N30468k44573l46362O01621l3386k25742j07291
1646G09143p0315L20793j4144j09869o26988m8314J97823J31395l88221K61482
1636C62785k96680j22558M53903K83555j43068K87864K09485m09010m67151k13743
$$ plain form
1626 -54618 682401 888294 779528 393531 268053 255184 332759 226225 327914 685582
1616 685582 732164 718917 576334 435207 850780 645954 751077 180578 117263 502418
1606 502418 225909 -215547 -371113 562479 30995 -325331 -250459 -274309 -189134 41139
1596 41139 25787 319418 791866 586500 346891 161281 -57648 387794 293013 662241
1586 662241 558022 252775 611427 557266 81346 585012 652911 162257 206040 -10315
1576 -10315 168001 232454 275774 812496 339058 398413 172630 106549 728321 460365 118342
1565 118342 154691 24005 35730 236272 68592 500238 549151 624204 890179 682389
1555 682389 695564 650222 792737 512706 215482 878258 870224 581246 11368 279162
$$ packed form
1626e4618P37019K05893j08766l85997j25478j2869P7575j06534J01689L57668
1616F85582M6582j3247j42583j41127M15573k04826J05123n70499o3315L85155
1606E02418k76509m41456j55566R33592n31484l56326P4872k3850Q5175K30273
1596D1139j5352K93631M72448k05366k39609j85610k18929M45442r4781L69228
1586F62241j04219l05247L58652n4161m75920N03666O7899m90654M3783k16355
1576a0315J78316O4453M3320N36722m73438N9355k25783o6081O21772k67956l42023
1565A18342L6349j30686J1725K00542j67680M31646M8913P5053K65975k07790
1555F82389J3175m5342J42515k80031k97224O62776q034k88978n69878K67794
$$ plain form
1545 279162 186191 -258459 195486 6193 329410 529480 639815 338959 76847 174676
1535 174676 411393 641296 156528 -111173 249854 393911 367254 430411 484946 1074121
1525 1074121 747413 95303 149316 598961 631473 271197 318704 491331 331294 209363
1515 209363 457380 631818 445095 943261 431464 415353 999706 1190128 187011 220325
1505 220325 165104 103219 299035 492043 435687 555056 454346 613658 849305 503907
1495 503907 1033276 801389 284784 491804 567634 818044 65793 802121 1238338 1060716
1485 1060716 1205559 1097451 1168822 571608 639764 607292 1339633 549875 176991 502132
1475 502132 782150 518365 1159406 617858 -47013 466289 295841 57746 700363 1098727
$$ packed form
1545B79162r2971m44650M53945j89293L23217K00070J10335l00856k62112R7829
1535A74676K36717K29903m84768k67701L61027J44057k6657O3157N4535N89175
1525A074121l26708o52110N4013M49645L2512l60276M7507J72627j60037j21931
1515B09363K48017J74438j86723M98166n11797j6111N84353J90422j003117L3314
1505B20325n5221o1885J95816J93008n6356J19369j00710J59312K35647l45398
1495E03907N29369k31887n16605K07020P5830K50410p52251P36328M36217j77622
1485A060716J44843j08108P1371n97214O8156l2472P32341p89758l72884L25141
1475E02132K80018k63785O41041n41548o64871N13302j70448k38095O42617L98364
$$ plain form
1465 1098727 833936 292523 49512 -141141 159193 827149 488033 852989 844995 702024
1455 702024 806444 236569 16610 741046 303093 -660301 -430700 -89133 115162 -72919
1445 -72919 509193 744548 333222 -73643 501740 1061508 1033446 1538617 1090621 805895
1435 805895 724390 455803 423146 283947 -131488 359861 869265 1125800 1078069 1048806
1425 1048806 857316 1162773 1294776 1269143 980473 670612 797880 599487 817458 561122
1415 561122 738538 1095109 747957 942346 786572 459291 666567 1055637 875349 133193
1405 133193 -44391 426900 338516 910585 1367647 1237481 973927 798908 1093897 650599
1395 650599 58363 253708 631776 964579 731485 401402 77812 176034 938788 488045
$$ packed form
1465A098727k64791n41413k43011j90653L00334O67956l39116L64956p994j42971
1455G02024J04420n69875k19959P24436m37953r63394K29601L41567K04295j88081
1445g2919N82112K35355m11326m06865N75383N59768k8062N05171m47996k84726
1435H05895q1505k68587l2657j39199m15435M91349N09404K56535m7731k9263
1425A048806j91490L05457J32003k5633k88670l09861J27268j98393K17971k56336
1415E61122J77416L56571l47152J94389j55774l27281K07276L89070j80288p42156
1405A33193j77584M71291q8384N72069M57062j30166k63554j75019K94989m43298
1395F50599n92236J95345L78068L32803k33094l30083l23590R8222P62754m50743
$$ plain form
1385 488045 399204 350264 298949 378249 440789 498903 598720 496079 482598 712056 856664
1374 856664 1050339 1259526 655052 861984 659388 846071 807888 826172 393603 41426
1364 41426 278754 608914 1092409 964846 502481 200087 411102 696727 462458 91516
1354 91516 142555 -113841 -114467 -92969 96306 282302 886828 988943 664448 550943 737207
1343 737207 944698 811748 182882 180161 236645 453009 96897 -288355 88155 112351
1333 112351 291940 750807 694476 378584 374157 421827 323387 390552 415584 336754 -53463
1322 -53463 7067 486547 895025 192026 -8313 632210 600970 622376 258003 182997 -49009
1311 -49009 358259 638627 234870 231180 503052 444356 669854 775342 401940 266989
$$ packed form
1385D88045q8841m8940n1315P9300O2540N8114R9817j02641j3481K29458J44608
1374H56664J93675K09187o04474K06932k02596J86683l8183J8284m32569l52177
1364D1426K37328L30160M83495j27563m62365l02394K11015K85625k34269l70942
1354I1516N1039k56396o26K1498J89275J85996O04526J02115l24495j13505J86264
1343G37207K07491j32950o28866k721N6484K16364l56112l85252L76510K4196
1333A12351J79589M58867n6331l15892m427M7670r8440O7165K5032p8830l90217
1322e3463O0530M79480M08478p02999k00339O40523l1240K1406l64373p5006k32006
1311d9009M07268K80368m03757l690K71872n8696K25498J05488l73402j34951
$$ plain form
1301 266989 489061 501634 856452 1090926 731469 689129 581744 1018216 860955 519100
1291 519100 88806 95524 -85410 -379193 87166 136686 322253 373056 502399 301482
1281 301482 1025802 601970 424827 202241 306995 451380 180443 526587 573934 962647
1271 962647 980761 1286736 772503 619875 582530 919305 917864 676105 398555 926088
1261 926088 1070404 1204152 915415 853590 1131154 569341 1013248 1220202 887937 860757
1251 860757 901436 531338 219726 -215546 -155731 167872 -20060 469730 587825 607902
1241 607902 605147 952849 912402 248189 2868 429260 278212 120901 414406 281450
1231 281450 311355 123744 739532 871562 722906 869254 1115862 1363507 652669 339631
$$ packed form
1301B66989K22072J2573L54818K34474l59457m2340j07385M36472j57261l41855
1291E19100m30294O718j80934k93783M66359M9520J85567N0803J29343k00917
1281C01482P24320m23832j77143k22586J04754J44385k70937L46144M7347L88713
1271I62647J8114L05975n14233j52628l7345L36775j441k41759k77550N27533
1261I26088J44316J33748k88737o1825K77564n61813M43907K06954l32265k7180
1251H60757M0679l70098l11612m35272N9815L23603j87932M89790J18095K0077
1241F07902k755L47702m0447o64213k45321M26392j51048j57311K93505j32956
1231B81450K9905j87611O15788J32030j48656J46348K46608K47645p10838l13038
$$ plain form
1221 339631 607846 794738 186428 -14506 520211 245982 833374 509595 719036 457010
1211 457010 -42186 89718 238861 555694 566761 752055 385913 398627 532487 617141
1201 617141 318390 114956 169388 99139 581903 457620 -93435 -440312 -418926 612212
1191 612212 934798 668623 836610 1107939 812993 565890 294907 917951 1017789 1310368
1181 1310368 1133788 995354 955726 733069 484236 360946 368636 308167 905792 446263
1171 446263 585866 421583 468245 292065 346417 508161 1187050 675167 331637 606623
1161 606623 1026417 887141 1032591 487475 -316220 49876 506199 335679 -488096 -506637
1151 -506637 -169846 78527 -247797 -195784 -345116 -146272 161114 93719 56119 454076
$$ packed form
1221C39631K68215J86892o08310k00934N34717k74229N87392l23779K09441k62026
1211D57010m99196J31904J49143L16833J1067J85294l66142J2714J33860Q4654
1201F17141k98751k03434N4432p0249M82764j24283n51055l46877K1386J031138
1191F12212L22586k66175J67987K71329k94946k47103k70983O23044R9838K92579
1181A310368j76580j38434l9628k22657k48833j23290P690o0469N97625m59529
1171D46263J39603j64283M6662j76180N4352J61744O78889n11883l43530K74986
1161F06623M19794j39276J45450n45116q03695L66096M56323j70520q23775j8541
1151e06637L36791K48373l26324N2013j49332J98844L07386o7395l7600L97957
$$ plain form
1141 454076 578387 826162 457999 287170 311348 376321 823034 622777 -247214 -318437
1131 -318437 -264288 24685 337755 291890 507435 682267 818453 273109 408698 910244
1121 910244 606922 425127 296067 614285 729058 495519 405223 363885 423788 609328
1111 609328 770551 636231 654051 563607 280103 463492 274908 -49861 603347 732030
1101 732030 169673 -37259 482947 959916 718471 963180 1099659 148724 612534 303266
1091 303266 293621 13854 175911 1023089 1231254 926072 955018 1246036 1457397 951399
1081 951399 949996 1053870 311599 813607 276132 -88918 371807 753465 361555 204521
1071 204521 395578 604492 935779 1258855 1219464 693894 373494 784897 651366 534215
$$ packed form
1141D54076J24311K47775l68163j70829K4178O4973M46713k00257q69991p1223
1131c18437N4149K88973L13070m5865K15545J74832J36186n45344J35589N01546
1121I10244l03322j81795j29060L18218J14773k33539r0296m1338N9903J85540
1111F09328J61223j34320J7820r0444k83504J83389j88584l24769O53208J28683
1101G32030n62357k06932N20206M76969k41445K44709J36479r50935M63810l09268
1091C03266r645k79767J62057Q47178K08165l05182K8946K91018K11361n05998
1081I51399j403J03874p42271N02008n37475l65050M60725L81658l91910j57034
1071B04521J91057K08914L31287L23076l9391n25570l20400M11403j33531j17151
$$ plain form
1061 534215 192169 502166 990372 1781075 1399971 978612 914128 1000935 933033 771083
1051 771083 463373 327147 259878 -45621 166588 364846 509608 127399 258953 190497
1041 190497 320263 94862 264142 455520 902085 628022 270758 405864 -167998 -396448
1031 -396448 400552 516864 384524 170877 699660 1089270 1449723 1169034 474007 918814
1021 918814 265730 431762 792433 858368 569238 1052244 919485 694648 1076416 929227
1011 929227 1158738 1053357 424590 167251 38917 222753 435283 -19756 464988 1125276
1001 1125276 826482 667697 154987 191206 333620 124700 -8685 6368 516748 495143
991 495143 289291 333035 929365 1021104 524393 526545 1005188 958609 1039267 1039735 512376
$$ packed form
1061E34215l42046L09997M88206P90703l81104m21359o4484Q6807o7902j61950
1051G71083l07710j36226o7269l05499K12209J98258J44762l82209J31554o8456
1041A90497J29766k25401J69280J91378M46565k74063l57264J35106n73862k28450
1031c96448P97000J16312j32340k13647N28783L89610L60453k80689o95027M44807
1021I18814o53084J66032L60671O5935k89130M83006j32759k24837L81768j47189
1011I29227K29511j05381o28767k57339j28334J83836K12530m55039M84744O60288
1001A125276k98794j58785n12710L6219J42414k08920j33385J5053N10380k1605
991D95143k05852M3744N96330R1739m96711K152M78643m6579Q0658M68n27359
$$ plain form
980 512376 478221 935410 755044 74436 161132 1050866 407180 576202 1139820 87606
970 87606 -95989 738304 349563 -167120 187275 406702 800390 909271 1280845 1722370
960 1722370 1007956 802775 598018 533061 395077 -244995 -139039 -249758 -451501 -416418
950 -416418 205863 455780 246343 -80376 158519 736878 409041 361410 575658 465047
940 465047 647135 345537 200845 335659 429382 513947 187349 85064 191387 383097
930 383097 296206 -99286 -222349 11999 143061 152120 490428 509229 119110 23057 199522
919 199522 385462 454988 441431 723353 639551 1082978 1108624 834817 463472 244500 823798
908 823798 668102 879956 611951 561950 243067 84987 942248 751817 467773 264941
$$ packed form
980E12376l4155M57189j80366o80608Q6696Q89734o43686J69022N63618j052214
970H7606j83595Q34293l88741n16683L54395K19427L93688J08881L71574M41525
960A722370p14414k05181k04757o4957j37984o40072J05956j10719k01743L5083
950d16418O22281K49917k09437l26719K38895N78359l27837m7631K14248j10611
940D65047J82088l01598j44692J34814R3723Q4565l26598j02285J06323J91710
930C83097q6891l95492j23063K34348J31062R059L38308J8801l90119r6053J76465
919A99522J85940O9526j3557K81922q3802M43427K5646k73807l71345k18972N79298
908H23798j55696K11854k68005n0001l18883j58080Q57261j90431k84044k02832
$$ plain form
898 264941 221913 197967 307516 511381 279947 352101 428859 493596 350832 649685 894830
887 894830 70607 47320 25501 127654 -140201 371771 486908 -215040 -185259 18848
877 18848 -281 30815 321687 515264 534367 286430 76728 -123953 -3802 276555 573753
866 573753 858437 737543 361374 363630 37440 -142109 78092 396863 597716 84141
856 84141 -207831 86995 362252 293175 97074 402953 417127 593546 674846 451840 579701
845 579701 748675 174186 208379 182309 374962 315654 459836 580484 551110 959909 952438
834 952438 340857 535688 614933 471086 571182 586739 450599 -236018 -8360 935087
824 935087 833770 745365 1019866 1218607 1514700 1414649 1329631 693354 617269 1105050
$$ packed form
898B64941m3028k3946J09549K03865k31434P2154P6758O4737j42764K98853K45145
887H94830q24223k3287k1819J02153k67855N11972J15137p01948K9781K04107
877A8848j9129L1096K90872J93577J9103k47937k09702k00681J20151K80357K97198
866E73753K84684j20894l76169K256l26190j79549K20201L18771K00853n13575
856H4141k91972K94826K75257o9077j96101L05879J4174J76419Q1300k23006J27861
845E79701J68974n74489L4193k6070J92653n9308J44182J20648k9374M08799p471
834I52438o11581J94831P9245j43847J00096J5557j36140o86617K27658R43447
824I35087j01317q8405K74501J98741K96093j00051q5018o36277p6085M87781
$$ plain form
814 1105050 1027897 772884 1041672 1020015 732788 538312 725038 112936 -142400 -108698
804 -108698 411970 419119 659814 686608 439803 447455 866065 585858 782466 748976 28781
793 28781 676887 210635 42435 103389 378953 450942 615369 748613 366658 845243
783 845243 874775 191915 -75379 254903 798861 470332 289278 484293 668559 143111
773 143111 -271792 145615 893881 784365 1345075 1161085 1005216 1010649 1144232 933344
763 933344 124588 114231 -110696 166117 117470 -53961 394496 717351 517691 1046246
753 1046246 1279758 768273 772657 445842 326455 545749 -53739 -58442 421411 767645
743 767645 360847 554749 656111 643466 511065 192361 213945 717047 764993 700070 525880
$$ packed form
814A105050p7153k55013K68788k1657k87227j94476J86726o12102k55336L3702
804a08698N20668P149K40695K6794k46805P652M18610k80207J96608l3490p20195
793B8781O48106m66252j68200O0954K75564P1989J64427J33244l81955M78585
783H45243K9532o82860k67294L30282N43958l28529j81054J95015J84266n25448
773A43111m14903M17407P48266j09516N60710j83990j55869N433J33583k10888
763I33344q08756j0357k24927K76813m8647j71431M48457L22855j99660N28555
753A046246K33512n11485M384l26815j19387K19294n99488m703M79853L46234
743G67645m06798J93902J01362j2645j32401l18704K1584N03102M7946o4923j74190
$$ plain form
732 525880 -196106 202792 379055 228394 761490 735643 726821 508905 639524 880196
722 880196 773584 762474 1053333 989943 362044 422636 372657 465712 702320 802883 318419
711 318419 -84401 -309299 19832 210438 585382 415130 -196129 291523 560717 814615
701 814615 997402 1083607 730671 165879 246610 746419 1089721 1301357 398343 413460
691 413460 646916 332745 156257 -198499 500982 1076726 1064052 486548 302527 426098
681 426098 496699 313661 319944 335729 272602 398434 -366266 -14459 838752 781257 1020105
670 1020105 695503 738114 1118574 1193056 956318 282348 351177 -63769 366121 435437
660 435437 -124829 464065 595819 601996 462554 106721 -103421 641947 769580 139273
$$ packed form
732E25880p21986L98898J76263j50661N33096k5847q822k17916J30619K40672
722H80196j06612j1110K90859o3390o27899O0592m9979R3055K36608J00563m84464
711C18419m02820k24898L29131J90606L74944j70252o11259M87652K69194K53898
701H14615J82787Q6205l52936n64792Q0731M99809L43302K11636r03014J5117
691D13460K33456l14171j76488l54756O99481N75744j2674n77504j84021J23571
681D26098P0601j83038O283J5785o3127J25832p64700L51807Q53211n7495K38848
670A020105l24602M2611L80460P4482k36738o73970O8829m14946M29890O9316
660D35437n60266N88894J31754O177j39442l55833k10142P45368J27633o30307
$$ plain form
650 139273 3823 352676 482479 414531 240434 779369 685179 267397 196141 202141 608473
639 608473 651224 441365 294313 402018 848754 769057 924940 534316 375312 641523
629 641523 554925 472815 360571 664100 538960 723450 658739 713749 796273 318311 474530
618 474530 88050 149985 685693 142129 157735 -80939 395583 163245 597099 770451
608 770451 396827 748911 299299 70463 315331 780729 1025765 938572 714827 633991
598 633991 -203456 110663 -35059 225229 151796 -143720 202945 386680 608299 912407
588 912407 639627 -235067 -390195 -135657 241968 313599 407357 27595 21728 42024 796820
577 796820 889606 403154 137749 276950 506258 542270 568423 799770 470786 275203
$$ packed form
650A39273j35450L48853J29803o7948j74097N38935r4190m17782p1256O000M06332
639F08473M2751k09859j47052J07705M46736p9697J55883l90624j59004K66211
629F41523q6598q2110j12244L03529j25140J84490o4711N5010Q2524m77962J56219
618D74530l86480O1935N35708n43564J5606k38674M76522k32338M33854J73352
608G70451l73624L52084m49612k28836K44868M65398K45036q7193k23745q0836
598F33991q37447L14119j45722K60288p3433k95516L46665J83735K21619L04108
588I12407k72780q74694j55128K54538L77625P1631R3758l79762n867K0296P54796
577G96820R2786m86452k65405J39201K29308L6012K6153K31347l28984j95583
$$ plain form
567 275203 629588 996938 944015 916742 1138010 886772 735265 392333 286744 32063
557 32063 329220 971772 425483 704864 883536 521050 427152 301438 293310 506098 858936
546 858936 700968 644837 700976 393462 581831 1104939 443461 712069 796163 871638 459989
535 459989 810670 723837 571465 862913 656039 576828 336119 688787 455708 655126
525 655126 487511 433921 427714 189419 668359 821402 819611 450412 462160 754067 571752
514 571752 1021493 1252534 804902 723896 353838 435592 538197 519956 433693 24987 366077
503 366077 600210 815560 708167 288182 29578 204462 732560 645886 404557 304663
493 304663 380857 21427 119074 936024 289920 245735 576079 572541 989260 1308281 1006093
$$ packed form
567B75203L54385L67350n2923k7273K21268k51238j51507l42932j05589k54681
557C2063K97157O42552n46289K79381J78672l62486r3898j25714q128K12788L52838
546H58936j57968n6131N6139l07514J88369N23108o61478K68608Q4094P5475m11649
535D59989L50681q6833j52372K91448k06874p9211k40709L52668k33079J99418
525F55126j67615n3590o207k38295M78940J53043j791l69199J1748K91907j82315
514E71752M49741K31041m47632q1006l70058Q1754J02605j8241q6263m08706L41090
503C66077K34133K15350j07393m19985k58604J74884N28098q6674k41329r9894
493C04663P6194l59430R7647Q16950o46104m4185L30344l538M16719L19021l02188
$$ plain form
482 1006093 614363 256421 -119141 269528 1136989 1020423 528085 12968 -81748 -106279
472 -106279 558946 450721 443314 882900 738404 478483 -68415 304971 446482 205384
462 205384 89391 -135126 243575 94017 -433166 206617 660969 721034 552412 89537
452 89537 656883 594411 769302 1420167 810143 -9183 896003 861105 388221 254958
442 254958 55890 333650 -352648 164721 867476 663281 434727 68507 523698 345865
432 345865 361163 456084 308539 -323096 36910 490952 381613 326738 -203134 268992
422 268992 343936 456140 256012 492022 779572 887857 381765 311383 618707 876275
412 876275 437127 219516 512822 355123 503891 548191 -108940 -78509 -303059 39228
$$ packed form
482A006093l91730l57942l75562L88669Q67461j16566m92338n15117r4716k4531
472a06279O65225j08225p407M39586j44496k59921n46898L73386J41511k41098
462B05384j15993k24517L78701j49558n27183O39783M54352O0065j68622m62875
452H9537N67346o2472J74891O50865o10024q19326R05186l4898m72884j33263
442B54958j99068K77760o86298N17369P02755k04195k28554l66220M55191j77833
432C45865J5298R4921j47545o31635L60006M54042j09339n4875n29872M72126
422B68992P4944J12204k00128K36010K87550J08285n06092p0382L07324K57568
412H76275m39148k17611K93306j57699J48768M4300o57131L0431k24550L42287
$$ plain form
402 39228 270916 76387 -17905 -191391 -117591 288751 190901 -123553 -61022 636280 549851
391 549851 563105 478320 590964 643103 261037 -287038 258342 623116 435602 523946 308834
380 308834 28042 389030 184528 -193969 6878 237738 533646 531003 529443 661181 256182
369 256182 477872 607249 227754 95364 149136 701424 684336 772159 639672 -38598
359 -38598 306673 357061 121376 63802 -41037 569371 376295 324425 119976 443313 463194
348 463194 535269 427322 219118 11662 226106 431215 715625 636206 340795 204516
338 204516 461150 -223382 -632451 -72557 -215104 -569454 -306082 1190358 1518561 873938
328 873938 483217 324344 -57612 -577061 -21994 -265991 463917 556476 585725 114515
$$ packed form
402C9228K31688j94529r4292j73486P3800M06342r7850l14454O2531O97302q6429
391E49851J3254q4785J12644N2139l82066n48075N45380L64774j87514Q8344k15112
380C08834k80792L60988k04502l78497K00847K30860K95908k643j560J31738m04999
369B56182K21690J29377l79495j32390N3772N52288j7088Q7823j32487o78270
359c8598L45271N0388k35685n7574j04839O10408j93076n1870k04449L23337J9881
348D63194P2075j07947k08204k07456K14444K05109K84410p9419k95411j36279
338B04516K56634o84532m09069N59894j42547l54350K63372J496440L28203o44623
328H73938l90721j58873l81956n19449N55067k43997P29908R2559K9249m71210
$$ plain form
318 114515 160281 323941 228486 760079 884724 790657 769205 692627 1015571 728371 898733
307 898733 592083 520843 631920 337284 955862 1273652 920495 601791 755509 761406
297 761406 796708 808094 52820 130660 749634 623911 608761 185415 456354 -37756 -77713
286 -77713 186240 415105 288900 277009 619807 587296 496153 610217 816051 1002574 513592
275 513592 118357 -112556 128046 794417 939595 1090464 617552 562456 342087 390266
265 390266 1137039 761340 698477 455966 447244 681393 664271 838971 974976 523570 633911
254 633911 773196 1052075 715701 124153 305767 677510 406849 647457 344292 16718
244 16718 400300 274245 387969 256971 42168 468219 621479 631804 993618 663380
$$ packed form
318A14515M5766J63660r5455N31593J24645r4067k1452p6578L22944k87200J70362
307H98733l06650p1240J11077k94636O18578L17790l53157l18704J53718N897
297G61406L5302J1386p55274P7840O18974j25723j5150m23346K70939m94110l9957
286g7713K63953K28865j26205j1891L42798l2511r1143J14064K05834J86523m88982
275E13592l95235k30913K40602O66371J45178J50869m72912n5096k20369M8179
265C90266P46773l75699o2863k42511q722K34149j7122J74700J36005m51406J10341
254F33911J39285K78879l36374n91548J81614L71743k70661K40608l03165l27574
244A6718L83582j26055J13724j30998k14803M26051J53260J0325L61814l30238
$$ plain form
234 663380 648003 439687 188971 345486 1166434 1120676 724177 856023 567814 767512
224 767512 522968 338177 543531 415283 325467 187568 683516 261652 -249839 258692
214 258692 190599 814218 784252 275394 -222637 337813 231291 417657 652980 954005
204 954005 1168843 1276040 1057629 905854 516793 213984 639308 334500 575740 645150
194 645150 89830 135974 421597 426317 548157 690105 353590 264541 657205 572549 1014936
183 1014936 614456 177365 108620 711204 502711 572884 81386 293644 407391 641378
173 641378 506247 310575 529838 271960 369618 353232 321291 347827 546830 735373 229323
162 229323 176451 399343 355706 667548 715587 747004 555814 573082 568609 457058 214759
$$ packed form
234F63380j5377k08316k50716J56515Q20948m5758l96499J31846k88209J99698
224G67512k44544j84791K05354j28248q9816j37899M95948m21864n11491N08531
214B58692o8093O23619k9966n08858m98031N60450j06522J86366K35323L01025
204I54005K14838J07197k18411j51775l89061l02809M25324l04808K41240O9410
194F45150n55320M6144K85623M720J21840J41948l36515q9049L92664q4656M42387
183A014936m00480m37091o8745O02584k08493P0173m91498K12258J13747K33987
173F41378j35131j95672K19263k57878R7658j6386l1941K6536J99003J88543n06050
162B29323n2872K22892m3637L11842M8039L1417j91190J7268m473j11551k42299
$$ plain form
151 214759 60382 176187 -202462 -301220 183260 295697 267298 133196 423267 596829
141 596829 542853 20602 135521 22628 181048 974 59114 507152 897168 800875
131 800875 746769 671086 335139 469348 560937 404299 172857 11823 -84524 615956 509703
120 509703 851352 1017386 779434 7475 -196416 -39920 456211 908790 726229 548304
110 548304 201996 399776 698911 651926 1056185 1208654 877016 997532 976800 603047
100 603047 563192 447007 693430 727198 617733 628385 336930 -5829 385086 774424
90 774424 723139 187970 -459387 30474 -127526 -150601 167502 395392 161315 10445
80 10445 452690 643125 508296 692238 814217 726824 434149 62538 -106152 198896
$$ packed form
151B14759j54377J15805l78649r8758M84480J12437k8399j34102K90071J73562
141E96829n3976n22251J14919j12893J58420j80074N8140M48038L90016r6293
131H00875n4106p5683l35947J34209R1589j56638k31442j61034r6347P00480j06253
120E09703L41649J66034k37952p71959k03891J56496M96131M52579j82561j77925
110E48304l46308J97780K99135m6985M04259J52469l31638J20516k0732l73753
100F03047l9855j16185K46423L3768j09465J0652k91455l42759L90915L89338
90G74424n1285n35169o47357M89861j58000k3075L18103K27890k34077j50870
80A0445M42245J90435j34829J83942J21979q7393k92675l71611j68690L05048
$$ plain form
70 198896 -282378 -30853 140128 420927 443523 -82964 60952 444775 652383 650552 747723
59 747723 339198 -65890 -7552 653638 418751 199797 238262 383882 256783 193464 -83486
48 -83486 138927 218564 369223 310108 30746 -52099 -117943 -78426 170880 541637 317208
37 317208 201505 393553 915241 675266 674946 607168 430501 239688 243681 530187 467855
26 467855 149187 334808 201703 103491 17029 128596 349673 104104 166698 272200 390255
15 390255 27407 -422330 -417461 281523 896405 513031 -209897 -324442 -24056 -96288 -99460
4 -99460 153577 12535 285802 16695
0 16695
$$ packed form
70A98896m81274K51525J70981K80799K2596n26487J43916L83823K07608j831R7171
59G47723m08525m05088N8338O61190k34887k18954L8465J45620j27099o3319k76950
48h3486K22413P9637J50659n9115k79362q2845o5844L9517K49306L70757k24429
37C17208j15703J92048N21688k39975l20o7778j76667j90813L993K86506o2332
26D67855l18668J85621j33105r8212q6462J11567K21077k45569O2594J05502J18055
15C90255l62848m49737M869O98984O14882l83374p22928j14545L00386p2232l172
4i9460K53037j41042K73267k69107
0A6695
$$ Imaginary data points
##PAGE= N=2
##DATA TABLE= (X++(I..I)), XYDATA
$$ plain form
16383 -688275 -957064 -731564 -928701 -882320 -860297 -711969 -604593 -588001 -661302 -952098
16373 -952098 -981466 -663362 -517836 -410348 -650593 -1129614 -1214176 -961295 -537729 -147554
16363 -147554 -400656 -345151 -676214 -458306 -402726 -634238 -664757 -372915 364226 -116872
16353 -116872 -405614 -132172 -164142 -285394 -147403 -411474 -655592 -477137 -361157 -275259
16343 -275259 -232128 -108107 -165297 -233740 -296008 -540562 -478920 -420133 146892 -33005 -341784
16332 -341784 -83903 -115568 57957 -277390 -366057 -57862 33969 -463555 -428316 255459
16322 255459 37231 -239350 -332679 227789 6892 5351 141382 -197556 -140712 58332
16312 58332 438684 44445 -75470 -123610 -102571 510862 459178 538811 546385 372324 -596455
$$ packed form
16383f88275k68789K25500j97137M6381K2023J48328J07376J6592p3301k90796
16373i52098k9368L18104J45526J07488k40245m79021q4562K52881M23566L90175
16363a47554k53102N5505l31063K17908N5580k31512l0519K91842P37141m81098
16353a16872k88742K73442l1970j21252J37991k64071k44118J78455J15980Q5898
16343b75259M3131J24021n7190o8443o2268k44554O1642N8787N67025j79897l08779
16332c41784K57881l1665J73525l35347q8667L08195R1831m97524L5239O83775
16322B55459k18228k76581r3329N60468k20897j541J36031l38938N6844J99044
16312E8332L80352l94239j19915m8140K1039O13433n1684P9633P574j74061r68779
$$ plain form
16301 -596455 -277859 -6569 59702 344591 107608 117970 224089 232213 56246 57105 -108495
16290 -108495 -21401 -14790 256105 359170 564433 781658 1333929 1054354 899046 667198
16280 667198 332499 -44691 117765 402144 554944 831347 798360 1393129 1156088 922622
16270 922622 918982 995799 565709 483666 598558 981642 1177010 918146 557183 570397
16260 570397 790343 672921 883219 628261 508140 931564 583674 923566 765655 958133
16250 958133 1100667 915962 1305238 879332 927555 822663 1038498 429084 703083 683930
16240 683930 765460 985895 474303 276487 385537 289898 633540 1182629 808050 1189515
16230 1189515 1841731 1627354 1159424 1415682 978183 813714 1115760 999896 848209
$$ packed form
16301e96455L18596K71290O6271K84889k36983J0362J06119Q124j75967Q59j65600
16290a08495Q7094O611K70895J03065K05263K17225N52271k79575j55308k31848
16280F67198l34699l77190J62456K84379J52800K76403l2987N94769k37041k33466
16270I22622l640P6817m30090q2043J14892L83084J95368k58864l60963J3214
16260E70397K19946j17422K10298k54958j20121M23424l47890L39892j57911J92478
16250I58133J42534j84705L89276m25906M8223j04892K15835o09414K73999j9153
16240F83930Q1530K20435n11592j97816J09050r5639L43642N49089l74579L81465
16230A189515O52216k14377m67930K56258m37499j64469L02046j15864j51687
$$ plain form
16221 848209 428793 761163 894362 1257412 801771 605368 1055604 1675409 2080374 1351816
16211 1351816 858517 1087706 1176331 1544287 994157 1087382 1311660 1379024 1709880 1457884
16201 1457884 1727354 1704233 1287962 967613 1286522 898236 841511 1341862 1434465 956521
16191 956521 1128977 991512 951961 1251792 1387803 1371721 1364593 1226484 1259974 1125807
16181 1125807 1047007 1185385 1509187 1478321 1301711 1101917 1315884 1233281 1389005 1472081
16171 1472081 1420902 1268904 1562240 1595872 1443798 1118145 1528411 1587096 1550874 1781413
16161 1781413 1378829 1263694 1548156 2062429 1308110 1113204 1229143 1640515 1612246 1634448
16151 1634448 1533673 1306982 1633069 1328051 1171991 1666946 1152037 504787 704076
$$ packed form
16221H48209m19416L32370J33199L63050m55641j96403M50236O19805M04965p28558
16211A351816m93299K29189Q8625L67956n50130R3225K24278O7364L30856k51996
16201A457884K69470k3121m16271l20349L18909l88286n6725N00351R2603m77944
16191I56521J72456j37465l9551K99831J36011j6082p128j38109L3490j34167
16181A125807p8800J38378L23802l0866j76610j99794K13967q2603J55724Q3076
16171A472081n1179j51998K93336L3632j52074l25653M10266N8685l6222K30539
16161A781413m02584j15135K84462N14273p54319j94906J15939M11372k8269K2202
16151A634448j00775k26691L26087l05018j56060M94955n14909o47250J99289
$$ plain form
16142 704076 967539 1354665 1458431 1604626 1951163 1307289 1705408 1931469 2098961 1848328
16132 1848328 1616899 2275197 2378574 1982028 1349147 1524831 1494076 1477221 1726439 1511842
16122 1511842 1595721 1423789 1681378 1993072 1556592 1409746 1066603 583261 1114288 2098267
16112 2098267 2280076 1913381 1686496 1439948 1766613 1490544 876566 1084970 1269040
16103 1269040 925495 806426 1316447 1661649 1557475 1794485 1727989 1060242 1271845 1773817
16093 1773817 1983485 1675880 1597320 1889329 1531827 1553796 1322253 1660903 1406144 1114519
16083 1114519 1592276 1844113 1458715 1513758 1063691 1053810 1754874 2047231 2132148 1955664
16073 1955664 2061544 1847263 1636423 770153 1014252 1313414 1676515 1837866 1828320 1428099
$$ packed form
16142G04076K63463L87126J03766J46195L46537o43874L98119K26061J67492k50633
16132A848328k31429O58298J03377l96546o32881J75684l0755j6855K49218k14597
16122A511842Q3879j71932K57589L11694m36480j46846l43143m83342N31027R83979
16112B098267J81809l66695k26885k46548L26665k76069o13978K08404J84070
16103A269040l43545j19069N10021L45202j04174K37010o6496o67747K11603N01972
16093A773817K09668l07605p8560K92009l57502K1969k31543L38650k54759k91625
16083A114519M77757K51837l85398N5043m50067r881P01064K92357Q4917j76484
16073A955664J05880k14281k10840q66270K44099K99162L63101J61351r546m00221
$$ plain form
16063 1428099 1034209 1545623 1396250 1557673 1441790 783891 1080072 1432715 1837490
16054 1837490 1913058 2014698 2191350 1978826 1521204 1341033 1556573 1625669 1501044 1663037
16044 1663037 1783438 1818691 1829267 1144669 877490 1449986 1466748 1390956 1236071 1262341
16034 1262341 1263643 1397677 2000532 1788088 1452333 1606970 1594341 1445653 1730973 2054275
16024 2054275 1687630 1590520 1677932 1687859 1439801 1670123 1616770 1716924 1590162 981523
16014 981523 1777398 1870845 988043 1432023 1289232 1343385 1270461 1253640 1519055 1702084
16004 1702084 997832 1234825 1485131 1805820 1564164 1000439 1787714 1686864 1728910 1436284
15994 1436284 1146157 1118164 1295852 1688147 1809409 1638266 1812301 1673674 1642588 1458028
$$ packed form
16063A428099l93890N11414j49373J61423j15883o57899K96181L52643M04775
16054A837490P5568J01640J76652k12524m57622j80171K15540O9096j24625J61993
16044A663037J20401L5253J0576o84598k67179N72496J6762p5792j54885K6270
16034A262341J302J34034O02855k12444l35755J54637j2629j48688K85320L23302
16024B054275l66645r7110Q7412R927k48058K30322n3353J00154j26762o08639
16014I81523P95875R3447q82802M43980j42791N4153p2924j6821K65415J83029
16004A702084p04252K36993K50306L20689k41656n63725P87275j00850M2046k92626
15994A436284k90127k7993J77688L92295J21262j71143J74035j38627l1086j84560
$$ plain form
15984 1458028 1494652 1645249 1268686 1086117 895048 1022958 1170525 1527033 1639354 1985379
15974 1985379 2080351 1782093 1753816 1231892 1619222 1116395 1535323 1658188 1456816 1865131
15964 1865131 1913914 1618144 1715072 1668890 1362563 1501871 1355222 1316784 1074357 1400337
15954 1400337 1833529 1255107 649256 1219330 1435050 1232515 1547782 1524592 1691294 1313430
15944 1313430 1448062 1492420 1464112 1763258 2047742 1559422 1764958 1761226 1728264 1611474
15934 1611474 1393428 1678325 1521477 1601376 2278803 2204818 1905758 1863506 2010721 1559541
15924 1559541 1330639 1528528 1622083 1596916 1988663 2165023 1747947 1623741 1521337 2068890
15914 2068890 2068650 1803664 1495687 1263178 1349371 1665710 1730704 2185674 2117296 1790153
$$ packed form
15984A458028L6624J50597l76563j82569j91069J27910J47567L56508J12321L46025
15974A985379R4972k98258k8277n21924L87330n02827M18928J22865k01372M08315
15964A865131M8783k95770R6928m6182l06327J39308j46649l8438k42427L25980
15954A400337M33192n78422o05851N70074K15720k02535L15267k3190J66702l77864
15944A313430J34632M4358k8308K99146K84484m88320K05536l732l2962j16790
15934A611474k18046K84897j56848P9899O77427p3985k99060m2252J47215m51180
15924A559541k28902J97889R3555k5167L91747J76360m17076j24206j02404N47553
15914B068890k40k64986l07977k32509Q6193L16339O4994M54970o8378l27143
$$ plain form
15904 1790153 1083446 1414277 1820702 1647351 1413594 1896268 1666309 1195367 813456
15895 813456 1082857 1114942 1366059 1569046 1821948 1578985 1600347 2192360 1879770 1877436
15885 1877436 1406967 1286250 1770883 1378257 1484741 2210532 1408510 1791227 1542378
15876 1542378 1707410 1991407 1928392 1913323 1516358 1005386 1022371 1250686 1028382 805189
15866 805189 972399 1124930 1010141 1681577 1736975 1983203 1996771 1561800 1421646 1260452
15856 1260452 1265994 1926818 1947793 1610540 1751055 2111722 1862660 1380167 1205826 1493184
15846 1493184 1745363 1606093 2151585 2047160 1683256 1347559 871297 1221238 1626963
15837 1626963 1252649 1087525 1239328 1254096 1244950 990372 1078084 1307048 1193624 981845
$$ packed form
15904A790153p06707L30831M06425j73351k33757M82674k29959m70942l81911
15895H13456K69401L2085K51117K02987K52902k42963K1362N92013l12590k334
15885A877436m70469j20717M84633l92626J06484P25791q02022L82717k48849
15876A542378J65032K83997o3015j5069l96965n10972J6985K28315k22304k23193
15866H05189J67210J52531j14789O71436N5398K46228J3568m34971j40154j61194
15856A260452N542O60824K0975l37253J40515L60667k49062m82493j74341K87358
15846A493184K52179j39270N45492j04425l63904l35697m76262L49941M05725
15837A626963l74314j65124J51803J4768r146k54578Q7712K28964j13424k11779
$$ plain form
15827 981845 1564655 1314517 1258504 1496457 1033731 1466580 1488905 1315945 913170 1615016
15817 1615016 1563474 1553728 1369819 698317 864248 693196 818760 1188842 1421240 1284392
15807 1284392 1578475 1513383 1583461 2042889 1904461 1698288 1690935 1723351 1849370 1669530
15797 1669530 1538540 1715410 2058076 1347209 1160748 1532383 1446456 623198 663311 1267982
15787 1267982 1342277 1225869 1921517 1805286 1681883 1685991 1643823 1912791 1139624 1088635
15777 1088635 1322399 1138140 1200808 1424177 1649878 1508128 1347293 1942576 1864568 1462577
15767 1462577 1366693 1133381 1493600 1878738 2315088 2257270 1398417 1289198 1454439 1603556
15757 1603556 1076450 374511 451602 1338850 1257562 1629895 1312821 1509460 1440154 1812616
$$ packed form
15827I81845N82810k50138n6013K37953m62726M32849K2325j72960m02775P01846
15817A615016n1542r746j83909o71502J65931j71052J25564L70082K32398j36848
15807A284392K94083o5092P0078M59428j38428k06173p353L2416J26019j79840
15797A669530j30990J76870L42666p10867j86461L71635q5927q23258M0113O04671
15787A267982P4295j16408O95648j16231j23403M108m2168K68968p73167n0989
15777A088635K33764j84259O2668K23369K25701j41750j60835N95283p8008m01991
15767A462577r5884k33312L60219L85138M36350n7818q58853j09219J65241J49117
15757A603556n27106p01939P7091Q87248q1288L72333l17074J96639o9306L72462
$$ [...]
##END NTUPLES=NMR SPECTRUM
##END=
