##TITLE=1H_DE-80H_X3
 200.13MHz, d2o
 8 sc
 
 19ns.26.2.2025
##JCAMPDX= 6.0         $$ Bruker NMR JCAMP-DX V2.0
##DATA TYPE= NMR SPECTRUM
##DATA CLASS= NTUPLES
##ORIGIN= UXNMR, Bruker Analytische Messtechnik GmbH
##OWNER= pz
$$ XWIN-NMR		Version 3.5
$$ Mon Dec 29 10:53:51 2025 Russian Standard Time (UT+4h)  Yarkov@DPX200
##.OBSERVE FREQUENCY= 200.1313
##.OBSERVE NUCLEUS= ^1H
##.ACQUISITION MODE= SIMULTANEOUS
##.ACQUISITION SCHEME= undefined
##.AVERAGES= 8
##.DIGITISER RES= 18
##SPECTROMETER/DATA SYSTEM= spect
##.PULSE SEQUENCE= zg30
##.SOLVENT NAME= DMSO
##.SHIFT REFERENCE= (INTERNAL, DMSO, 0, 15.4968)
##AUDIT TRAIL= $$ (NUMBER, WHEN, WHO, WHERE, WHAT)
$$ ##TITLE= Audit trail, XWIN-NMR		Version 3.5
$$ ##JCAMPDX= 5.01
$$ ##ORIGIN= Bruker BioSpin GmbH
$$ ##OWNER= Yarkov
$$ C:/Bruker/XWIN-NMR/data/yarkov2/nmr/H-C/1/pdata/1/auditp.txt
$$ ##AUDIT TRAIL=  $$ (NUMBER, WHEN, WHO, WHERE, WHAT)
(   1,<2025-12-29 10:52:03.64 +0400>,<Yarkov>,<DPX200>,
      <created by zg, POWCHK disabled, PULCHK disabled
       configuration hash MD5:
       00 E9 B6 7A A2 85 ED C7 34 08 36 98 17 FE 4E 26
       data hash MD5: 16K
       74 0E 16 B9 1B AD 29 34 7E 9F 63 91 F4 2C B7 FB>)
(   2,<2025-12-29 10:53:02.51 +0400>,<Yarkov>,<DPX200>,
      <Start of raw data processing
       efp BC_mod = 2 LB = 0.25 FT_mod = 6 PKNL = 1 PHC0 = -5301.897 PHC1 = 7.62193 SI = 16K 
       data hash MD5: 16K
       68 EF BC C3 33 37 78 62 02 C0 F0 2A F8 18 29 C0>)
$$ ##END=
$$ 
$$ hash MD5
$$ 04 94 9D 32 62 3C 17 D0 73 72 55 C5 EE 23 CF 1A
##$RELAX= 
##$RELAX= 
##$RELAX= 
##$RELAX= 
##$RELAX= 
##$RELAX= 
$$ Bruker specific parameters
$$ --------------------------
##$DU= <C:/Bruker/XWIN-NMR>
##$EXPNO= 1
##$NAME= <H-C>
##$PROCNO= 1
##$TYPE= <nmr>
##$USER= <yarkov2>
##$AMP= (0..31)
100 100 100 100 100 100 100 100 100 100 100 100 100 100 100 100 100 100 
100 100 100 100 100 100 100 100 100 100 100 100 100 100 
##$AQSEQ= 0
##$AQ_mod= 1
##$AUNM= <au_zg>
##$AUTOPOS= <>
##$BF1= 200.13
##$BF2= 200.13
##$BF3= 200.13
##$BF4= 200.13
##$BF5= 200.13
##$BF6= 200.13
##$BF7= 200.13
##$BF8= 200.13
##$BYTORDA= 1
##$CFDGTYP= 0
##$CFRGTYP= 5
##$CHEMSTR= <none>
##$CNST= (0..31)
1 1 145 1 1 1 1 1 1 1 1 1 1 1 1 1 1 1 1 1 1 1 1 1 1 1 1 1 1 1 1 1 
##$CPDPRG= <>
##$CPDPRG1= <>
##$CPDPRG2= <>
##$CPDPRG3= <>
##$CPDPRG4= <mlev>
##$CPDPRG5= <mlev>
##$CPDPRG6= <mlev>
##$CPDPRG7= <mlev>
##$CPDPRG8= <mlev>
##$CPDPRGB= <>
##$CPDPRGT= <>
##$D= (0..31)
0 0.7 0 0 0 0 0 0 0 0 0 0.03 0 0 0 0 0 0 0 0 0 0 0 0 0 0 0 0 0 0 0 0 
##$DATE= 1766991123
##$DBL= (0..7)
120 120 120 120 120 120 120 120 
##$DBP= (0..7)
150 150 150 150 150 150 150 150 
##$DBP07= 0
##$DBPNAM0= <>
##$DBPNAM1= <>
##$DBPNAM2= <>
##$DBPNAM3= <>
##$DBPNAM4= <>
##$DBPNAM5= <>
##$DBPNAM6= <>
##$DBPNAM7= <>
##$DBPOAL= (0..7)
0.5 0.5 0.5 0.5 0.5 0.5 0.5 0.5 
##$DBPOFFS= (0..7)
0 0 0 0 0 0 0 0 
##$DE= 6
##$DECBNUC= <off>
##$DECIM= 32
##$DECNUC= <off>
##$DECSTAT= 4
##$DIGMOD= 1
##$DIGTYP= 9
##$DL= (0..7)
0 120 120 120 120 120 120 120 
##$DP= (0..7)
$$ [...]
##$SUBNAM2= <"">
##$SUBNAM3= <"">
##$SUBNAM4= <"">
##$SUBNAM5= <"">
##$SUBNAM6= <"">
##$SUBNAM7= <"">
##$SUBNAM8= <"">
##$SUBNAM9= <"">
##$SW= 18.0517328524113
##$SWIBOX= (0..15)
0 0 2 0 0 0 0 0 0 0 0 0 0 0 0 0 
##$SW_h= 3612.71676300578
##$TD= 16384
##$TD0= 1
##$TE= 0
##$TE2= 300
##$TE3= 300
##$TEG= 300
##$TL= (0..7)
0 120 120 120 120 120 120 120 
##$TP= (0..7)
150 150 150 150 150 150 150 150 
##$TP07= 0
##$TPNAME0= <>
##$TPNAME1= <>
##$TPNAME2= <>
##$TPNAME3= <>
##$TPNAME4= <>
##$TPNAME5= <>
##$TPNAME6= <>
##$TPNAME7= <>
##$TPOAL= (0..7)
0.5 0.5 0.5 0.5 0.5 0.5 0.5 0.5 
##$TPOFFS= (0..7)
0 0 0 0 0 0 0 0 
##$TUNHIN= 0
##$TUNHOUT= 0
##$TUNXOUT= 0
##$USERA1= <user>
##$USERA2= <user>
##$USERA3= <user>
##$USERA4= <user>
##$USERA5= <user>
##$V9= 5
##$VALIST= <valist>
##$VCLIST= <CCCCCCCCCCCCCCC>
##$VD= 0
##$VDLIST= <DDDDDDDDDDDDDDD>
##$VPLIST= <PPPPPPPPPPPPPPP>
##$VTLIST= <TTTTTTTTTTTTTTT>
##$WBST= 1024
##$WBSW= 4
##$XGAIN= (0..3)
0 0 0 0 
##$XL= 0
##$YL= 0
##$YMAX_a= 140811
##$YMIN_a= -120408
##$ZGOPTNS= <>
##$ZL1= 120
##$ZL2= 120
##$ZL3= 120
##$ZL4= 120
##$ABSF1= 0
##$ABSF2= 0
##$ABSG= 0
##$ABSL= 0
##$ALPHA= 0
##$AQORDER= 0
##$ASSFAC= 0
##$ASSFACI= 0
##$ASSFACX= 0
##$ASSWID= 0
##$AUNMP= <proc_1d>
##$AZFE= 0.1
##$AZFW= 0.1
##$BCFW= 0
##$BC_mod= 2
##$BYTORDP= 0
##$COROFFS= 0
##$CY= -3
##$DATMOD= 1
##$DC= 0
##$DFILT= <>
##$DTYPP= 0
##$F1P= 0
##$F2P= 0
##$FCOR= 1
##$FTSIZE= 16384
##$FT_mod= 6
##$GAMMA= 0
##$GB= 0
##$INTBC= 1
##$INTSCL= 3.241238e-09
##$ISEN= 128
##$LB= 0.25
##$LEV0= 0
##$LPBIN= 0
##$MAXI= 10000
##$MC2= 0
##$MEAN= 0
##$ME_mod= 0
##$MI= 1.114404
##$NCOEF= 0
##$NC_proc= -7
##$NLEV= 6
##$NOISF1= 3.799351
##$NOISF2= 2.8
##$NSP= 0
##$NTH_PI= 0
##$NZP= 0
##$OFFSET= 15.4968
##$PC= 1
##$PHC0= -5301.897
##$PHC1= 7.62193
##$PH_mod= 1
##$PKNL= yes
##$PPARMOD= 0
##$PSCAL= 0
##$PSIGN= 0
##$REVERSE= no
##$SF= 200.130004982714
##$SI= 16384
##$SIGF1= 3
##$SIGF2= 2
##$SINO= 0.751879
##$SIOLD= 32768
##$SREGLST= <19F.Aceton>
##$SSB= 0
##$STSI= 16384
##$STSR= 0
##$SW_p= 3612.71676300578
##$SYMM= 0
##$S_DEV= 0
##$TDeff= 16384
##$TDoff= 0
##$TI= <>
##$TILT= no
##$TM1= 0
##$TM2= 0
##$TOPLEV= 0
##$USERP1= <user>
##$USERP2= <user>
##$USERP3= <user>
##$USERP4= <user>
##$USERP5= <user>
##$WDW= 1
##$XDIM= 16384
##$YMAX_p= 511996389
##$YMIN_p= -1024115
$$ End of Bruker specific parameters
$$ ---------------------------------
##NTUPLES= NMR SPECTRUM
##VAR_NAME=  FREQUENCY,     SPECTRUM/REAL,   SPECTRUM/IMAG
##SYMBOL=    X,             R,               I
##VAR_TYPE=  INDEPENDENT,   DEPENDENT,       DEPENDENT
##VAR_FORM=  AFFN,          ASDF,            ASDF
##VAR_DIM=   16384,         16384,           16384
##UNITS=     HZ,            ARBITRARY UNITS, ARBITRARY UNITS
##FACTOR=    0.220516191357247, 1,           1
##FIRST=     3101.37474580476, 0,            0
##LAST=      -511.342017201017, 0,           0
##MIN=       -511.342017201017, -1024115,    0
##MAX=       3101.37474580476, 511996389,    0
$$ Real data points
##PAGE= N=1
##DATA TABLE= (X++(R..R)), XYDATA
$$ [...]
8459A777618l70166l03696K58001J62831m4764J01038L68623M7486o4334l34644
8449A597993j89775j10315l2896r9445k45488N25577L11914J45914k16912k01318
8439A485249j1906O4740P5056j94229l65910j84096j1974K25306N4533K1992K0957
8428A179718K29825R8888R0479k62832l72866M91760J54547J61234k99226O9216
8418A540743J91604J68752j68783m20968J9810J59096k45978K71280k72454Q2358
8408A325460J10409o4343K23416m85664j77830M8545K64685l8468m03371j52613
8398F50226l22720K88376K34045k09428M49252k89229L92078j35621k16638K92894
8388A133235n8215p9412j37529P4922K24136n1452l54406j77068M80697K9886
$$ y = [1777618, 1407452, 1103756, 1361757, 1524588, 1479824, 1580862, 1949485, 1996971, 1932637, 1597993, 1408218, 1297903, 1265007, 1165562, 920074, 1445651, 1757565, 1903479, 1686567, 1485249, 1473343, 1538083, 1613139, 1418910, 1053000, 868904, 856930, 1082236, 1136769, 1158761, 1179718, 1409543, 1508431, 1598910, 1336078, 963212, 1454972, 1609519, 1770753, 1471527, 1540743, 1732347, 1901099, 1732316, 1311348, 1331158, 1490254, 1244276, 1515556, 1243102, 1325460, 1435869, 1371526, 1594942, 1109278, 931448, 979993, 1244678, 1206210, 802839, 650226, 327506, 615882, 849927, 640499, 1089751, 800522, 1192600, 1056979, 840341, 1133235, 1075020, 995608, 858079, 933001, 1157137, 1105685, 751279, 574211, 1054908, 1084794]
8378A084794Q5482J36085m97851J26096L289K42306m57143l65442O7304L03789
8368G28709O0483l16204j22159M46281l4397r8683r262l88697q1396L0108L49101
8357E63884o0979Q3829J33616K42368P4484J64071l83459j87886N1574m48641
8347B32861J43702j10340J57209M49314o8806l6017R9934L53286l20687p35465
8337A64991q8419K11336J85540O6790o65150M34496J7936K22808K08960m33632
8327C25656j49428j17675M76079k01616m82751n4242R3596J31214L90295j44115
8317B67013N85983l65894K007K15688k6768k4064l00154K68869M7535j83107j81905
8306C05203K88930L2130j10062k49749L63598j40033J48854k71734K35546l31256
$$ y = [1084794, 1170276, 1306361, 808510, 934606, 937895, 1180201, 723058, 357616, 424920, 728709, 789192, 472988, 350829, 797110, 762713, 664030, 654768, 266071, 184675, 214783, 563884, 502905, 586734, 720350, 962718, 1037202, 1201273, 817814, 629928, 681502, 232861, 376563, 266223, 423432, 872746, 803940, 767923, 867857, 1221143, 900456, 164991, 76572, 287908, 473448, 540238, -124912, 309584, 327520, 550328, 759288, 325656, 176228, 58553, 534632, 333016, -149735, -203977, -110381, 20833, 411128, 267013, 852996, 487102, 489109, 704797, 678029, 653965, 353811, 622680, 670215, 487108, 305203, 594133, 626263, 516201, 266452, 630050, 490017, 638871, 367137, 602683, 271427]
8296B71427n11764P6691J4492M06009j75253m13447j19235O26664R7573o2272
8286B10885j75297k11450K85696L16117j40413J3743k37829L84796J48932J42511
8276G37691j97369k82269K78887o6668k00962m21685k05005L84212K80805J72802
8266D80439q995J47394j8746j78818J31906L24624j38016p95786l29899P23131
8256C37234Q32629j99385o55819M2043N90163k00593k67108k00455k60905P4006
8246I1810J21713j56142M55217K44246l13904j42803j22843K25152M56522m85288
8236C73680n08207O15352J44540l02153k93165J75588K42684m27934j42040k4667
8226a46322R5753J95143j16951K53875m54397l74884L22182q6185j25957k54141
$$ y = [271427, -240337, -163646, -149154, 256855, 81602, -331845, -451080, 175584, 273157, 210885, 35588, -175862, 109834, 425951, 285538, 299281, 61452, 446248, 595180, 737691, 540322, 258053, 536940, 470272, 269310, -152375, -357380, 26832, 307637, 480439, 471444, 618838, 600092, 421274, 553180, 877804, 739788, -55998, -385897, 337234, 1169863, 970478, 314659, 356702, 946865, 746272, 479164, 278709, 17804, 91810, 213523, 57381, 512598, 756844, 442940, 300137, 177294, 402446, 858968, 373680, -134527, 480825, 625365, 323212, 30047, 205635, 448319, 20385, -121655, -146322, -50569, 144574, 27623, 281498, -172899, -547783, -225601, -311786, -437743, -691884]
8216f91884K93709L88310j20762J31556J02043L68215k76417n63460K3582L73179
8206B8071N35499m40471J21095j51745K84659M45817m86263k51813J13088l93708
8196a95771j5810M2807P31968K53580o01162k22971M94776M45903q31450N00043
8186F01913R2879l07815l32944K93390P58189M9028o04956k59311J40016O06587
8176A036976l69396k68691J2255J28710K62372j29241n8424J67599K41413m61409
8166E62164m52160Q2182Q16701K8808m54656p9633J36078J52394m58802n10794
8156a77718L77030L6236Q2179l97426J74518L95461m1915J17596r32138j90700
8146e56877N41290o7357K98217k44304K7587N81686j63090k03452j60878R6144
$$ y = [-691884, -398175, -9865, -130627, 929, 102972, 471187, 194770, -368690, -345108, 28071, 563570, 123099, 244194, 92449, 377108, 822925, 336662, 84849, 197937, -195771, -211581, -168774, 563194, 816774, 215612, -7359, 487417, 933320, 101870, 601913, 694792, 386977, 54033, 347423, 1105612, 1154640, 549684, 290373, 430389, 1036976, 667580, 398889, 411144, 539854, 802226, 672985, 614561, 782160, 1023573, 562164, 110004, 192186, 1008887, 1037695, 583039, 503406, 639484, 791878, 333076, -177718, 199312, 235548, 317727, -79699, 94819, 490280, 448365, 565961, -366177, -556877, -15587, -82944, 215273, -29031, -1444, 580242, 417152, 213700, 52822, 148966]
8136A48966J0639N4644r7970p1988K37283q9552k09375K78533p8377j21907l31415
8125b70519r5108O12796l30314n0085J72031L18570M09885k49626k31962q9480
8115A96188k57421K73381P3660K30267J26342J4647j23148l11505L64383k63827
8105C22967l66777q9769J07392N32918J73246N4622k54114m0737k31847K10612
8095D18513L60130q24353j3582Q82167o3187j6458l33115J32691M47795o40526
8085C50075Q391j36885J01758k97565J00740n8725P9570P4477J97223o0420m33706
8074g5067r1383J13073R1979j3438l552N6364L60721l1975N54844n91363n96238
8063b26035J72932O10380n739m52791l43652M76995j50916j47805N2380n19705
$$ y = [148966, 159605, 214249, 116279, 44291, 281574, 192022, -17353, 261180, 182803, 60896, -270519, -365627, 247169, -83145, -133230, 38801, 357371, 767256, 517630, 285668, 196188, -61233, 212148, 285808, 516075, 642417, 657064, 533916, 222411, 586794, 322967, -43810, -133579, -26187, 506731, 679977, 734599, 480485, 439748, 207901, 418513, 778643, -45710, -59292, 822875, 759688, 743230, 410115, 542806, 990601, 350075, 358466, 221581, 323339, 25774, 126514, 67789, 147359, 221836, 419059, 358639, -75067, -166450, -53377, 38602, 25164, 21612, 77976, 438697, 406722, 961566, 370203, -226035, -53103, 557277, 551538, 98747, -244905, 232090, 81174, -66631, -14251, -533956]
8053e33956J71471q7953N27004L26446l0533j09901L30188l22543p6276j13683
8043H0264K08889k14660O3233P0420K26498J82916k05938K14881K13796j25488
8033G14811k82385J8988l36597J20896j56333k55031R4346M53469N7069m7383
8023C81850k30318K60212L90989m41576l42382o9464L77061J90670l66632j01349
8013D9061k61917j5555M34120M05005r1230o06548l7834M93805p2550J94500n39765
8002d8908k08885N64892j3674J20434J10993k23389m7853Q4487K18654L02419
7992H59170j01658j83696k99125J32986j15343J59583o7295k87408L16940K76535
7982F90689j93942O412k31504J32929M8690k05326L5409p6645K45128m0773m3557
$$ y = [-533956, -362485, -450438, 76566, 403012, 372479, 262578, 592766, 270223, 193947, 80264, 289153, 74493, 137726, 208146, 434644, 617560, 411622, 626503, 840299, 714811, 432426, 451414, 114817, 235713, 79380, -175651, -81305, 372164, 429233, 381850, 151532, 411744, 802733, 361157, 18775, -50689, 326372, 517042, 150410, 49061, -212856, -228411, 205709, 610714, 519484, -87064, -124898, 368907, 296357, 490857, -48908, -257793, 307099, 293425, 413859, 524852, 301463, 253610, 338097, 556751, 859170, 757512, 573816, 274691, 407677, 292334, 451917, 384622, 97214, 414154, 690689, 496747, 503159, 271655, 404584, 453274, 247948, 283357, 206712, 451840, 411067, 367510]
7971C67510Q2184J69317K9419R583o1860J98788l24735M6560n9026p0697J43826
7960E30869O5477K78549j47966l42113L96390j99912l13709M48519l68981j52588
7950A94535o5893q2435M82814j23192m97658Q5731N3993N83325N0507j67549m73615
7939D0563o3176M37224k65271L7352J10664P8648O9579J02756R3032J30320j52508
7928F19183Q7942J23200k94052l94130M06495M85017q0502n89081J98458J51118
7918G13648P9285P9588j21408N7690m39568k09396M75594j65422K02822j56441
7908E16392o4098L01848l42582N65124Q1291l09782m8651M4134n5607k5209j06153
7897E56707J61877j93820k42646J49562M78401J5883K10319j47603J1603o5155
$$ y = [367510, 449694, 619011, 648430, 658013, 596153, 794941, 470206, 516766, 457740, 387043, 530869, 596346, 874895, 726929, 384816, 781206, 581294, 267585, 716104, 347123, 194535, 128642, 46207, 529021, 405829, -91829, -6098, 47895, 631220, 681727, 514178, 40563, -22613, 414611, 149340, 186692, 297356, 376004, 445583, 548339, 641371, 771691, 619183, 707125, 830325, 536273, 142143, 548638, 1033655, 953153, 364072, 562530, 713648, 792933, 872521, 751113, 808803, 369235, 159839, 635433, 470011, 672833, 516392, 452294, 754142, 411560, 976684, 1057975, 748193, 699542, 743676, 688069, 662860, 556707, 718584, 524764, 282118, 431680, 910081, 925964, 1136283, 988680, 1000283, 935128]
7887I35128M9150J89207r1134J97004j65769k72042m2152j06557M03393K56704
7877A352932l56339k00012J3052N345j02953J56582m16153j01988m14745L16193
7867B51914P47578j49412m17656m82347O7445O65196n6807j02357L5788l1973
7857E27369K33621J98935j1326j13702K16007m14902J39393l2774p3875K1745
7847F90491j96588J00046K40707m7573K42654l62640L30467j72755J1747K5010
7837H61566l72521J91395K19329L67543Q7555j83747k30494L44929M9819j50462
7827A184912m18235J89115K00470p8743l62904L76892M14783k6022k82252n1518
7817A146498K17244M89146O5323J9864n3996o89919J57170J64616M66467l45953
$$ y = [935128, 984278, 1173485, 1082351, 1279355, 1113586, 841544, 799392, 692835, 1096228, 1352932, 996593, 796581, 809633, 814978, 712025, 868607, 452454, 350466, -64279, 251914, 999492, 850080, 432424, -49923, 17522, 682718, 625911, 523554, 559342, 527369, 760990, 959925, 948599, 834897, 1050904, 636002, 775395, 742621, 668746, 690491, 493903, 593949, 834656, 787083, 1029737, 667097, 997564, 824809, 836556, 861566, 489045, 680440, 899769, 1267312, 1354867, 1171120, 940626, 1285555, 1335374, 1184912, 766677, 955792, 1156262, 1077519, 714615, 1091507, 1506290, 1480268, 1198016, 1146498, 1363742, 1852888, 1918211, 1938075, 1884079, 1194160, 1351330, 1515946, 1982413, 1636460]
7807A636460o01401K82102K55672L36641j12037j94680M79276k99833J67219m34872
7797A514547m56951L58805j69535K33270p8965l3701K35614Q7606J42484p6564
7787A756610j77424n45446J22695N85167J61194q9160j0293L43778Q6264J04373
7777B337758o4199l6099l20389j77524P9893K03229K0690N60753k08995p2351
7767B322766k88017L77567K20015j76039m41289n12330M66602K25728J41977q776
7757B328204m44598P474J55493q5703J48602q658K57738j60933k77147j20759
7747A799713N70182j32613m62584m7261J97902L78970m41361Q3003K6001K1825
7737A993777o4051l98847j45178L65402J02850r6345m66864K29671L00385J17683
$$ y = [1636460, 1035059, 1317161, 1572833, 1909474, 1797437, 1602757, 2082033, 1782200, 1949419, 1514547, 1057596, 1416401, 1246866, 1480136, 1401171, 1367470, 1603084, 1690690, 1833174, 1756610, 1579186, 1033740, 1156435, 1741602, 1902796, 1813636, 1803343, 2147121, 2233385, 2337758, 2273559, 2237460, 1917071, 1739547, 1819440, 2022669, 2043359, 2604112, 2395117, 2322766, 2034749, 2412316, 2632331, 2456292, 2015003, 1502673, 1969275, 2195003, 2336980, 2328204, 1883606, 1891080, 2046573, 1960870, 2109472, 2100814, 2358552, 2197619, 1920472, 1799713, 2369895, 2237282, 1774698, 1727437, 1925339, 2304309, 1862948, 1945951, 1971952, 1993777, 1929726, 1530879, 1385701, 1751103, 1853953, 1757608, 1290744, 1520415, 1820800, 1938483]
7727A938483K06183j45015j93844o5892m95254J86593N17450k56024r6611j74511
7717A421558J65401N63176j36361k80153m2303l10663J58028j65653k7923N77538
7707A922645M7994j57208k67974M9299P66245k31756m08409l50307L19558O2367
7697A752454l38319j12816K44396K47800J76686k1408K09392M3764k77933k75584
7687A648432n54507J41453j31523p7851n3161N06M35964j22879p040j1867r9187
7676A168340K79670k21422m30850l3042N052M10080k09185m10684M4123L68385
7666I70467J74994p1655m23847k39306K54998M47155j56563n82805m5640K03609
7656E31407L00935j26537l48529N60365k3785j4204K16945L14396p8416j11875
$$ y = [1938483, 2144666, 1999651, 1805807, 1739915, 1244661, 1431254, 1948704, 1692680, 1596069, 1421558, 1586959, 2150135, 2013774, 1733621, 1691318, 1380655, 1538683, 1373030, 1345107, 1922645, 1970639, 1813431, 1545457, 1594756, 2361001, 2129245, 1720836, 1370529, 1690087, 1752454, 1414135, 1301319, 1545715, 1793515, 1970201, 1948793, 2158185, 2201949, 1924016, 1648432, 1093925, 1235378, 1103855, 1026004, 972843, 973349, 1409313, 1286434, 1279394, 1267527, 1168340, 1448010, 1226588, 795738, 762696, 767748, 1177828, 968643, 557959, 602082, 970467, 1145461, 1073806, 649959, 410653, 665651, 1112806, 956243, 373438, 327798, 531407, 832342, 705805, 357276, 917641, 893856, 879652, 1096597, 1410993, 1332577, 1220702]
7646A220702m19235j23595Q6297K30255J01910K51689j46762J00217J54872k40365
7636A215985J32345l43215n2895k06018k38445L44299L57574j16948J76034j86808
7626A081908q2578J95789k5945J3319k45193l32475J37422M26545K75065j53676
7616A290181J88635k75827l68568R7860j56536k1187j78053O5791J47183q9003
7606G00476J86906J90194j64538l91799m36387N08232O1084J28104j25084l71468
7596B85720J38623k31906J83651K46852L069k23985k1624J32558K07782j26499
7586E94241J15916l39482P7472L1006K44166j15204k83388n6558j37250K41399
7576C72318R0446J21221K40683n08962J31477L11798J07853K9435p7950K07966
$$ y = [1220702, 801467, 677872, 764169, 994424, 1096334, 1348023, 1201261, 1301478, 1456350, 1215985, 1348330, 1005115, 952220, 746202, 507757, 852056, 1209630, 1092682, 1268716, 1081908, 999330, 1195119, 1169174, 1182493, 937300, 604825, 742247, 1168792, 1443857, 1290181, 1478816, 1202989, 834421, 932281, 775745, 754558, 576505, 642296, 789479, 700476, 887382, 1077576, 913038, 521239, 84852, 593084, 654168, 782272, 657188, 285720, 424343, 192437, 376088, 622940, 626009, 402024, 380400, 512958, 720740, 594241, 710157, 370675, 448147, 479153, 723319, 608115, 324727, 268169, 130919, 372318, 462764, 583985, 824668, 315706, 447183, 758981, 866834, 896269, 818319, 1026285]
7566A026285m0586k3370P1409l83065J74466l19264K0873J50432J88673K42552
7556A108405J39678j63026k56918Q6880L5163J03671J69779n2945n7397M22269
7546A535559J39220J52136K62611L53419M69951m089m67054q4225m18789n54778
7536A383961l04563o28015L44523m8163L61159J10501M3578k34456j98993m1356
7526G88176L22303l30434l73359n34278Q3904N07677J26491L2638m09047J34533
7516C48604J87598O07936m22372j44646l67040m165J55214j10831n3119M69363
7506F66542J59192j05861m14270q51J48544J63039O5682j38053O8579k10419M14958
7495H17082J37713m63862k42414j52730N45674k73927p6857L25457R3527m03237
$$ y = [1026285, 985699, 962329, 1033738, 650673, 825139, 505875, 526748, 677180, 865853, 1108405, 1248083, 1085057, 828139, 915019, 950182, 1053853, 1223632, 1170687, 1113290, 1535559, 1674779, 1826915, 2089526, 2442945, 2912896, 2908807, 2441753, 2357528, 1938739, 1383961, 1079398, 451383, 795906, 747743, 1108902, 1219403, 1262981, 1028525, 829532, 788176, 1110479, 780045, 406686, -127592, -43688, 463989, 590480, 623118, 214071, 348604, 536202, 1144138, 721766, 577120, 210080, 205915, 361129, 250298, 197179, 666542, 825734, 719873, 305603, 304752, 453296, 616335, 682017, 543964, 612543, 402124, 817082, 954795, 490933, 248519, 95789, 641463, 367536, 290679, 616136, 709663, 306426]
7485C06426j13454J26429N77789O6483m82212m6999J64674J16837n7552o7835
7475E90586l8158N3987o2514k41893L38189K52142Q722k55655k87245J54594L61938
7464H74693l1411k21831k75089N1275m15137M02955J25945N7495J97840j01238
7454F65497K96357Q0719l51955j34158k30519J30022j44369j2607K55702M1921
7444E96610L22869k59389o4155J90897L0719j4090j37807j43514j5749k42534
7434B63857k02842J01184N47153j48007j91923j35252L62062J86407l68648j46985
7424B67006J33470J46154l48186j77754K07998n7068o0232r3593k67634K07219
7414d2620k0232L77656k59237l56440j5491K87088N81783j95038l14219L18077
$$ y = [306426, 192972, 319401, 897190, 963673, 481461, 434462, 599136, 715973, 658421, 590586, 552428, 606415, 543901, 302008, 640197, 892339, 901061, 645406, 358161, 512755, 874693, 843282, 621451, 346362, 397637, -17500, 385455, 511400, 568895, 766735, 665497, 961854, 1042573, 690618, 556460, 325941, 455963, 311594, 298987, 554689, 596610, 919479, 660090, 595935, 786832, 817551, 803461, 665654, 522140, 506391, 263857, 61015, 162199, 709352, 561345, 369422, 234170, 596232, 782639, 413991, 267006, 400476, 546630, 198444, 20690, 228688, 171620, 111388, 17795, -249839, -42620, -62852, 314804, 55567, -300873, -316364, -29276, 552507, 357469, 43250, 361327]
7404C61327J78747N7512l70709m22745J22694R2565K87159l36456r4680L07083
7394A82497M35878K18334l38106l52973o613r8654J63502K22782o0422j50065
7384B16160O03693j33939J77685k39606j31877L86648l86173Q9076L50324j88333
7374G43658L67400k22663J66752j4553k32705j14010j98109N3752l91692K1124
7364A78954J52169j29654M02427l67671j83835k37619R5549N38246m150n5388
7354C89028j47178J2618K61509l33064M0430k63900j02797p4569k8481p5156L66896
7343D5336N05238k03461j25385k65065J75863R3735o23850P9623n2409M17375
7333D7000L21813m3442L44595k3258k5018j80291n86332J37205J22564k28830
$$ y = [361327, 540074, 597586, 226877, -195868, -73174, 19391, 306550, -29906, -124586, 182497, 618375, 836709, 498603, 145630, 139017, 40363, 203865, 426647, 366225, 216160, 819853, 685914, 863599, 623993, 492116, 878764, 492591, 581667, 931991, 743658, 1111058, 888395, 1055147, 1040594, 807889, 693879, 495770, 549522, 157830, 178954, 331123, 201469, 603896, 236225, 52390, -185229, -89680, 448566, 444416, 389028, 241850, 254468, 515977, 182913, 223343, -40557, -143354, -217923, -246404, -321560, 45336, 550574, 347113, 221728, -43337, 132526, 226261, -397589, -317966, -370375, 47000, 368813, 325371, 669966, 646708, 621690, 441399, -144933, -7728, 114836, -113994]
7323a13994j83336L55726K75900J87714q8920m57594N51599j65503l17617m09134
7313c65159J87872L51977O557O0270K2350O3685M85333m26412L94682j0528m51775
7302C18852N7121j45501L54642J42771j48122k22359j79381n6505O9670J43394
7292C34582P8414j31997k39273L7345J18566l0334j57749O7514p1727K13038Q1501
7281B99880L00313O2448L27453k59231m44564q39L35669m334k21056m80986J82741
7270I7494M80627j06508r3342J67289J12637K97419l24505j46053k51274p9390
7260A54394M1466K1116p8902P3849L18253M19758j80309m72192k9065L34558K5141
7249F28067k04673m6605J18193L38271l5940l67506n2948L52833L00674m32828
$$ y = [-113994, -297330, 58396, 334296, 522010, 433090, -24504, 527095, 361592, 43975, -365159, -177287, 174690, 181247, 241517, 263867, 327552, 812885, 386473, 781155, 770627, 318852, 375973, 230472, 585114, 727885, 579763, 357404, 178023, 121518, 191188, 334582, 412996, 280999, 41726, 79071, 197637, 167303, 9554, 77068, 5341, 218379, 299880, 600193, 662641, 990094, 730863, 286299, 285460, 621129, 616795, 395739, -85247, 97494, 578121, 471613, 378271, 545560, 658197, 955616, 631111, 485058, 233784, 154394, 195860, 216976, 138074, 211923, 530176, 949934, 769625, 297433, 268368, 602926, 628067, 423394, 376789, 494982, 833253, 797313, 429807, 376859, 729692, 1030366, 597538]
7239E97538k08315j45249P1724J74517k68072J95985K79213l07949K66920J23083
7229G79395J58356k61023m33361k13893K74979K33560l39750J91654l87295J12645
7219A15267N7119k33504J47950J60587k2130l1992j87390J8478J36514K90560
7209D51459Q4270J40317j86525k34912K57313K88302m3123r9643m98051M85936
7199F45343K35139j60062j21974j8l3645j05646m1196N8303K80773K02694k47132
7188G12579l46250k01028J00180K31550j34930k93346N4061L53580K75764J26127
7178H78287k98111k41570M4708k94269L35609J5670K14350K27638j62886j65469
7168E53957K83536j20907K95272k45545k68874k7825q8337J09745L96092l02126
$$ y = [597538, 389223, 243974, 315698, 490215, 222143, 418128, 697341, 389392, 656312, 779395, 937751, 676728, 243367, 29474, 304453, 538013, 198263, 389917, 2622, 115267, 172386, -61118, 86832, 247419, 225289, 193297, 5907, 24385, 160899, 451459, 535729, 676046, 489521, 254609, 511922, 800224, 757101, 657458, 159407, 645343, 880482, 720420, 598446, 598428, 564783, 459137, 417941, 476244, 757017, 959711, 712579, 366329, 165301, 265481, 497031, 362101, 68755, 122816, 476396, 752160, 878287, 580176, 338606, 383314, 89045, 424654, 440324, 654674, 882312, 719426, 553957, 837493, 716586, 1011858, 766313, 497439, 469614, 381277, 491022, 887114, 584988]
7158E84988j58430k5153J53891o3005k14568J39632k73674m57791K04929J22855
7148A3674N97090k21826j96883L04371k57888r8900M5518J7818L42010P3151m6062
7137E72073M2480j80418M19343k81935j64850j42725K85378l2900P5308N1344
7127F43098J051n0529j39079k99405J12128M84739J80533J21542k57124J23799
7117I20753j78050O6566k68915j72280l0456j76741J2247K56014o5439K94655
7107F58354j8046l2510N45892l27577J14709k67172j24019l30899j61193K27042
7097B84581P32623m0752k87558Q8855j16268K800k8597k28302K12946j21501K59834
7086G58661R9573n3782J52746l61079m41446k79210R5532N21054m82947k16121
$$ y = [584988, 426558, 401405, 555296, 492291, 277723, 417355, 143681, -314110, -109181, 13674, 610764, 388938, 192055, 496426, 238538, 139638, 185156, 202974, 544984, 618135, 572073, 614553, 434135, 853478, 571543, 406693, 263968, 549346, 516446, 591754, 643098, 644149, 593620, 454541, 155136, 267264, 752003, 932536, 1054078, 796954, 920753, 742703, 809269, 540354, 368074, 337618, 160877, 173124, 429138, 363699, 658354, 640308, 607798, 1153690, 826113, 940822, 673650, 549631, 218732, 57539, 284581, 1017204, 976452, 688894, 777749, 661481, 664281, 635684, 407382, 620328, 498827, 758661, 858234, 804452, 957198, 596119, 154673, -124537, -29005, 492049, 9102, -207019]
7076b07019n375L41556O2550j50392R482J63520J6786K3978k3417L5713j56339
7065A11043l5585J59701K21131L82026l94935m9648j74971J88157R2050m07035
7055I1934R3452N88501L96704m20682j30097l30033J18982O7398l13277l43887
7045a81005L63209m7827P24407m15400k68749j44125L20972L84273n16289j65768
7035E3698J34763L13022K55823M2511q8777j44901n3829J23427k03185M23227
7025H55779m30252k47321l8674J66307O47137p8423l64084j88182m8731N11834
7015G85390m59422j56241j79085L35926M56422k37214l9651N7828j4146k3117
7005E26690m27815k92056L55537K13757o0385L554K9916L32429K55015m36978
$$ y = [-207019, -212394, 129162, 191712, 41320, 50802, 214322, 231108, 255086, 231669, 267382, 111043, 75458, 235159, 456290, 838316, 443381, 393733, 218762, 406919, 498969, 91934, 185386, 773887, 1170591, 749909, 619812, 289779, 408761, 476159, 162882, -181005, 182204, 134377, 858784, 443384, 174635, 30510, 351482, 735755, 219466, 53698, 188461, 501483, 757306, 799817, 711040, 566139, 512310, 635737, 432552, 855779, 425527, 178206, 139532, 305839, 952976, 874553, 510469, 322287, 273556, 785390, 325968, 169727, -9358, 326568, 782990, 545776, 506125, 563953, 549807, 526690, 98875, -193181, 162356, 376113, 315728, 319282, 349198, 681627, 936642, 499664]
6995D99664j2733K9416K87543l24454l87646J55034J83160N57844l60133k55345
6985C72350m052J16769K75916l25160k62L81378m16669M28847m42694J95704k7898
6974E54229m982m7902l84548J78868K32089m5125K39178l52610J12121J96115
6964F77433k06584J5366J46855l36420M68234J49587m61059K00396q573n60K5997
6953F70672l82036J80552K3101k88831R6378k02890J48912l8573J16379J65019
6943D88683M5383j56514q0830j07524q5300J1475j18036l1108M497J73135K3350
6932A67211K18793j29971O821J44907k65081q0055L82589N2202J8343P2414J19213
6921G07386j13247o0417q6870J7141j49579j61824L7932j20418j62320L03599
$$ y = [499664, 486931, 516347, 803890, 479436, 91790, 246824, 429984, 987828, 627695, 372350, 368298, 485067, 760983, 435823, 435561, 816939, 400270, 829117, 386423, 582127, 554229, 549247, 501345, 116797, 295665, 527754, 482629, 721807, 369197, 481318, 677433, 470849, 486215, 633070, 296650, 764884, 914471, 453412, 653808, 645235, 644675, 670672, 288636, 469188, 492289, 203458, 299836, 96946, 245858, 207285, 323664, 488683, 534066, 377552, 296722, 189198, 103898, 115373, -2663, -33771, -29274, 143861, 167211, 386004, 256033, 262854, 407761, 142680, 62625, 445214, 497416, 515759, 588173, 707386, 594139, 533722, 446852, 463993, 314414, 152590, 190522, 70104, -92216, 211383]
6911B11383L70442l2430j34269j5654J48413O0694o7167l91872K09071k39543
6901A19068K12141J75760n073n9657j14123J36847k3650j59691M46547m46519
6891B81650K62905l9908K24877M2944n17678P8658m14k82138K71740j78051J20318
6880B64903j32528J25967M79502l10010l54555j42004M30114L35285m56105l85489
6870a44920L27640L32506J88695l52154j14818K05194p1524p160k81681J56370
6860B38148K219o5265o8638M06884j17085K9217q789J17184K6953o21156j87855
6849b48183Q43980K56643n03901m48030K01267M89599M4990l1497k37875L305
6839C70298K6209P2137n5223l8724j39265m1044q8753K81068K93670K3552j18462
$$ y = [211383, 581825, 549395, 415126, 399472, 547885, 608579, 541412, 149540, 358611, 119068, 331209, 506969, 501896, 442239, 328116, 464963, 441313, 281622, 728169, 281650, 544555, 504647, 729524, 772468, 254790, 333448, 333034, 50896, 322636, 144585, 264903, 132375, 258342, 737844, 427834, 73279, -68725, 361389, 696674, 240569, -144920, 182720, 515226, 703921, 351767, 236949, 442143, 370619, 363459, 81778, 238148, 240367, 175102, 106464, 513348, 396263, 425480, 416691, 533875, 560828, -60328, -248183, 595797, 852440, 348539, -99491, 101776, 591375, 636365, 604868, 366993, 370298, 396507, 468644, 413421, 374697, 235432, 194388, 105635, 386703, 680373, 703925, 585463]
6828E85463n58322k15087M03704J46940N5239j61799j67754M36643M27334j37765
6818H14596l70866k74207M44395R0349k95156k46069L70759J84921l42524j67946
6808B08252K35440K3065j69042M8670J9990J03428J13544j49436J04321K86518
6798H24750n2128q1407k85932j0047P1342K5439m5001O1818J27517l4664L3152
6787F34839L2260k23032n57516L11238l3448J32168j21521M6824L14777K21276
6777G57865l69344j50859j44378J70888j82197J61577K14810M26761M65277k59180
6767A091220l78113k75209J67082j46047j27483k41413J89905K75613j48998j3888
6757C92669R3849j63953j10031k12633r4229q4710J40539J05396r6868J1271J23274
$$ y = [585463, 27141, -187946, 215758, 362698, 417937, 256138, 88384, 525027, 952361, 814596, 443730, 169523, 613918, 704267, 409111, 163042, 533801, 718722, 376198, 208252, 443692, 466757, 297715, 346385, 366375, 469803, 583347, 433911, 538232, 824750, 772622, 691215, 405283, 395236, 466578, 492017, 447016, 508834, 636351, 601687, 634839, 667099, 444067, -113449, 197789, 164341, 296509, 174988, 221812, 536589, 757865, 388521, 237662, 93284, 264172, 81975, 243552, 458362, 885123, 1350400, 1091220, 713107, 437898, 604980, 458933, 331450, 90037, 279942, 555555, 406557, 392669, 486518, 322565, 212534, -99, -94328, -179038, -38499, 66897, -29971, -18700, 104574]
6746A04574N85317P0794j27004m73132j51464K19750J59144M1037j75022k04553
6736D9441O67289k10541j2501P9864O9806L23300k82171J44280L56279j01933
6726A083113j21913j59948k90963j61898k13824O80209P034k39541j14384L02670
6716G70555J44550n4474k6038l3640j95952m45856R3790K71162K49818k65752
6706E08163l08335J06550J96955K00634n192k13565k48479o9811k78920L45217
6696B33217n1816L45763K1751j04763P3969n9582J7324m8278k02017l01524k91138
6685c67094K72550L74403j55756j4304j11413K19984k59169K25014R7345l56869
6675g5309L70431n22416p1908K66347K08072K14376j42685o58092N66051K43713
$$ y = [104574, 689891, 760685, 633681, 160549, 9085, 228835, 387979, 429016, 253994, 49441, 716730, 506189, 493688, 573552, 643358, 966658, 684487, 828767, 1185046, 1083113, 961200, 801252, 510289, 348391, 134567, 814776, 821810, 582269, 467885, 770555, 915105, 860631, 834593, 800953, 605001, 159145, 252935, 524097, 773915, 508163, 199828, 306378, 503333, 703967, 698775, 485210, 236731, 166920, -112000, 233217, 181401, 527164, 548915, 444152, 518121, 458539, 475863, 427585, 225568, -75956, -367094, -94544, 279859, 124103, 109799, -1614, 218370, -40799, 184215, 281560, -75309, 295122, -227294, -299202, -32855, 175217, 389593, 246908, -411184, 154867, 398580]
6665C98580J25357l81940m15670M61352K2206K060L64323J95064K18345n60616
6655D29061k37833O26285k00064j41765l57442N7478M16349q5891k30110j41299
6645A34769J44656K70962l20426K11950J67398j76782o507j62852K24023j02151
6635C85040l45647J34394M20839K2562k95662j2648M09859J67138k83873Q9801
6625F91803L5681K30763j19261m26l21688k55937J81097L46920j6612j97015k48077
6614C27248N4788Q9114n5982R8220m85801J41342L74000K32891J45722l51914
6604E69628N8197J41915l72139q0280j12872K7944J50482k39974L48029k82250
6594B08680J53376K95357Q7442p9823k38962K39173J4676k91465J46527j01546
$$ y = [398580, 523937, 141997, -273673, 187679, 209885, 211945, 576268, 771332, 989677, 429061, 191228, 817513, 617449, 475684, 118242, 175720, 592069, 506178, 276068, 134769, 279425, 550387, 229961, 441911, 609309, 432527, 426020, 263168, 487191, 385040, 39393, 173787, 594626, 617188, 321526, 308878, 718737, 885875, 602002, 691803, 727484, 958247, 838986, 838560, 516872, 260935, 442032, 788952, 772340, 575325, 327248, 382036, 471150, 415168, 513388, 27587, 168929, 542929, 775820, 921542, 569628, 627825, 769740, 397601, 317321, 204449, 232393, 382875, 142901, 490930, 208680, 362056, 657413, 744855, 665032, 426070, 665243, 679919, 388454, 534981, 433435]
6584D33435j60588Q2127K68597L92587m81387j50833K14181o6312n8875j76191
6574B96741o0762R5024K5255j11470J06781o8823K68284r4644k92850l0898K31284
6563C63922K78702l33990k06660M896M07404J2971N3550P686K37330O0968Q0373
6552I67152J00772J73242m25515j64237Q0007j49066J252k64157K9471K33780
6542E82701J98736j53778j63787j03869L82584K4601k82258j59623J04494J73118
6532F02919K64518K039J02855p7739J191j91r1443j05166m02830K76885J31252
6521G04290j706M2026J66625l1037M3961k16387J1640k10228k9341K41574k18278
6510E03139j96903J68012k8551J61691l27567j7478M86763j68866K68373n10937
$$ y = [433435, 272847, 354974, 623571, 1016158, 534771, 383938, 598119, 531807, 472932, 296741, 235979, 331003, 356258, 244788, 351569, 282746, 551030, 456386, 163536, 132638, 363922, 642624, 308634, 101974, 106870, 514274, 527245, 580795, 588481, 825811, 886779, 967152, 1067924, 1241166, 815651, 651414, 731421, 582355, 583607, 319450, 348921, 582701, 781437, 627659, 463872, 360003, 742587, 767188, 484930, 325307, 429801, 602919, 867437, 869476, 972331, 894592, 895783, 895592, 804149, 698983, 296153, 573038, 704290, 702584, 744610, 911235, 880198, 924159, 707772, 719412, 509184, 479843, 721417, 503139, 306236, 474248, 445697, 607388, 279821, 262343, 749106, 580240, 848613, 337676]
6500C37676L7578J86278K10978J03435k99682j22728K19784l6742J48771J28859
6490I14207k4984J1034J56307j73691p0523K7356m98411M01104k505K13884K48051
6479A201829r3528l44j89884Q4520j44778l78080j42280J61085J62164o2377Q1077
6468F79404k55418P3424P2600p2473K08209j61885l4512R7608n0055M02599M9700
6457A009201J47171j43610j5368K15177j92886L1508r3072L9116k74555L19298
6447A041980l6991j3440k48502j79788N22517r0612l84862j39369j37706L88621
6437G21848l48601j95776L00061j11810m6922k54429K04901J59718N47256J48557
6427A124803j57334r2864Q9815O4312J56654n01483k53185m32769P2692Q34374
$$ y = [337676, 375254, 561532, 772510, 875945, 576263, 453535, 673319, 636577, 785348, 914207, 889223, 900257, 1056564, 882873, 812350, 839706, 341295, 742399, 739894, 953778, 1201829, 1108301, 1107957, 918073, 1002593, 857815, 479735, 337455, 498540, 660704, 598327, 679404, 423986, 497410, 570010, 497537, 705746, 543861, 509349, 606957, 556902, 959501, 1009201, 1156372, 1012762, 997394, 1212571, 1019685, 1051193, 958121, 997237, 722682, 1041980, 1004989, 991549, 743047, 563259, 1085776, 995164, 610302, 470933, 333227, 721848, 373247, 177471, 477532, 365722, 318800, 64371, 269272, 428990, 976246, 1124803, 967469, 874605, 964420, 1028732, 1185386, 683903, 430718, -2051, 70641, 905015]
6417I05015K98020k76245k49166p5656L61109K21471k83387L38449l48101m03142
6407D88367k52497N68711M97458m15826l16127l907R6370M35133l42918j08648
6397F46116j09775j52133M57060o1249o1351q7473K35008K07198r2336j399N0586
6386A030252L26781M0675m49128j50605j56618L39485K04704k51715k723K79612
6376A210720k39670J45481j92108K00808L29537n05574j6894K528J21203k6002
6366A030029l49196l8656q5023j26645L5521j76404K59547r6055o833R9073J39824
6355F85182K9247k00218j87024L19743l5671j09705L99645J77234J90709l73615
6345H95527k01845J48931J44186p6055j98762Q9026J82601L3804J42955L50009
$$ y = [905015, 1203035, 926790, 677624, 601968, 963077, 1184548, 901161, 1239610, 891509, 488367, 235870, 804581, 1302039, 886213, 570086, 566179, 662549, 1097682, 754764, 646116, 536341, 384208, 841268, 780019, 718668, 631195, 866203, 1073401, 981065, 979666, 1030252, 1357033, 1397708, 948580, 797975, 641357, 980842, 1185546, 933831, 931108, 1210720, 971050, 1116531, 924423, 1125231, 1454768, 949194, 932300, 934828, 1056031, 1030029, 680833, 642177, 557154, 430509, 466030, 289626, 549173, 453118, 446285, 545358, 685182, 714429, 514211, 327187, 646930, 611259, 501554, 901199, 1078433, 1269142, 895527, 693682, 842613, 986799, 910744, 711982, 801008, 983609, 1017413, 1160368, 1510377]
6335A510377K42607l94916m84483j76595K23990j30473k6056J2678L57040J61227
6325A295396m02974m0824M18214m0114l26888m10198M36097N98583n05220Q6531
6315A108603M29715K14544m26150n35971K76072L05438k04743k96089k0040M30462
6305A281841O6243K06317o8958j88541k9652q9600j52466J91794o9274j65359
6295I82345Q3144l0811j32878J22915P7449r2383q5107l17968R1781N54014K42202
6284A494703j05764M6399r6694L38201j02698j99025K35360P3188k80352J35838
6274A539156J70848N00888n2985l93317K1313k16317J86432J1960j5184j82391
6264A570403M44769J62870N5021j68571j04496k85935p756p9008j07850M3653
$$ y = [1510377, 1752984, 1358068, 873585, 696990, 920980, 790507, 764451, 777129, 1134169, 1295396, 892422, 851598, 1269812, 1229698, 902810, 492612, 928709, 1527292, 1022072, 1108603, 1538318, 1752862, 1326712, 790741, 1066813, 1372251, 1167508, 871419, 851379, 1281841, 1348084, 1554401, 1485443, 1296902, 1267250, 1177650, 1025184, 1216978, 1147704, 982345, 1065489, 1034678, 901800, 1024715, 1102164, 1009781, 924674, 606706, 698487, 1252501, 1494703, 1388939, 1435338, 1338644, 1676845, 1574147, 1375122, 1610482, 1683670, 1403318, 1539156, 1710004, 2210892, 2157907, 1764590, 1785903, 1569586, 1756018, 1767978, 1752794, 1570403, 2015172, 2178042, 2233063, 2064492, 1959996, 1674061, 1666305, 1587297, 1479447, 1523100]
6254A523100r1559K33056L97380o0800R2389j42145K09889J09559k56160j66447
6244A848262o5298K67090J26090Q8368M57305k61652J54522q4529m42006K10214
6234B298366j97746K43076l13385j38907K08344J3914K44145J79150j88497L12078
6224B660538j28958k9164j51437j76974L85529n1084j54529j59507J67667N50335
6214B912416m643j91667K73893K67073L65905l23099k11127K03791K88320k84444
6204C296418m33553k30678K13749P42898j15446n36331J26993K67834P7452N0285
6194C459621m44529M67814K14472j47843k61311J16767J17618L73567l58843k84546
6184C252787k90781K49299J35009J46192p0867l03374k0486K60452N52649n3497
$$ y = [1523100, 1431541, 1664597, 2061977, 2001177, 2093566, 1951421, 2161310, 2270869, 2014709, 1848262, 1782964, 2050054, 2176144, 2264512, 2721817, 2460165, 2614687, 2530158, 2088152, 2298366, 2100620, 2343696, 2030311, 1891404, 2099748, 2113662, 2357807, 2536957, 2348460, 2660538, 2531580, 2502416, 2350979, 2174005, 2559534, 2508450, 2353921, 2194414, 2362081, 2912416, 2907773, 2716106, 2989999, 3257072, 3622977, 3299878, 3088751, 3292542, 3580862, 3296418, 2862865, 2632187, 2845936, 3588834, 3473388, 2937057, 3064050, 3331884, 3409336, 3459621, 3015092, 3482906, 3697378, 3549535, 3288224, 3404991, 3522609, 3896176, 3537333, 3252787, 2962006, 3211305, 3346314, 3492506, 3421639, 3118265, 3097779, 3358231, 3910880, 3857383]
6174C857383l31413j53983K13658K70534j03594j10684j50516j54366J18845K1340
6164C477204N14528l01269j54262L34106j62428j95550k51779k52698M60709k50026
6154C218535l34248n1687L31118N59400K9706j47808n27575K26478N4589j02868
6144C255640r0475j50059r3326L20178J94383M30330q5380k65690j27262p0883
6134C317456j14791j55309j91501L56632p1008m19883M78993m8711J99676P573
6124C359127k60347n8328K49302K77430j97371k77398J39487l678r2699j03022
6114C032503M7310o7697J41140j93752l3818Q7164j63183r3576j02543j21841
6104B531707J52446l73461J22046M82980l9914k8133J23402l08871p4034K95180
$$ y = [3857383, 3525970, 3371987, 3585645, 3856179, 3752585, 3641901, 3491385, 3337019, 3455864, 3477204, 3991732, 3690463, 3536201, 3870307, 3707879, 3512329, 3260550, 3007852, 3468561, 3218535, 2884287, 2832600, 3163718, 3723118, 3752824, 3605016, 3077441, 3303919, 3358508, 3255640, 3165165, 3015106, 2921780, 3241958, 3436341, 3866671, 3781291, 3515601, 3388339, 3317456, 3202665, 3047356, 2855855, 3212487, 3141479, 2721596, 3200589, 3151878, 3351554, 3359127, 3098780, 3040452, 3289754, 3567184, 3369813, 3092415, 3231902, 3228224, 3135525, 3032503, 3079813, 3012116, 3153256, 2959504, 2925686, 3012850, 2849667, 2756091, 2653548, 2531707, 2684153, 2310692, 2432738, 2915718, 2875804, 2847671, 2971073, 2662202, 2588168, 2883348]
6094B883348j15107L4811l93105J09365M88689n1919j15710l5137m6887J08872
6084B867220p78982Q972J67053k66699L24404k77628M35730J24717l33597j11935
6074B159255M6783M22694p4186l86145Q3712M88119M07569k59183l83406k54108
6064B251104P57142k63170j02280r0411L5106K12843k19865k63691J89387J05815
6054B611980m1890k14615p6965K5567L44329J64139k49194J90757k9207J28911
6044B853812j49608K3748K1987l9520j73946r9020N23897M4129p2741l17079k90475
6033B325184Q7209j47895R8651J19382R1953J17125J55725M1739j00562n5367
6023B733144J4493J19649q6905l51640M05184O28801q2993k4647j87396J90908
$$ y = [2883348, 2768241, 2803052, 2409947, 2519312, 3008001, 2956082, 2840372, 2805235, 2758348, 2867220, 2088238, 2097210, 2264263, 1997564, 2321968, 2044340, 2480070, 2604787, 2271190, 2159255, 2206038, 2628732, 2554546, 2168401, 2252113, 2740232, 3147801, 2888618, 2505212, 2251104, 3008246, 2745076, 2642796, 2552385, 2587491, 2800334, 2580469, 2316778, 2506165, 2611980, 2570090, 2355475, 2278510, 2304077, 2648406, 2812545, 2563351, 2754108, 2724901, 2853812, 2704204, 2727952, 2749939, 2710419, 2536473, 2437453, 2961350, 3005479, 2932738, 2615659, 2325184, 2412393, 2264498, 2363149, 2482531, 2574484, 2691609, 2847334, 2889073, 2788511, 2733144, 2747637, 2867286, 2780381, 2428741, 2833925, 3462726, 3379733, 3355086, 3167690, 3358598]
6013C358598J08908j41686k65246N1141k7338M127K54194n0075J61729J30125
6003C584477K47205J02066J43662j28368j77866K47723L72258l89624j79329L585
5993C825789P87740j60673k31640J39635N12878J45310j83976m59389L24741J62846
5983D863261m49612j19727R411K28824K59536q242M02088K96273J08603j16463
5973E473952l20909j74206J12212K60097j57825K05823J93547L13025L00922J39122
5963F345760j52227k64702K82876k6831l91355m00963j34672N81394K82944m48496
5953E673728K94581O50469N2789k50126j52374L32321N61181p00973k60925L87102
5943F587773K81909j9876j33579K44163O79696m9763q1872j61577L93509L31932
$$ y = [3358598, 3467506, 3325820, 3060574, 3111715, 3084377, 3088504, 3342698, 3292623, 3454352, 3584477, 3831682, 3933748, 4077410, 3949042, 3771176, 4018899, 4391157, 4001533, 3822204, 3825789, 4613529, 4452856, 4221216, 4360851, 4873729, 5019039, 4835063, 4375674, 4700415, 4863261, 4413649, 4293922, 4303333, 4532157, 4791693, 4783451, 5185539, 5481812, 5590415, 5473952, 5153043, 4978837, 5091049, 5351146, 5193321, 5399144, 5592691, 5905716, 6206638, 6345760, 6193533, 5928831, 6211707, 6184876, 5793521, 5392558, 5257886, 5839280, 6122224, 5673728, 5968309, 6618778, 6671567, 6421441, 6269067, 6601388, 7162569, 6461596, 6200671, 6587773, 6869682, 6849806, 6716227, 6960390, 7640086, 7590323, 7508451, 7346874, 7740383, 8072315]
5933H072315j40814j76540n15031k4669K71498M07269M36776q1394l22379L9621
5923G966652m425L97325o07999l20299O4528M28012j5018O42199K84006k64266
5913H570715l20989r7564O29508L21598n84039m25724J374K39880J44481K00082
5903H679322k08917O0217K27084j87474Q7604r1199L62233k93476n4189l666N1375
5892H628914N64891j23501J17961j2446j67204N2039l69326L20147j1288m99686
5882H500501k1471n79137M79796K43384J57745n992l23805J57996M40016j58597
5872H890436j91060l91615Q6933k72301j76576J37563L46074M20578r1143m02341
5862H356548L1538J44317J1659k49622p32499k23446J78695J88512K73027j18115
$$ y = [8072315, 7931501, 7754961, 7239930, 7215261, 7486759, 7894028, 8330804, 8249410, 7927031, 7966652, 7962227, 8359552, 7751553, 7431254, 7495782, 7923794, 7908776, 8550975, 8834981, 8570715, 8249726, 8152162, 8781670, 9103268, 8519229, 8093505, 8094879, 8334759, 8479240, 8679322, 8470405, 8530622, 8757706, 8570232, 8657836, 8566637, 8928870, 8635394, 8581205, 8577539, 8628914, 9193805, 9070304, 9188265, 9175819, 9008615, 9060654, 8691328, 9011475, 9000187, 8500501, 8479030, 7899893, 8379689, 8623073, 8780818, 8774826, 8451021, 8609017, 9049033, 8890436, 8699376, 8307761, 8394694, 8122393, 7945817, 8083380, 8429454, 8850032, 8758889, 8356548, 8388086, 8532403, 8544062, 8294440, 7561941, 7338495, 7517190, 7705702, 7978729, 7860614]
5852G860614j86240j65292J68074j25645k96005p6995k86215M869l10996K04422
5842F790591M5423J87602K02579l29397P5318Q9567m7764l18206l57954M4499
5832F382258j23762k69066L5749J50216L31303K7329q893O1286k5518l97070j53689
5821F010143J822m02178J20153l09572J87197M48368P5366j21099j35110Q3794
5811E958884M23745L9629l77791l00125j76819J09454K61029j73723p5238K51202
5801E940247J13638j3736o6491P7314j78331l48904J99038l87859N7799k59057
5791E133658J27324N84123P8693r2523l6128j59851L02047k95764k83410q8411
5781E269758q0718n8588L58114K62541P5342j89486k09530N14890R5204n29098
$$ y = [7860614, 7674374, 7509082, 7677156, 7551511, 7255506, 7178511, 6892296, 6897165, 6586169, 6790591, 6836014, 7023616, 7226195, 6896798, 6972116, 7061683, 7013919, 6695713, 6337759, 6382258, 6258496, 5989430, 6025179, 6175395, 6506698, 6534027, 6525134, 6586420, 6560902, 6163832, 6010143, 6011965, 5609787, 5729940, 5420368, 5607565, 6055933, 6131299, 6010200, 5875090, 5958884, 6382629, 6422258, 6044467, 5744342, 5567523, 5676977, 5938006, 5764283, 5689045, 5940247, 6053885, 6040149, 5973658, 6050972, 5872641, 5523737, 5722775, 5334916, 5392715, 5133658, 5260982, 5845105, 5923798, 5831275, 5795147, 5635296, 5937343, 5641579, 5358169, 5269758, 5189040, 5130452, 5488566, 5751107, 5826449, 5636963, 5427433, 5942323, 6037527, 5508429]
5771E508429l63669n0984J97176j22803j21599J65084M85481M3807m57002j16759
5761E167161K14956M9625J08623k49130k93707L8681l7155J96243p9254m6218
5751E069825j51373k5234L4171j03351J18366p3694j07027k6897l41980K04044
5741D596850j31501L7376L88270J24344K25323j79327j8960N1091L52590M2988
5731E489044k38944l74436k16491N94341M83814j59901J069L4937J55861J58743
5721E928037m62049J6985N1883J01331m45585R4299N46128M27502Q5550l32108
5711F011973m37608L06155J13160O2428j90764l50041K36449L73408L13915o1700
5701F377375o8229R2775J67880o5942j69771k15718K37652Q7304k73935O3982
$$ y = [5508429, 5144760, 5093776, 5290952, 5168149, 5046550, 5211634, 5697115, 5740922, 5283920, 5167161, 5382117, 5431742, 5540365, 5291235, 4997528, 5036209, 4999054, 5195297, 5116043, 5069825, 4918452, 4893218, 4927389, 4824038, 4942404, 4868710, 4761683, 4734786, 4392806, 4596850, 4465349, 4502725, 4890995, 5015339, 5240662, 5061335, 5042375, 5093466, 5446056, 5489044, 5250100, 4875664, 4659173, 5253514, 5737328, 5577427, 5578496, 5613433, 5769294, 5928037, 5465988, 5482973, 5534856, 5636187, 5190602, 5284901, 5831029, 6258531, 6344081, 6011973, 5574365, 5880520, 5993680, 6056108, 5865344, 5515303, 5751752, 6125160, 6439075, 6377375, 6309146, 6401921, 6569801, 6503859, 6334088, 6118370, 6356022, 6443326, 6169391, 6233373]
5691F233373J06320K64541j3763Q0655P0925k11805J14830Q8731j57202m0522
5681F536083m41032K4537k2412K2423K4925K30140O6540k00984m8351K90282J06148
5670F588299N7611p80307P8779O75533k00320J73482J247L55253P17804j73087
5660G494294j17035M44532l3589P2477l42513o8996K21053J67229J11177j16462
5650G832167K46457n8854J70727L1905k52531j30890L45239J3280j57874j44499
5640G895127j36462N29908L19373r8505r7702N0373N35066Q4335m17369L31792
5630H995936M39598M4162l62387r0524Q41298O17640k97912k79918J86401P76014
5620A0870308L52651l53992m16635N7180L84351K37579K4999J48222n3320K98371
$$ y = [6233373, 6339693, 6604234, 6590471, 6671126, 6742051, 6530246, 6645076, 6733807, 6576605, 6536083, 6095051, 6119588, 6097176, 6119599, 6144524, 6374664, 6441204, 6240220, 6191869, 6482151, 6588299, 6645910, 5865603, 5944382, 6619915, 6419595, 6593077, 6594324, 6949577, 7667381, 7494294, 7377259, 7821791, 7788202, 7860679, 7518166, 7449170, 7670223, 7837452, 7948629, 7832167, 8078624, 8019770, 8190497, 8222402, 7969871, 7838981, 8184220, 8197500, 8039626, 7895127, 7758665, 8288573, 8607946, 8509441, 8411739, 8462112, 8997178, 9081513, 8664144, 8995936, 9435534, 9479696, 9117309, 9026785, 9868083, 10485723, 10187811, 9907893, 10094294, 10870308, 11222959, 10868967, 10452332, 10509512, 10893863, 11131442, 11156441, 11304663, 11251343, 11549714]
5610A1549714M7143O8334K92248n2375k66523l07806r251M76600L17047K43262
5600A2358393K21718K98901K4198r704L81752N7294L08544J70112K85587N12252
5590A4609047K84770M24119K92354J26056n2043J38074R3787L33654O34047K56799
5580A7140664m2768L9914J91703N52671L19411p0884r8267K77571J56979N06865
5570A8973859N05382L27225L22678J89073K07910O27962P9904K68333K57913M92820
5560B2253059O16453O39548N69547M00183O39390J81061K02784L35663O27953
5551B6465641Q52428L48007M48483R18764P44388M20839K89407Q69725O51568
5542C2009250O51183N46351O49331J012193O50850J083977R56270L75492Q55623
$$ y = [11549714, 11596857, 11665191, 11957439, 11905064, 11638541, 11330735, 11321484, 11798084, 12115131, 12358393, 12580111, 12879012, 12903210, 12893506, 13275258, 13332552, 13641096, 13811208, 14096795, 14609047, 14893817, 15317936, 15610290, 15736346, 15684303, 15822377, 15916164, 16249818, 16883865, 17140664, 17097896, 17137810, 17329513, 17882184, 18201595, 18130711, 18032444, 18310015, 18466994, 18973859, 19479241, 19806466, 20129144, 20318217, 20526127, 21154089, 21233993, 21502326, 21760239, 22253059, 22869512, 23509060, 24078607, 24478790, 25118180, 25299241, 25502025, 25837688, 26465641, 27318069, 27666076, 28114559, 29033323, 29777711, 30198550, 30487957, 31357682, 32009250, 32660433, 33206784, 33856115, 34868308, 35519158, 36603135, 37559405, 37934897, 38790520]
5533C8790520Q43785J042292R80120N85379J021797R44148J228367J317456J434497
5524D8188361J088741J285881J145864J243661J369047J479840J471801J440740
5516E8713936J816325K077286J894865J832711J792981J831685K178793K016024
5508G4154606K815829K484299K686273K523275K906152L337068L447276L292911
5500I7647689L671762M101926M451445M798545M453819N074260N814453O093330
5492A36107229O149503O265683P206387Q126788Q615729Q957523R235149J0501077
5484B01165068J1127869J1729701J2747097J2761166J4348540J4867781J5735994
5477B94483216J6887720J7426728J8249788J8819319J9275397J9442932J9154566
$$ y = [38790520, 39634305, 40676597, 41656717, 42242096, 43263893, 44208041, 45436408, 46753864, 48188361, 49277102, 50562983, 51708847, 52952508, 54321555, 55801395, 57273196, 58713936, 60530261, 62607547, 64502412, 66335123, 68128104, 69959789, 72138582, 74154606, 76970435, 79454734, 82141007, 84664282, 87570434, 90907502, 94354778, 97647689, 101319451, 105421377, 109872822, 114671367, 119125186, 124199446, 130013899, 136107229, 142256732, 148522415, 155728802, 163855590, 172471319, 181428842, 190663991, 201165068, 212292937, 224022638, 236769735, 249530901, 263879441, 278747222, 294483216, 311370936, 328797664, 347047452, 365866771, 385142168, 404585100, 423739666]
5470D23739666J8615957J7467970J5946064J3424517J0832965P726449M112047
5463E11865635J30754l876779p350009j0874104j4002560j6617935j8967977k0082480
5455D20224545k0950946k1007916k1096645k0953515j9924617j8854137j7596444
5448B79840325j6335340j5835454j4787114j3722042j2365388j1221027j0998683
5441A84575277j0049995r090960q622252p785096o896531o633987o411948o198622
5433A22885886n393801m645058m306855m532330m399676l539257l524672l335237
5425H9209000l058664l106560k913522l068368k779361k435121k124501k157215
5417F7565688k182231j939989j669402j704079j698253k007968j630983j547017
$$ y = [423739666, 442355623, 459823593, 475769657, 489194174, 500027139, 507753588, 511865635, 511996389, 508119610, 500769601, 489895497, 475892937, 459275002, 440307025, 420224545, 399273599, 378265683, 357169038, 336215523, 316290906, 297436769, 279840325, 263504985, 247669531, 232882417, 219160375, 206794987, 195573960, 184575277, 174525282, 165434322, 156812070, 149026974, 142130443, 135496456, 129084508, 122885886, 117492085, 112847027, 108540172, 104007842, 99608166, 96068909, 92544237, 89209000, 86150336, 83043776, 80130254, 77061886, 74282525, 71847404, 69722903, 67565688, 65383457, 63443468, 61774066, 60069987, 58371734, 56363766, 54732783, 53185766]
5409E3185766j429893j581968j504610j099775j014881j077140j135519j363371
5401D2978609j074569q16781j233660j218959p37158o76464q64229q72317p91494
5392C4692978l13580n33583r94341o15827n86455m67584o73846l64573o3911k33182
5382B9846096j48474m20109p71817k16700o34050m13118p17954o50265n76l52801
5372B5520232j79396n29431m2490j13139r44936o19787k70656m1737K2682m15729
5362B2385613k91512N0227o8502l12059m24809Q4376m46150l35115l66745R4868
5352B0370192K06931k69438p26590m52018K41651J47687k77224p09370l32646
5343A8199175l52939M6862L56017J75849n34545m74484k8307N79796l04709n37842
$$ y = [53185766, 51755873, 50173905, 48669295, 47569520, 46554639, 45477499, 44341980, 42978609, 41904040, 41087259, 39853599, 38634640, 37897482, 37221018, 36356789, 35484472, 34692978, 34379398, 33845815, 32851474, 32235647, 31649192, 31181608, 30507762, 30143189, 30079278, 29846096, 29697622, 29277513, 28505696, 28288996, 27654946, 27241828, 26523874, 25873609, 25873033, 25520232, 25340836, 24811405, 24768915, 24655776, 23710840, 23091053, 22820397, 22778660, 22801342, 22385613, 22094101, 22144328, 22075826, 21763767, 21338958, 21423334, 20977184, 20642069, 20275324, 20370192, 20577123, 20307685, 19581095, 19129077, 19370728, 19518415, 19241191, 18531821, 18199175, 17846236, 17893098, 18249115, 18424964, 17890419, 17415935, 17387628, 17967424, 17662715, 17124873]
5333A7124873l64576J3106J09177k43487o2105M3491J2838o06106k86614m94916
5323A5245681k6901k41029j57920L15037m2354q052k76390k00685L50197K3109
5313A4980693l95527k34101j16603K87825J87503J22615k64306k14940k83516
5304A4069643L07857K60367m51886k12012k88771m88962J62909J4166J01592J25355
5294A3600258m74279l22737k43J41703J81452k05513l07488M0575K25530K25589
5284A3104847k37124k96834J45333j11174k46332k65875J13388L37261k4399k29555
5274A2289536l64668M6949K34475j02879P2682m84650k77085L48443K87284R7181
5264A2147268m9269j21877k99776K57050o8672q0905q2591l62328j61255n1055
$$ y = [17124873, 16760297, 16773403, 16882580, 16639093, 16576988, 16620479, 16633317, 16027211, 15740597, 15245681, 15218780, 14977751, 14819831, 15134868, 15092514, 15084462, 14808072, 14607387, 14957584, 14980693, 14585166, 14351065, 14234462, 14522287, 14709790, 14832405, 14568099, 14353159, 14069643, 14377500, 14637867, 14185981, 13973969, 13685198, 13196236, 13359145, 13373311, 13474903, 13600258, 13125979, 12803242, 12802999, 12944702, 13126154, 12920641, 12613153, 12653728, 12879258, 13104847, 12867723, 12570889, 12716222, 12605048, 12358716, 12092841, 12206229, 12543490, 12519091, 12289536, 11924868, 11971817, 12206292, 12103413, 12176095, 11691445, 11414360, 11762803, 12050087, 12147268, 12097999, 11976122, 11676346, 11933396, 11864724, 11783819, 11701228, 11338900, 11177645, 11126590]
5254A1126590J1799K18842J31758l13016P725Q9765k22349k06569j84446K75018
5244A0935117o2770m03409K69559N17037K63426l09491n06056P8298L2095k25568
5234A0588238p7155o5069p4538p7647J56700K19505k53742l21406k34645K57572
5224A0117813J48839m75966k89590N56581J75078j8375j70832m1652J00986k56685
5214I846197m06868R4724P4226o3946J4750j24986J22023n6212j36266l50825
5204I012817p7644l67384k26326K01366K37402Q8502J94929k93418l93651K44558
5194H621151J822L0579j20301l01976K90058L44099O3923O910N765o24969o8482
5183H248579m44839J98511L99551j31324N0625j42731K71860K53201m05762J02643
$$ y = [11126590, 11138389, 11357231, 11488989, 11175973, 11183698, 11273463, 11051114, 10844545, 10660099, 10935117, 10872347, 10468938, 10738497, 11255534, 11518960, 11209469, 10703413, 10781711, 10813806, 10588238, 10511083, 10446014, 10371476, 10293829, 10450529, 10670034, 10416292, 10094886, 9860241, 10117813, 10266652, 9790686, 9501096, 10057677, 10232755, 10214380, 10043548, 10001896, 10102882, 9846197, 9439329, 9534053, 9608279, 9544333, 9559083, 9434097, 9556120, 9499908, 9363642, 9012817, 8935173, 8567789, 8341463, 8542829, 8780231, 8868733, 9063662, 8770244, 8376593, 8621151, 8622973, 8653552, 8533251, 8231275, 8521333, 8865432, 8929355, 8936265, 8942030, 8317061, 8248579, 7803740, 8002251, 8401802, 8270478, 8321103, 8178372, 8450232, 8703433, 8297671, 8400314]
5173H400314j23946m17862m14922J27938Q39089m21120o9383l78415K71014M67091
5163H279798m32810k12592k84644m59841k1668J66919J99442K37685k6031l80985
5153G065273P8624J77042j79715O2013n11255J73017K40646J9139M297j37834
5143F991247n5390P3674l08421l27220M0785J63383J88402K9772o35782l73739
5133E786711L28278J44397o1793n56366J52490r4555L01218j86316J1087M67887
5123F293038m55801n0362n4901l61058M78769j06592k20497j79092j30114J59712
5113E373102M68223Q4567n17661k38177l55595K02155K79773l86385K2598L2000
5103D964600J49165J78948j99821L46486j54294q3106m18876J0449L41444J0437
$$ y = [8400314, 8276368, 7858506, 7443584, 7571522, 8410611, 7989491, 7920108, 7541693, 7812707, 8279798, 7846988, 7634396, 7349752, 6889911, 6868243, 7035162, 7234604, 7472289, 7446258, 7065273, 7143897, 7320939, 7141224, 7203237, 6691982, 6864999, 7105645, 7124784, 7129081, 6991247, 6935857, 7009531, 6701110, 6373890, 6414675, 6578058, 6766460, 6796232, 6160450, 5786711, 6114989, 6259386, 6197593, 5641227, 5793717, 5699162, 6000380, 5814064, 5825151, 6293038, 5837237, 5786875, 5731974, 5370916, 5849685, 5743093, 5522596, 5343504, 5213390, 5373102, 5841325, 5925892, 5408231, 5170054, 4814459, 5016614, 5296387, 4910002, 4932600, 4964600, 5113765, 5292713, 5092892, 5439378, 5285084, 5201978, 4783102, 4793551, 5134995, 5145432]
5093E145432k59136k80291K12106j24340k96540K45145j63644j75324J08437j56644
5083D255201L10255l59901K14543m9022J06420k71905n45933M14586K54296k58738
5073D069802P3037n31303M27364O01227m12972j84283J2907J48222m66104m89888
5063C248009J2748P13893k60272o85991j36343N69003K77205r7555m18075l9922
5053C182700N37447p7190q2398j67916j48477K58906j12170O2885k13493k97907
5043B942387K51650L1490k285k11585J7068K88250k31593p462K7445N4447p4764
5032C085048q06864K24599P28206J37376l71140l96068J014N08151J21151l30361
5022B901112K337R4381j80638L44068J03303j52821M42396m43812m4341l30341
$$ y = [5145432, 4886296, 4606005, 4818111, 4693771, 4397231, 4642376, 4478732, 4303408, 4411845, 4255201, 4565456, 4205555, 4420098, 4371076, 4477496, 4205591, 3659658, 4074244, 4328540, 4069802, 4142839, 3611536, 4038900, 4640127, 4227155, 4042872, 4055779, 4204001, 3737897, 3248009, 3260757, 3974650, 3714378, 3028387, 2892044, 3461047, 3738252, 3640697, 3222622, 3182700, 3720147, 3642957, 3560559, 3392643, 3244166, 3503072, 3390902, 3453787, 3240294, 2942387, 3194037, 3225527, 3223242, 3011657, 3028725, 3316975, 3085382, 3077920, 3105365, 3159812, 3085048, 2278184, 2502783, 3230989, 3368365, 2997225, 2601157, 2602171, 3110322, 3231473, 2901112, 2903449, 2997830, 2817192, 3161260, 3264563, 3111742, 3554138, 3110326, 3065985, 2735644]
5012B735644l06601L27197L14160k53444k38015J2097L46845P29796Q6971n45336
5002C209314j11380r0915L01269k64084k78609K239N2898q849J27394J49939J22509
4991C211725J72347k77238k96768K6386L12074K57199j56994m90388Q1387K31037
4981C070767r7736n2684M73453K2655n1730j21093j70496M83936K27201o39597
4971C144676o30078k491L18366L66087R695n18294j73016M24377K2364L10875
4961C272561m40736K3442J778l12082R8607K17755J45040K37497n2996J33027
4951C323893J05008k5081K47848L1842k76462m2671M78836M74760N05329K24317
4941E047619J67364Q5443J97297O04565R45864N98766J21396j03328k23808m9960
$$ y = [2735644, 2429043, 2756240, 3070400, 2816956, 2578941, 2591038, 2937883, 3667679, 3754650, 3209314, 3097934, 3007019, 3308288, 3044204, 2765595, 2767834, 2820732, 2811883, 2939277, 3089216, 3211725, 3384072, 3106834, 2810066, 2836452, 3148526, 3405725, 3248731, 2758343, 2839730, 3070767, 2973031, 2920347, 3393800, 3416455, 3364725, 3243632, 3073136, 3557072, 3784273, 3144676, 2514598, 2512107, 2830473, 3196560, 3206255, 2687961, 2514945, 2939322, 2961686, 3272561, 2831825, 2855267, 2857045, 2544963, 2643570, 2861325, 3006365, 3243862, 3190866, 3323893, 3428901, 3403820, 3651668, 3683510, 3407048, 3364377, 3843213, 4317973, 4823302, 5047619, 5214983, 5300426, 5497723, 6102288, 7048152, 7646918, 7768314, 7664986, 7441178, 7391218]
4931G391218l82014o16723m26238k75461p077m98018k1235j37527L02909J03012
4921E432846K9937j01219N55381R5632j83541M58J25970K18953J29461k93753
4911F010125K94991M67594j34531J32926l22307K08131J90958N602K10074Q2139
4901G145702m2166L55822J74061j78465m81363j68251J23856R972J7779m60161
4891F496786L35704m8534L59913P6832n28532m20539J95790j01646J14342k88618
4881F191498m0657J04322J92814J28766k2294p363l48861n3509J32177j37407
4871F139486P8447J40729K10669M28040p3670r6857j43319k02620J73459J05251
4861F759615o59820Q2743J550N48426K79742k47776J48906K85561l40460R882
$$ y = [7391218, 7009204, 6392481, 5966243, 5690782, 5683705, 5185687, 5164452, 5026925, 5329834, 5432846, 5462783, 5361564, 5916945, 6012577, 5829036, 5829494, 5955464, 6174417, 6303878, 6010125, 6305116, 6772710, 6638179, 6771105, 6448798, 6656929, 6847887, 6853489, 7063563, 7145702, 7103536, 7459358, 7633419, 7454954, 6973591, 6805340, 6929196, 6939168, 6956947, 6496786, 6832490, 6783956, 7143869, 7220701, 6692169, 6271630, 6467420, 6365774, 6480116, 6191498, 6150841, 6255163, 6447977, 6576743, 6554449, 6547086, 6198225, 6144716, 6276893, 6139486, 6217933, 6358662, 6569331, 6997371, 6923701, 6826844, 6683525, 6480905, 6654364, 6759615, 6099795, 6182538, 6184088, 6732514, 7012256, 6764480, 6913386, 7198947, 6858487, 6868369]
4851F868369J90415O8454q0744m06409J69309N18270K28362j06060N8149l99461
4841G108654J14492N54953J37309k02217l68782K64396L37150K14734n6830l52567
4831G751292K40208j0259j2099L31635k78900l123j30815j33114N1875K64960
4821H071660l1353j71651l12212M3260J5940R2209m90867M06353l091j07155j95341
4810G317752k12821N10589m9491j86857j23712k80265P60230K95395o6067j69310
4800G795443k83259O50107j68758q5408K82903N01674O32476L16544L61933J013355
4790A1017010P1219k98397j51763q20214j52133l50298p99322k50647m98782j67085
4780G599588J63889l66002K21800k10757m58161m12086k27626K7127J04252q8577
$$ y = [6868369, 7058784, 7127238, 7046494, 6640085, 6809394, 7327664, 7556026, 7449966, 7508115, 7108654, 7223146, 7778099, 7915408, 7713191, 7344409, 7608805, 7945955, 8160689, 8103859, 7751292, 7991500, 7981241, 7969142, 8300777, 8021877, 8018754, 7887939, 7754825, 7806700, 8071660, 8040307, 7868656, 7556444, 7599704, 7615644, 7707853, 7216986, 7623339, 7620248, 7513093, 7317752, 7104931, 7615520, 7566029, 7379172, 7255460, 6975195, 7735425, 8030820, 7964753, 7795443, 7512184, 8162291, 7993533, 7908125, 8191028, 8692702, 9325178, 9641722, 10003655, 11017010, 11088229, 10789832, 10638069, 9817855, 9665722, 9315424, 8516102, 8265455, 7766673, 7599588, 7763477, 7397475, 7619275, 7408518, 6950357, 6538271, 6310645, 6337772, 6442024, 6353447]
4770F353447j57171L8307J93962j06907K20130k88288m88038r0315J36123N07798
4760F319048R1992j59429O6958L16415j40408m54984r6683J13935j12784k91522
4750E652538k32274j20086J25241J38629k40864J4428k72922K35797J82576l22252
4740E160811j63449j33686k56579J21481k87928n7965J14097l26912K88K19258
4730D389416j67942O618j92272P0556J77663k77769l38509k28414K8468k9322
4720C438493l1222j67663O7608J76023K51309J33055m21486j57306M743K0284
4710C313838N9002m5410k14376M27593k87056J10404k24886R7514K949M9279r6374
4699C192477l41548J20609J66842L5305j13395P0216J64308K12053k70578J02
$$ y = [6353447, 6196276, 6234583, 6428545, 6321638, 6541768, 6253480, 5765442, 5675127, 5811250, 6319048, 6411040, 6251611, 6318569, 6634984, 6494576, 6039592, 5942909, 6056844, 5944060, 5652538, 5420264, 5300178, 5425419, 5564048, 5323184, 5337612, 5064690, 5300487, 5483063, 5160811, 4997362, 4863676, 4607097, 4728578, 4440650, 4382685, 4496782, 4169870, 4170158, 4389416, 4221474, 4228092, 4035820, 4106376, 4284039, 4006270, 3667761, 3439347, 3467815, 3438493, 3407271, 3239608, 3307216, 3483239, 3734548, 3867603, 3446117, 3288811, 3293554, 3313838, 3372840, 3327430, 3113054, 3540647, 3253591, 3363995, 3139109, 3236623, 3239572, 3288851, 3192477, 2850929, 2971538, 3138380, 3173685, 3060290, 3130506, 3294814, 3506867, 3236289, 3236391]
4689C236391M27308j49752m40900J33643J73900L30759L8203m77887q7029J95741
4679C380377L35325n4160o96220k17528N51594M69494j68221l71667J80144L12846
4669C721984R1627k29918l0762K68774J35286J76836r8720j75736J69877K22250
4659D251498n6796k541J59159O84894k65037l98048M92596N01603J87921l86715
4649E168534Q5374L48006K65854J64945J6880L17522N6505L82597M98945j36752
4639G168410O41027O49313R25557K76942R948J113655J093139J235184Q67363
4630A3980538J057509K521552L306960M448823M870932L651978K066813q97694
4622C5007411k469335k334294l511797l856175k088848j654670m51397J92630
$$ y = [3236391, 3663699, 3513947, 3073047, 3206690, 3380590, 3711349, 3749552, 3271665, 3184636, 3380377, 3715702, 3661542, 2965322, 2747794, 3299388, 3768882, 3600661, 3228994, 3409138, 3721984, 3813611, 3583693, 3552931, 3821705, 3956991, 4133827, 4035107, 3859371, 4029248, 4251498, 4194702, 4192161, 4351320, 5036214, 4771177, 4373129, 4865725, 5367328, 5555249, 5168534, 5253908, 5601914, 5867768, 6032713, 6049593, 6367115, 6423620, 6806217, 7305162, 7168410, 7809437, 8458750, 9384307, 9661249, 9671197, 10784852, 11877991, 13113175, 13980538, 15038047, 17559599, 20866559, 25315382, 30186314, 33838292, 35905105, 35007411, 32538076, 30203782, 26691985, 22835810, 20746962, 19092292, 18640895, 18833525]
4614A8833525K18070Q99240P31123J335861K216173K636445L033652K899208L059956
4605C5863253K528390K520219J923786K201791L312064L620481M255799L926693
4597F0152476K672861K440684J446930J118502Q74568J672465K449685K890896
4589G5719067J826808m1274j379696k764026l170944k712156j786671j360976
4581F4330132j755902k110198l302249l348914l617062m251895l673512l239623
4573C9030777k168155k340181k776499k892419l209196k799046k916083k681145
4565A7248053k038304j433545q44310j063456j201967j014885m86935J33986j056231
4556H242406n21547l72825k81877j26741o64777J20041J0922k49907k27853M6855
$$ y = [18833525, 19051595, 19950835, 20681958, 22017819, 24233992, 26870437, 29904089, 32803297, 35863253, 38391643, 40911862, 42835648, 45037439, 48349503, 51969984, 56225783, 60152476, 62825337, 65266021, 66712951, 67831453, 68706021, 70378486, 72828171, 75719067, 77545875, 77504601, 76124905, 73360879, 70189935, 67477779, 65691108, 64330132, 62574230, 60464032, 57161783, 53812869, 50195807, 45943912, 42270400, 39030777, 36862622, 34522441, 31745942, 28853523, 25644327, 22845281, 19929198, 17248053, 15209749, 13776204, 12931894, 11868438, 10666471, 9651586, 9164651, 9298637, 8242406, 7720859, 7348034, 7066157, 6939416, 6274639, 6394680, 6405602, 6155695, 5927842, 5974697]
4546E974697j68763l51438k54409k10647n9613m01975j29907l79456j88729O0369
4536C890129l78934J78513o09666k73526R33810L65627j91459p67729n17666N13447
4526C142546J81054m13786o18694M06675J17668K99923l36055j97452M35029k62808
4516B754100o49343k30067J10189R02005k66042j24868m0618m7438N79794j73770
4506B813942q2885l62503j41452M2993k05039K40458j07716J48719K42380l31235
4496B257662R9440P3536j4965j11398m41694j75562R4738K27453P4910k5895l85469
4485A672756j11222L14048R0296k76189J18279J18148j0807k38893J03508k19473
4475A560451K70843J71028p225j215j93170J84J03841r5385j72088k93395q1115
$$ y = [5974697, 5805934, 5454496, 5200087, 4989440, 4929827, 4527852, 4397945, 4018489, 3829760, 3890129, 3511195, 3689708, 3080042, 2806516, 3740326, 4105953, 3914494, 3146765, 2629099, 3142546, 3323600, 2909814, 2291120, 2697795, 2815463, 3115386, 2779331, 2581879, 3016908, 2754100, 2104757, 1874690, 1984879, 2886884, 2620842, 2495974, 2455356, 2407918, 2987712, 2813942, 2731057, 2368554, 2227102, 2270095, 2065056, 2305514, 2197798, 2346517, 2588897, 2257662, 2357102, 2430638, 2415673, 2304275, 1862581, 1687019, 1781757, 2009210, 2084120, 2058225, 1672756, 1561534, 1875582, 1965878, 1689689, 1807968, 1926116, 1915309, 1676416, 1779924, 1560451, 1831294, 2002322, 1995097, 1993882, 1800712, 1800896, 1904737, 1809352, 1637264, 1343869, 1262754]
4464A262754j95625N4752O5055P8743k8762k25381J89723J32604K28456r9916
4454A462403k26707N5848L10650m53252K58121j41375m8382r7560k24515K64191
4444A159422L40420j4064p2754M3322k40402k58434J29162J67413K38840J6252
4434A509177n02688M87950N2971J92216l10471m39279k77304k05778L12565j63499
4424F55860L0195q3157j8201J33887K39385n4877j77762l17411p4374k79674J51724
4413B05595K5295O29645K96867j14782l4669J25890N8272n59623p9130L57801
4403I11161l67372K13361j1879L24457L15100o9543l85478k06159r2246M7089
4393F78491J19941K223l26312K61554M438P8494K83875k05426m7869l60868K49851
$$ y = [1262754, 1067129, 1121881, 1186936, 1265679, 1236917, 1011536, 1201259, 1333863, 1562319, 1462403, 1235696, 1291544, 1602194, 1148942, 1407063, 1265688, 1217306, 1119746, 895231, 1159422, 1499842, 1485778, 1413024, 1456346, 1215944, 957510, 1086672, 1254085, 1492925, 1509177, 1006489, 1494439, 1547410, 1739626, 1429155, 989876, 712572, 506794, 819359, 655860, 686055, 602898, 584697, 718584, 957969, 903092, 725330, 407919, 333545, 53871, 205595, 230890, 860535, 1157402, 1042620, 1007951, 1133841, 1192113, 632490, 553360, 911161, 543789, 757150, 745271, 1069728, 1384828, 1315285, 929807, 723648, 631402, 678491, 798432, 800655, 474343, 735897, 740335, 818829, 1102704, 897278, 849409, 488541, 738392]
4382G38392J92384p0760j08050j62267J73572m028m83265O15326j80269m9689
4372F61346J62127j43349L07926j6566L14300p257m16808l38974K38024J69532
4362I30301j67766Q8239q6638N8156L80085k11418K59072l39264n66426L8804
4352C83145k50737j53778P3691N18707M49163j5383l09201p5886J52577j12510
4342F59788k91682J03981N2532L30101l13727K10007N03138K66935k46468m25441
4332H49164J55039L29570M15890m75929o30680J28279J01700Q5329k75264K32427
4322I15525K13217l42289J01838n5006L06544l6538k29766K72807j65083K43306
4312A224555L8246K87351L06332o56968K64021J10904Q0622K03769m36326K73073
$$ y = [738392, 930776, 860016, 751966, 589699, 763271, 759243, 275978, 891304, 711035, 661346, 823473, 680124, 988050, 971484, 1285784, 1278527, 861719, 522745, 760769, 930301, 762535, 850774, 764136, 822292, 1202377, 990959, 1250031, 910767, 344341, 383145, 132408, -21370, 52321, 571028, 1020191, 1004808, 695607, 619721, 772298, 659788, 368106, 472087, 524619, 854720, 540993, 751000, 1254138, 1521073, 1274605, 849164, 1004203, 1333773, 1749663, 1273734, 643054, 771333, 873033, 958362, 683098, 915525, 1128742, 786453, 888291, 833285, 1139829, 1103291, 873525, 1146332, 981249, 1224555, 1262801, 1550152, 1856484, 1199516, 1463537, 1574441, 1655063, 1858832, 1422506, 1695579]
4302A695579k8164q6500l9303K07563M34117j45385J26384j96615K1761L89999
4292B379436j1231r2108p4990n9380k4407L8923K12609k32278k18662k38031O8573
4281A748454O54741j99697J37496R2054K6169Q0376J8011J44146K55720p9575
4271B877895r577J21561K38592J55123K1584j76200j56318O9949J22557Q942l73211
4260B900897J48539L28236N22421j35412l10747R1708K91970J45915j61503j89497
4250C632527J08838J71292L11590N77016J74015k4305k5855K19827O3633K28684
4240E437262P1042K25277o3128L82742R69056J92653j41940m4100P4280N64079
4230G667223L38475N09204P95470R22723Q68758J251827J021579J202953J535217
$$ y = [1695579, 1667415, 1580915, 1541612, 1749175, 2183292, 2037907, 2164291, 1967676, 1989437, 2379436, 2368205, 2276097, 2201107, 2141727, 2117320, 2156243, 2368852, 2136574, 1917912, 1679881, 1748454, 2403195, 2203498, 2340994, 2433048, 2459217, 2539593, 2557604, 2701750, 2957470, 2877895, 2868318, 2989879, 3228471, 3383594, 3405178, 3228978, 3072660, 3142609, 3265166, 3274108, 2900897, 3049436, 3377672, 3900093, 3764681, 3453934, 3545642, 3837612, 3983527, 3822024, 3632527, 3741365, 3912657, 4224247, 4801263, 4975278, 4950973, 4925118, 5144945, 5208578, 5437262, 5508304, 5733581, 5670453, 6053195, 7022251, 7214904, 7072964, 7028864, 7103144, 7667223, 8005698, 8514902, 9310372, 10233095, 11101853, 12353680, 13375259, 14578212, 16113429]
4221A6113429K138900J479055J743453J846245L332748L341382M113544L885663
4213C7994419O304660P734533J2025282J6022998K7203694K4827673K1781380
4206A53894639R440284j5184014j6373165j9339014k3920302k4798971j5876192
4199D7843265j0660544o699419m849141k644959k810574j984965k016629r59293
4191A5217741r44936q82769q85689j053923p56757o83804n45425q4880p38756
4182H640802m09249r38201j75786K98388k25634k01955o93227k65229L22191O7054
4172F419154P2186m54085L64223l49186l28049J87637K58161K28964r27039o39954
4162D832012P2408L37475n7010o30600j23121J77655k207k94311m13028J64577
$$ y = [16113429, 18252329, 19731384, 21474837, 23321082, 26653830, 29995212, 34108756, 37994419, 44299079, 52033612, 64058894, 80081892, 107285586, 132113259, 153894639, 163334923, 148150909, 131777744, 112438730, 88518428, 63719457, 47843265, 37182721, 30483302, 25634161, 22989202, 20178628, 18193663, 16177034, 15217741, 14272805, 13390036, 12504347, 11450424, 10693667, 10009863, 9464438, 9379558, 8640802, 8231553, 7293352, 7117566, 7415954, 7190320, 6988365, 6295138, 6029909, 6352100, 6419154, 6491340, 6037255, 6401478, 6052292, 5724243, 5911880, 6170041, 6399005, 5471966, 4832012, 4904420, 5241895, 5184885, 4554285, 4431164, 4608819, 4606612, 4312301, 3899273, 4063850]
4152D063850j52361l67932n82899n6999L32198j67632o4838R658j23675k0695
4142B868675k10928j68564l38578k79521l15045J87835K57916J00203k08399K45641
4132B139235P1194L92448m07565j55275K00837J81453k18904k36938J57677J44571
4122B268733k01970j40431L5353J29k04681k66804M3282N26323o4682j79481m88612
4111A327159J20253K11782M01917n99895k12117p7523K94615L04417J03228j11903
4101A761933r5032j02972L060j49259q7182M08333L2559j22159J87098K11466
4091B047845M01295k21380p09396j93091L2711J46094o2147m58876L56819K07512
4081A547386L46234k97686N1935K13783j38236k32550k79680P1082M59588j61855
$$ y = [4063850, 3911489, 3543557, 2960658, 2903659, 3235857, 3068225, 3003387, 3013045, 2889370, 2868675, 2657747, 2489183, 2150605, 1871084, 1556039, 1743874, 2001790, 2101993, 1893594, 2139235, 2210429, 2602877, 2195312, 2040037, 2240874, 2422327, 2203423, 1966485, 2124162, 2268733, 2066763, 1926332, 1961685, 1961814, 1757133, 1490329, 1533611, 2059934, 1995252, 1815771, 1327159, 1447412, 1659194, 2061111, 1461216, 1249099, 1171576, 1466191, 1770608, 1873836, 1761933, 1666901, 1563929, 1566989, 1417730, 1330548, 1738881, 1771440, 1649281, 1836379, 2047845, 2449140, 2227760, 1518364, 1325273, 1357984, 1504078, 1441931, 983055, 1339874, 1547386, 1893620, 1595934, 1647869, 1861652, 1723416, 1490866, 1211186, 1282268, 1741856, 1580001]
4071A580001L69602J21386P4056N49916J07082j59483m04836K59025K50610J79708
4061B927067P2625K63382O94578Q67787N18747N10538P37685J103196J487543
4052I183148K579835K599053K243065J569979l80363j344112j373797k215541
4044A2861267k562655k365407j412273n49234l48907m87319o2229m00354k46803
4035D426086k78296K7768J35304n64983m73437J19905J63885N6560p01885j54703
4025B756204K19833n09090n71938r9310j00930n348k17089k12397K26239K20147
4015A706321R2275o8101o20691J82773k84873j1202O3885q9779M01621m7894n7341
4004A266994M28539k61000j95178k78230m1946k29780j67928k060M20216L00630
$$ y = [1580001, 1949603, 2070989, 2145045, 2694961, 2802043, 2642560, 2237724, 2496749, 2747359, 2927067, 2999692, 3263074, 3957652, 4825439, 5344186, 5854724, 6592409, 7695605, 9183148, 11762983, 14362036, 16605101, 18175080, 17794717, 16450605, 15076808, 12861267, 10298612, 7933205, 6520932, 5971698, 5622791, 5135472, 5073243, 4672889, 4426086, 4147790, 4175558, 4310862, 3745879, 3272442, 3392347, 3556232, 3612792, 2910907, 2756204, 2976037, 2466947, 1895009, 1795699, 1694769, 1689421, 1472332, 1259935, 1486174, 1706321, 1798596, 1730495, 1109804, 1292577, 1007704, 996502, 1060387, 970608, 1372229, 1324335, 1266994, 1695533, 1434533, 1239355, 961125, 919179, 689399, 521471, 519411, 939627, 1240257]
3994A240257O2767R2820J63074P5458k14026m22337J58134l82925R1846K57338
3984A122406J17931K23185m4118K8008j81080l01900l72933l576k8931j68740
3974C90252l08532j66612K82954Q40236k26020O6743l06677j3111M45672k96049
3964G08856J91426j66912K58215N7392l07877R9001K17826l81857k09292J23479
3954E90257L24327j12656j37405m08603p6844N1571k48370K15644k65143R5645
3944B8423L46790J84710J83095j11566j10813j36053j67025M15376j22180k90985
3934B19772k2268K30686L31118Q9196k50592L64855n1642k64471j48387J62663
3924F60930l30775k28937O670M03064L71151K12835K3876J36232j36876k01686
$$ y = [1240257, 1303024, 1395844, 1558918, 1634376, 1420350, 998013, 1156147, 773222, 865068, 1122406, 1240337, 1463522, 1419404, 1447412, 1266332, 964432, 591499, 587923, 558992, 390252, 81720, -84892, 198062, 1038298, 812278, 879021, 572344, 559233, 1004905, 708856, 900282, 733370, 991585, 1048977, 741100, 840101, 1057927, 676070, 466778, 590257, 914584, 801928, 664523, 255920, 179076, 230647, -17723, 197921, -67222, 28423, 375213, 559923, 743018, 631452, 520639, 384586, 217561, 632937, 510757, 219772, 197504, 428190, 759308, 848504, 597912, 962767, 911125, 646654, 498267, 660930, 330155, 101218, 107888, 510952, 882103, 1094938, 1118814, 1255046, 1118170, 916484]
3914I16484l48506J34738l77879J11028J30897l55419k8311M8819L57801L20681
3904I10333m10953k50779j41203M02844Q0144n35731l82846J97925M81034O34202
3894I84970j25383o4341J34568k2976J13559j97882k37910j69311r5001j1465
3884C08828K46591j493k02025Q2268K85568l8408m79641K8744k5746M4090p7320
3873A71456k52611L2317K37538Q5107K90303n4032l48884K9849p6974n2283O5883
3862A27669K02400M3099j47008k58979K88608J575J05518O047k36275r7383J94004
3851B29275O26L33662m72256m06836K96782o7089n723j3241K10218L45566j90159
3840B60825l87452R7048J24786j91715k30430j78186L18946M2139J09782P4080
$$ y = [916484, 567978, 702716, 324837, 435865, 566762, 211343, 183032, 231851, 589652, 910333, 499380, 248601, 107398, 510242, 590386, 54655, -328191, -130266, 350768, 984970, 859587, 795246, 929814, 906838, 1020397, 822515, 584605, 415294, 320293, 308828, 555419, 553926, 351901, 434169, 719737, 681329, 201688, 230432, 204686, 248776, 171456, -81155, -48838, 188700, 273807, 564110, 510078, 161194, 191043, 114069, 61786, 127669, 330069, 373168, 226160, -32819, 255789, 257364, 362882, 368929, 132654, 35271, 229275, 229901, 563563, 91307, -315529, -18747, -85836, -91559, -104800, 105418, 450984, 260825, -126627, -29579, 95207, -96508, -326938, -505124, -186178, -144039, -34257, 39823]
3830C9823j67351J58830k3849j39303K85519k12652j00859j38192J35391M02883
3820B40240K46361M03323j46444j89618q8635k77727K34103m54186m39472k1923
3810d93978M66948N46513k50988k84309K74814K86118N1475o02706J83670M67939
3800F45496R6059k35618L6137K13263K35065j73383j23229j81132M8904k25509
3790C36053n656P242k32357k0186k39921M5848K21887M0117P9460p128K25436
3779D50795j0563j28019j8122J0459p9672j24315p0080j8817K45570N2L05446
3768E62734J99293l12724j74939K69429J9368k79398m06247k32801K95640J49500
3758H9855K14025N4159j0443o6960o7785M37431k34804m4582n4774k24343M57837
$$ y = [39823, -127528, 31302, 7453, -131850, 153669, -58983, -159842, -298034, -162643, 240240, 486601, 889924, 743480, 553862, 465227, 187500, 421603, -32583, -472055, -493978, -27030, 519483, 268495, -15814, 259000, 545118, 596593, -6113, 177557, 645496, 741555, 505937, 542074, 755337, 990402, 817019, 693790, 512658, 561562, 336053, 330397, 337639, 105282, 85096, -154825, -108977, 112910, 153027, 232487, 225359, 450795, 440232, 312213, 294091, 304550, 224878, 100563, 30483, 11666, 257236, 257288, 562734, 762027, 449303, 274364, 543793, 563161, 283763, -122484, -355285, -59645, 89855, 303880, 358039, 347596, 280636, 212851, 650282, 415478, 370896, 316122, 91779, 549616]
3747E49616K22922n28284P1941n1073K43316p7823j36495k4122j53737K9350k85594
3736a39983P2284J90093J7219O0962L2150K2628K03870R5129k54450q7483q657
3725B03762K33628o8798m2505j27090Q3197L112J12210k19445J99859j40258n1119
3714A86553j3220l62946k27964M7068J48831Q5242j37149R7419J92537k2842m5093
3703e1564j01441J03755J5226n488J59784K26816q1957j12134Q7200R8658O22132
3692I60987l67877l46216r9572J62293L38776k41695m10333J86403M99850P5294
3682G57910O2533j26282L2060j17031l197k00250j68098j3421K80544M4215m61955
3671H7028J18683J44372J90192n31883k99538J4010J13791P8867J08580q0289
$$ y = [549616, 772538, 244254, 316195, 265122, 508438, 430615, 294120, 269998, 116261, 145611, -139983, -67699, 122394, 139613, 200575, 232725, 255353, 459223, 554352, 299902, 212419, 203762, 437390, 368592, 326087, 198997, 282194, 285306, 397516, 178071, 377930, 237672, 186553, 173333, -189613, -417577, -370509, -221678, -136436, -273585, -176166, 16371, -6471, -51564, -153005, -49250, -34024, -39512, 120272, 347088, 265131, 152997, 240197, 338855, 960987, 593110, 246894, 147322, 309615, 648391, 406696, -3637, 182766, 682616, 757910, 820443, 694161, 726221, 609190, 605993, 405743, 237645, 224224, 504768, 548983, 87028, 205711, 350083, 540275, 8392, -291146, -277136, -163345, -84478, 24102, -56187]
3661e6187K60004M5034K68498j89943r0867J84021k40984J35544l24830K18345
3651B08635K10154O5327l54664q6958q2491J89848k34069j83467m43541L42666
3641c68560L71193R0820p2015q5681J48761N8354j80237n34981J47601N43530
3631A18785l3272o2686r6088J01279K58737l25651J08547L2091n166j572k45257
3620a50253O62795K9904J73728k24605l78019J74325J20381l31039k09249L65250
3610B33218L77404L31800n456j12033K29066P588m13064m27685k71266K66485
3600B16057j24803m6258N241q2033M73316l01220O5854l07352k38709K19408K92500
3589A72001j25698J78300J66353J98977K0784j79338q3589J87542K9756n95841
$$ y = [-56187, 203817, 248851, 517349, 327406, 236539, 420560, 179576, 315120, -9710, 208635, 418789, 484116, 129452, 42494, -39997, 149851, -84218, -267685, -711226, -368560, 2633, 93453, 21438, -64243, 84518, 142872, -37365, -572346, -424745, 118785, 85513, 22827, -73261, 28018, 286755, -38896, 69651, 101742, 96576, 95004, -150253, 512542, 542446, 716174, 491569, 113550, 287875, 408256, 77217, -132032, 233218, 610622, 942422, 936966, 824933, 1053999, 1061587, 648523, 220838, -50428, 216057, 91254, 44996, 50237, -31796, 441520, 140300, 206154, -101198, -339907, -120499, 172001, 46303, 224603, 390956, 589933, 610717, 431379, 347790, 535332, 565088, -30753]
3579c0753P6692K99803L78929m20488k68466r6494L22946k26743n21838N1146
3569d35266J47329K32582l46269l3390O20414J26683m28072j47493j8396O60377
3559C78499k73979j60315K60976o8274j32416r3196j55429J81L5880O082M35928
3548B33937j17163p2917j102J25777J82713j13560l39031K57064J69303K36183
3538E61204n3568j57384L21559J69678p1469N7539r0634J21033o0456j71325M5586
3527F71763k6879o85701j37975K7275K11622k21544l54360N30594M96910K16268
3517G27973J7906l59994J21541l6570J61718j5677l12845k9900K01344N32914
3507A008410k9867j50285k1914m80173K12400r8038m74008q2933M633M06088J16557
$$ y = [-30753, 45939, 345742, 724671, 304183, 35717, -60777, 262169, 35426, -486412, -435266, -287937, -55355, -401624, -435014, 185400, 312083, -115989, -263482, -281878, 378499, 104520, -55795, 205181, 136907, 4491, -88705, -244134, -243953, -208073, -201991, 233937, 116774, 43857, 42755, 168532, 351245, 237685, -101346, 155718, 325021, 561204, 507636, 350252, 671811, 841489, 770020, 827559, 736925, 857958, 797502, 626177, 671763, 644884, -40817, -178792, -151517, 60105, -161439, -515799, 14795, 511705, 727973, 745879, 385885, 507426, 470856, 632574, 616897, 304052, 274152, 475496, 1008410, 978543, 828258, 806344, 326171, 538571, 440533, -33475, -116408, -111775, 294313, 410870]
3496D10870j24416j9681n136p0505j27953J99385j06306l768M9018K10513K55410
3485F67431k50293j12854L1829m01422J76676j44865L06891J15663k34971K09953
3475C64038J01958k15999N5380j25368k10640m2259n9044M87543J40944O4275
3465E60828J77930p6864M19779j64494o07936K98596q6811L17732r8855m22826
3455C17079J15442M56198j77815n06066k03809r9277O77045L7510k76345N01229
3445H41191k01149K43580o2754j91710K21662k11701K09798j19984J56245N17296
3435A402474l68397K01316r2313j41569j78222p8812J1862J15359K32829J13864
3425A218391l2759o0116K62444K54387k42397k70474j39350J35907K5843J7026
$$ y = [410870, 286454, 266773, 261637, 191132, 63179, 262564, 156258, 152490, 201508, 412021, 667431, 417138, 304284, 336113, -65309, 111367, -33498, 273393, 389056, 154085, 364038, 465996, 249997, 305377, 180009, -30631, -72890, -131934, 355609, 496553, 560828, 738758, 661894, 1081673, 917179, 309243, 607839, 521028, 838760, 739905, 317079, 432521, 888719, 710904, 204838, 1029, -98248, 578797, 616307, 339962, 841191, 640042, 883622, 820868, 629158, 850820, 639119, 848917, 728933, 885178, 1402474, 1034077, 1235393, 1143080, 1001511, 823289, 744477, 756339, 871698, 1104527, 1218391, 1185632, 1125516, 1387960, 1642347, 1399950, 1129476, 990126, 1126033, 1151876, 1168902]
3415A168902N657j52573l67484k1589R9486J94674l16972K785m22989L11242K1386
3404E22525L3067P003m19238k83548J7140L29991K64140k3204k93847L19979J30053
3393F04061O3388j8977l25684q1504K1076j16432J26280Q5993O09225K4749l53100
3382F39075j80438k97193K79664k36386J53930l51190k02442O91216M04824K09691
3372A110751l03256k21985K63424J96854j64737L8038p7539J34512m64117J69137
3362F81082M8312k4369j12805j89572L09766K94771m0081L4031K72867R9320N08189
3351A881511l83819m26297K37120M36817O4910j86208M51039j16680j27343k61919
3341A569131k53993m8948l67149o55472P0389O627K77838l96712J97664K5173
$$ y = [1168902, 1174559, 1021986, 654502, 632913, 732399, 927073, 610101, 612886, 189897, 501139, 522525, 555592, 562595, 143357, -140191, -123051, 206940, 471080, 447876, 154029, 474008, 604061, 667449, 648472, 322788, 241284, 262360, 145928, 272208, 358201, 967426, 992175, 639075, 458637, 161444, 441108, 204722, 358652, 7462, -194980, 496236, 901060, 1110751, 807495, 585510, 848934, 1045788, 881051, 919089, 841550, 976062, 511945, 681082, 729394, 705025, 592220, 402648, 712414, 1007185, 967104, 1001135, 1274002, 1373322, 1881511, 1497692, 1071395, 1308515, 1745332, 1810242, 1624034, 2075073, 1958393, 1831050, 1569131, 1315138, 1266190, 899041, 243569, 313958, 320585, 598423, 201711, 399375, 424548]
3331D24548Q03L2016l18923J20081M3791j63086j79811K0671M73975M9552k77098
3320B26519n3072J44102L72587m50730j96549j85568K50214J83124k32569j1064
3310D6994k80571K97581l6195L5480J23061K3299J89405k6641k40368L41048K13288
3299F86381j10827L019k28851l01256L19730J96960l21883J082l75542L80717
3289B49530K65959l60924r3170Q6886J87218k04477Q7953M38059q3966j90923
3279C82145l61320J42683N51426j6332j62552j27683J02273J23724q9687j52474
3269C92203j6529J11954P1967m8804p2120J73244q0414k62089K75960k16473k70674
3258E8225L66430K71936K35804l42485K6012L88522n0932j59053l35579j08009
$$ y = [424548, 425351, 457367, 138444, 258525, 302316, 139230, -40581, -19910, 454065, 503617, 226519, 173447, 317549, 690136, 239406, 42857, -142711, 107503, 290627, 58058, 46994, -233577, 64004, 27809, 63289, 186350, 209649, 399054, 372413, 132045, 473093, 686381, 575554, 578573, 349722, 48466, 368196, 565156, 243273, 244355, -131187, 249530, 515489, 154565, 61395, 148281, 335499, 131022, 218975, 657034, 573068, 382145, 20825, 163508, 714934, 698602, 536050, 408367, 510640, 634364, 544677, 392203, 375674, 487628, 559595, 510791, 438671, 611915, 531501, 269412, 545372, 328899, 58225, 424655, 696591, 932395, 589910, 615922, 1004444, 953512, 794459, 458880, 350871]
3248C50871K9784J30702K84096k29546J97673K27925j81263k65765k37808P9004
3238C85673L24988l38552m12837J57008L66269N5422K63881L0133l004j22259
3228G06722J1259j91328l35143j09701J16738J77874j74125k7493L3740K8309
3218B36852j68869k47471N2589K02319l06929K42537l5672K4936O3049k49319
3208a85978K94403r6906K6183L0100J1841K09257Q6383k57331j32898k71246K92880
3197F688n14327j44772R0232K49337k7831j4889Q4102J85915K28398o2055Q9736
3186A70534k6323j86593R2353K29456k49013J66672L6723N69038M5171k61393
3176E86625m6708k18803J24882j59064O3052N5364k13847o3195R5189K35441k03548
$$ y = [350871, 380655, 511357, 795453, 565907, 763580, 991505, 810242, 544477, 306669, 385673, 710661, 372109, -40728, 116280, 482549, 537971, 801852, 831985, 828981, 706722, 717981, 526653, 191510, 81809, 198547, 376421, 202296, 174803, 208543, 236852, 67983, -179488, -126899, 75420, -231509, 11028, -24644, 292, 63341, -185978, 108425, 11519, 37702, 67802, 79643, 288900, 375283, 117952, -14946, -286192, 6688, -507639, -652411, -562179, -312842, -340673, -355562, -271460, -85545, 142853, 80798, 170534, 144211, -42382, 49971, 279427, 30414, 197086, 233809, 802847, 848018, 586625, 539917, 321114, 445996, 286932, 349984, 405348, 191501, 128306, 223495, 458936, 255388]
3165B55388k15547Q9752M0150L46367n2177l78355K25347J90295K04818m81478
3155B24560J73612J88795K49062j8627q58808L60964k1628j82445J62537k74576
3145C446q7350M96541K06518l46610k63099j74823J77946K92564j60103j54643
3135i613L87695l47638J53592k01183K85131p2072j83664j83694L3607L23106
3125A85267j81808j52225J15308J74998L90470k32075j45576K04920k72987J27803
3115B14095j71618J62166K24625k17210R5185L21531k54414k59252Q4843o0859
3105A39092l8746L4034L13709M44004l63061j85456J22952m2311J77226m99078
3095A02365K22666q4743K53050N2223k29274J28058K18153n3068l31044L6025
$$ y = [255388, 39841, 129593, 169743, 516110, 463933, 85578, 310925, 501220, 706038, 224560, 398172, 586967, 836029, 817402, -41406, 319558, 297930, 115485, 278022, 3446, -83904, 412637, 619155, 272545, 9446, -165377, 12569, 305133, 145030, -9613, 378082, 30444, 184036, -17147, 267984, 195912, 12248, -171446, -137839, 185267, 3459, -148766, -33458, 141540, 532010, 299935, 154359, 359279, 86292, 214095, 42477, 204643, 429268, 212058, 307243, 628774, 374360, 115108, 199951, 139092, 100346, 134380, 448089, 892093, 529032, 343576, 466528, 424217, 601443, 102365, 325031, 240288, 493338, 545561, 316287, 444345, 662498, 609430, 278386, 314411]
3085C14411K81085q3288k60999j76753L52278J02604n55581J75665O0503K69567
3075D79492j21044j73575Q4609m754L02586J99393k36035K16560j52021q1534
3065E13677k85798j10122J25791L4828k12138o5601J31258K25158j69062n3969
3055A34022k64393l90296J56078N64049J04798j1017j18935k46234J21276k8776
3045B0572M4956L53302l89222k84066K82862L84117K46797o6252k82253j62500
3035A48313N4740k66775J986J73407N1107k23797r2051L13551L34382J24453j30589
3024D88727k98230j5622K26461J04124j69881l27805j10853O7584M57890m73789
3014e1394n5925l8010K65600P4373m61139o5392L40956J67545k91954l2735Q3535
$$ y = [314411, 595496, 512208, 251209, 74456, 426734, 529338, -26243, 149422, 209925, 479492, 358448, 184873, 269482, 264728, 567314, 766707, 530672, 747232, 595211, 513677, 227879, 117757, 243548, 278376, 66238, 637, 131895, 357053, 187991, 134022, -130371, -520667, -364589, 199460, 304258, 293241, 174306, -71928, 49348, 20572, 65528, 418830, 29608, -254458, 28404, 412521, 659318, 593066, 310813, 148313, 203053, -63722, -61736, 111671, 162778, -61019, -153070, 160481, 494863, 619316, 488727, 190497, 174875, 401336, 505460, 335579, 7774, -103079, -35495, 422395, -51394, -107319, -145329, 120271, 194644, -266495, -331887, 9069, 176614, -115340, -148075, -64540]
3003f4540M5486j65237M80296Q7024K52694l79894N1431J19194L2276j05482j67382
2992A85866K44488p96973o3571K97850K31276r5101o30796O8963O72505L44456
2982D58963o9743l63434K9972J92122j07257J8327J76914J99961m20618k9961
2972H5246M21080L44895l71892l42724K92203r9854j62692m69696K06139L14696
2962B17401j70165j82350Q8426L78827j1870j66886p1191j87547j53713J7479
2952b41589J45792L98135m13825j18121J18385L68627m23105n14555Q8666M97117
2942i4473L05244l97047l19353L43629Q85514k65187o38757l02781Q4991L3907
2932c64313j41729J12505L54807m0246J82585J42427P8792j29315n65824j855
$$ y = [-64540, -19054, -184291, 296005, 383029, 635723, 255829, 307260, 426454, 458730, 353248, 185866, 430354, -366619, -430190, -132340, 98936, 3835, -626961, -557998, 114507, 458963, 389220, 25786, 55758, 247880, 140623, 158950, 335864, 535825, 115207, 85246, 506326, 851221, 479329, 136605, 428808, 328954, 166262, -303434, -97295, 217401, 47236, -135114, -46688, 332139, 320269, 153383, 82192, -105355, -259068, -241589, -95797, 302338, -111487, -229608, -111223, 257404, -165701, -680256, -591590, -94473, 210771, -186276, -505629, -162000, 723514, 458327, -180430, -483211, -398220, -364313, -506042, -393537, -38730, -78976, 103609, 246036, 324828, 195513, -370311, -372166]
2922c72166k49824J55601K00159J4406Q60N2500K4820J01139O1609o0076r8238
2911a69210q9213J59803L20516j39429l5036L10736J060l50774k61653L85141
2901A31941J60775l44838k15664L72172M97067j54326j61226m35778M01009n371
2891B45761l30954J40929J00452K62587J65461L2492p2268k84642k38532k22290
2881b01004j20862J33226l97550K63062M08043K48653k51163k93046J20526K87281
2871A97166m22523k23737J30229j90909O7972j10590N01598J42137j37155K15816
2861A70004q8254K432j38264l46118K66726k81366k5412L90415K5712R4973j81716
2850a10868k04496j8042P0648l2947L0411K81735K451j80862o4818J18873L38115
$$ y = [-372166, -621990, -466389, -266230, -251824, -250964, -198464, -173644, -72505, -10896, -70972, -169210, -258423, -98620, 221896, 82467, 47431, 358167, 359227, 8453, -253200, 131941, 292716, -52122, -267786, 104386, 601453, 447127, 285901, -149877, 251132, 245761, -85193, 55736, 156188, 418775, 584236, 616728, 544460, 259818, 21286, -201004, -321866, -188640, -586190, -323128, 84915, 333568, 82405, -210641, -90115, 197166, -225357, -449094, -318865, -509774, -441802, -552392, -50794, 91343, -45812, 170004, 81750, 84182, -54082, -400200, -133474, -414840, -440252, -49837, -24125, 70848, -110868, -315364, -333406, -262758, -295705, -265294, 16441, 18892, -161970, -226788, -107915, 230200]
2839B30200l04881L0264K08494J86120J22549k27433j63103K38743l13298j46375
2829a38720k42717K64677K91235r1848j32j13140j9646K65847p4303o19K9070
2818A69704n4440L02718m95542K37490J12745q4020K05533l01510L48114o5331
2808C75461n24418k78333O1428K66315M1677k95385q954M09618J34193k66144
2798h4542j10086L7873K26659j09536n6344O4235J66385L828j54180q9172Q2333
2787b2547K81325K35685j81164J1195m51495M3071j95j79277k42297k1649K78009
2776b49339P4197K15619k05229Q3565j09617l86705J32954K17874K54154M04947
2766D32420n90629L33644L4185K76734J03813o06866Q5461Q5769k48375r6995
$$ y = [230200, -74681, -44417, 164077, 350197, 472746, 245313, 82210, 320953, 7655, -138720, -381437, -116760, 174475, 82627, 82495, -30645, -50291, 215556, 141253, 140634, 169704, 115264, 417982, -77560, 159930, 272675, 188655, 394188, 92678, 440792, 375461, -148957, -427290, -365862, -99547, -57870, -353255, -362209, 47409, 181602, -84542, -194628, -156755, 69904, -39632, -95976, -31741, 134644, 138472, -15708, -104880, -22547, 258778, 494463, 313299, 324494, -127001, -83930, -84125, -263402, -505699, -527348, -249339, -175142, 40477, -164752, -81187, -190804, -577509, -444555, -226681, 27473, 432420, -158209, 175435, 209620, 486354, 590167, -16699, 68762, 154531, -93844, -190839]
2756a90839p7075K12755k3143k64508J32244O0230J33637J9382J14277j08257
2746H703j49822j52106K45366K05618J59056Q1413j24278r1291j97309N3161j42907
2735a04396J50369q2709p7170n3688R7174L84965k72071m85297N38674L48989
2725D44840L62973n81521j76168J03918J98283l35095k81240K60693N05451Q3485
2715E85619j6106k87242j4507o2885k7888q1859n4560l1178j36321L53481j97504
2704B9050P5536m27406j06887K29760N8818p1461P2598p0926M2881k55659L26008
2693i7688J16134K58435j64679j63893K01134l92372J07386k34926K35000j95560
2683c31029j01035r7539J9048L16851N4396o7463J24216Q131N85460j32106k46444
$$ y = [-190839, -267914, -55159, -78302, -342810, -210566, -150336, -16699, 2683, 116960, 8703, -141119, -293225, -47859, 157759, 316815, 398228, 273950, 182659, -14650, 38511, -104396, 45973, -36736, -113906, -167594, -70420, 314545, 42474, -442823, 95851, 444840, 807813, 226292, 50124, 154042, 352325, 17230, -264010, -3317, 502134, 585619, 569513, 282271, 267764, 204879, 176991, 95132, 40572, 9394, -126927, 226554, 29050, 104586, -322820, -429707, -199947, -141129, -212590, -139992, -210918, -168037, -423696, -97688, 18446, 276881, 112202, -51691, 149443, -242929, -135543, -370469, -135469, -331029, -432064, -529603, -510555, -193704, -139308, -206771, -82555, -74424, 511036, 378930, 132486]
2672A32486l73559l11705K04721l73308K93894l9607M57288J45676K48503j77844
2662B06545j09232K1899l04453J42449k1502l94747Q9679J24695M20729M09125
2652E85187j75268J80689Q9207l63794j28629k01350M05190n17072m45822J29140
2642d42522O61812M72997k99029l07641R3818J82624k9815m3499k15181j12529
2632c8965P4261m2408O1840o0515k34547L71763j92035L38695J3679j55490K87973
2621D24251k81044l83616n3809o7786n0745J37190k52222O56413J51344l06044
2611b6068P5546R6137r1732Q2997l57331J36641l2214j20730K36040J46055r2060
2600E3281J43516j46263N8750k6710l77074L83309j79759j78513N1385J1075N48073
$$ y = [132486, -241073, -552778, -348057, -721365, -427471, -467078, -9790, 135886, 384389, 206545, 97313, 119212, -185241, -42792, -64294, -459041, -369362, -244667, 176062, 585187, 409919, 590608, 679815, 316021, 187392, -13958, 391232, -125840, -571662, -442522, 219290, 692287, 393258, 85617, 179435, 362059, 332244, 288745, 73564, -38965, 35296, -7112, 54728, -5787, -240334, 131429, -60606, 278089, 291768, 136278, 424251, 143207, -240409, -294218, -362004, -412749, -275559, -527781, 128632, 279976, -26068, 49478, 145615, 53883, 136880, -220451, -83810, -116024, -236754, -714, 145341, 53281, 196797, 50534, 109284, 82574, -294500, 88809, -90950, -269463, -218078, -207003, 341070]
2589C41070j54742n39257K14955J40166K96513k07344j71589K32946J07709K92480
2579E52907m13585n59840O6159k8171K23642J02858o082j47571j03597K2453L62820
2568G1993J4344k96004k96753K23229K79954K58906J21314j37187n85741J77403
2558a68542J35781Q7672j26553j73058P3877p3997M08080J44039J98689k38743
2548B67245l21423L4097m71912j07666k8649L41239L21856j86916m4388j207Q5721
2537a12003L40050k41005m5074m70357p572N78172M65895k05666k84909n2206
2527c4675Q2596M6997j04986k37703j29283k2097J24295L24961K28952j97454
2517H1603l16756K4709j89642K34008l62k22131L97772K54901n6427j72758q6472
$$ y = [341070, 186328, -352929, -137974, 2192, 298705, 91361, -80228, 152718, 260427, 552907, 139322, -420518, -354359, -382530, -158888, -56030, -62112, -209683, -313280, -290827, 71993, 86337, -209667, -506420, -283191, -3237, 255669, 376983, 239796, -345945, -168542, -32761, 54911, -71642, -244700, -170823, -244820, 163260, 307299, 505988, 267245, -54178, -20081, -491993, -599659, -628308, -287069, 34787, -152129, -196517, -197724, -112003, 228047, -12958, -58032, -528389, -535961, 42211, 508106, 302440, 17531, -34675, 47921, 94918, -10068, -247771, -377054, -399151, -274856, 50105, 279057, 81603, -235153, -210444, -400086, -166078, -166440, -388571, 9201, 264102, 207675, 34917, -51555]
2506e1555K43387j99207j65557j22834r3640K02775K16468J95392j01390l61849
2496b38010J12330K49742l1546j59341j19787K42084J07607j72905J65382j29788
2486B5768K74443k31003r4718K40662l55383k1444J80935O4569l9582J41932J66563
2475C52742K22676o2342n55390k34522R7377P2091l41916Q1241N37711j56737
$$ y = [-51555, 191832, -7375, -172932, -295766, -389406, -186631, 29837, 225229, 123839, -238010, -125680, 124062, 92516, -66825, -186612, 55472, 163079, -9826, 155556, 25768, 300211, 69208, -25510, 215152, -140231, -161675, 19260, 83829, 44247, 186179, 352742, 575418, 513076, -42314, -276836, -179459, -107368, -449284, -368043, 169668, 12931]
$$ [...]
##END NTUPLES=NMR SPECTRUM
##END=
