##TITLE=1H_DE-80H_X3
 200.13MHz, d2o
 8 sc
 
 19ns.26.2.2025
##JCAMPDX= 6.0         $$ Bruker NMR JCAMP-DX V2.0
##DATA TYPE= NMR SPECTRUM
##DATA CLASS= NTUPLES
##ORIGIN= UXNMR, Bruker Analytische Messtechnik GmbH
##OWNER= pz
$$ XWIN-NMR		Version 3.5
$$ Wed Jan 14 11:39:56 2026 Russian Standard Time (UT+4h)  Yarkov@DPX200
##.OBSERVE FREQUENCY= 200.1313
##.OBSERVE NUCLEUS= ^1H
##.ACQUISITION MODE= SIMULTANEOUS
##.ACQUISITION SCHEME= undefined
##.AVERAGES= 8
##.DIGITISER RES= 18
##SPECTROMETER/DATA SYSTEM= spect
##.PULSE SEQUENCE= zg30
##.SOLVENT NAME= CDCl3
##.SHIFT REFERENCE= (INTERNAL, CDCl3, 0, 15.4803)
##AUDIT TRAIL= $$ (NUMBER, WHEN, WHO, WHERE, WHAT)
$$ ##TITLE= Audit trail, XWIN-NMR		Version 3.5
$$ ##JCAMPDX= 5.01
$$ ##ORIGIN= Bruker BioSpin GmbH
$$ ##OWNER= Yarkov
$$ C:/Bruker/XWIN-NMR/data/yarkov2/nmr/H-C/1/pdata/1/auditp.txt
$$ ##AUDIT TRAIL=  $$ (NUMBER, WHEN, WHO, WHERE, WHAT)
(   1,<2026-01-14 11:38:55.51 +0400>,<Yarkov>,<DPX200>,
      <created by zg, POWCHK disabled, PULCHK disabled
       configuration hash MD5:
       00 E9 B6 7A A2 85 ED C7 34 08 36 98 17 FE 4E 26
       data hash MD5: 16K
       DF 4F 5A 47 28 4D 31 EE 56 6B 3C B6 3B 48 51 D6>)
(   2,<2026-01-14 11:39:05.20 +0400>,<Yarkov>,<DPX200>,
      <Start of raw data processing
       efp BC_mod = 2 LB = 0.25 FT_mod = 6 PKNL = 1 PHC0 = -5301.897 PHC1 = 7.62193 SI = 16K 
       data hash MD5: 16K
       FC FA B1 8C 19 A5 1B 16 27 C3 D0 48 3B 44 56 17>)
(   3,<2026-01-14 11:39:12.40 +0400>,<Yarkov>,<DPX200>,
      <abs ABSG = 5 
       data hash MD5: 16K
       93 0B 73 DE 68 2C 25 E3 2C BA AE 9A 26 FC 94 FF>)
$$ ##END=
$$ 
$$ hash MD5
$$ A3 B9 D1 7E 6A 39 D1 FE 39 41 84 54 77 94 35 01
##$RELAX= 
##$RELAX= 
##$RELAX= 
##$RELAX= 
##$RELAX= 
##$RELAX= 
$$ Bruker specific parameters
$$ --------------------------
##$DU= <C:/Bruker/XWIN-NMR>
##$EXPNO= 1
##$NAME= <H-C>
##$PROCNO= 1
##$TYPE= <nmr>
##$USER= <yarkov2>
##$AMP= (0..31)
100 100 100 100 100 100 100 100 100 100 100 100 100 100 100 100 100 100 
100 100 100 100 100 100 100 100 100 100 100 100 100 100 
##$AQSEQ= 0
##$AQ_mod= 1
##$AUNM= <au_zg>
##$AUTOPOS= <>
##$BF1= 200.13
##$BF2= 200.13
##$BF3= 200.13
##$BF4= 200.13
##$BF5= 200.13
##$BF6= 200.13
##$BF7= 200.13
##$BF8= 200.13
##$BYTORDA= 1
##$CFDGTYP= 0
##$CFRGTYP= 5
##$CHEMSTR= <none>
##$CNST= (0..31)
1 1 145 1 1 1 1 1 1 1 1 1 1 1 1 1 1 1 1 1 1 1 1 1 1 1 1 1 1 1 1 1 
##$CPDPRG= <>
##$CPDPRG1= <>
##$CPDPRG2= <>
##$CPDPRG3= <>
##$CPDPRG4= <mlev>
##$CPDPRG5= <mlev>
##$CPDPRG6= <mlev>
##$CPDPRG7= <mlev>
##$CPDPRG8= <mlev>
##$CPDPRGB= <>
##$CPDPRGT= <>
##$D= (0..31)
0 0.7 0 0 0 0 0 0 0 0 0 0.03 0 0 0 0 0 0 0 0 0 0 0 0 0 0 0 0 0 0 0 0 
##$DATE= 1768376335
##$DBL= (0..7)
120 120 120 120 120 120 120 120 
##$DBP= (0..7)
150 150 150 150 150 150 150 150 
##$DBP07= 0
##$DBPNAM0= <>
##$DBPNAM1= <>
##$DBPNAM2= <>
##$DBPNAM3= <>
##$DBPNAM4= <>
##$DBPNAM5= <>
##$DBPNAM6= <>
##$DBPNAM7= <>
##$DBPOAL= (0..7)
0.5 0.5 0.5 0.5 0.5 0.5 0.5 0.5 
##$DBPOFFS= (0..7)
0 0 0 0 0 0 0 0 
##$DE= 6
$$ [...]
##$SUBNAM3= <"">
##$SUBNAM4= <"">
##$SUBNAM5= <"">
##$SUBNAM6= <"">
##$SUBNAM7= <"">
##$SUBNAM8= <"">
##$SUBNAM9= <"">
##$SW= 18.0517328524113
##$SWIBOX= (0..15)
0 0 2 0 0 0 0 0 0 0 0 0 0 0 0 0 
##$SW_h= 3612.71676300578
##$TD= 16384
##$TD0= 1
##$TE= 0
##$TE2= 300
##$TE3= 300
##$TEG= 300
##$TL= (0..7)
0 120 120 120 120 120 120 120 
##$TP= (0..7)
150 150 150 150 150 150 150 150 
##$TP07= 0
##$TPNAME0= <>
##$TPNAME1= <>
##$TPNAME2= <>
##$TPNAME3= <>
##$TPNAME4= <>
##$TPNAME5= <>
##$TPNAME6= <>
##$TPNAME7= <>
##$TPOAL= (0..7)
0.5 0.5 0.5 0.5 0.5 0.5 0.5 0.5 
##$TPOFFS= (0..7)
0 0 0 0 0 0 0 0 
##$TUNHIN= 0
##$TUNHOUT= 0
##$TUNXOUT= 0
##$USERA1= <user>
##$USERA2= <user>
##$USERA3= <user>
##$USERA4= <user>
##$USERA5= <user>
##$V9= 5
##$VALIST= <valist>
##$VCLIST= <CCCCCCCCCCCCCCC>
##$VD= 0
##$VDLIST= <DDDDDDDDDDDDDDD>
##$VPLIST= <PPPPPPPPPPPPPPP>
##$VTLIST= <TTTTTTTTTTTTTTT>
##$WBST= 1024
##$WBSW= 4
##$XGAIN= (0..3)
0 0 0 0 
##$XL= 0
##$YL= 0
##$YMAX_a= 340498
##$YMIN_a= -199105
##$ZGOPTNS= <>
##$ZL1= 120
##$ZL2= 120
##$ZL3= 120
##$ZL4= 120
##$ABSF1= 15.48025
##$ABSF2= -2.571599
##$ABSG= 5
##$ABSL= 3
##$ALPHA= 0
##$AQORDER= 0
##$ASSFAC= 0
##$ASSFACI= 0
##$ASSFACX= 0
##$ASSWID= 0
##$AUNMP= <proc_1d>
##$AZFE= 0.1
##$AZFW= 0.1
##$BCFW= 0
##$BC_mod= 2
##$BYTORDP= 0
##$COROFFS= 0
##$CY= -3
##$DATMOD= 1
##$DC= 0
##$DFILT= <>
##$DTYPP= 0
##$F1P= 0
##$F2P= 0
##$FCOR= 1
##$FTSIZE= 16384
##$FT_mod= 6
##$GAMMA= 0
##$GB= 0
##$INTBC= 1
##$INTSCL= 3.241238e-09
##$ISEN= 128
##$LB= 0.25
##$LEV0= 0
##$LPBIN= 0
##$MAXI= 10000
##$MC2= 0
##$MEAN= 0
##$ME_mod= 0
##$MI= 1.114404
##$NCOEF= 0
##$NC_proc= -6
##$NLEV= 6
##$NOISF1= 3.799351
##$NOISF2= 2.8
##$NSP= 0
##$NTH_PI= 0
##$NZP= 0
##$OFFSET= 15.48025
##$PC= 1
##$PHC0= -5301.897
##$PHC1= 7.62193
##$PH_mod= 1
##$PKNL= yes
##$PPARMOD= 0
##$PSCAL= 0
##$PSIGN= 0
##$REVERSE= no
##$SF= 200.130008295918
##$SI= 16384
##$SIGF1= 3
##$SIGF2= 2
##$SINO= 0.751879
##$SIOLD= 32768
##$SREGLST= <19F.Aceton>
##$SSB= 0
##$STSI= 16384
##$STSR= 0
##$SW_p= 3612.71676300578
##$SYMM= 0
##$S_DEV= 0
##$TDeff= 16384
##$TDoff= 0
##$TI= <>
##$TILT= no
##$TM1= 0
##$TM2= 0
##$TOPLEV= 0
##$USERP1= <user>
##$USERP2= <user>
##$USERP3= <user>
##$USERP4= <user>
##$USERP5= <user>
##$WDW= 1
##$XDIM= 16384
##$YMAX_p= 317818496
##$YMIN_p= -375289
$$ End of Bruker specific parameters
$$ ---------------------------------
##NTUPLES= NMR SPECTRUM
##VAR_NAME=  FREQUENCY,     SPECTRUM/REAL,   SPECTRUM/IMAG
##SYMBOL=    X,             R,               I
##VAR_TYPE=  INDEPENDENT,   DEPENDENT,       DEPENDENT
##VAR_FORM=  AFFN,          ASDF,            ASDF
##VAR_DIM=   16384,         16384,           16384
##UNITS=     HZ,            ARBITRARY UNITS, ARBITRARY UNITS
##FACTOR=    0.220516191357247, 1,           1
##FIRST=     3098.06263268581, 0,            0
##LAST=      -514.654130319968, 0,           0
##MIN=       -514.654130319968, -375289,     0
##MAX=       3098.06263268581, 317818496,    0
$$ Real data points
##PAGE= N=1
##DATA TABLE= (X++(R..R)), XYDATA
$$ [...]
12159a10224M2028M9476p0406L3567n5533K8647M2447q4481K0460K5433J2869
12148f5717O2184p6412m2892O1615m245k7937k4530m9202J6462k504Q6230n882
12136g2830k6825J03419j50205O2603N8551o2578N3899p5558J5514J437m647j3283
12124a10503L8629N7760q4937J4337k1577R667Q0501O119l3536O360M3464k5289
12112a9005N067r624o3670N4150n1851j6435M433J0321J16402o2599o8116l7695
12100a38622P2983M6181r4755P6286o7320M0357J07637l3667O7506n4181n8355
12089c5950k598L0485N2640m7316n0749j2117O8432m7063R218M2247J6757k0707
12077C279m2217K082r820J0194P6841p3225J0771m3260m1264P5119n9768j855
$$ y = [-110224, -68196, -18720, -89126, -55559, -111092, -82445, -39998, -124479, -104019, -78586, -65717, -3533, -79945, -122837, -61222, -65467, -93404, -117934, -167136, -150674, -153178, -66948, -72830, -99655, 3764, -146441, -83838, -25287, -87865, -33966, -109524, -94010, -92573, -97220, -110503, -71874, -14114, -99051, -84714, -106291, -96624, -16123, -10004, -43540, -37180, 6284, -19005, -13938, -23562, -87232, -33082, -84933, -101368, -96935, -86614, 29788, -32811, -100927, -138622, -65639, -19458, -114213, -37927, -105247, -64890, 42747, 9080, 76586, 22405, -35950, -38548, -8063, 44577, -2739, -53488, -65605, 2827, -44236, -35018, 7229, 23986, 3279, -38938, -36856, -46676, -36482, 40359, -32866, -22095, -65355, -106619, -31500, -91268, -93123]
12065i3123M1218J9812N8262m6931j7236N8495k865Q9567o9702q9495J4148n5758
12053i3608J10787P039l5782J4812l6217R6252j876r8510Q69j5214J00898m6919
12041B531q0987P9906n3959L3665j8727m3711j982q2223J10876J9585K1479P0325
12029E6778j44735J7343J00360o9602O039m0122M6381M4477m0768M8942m8026
12018b2933L9791k0865p5948P4907o6466K6126R9894r9423N6414r0152q178M2981
12006d3852n623N9577n6050o3820J09541J2599O1152o5954K5525O0681j69544
11995g5768P2012j9198L2928r553p3430O6343k6121M8729K2904q5249L9697k0821
11983b7527k0204Q3310J8585Q6357j30143k8516K7479p4138M0936n3594N784O1453
$$ y = [-93123, -51905, -32093, 26169, -20762, -37998, 20497, 17632, 107199, 37497, -51998, -37850, -93608, 17179, 24218, -11564, 3248, -32969, 63283, 61407, -37103, -36234, -51448, 49450, 2531, -78456, 1450, -52509, -18844, -37571, -81282, -83264, -165487, -54611, -35026, -13547, 56778, -87957, -70614, 29746, -39856, -33817, -73939, -27558, 16919, -23849, 25093, -22933, 16858, -4007, -79955, -5048, -71514, -45388, 54506, -44917, 11497, -78655, -86833, -43852, -49475, 10102, -45948, -109768, -227, 12372, 73524, 7570, 33095, 93776, -75768, -3756, -22954, 9974, 421, -73009, -6666, -32787, 15942, 38846, -46403, -6706, -27527, -47731, 35579, 54164, 140521, 10378, -18138, 9341, -64797, -23861, -77455, -71671, -10218]
11971a0218J714L2767j6461p5668M7593j9489Q7949m7822l9648O7111n8375J20238
11959H9691k8461j51820R0400r8140N2527l756q6272J10554j5672Q6720k6939
11948A8832o4458P9978m8223P2334J7459j29085P3102r2349Q9391P0008p1130
11937A5859P3777r2720j8271N4000M1779K5804j21573J9468M0620o6457L0676
11926B962l6837L9623J58525j91991K3759K5054p055J07129m3660j2910m1685
11915B2914n6790k4004k8812R0914K5676P38M4735l8318K9973M3848q5602K9787
11903E5059N0452M366l8068q9032R4935j7845n7622P1372l3654M0978m2431k0631
11891A7879P613q7466J28700O693n0842Q513M9276O3294j19789o305R9808m3221
$$ y = [-10218, -8504, 24263, 7802, -67866, -20273, -39762, 48187, 365, -39283, 27828, -30547, 89691, 61230, -90590, -190, -98330, -45803, -49559, -135831, -25277, -40949, 45771, 18832, -45626, 34352, -13871, 58463, 75922, -53163, 19939, -72410, 16981, 86989, 15859, 89636, -3084, -21355, 32645, 74424, 100228, -21345, -1877, 38743, -27714, 2962, -33875, 5748, 164273, -27718, -3959, 21095, 14040, 121169, 77509, 64599, 22914, -33876, -57880, -86692, 4222, 29898, 30636, 75371, 37053, 67026, 110874, 25272, 55059, 105511, 109877, 71809, -17223, 77712, 59867, 2245, 73617, 39963, 80941, 38510, 17879, 25492, -61974, 66726, 73419, 22577, 31090, 80366, 143660, 23871, 17566, 117374, 74153]
11879G4153j9496j10104Q8358R9327p8371L3754n3948k36L5283l3178L3792l0467
11867C8867P9460n388k1480L697O315O4033l7870j02451L4078J4896N6072M9771
11855A80000p6318J9419p721o6226P6125m5583J8460M3122o4263J25503o2863
11844A39655j1571L3246K6750O6148j17826M3372l5925L534L9678l1092R867m6495
11832A19341Q167M1042l2072k5199J00688p2709J4138l2291J6617O3158O529J3958
11820B21367l5466M8053n498m3814J0818K6449j06835L0790r2891N1332N5779
11809A60084k6306K6208m8563O0718j5139k0154n179K567O0410M0199n1037N2155
11797B35963m1930q599L6997Q858K9046n0125l2738k4176n284N3739J1991k532
$$ y = [74153, 54657, -55447, 32911, 132238, 53867, 87621, 33673, 33437, 68720, 35542, 69334, 38867, 118327, 112939, 91459, 95156, 101471, 165504, 127634, 25183, 59261, 74157, 130229, 180000, 103682, 123101, 115380, 49154, 125279, 79696, 98156, 141278, 77015, 202518, 139655, 128084, 161330, 188080, 254228, 136402, 179774, 143849, 147383, 187061, 155969, 165836, 119341, 127508, 168550, 136478, 111279, 211967, 139258, 153396, 121105, 137722, 200880, 207409, 221367, 185901, 233954, 228456, 184642, 195460, 221909, 115074, 145864, 52973, 104305, 160084, 133778, 159986, 111423, 172141, 157002, 136848, 131669, 134236, 194646, 234845, 183808, 235963, 194033, 185434, 222431, 231289, 260335, 210210, 177472, 153296, 148012, 201751, 213742, 211210]
11785B11210L9204j4994J0730R293l8281P790k4448j1311k2410r5570N9200P6197
11773B06610L5321o1386K236k6958L0614J00581r5346Q488L5142J5199M4103l7396
11761B57208N329L4608k6270N4507j6952k7768j5499J08938q747j10452J18194
11750C73096p6419N4781N9748m8267l0659O7983M3405k9516R415p8437J2192J11654
11738D68976l4303J4065J5994q5344P7621l3235J8135m7733Q5259L504k5197N0742
11726E08484j32123O7091O012K6024R8007j26001q0615M3514O2450L8694k1835
11715D89702p7824k0690L2114O4917k1322m5260J5162O7935Q6377R323j02250
11704D98184L1775j9441Q426J7036n588K9058j79644J09886J16926j72162J15176
$$ y = [211210, 250414, 235420, 246150, 255443, 217162, 224952, 200504, 189193, 166783, 71213, 130413, 206610, 241931, 180545, 182781, 155823, 186437, 287018, 191672, 200160, 235302, 250501, 294604, 257208, 262537, 297145, 270875, 325382, 308430, 280662, 265163, 374101, 365354, 254902, 373096, 296677, 351458, 411206, 362939, 332280, 400263, 443668, 414152, 423567, 345130, 357322, 468976, 434673, 448738, 464732, 379388, 457009, 423774, 441909, 394176, 479435, 482939, 457742, 508484, 376361, 443452, 449464, 475488, 573495, 447494, 366879, 410393, 472843, 511537, 489702, 411878, 391188, 423302, 488219, 466897, 421637, 436799, 504734, 591111, 600434, 498184, 529959, 510518, 518944, 535980, 530392, 559450, 379806, 489692, 606618, 434456, 549632]
11693E49632j29655Q0511M2891j15501J1784q5739J05844K0050k2510m0341N831
11682D22797M1511n1946l9987J4777k6260J11435j5109j21686M2046M4196j12039
11671C09735M1274k2473J3652j252r0790N9783o7824k1790L4305l5902K11281
11660D29999p1425n4559M9338n7590J42595p5142p4595m9703j7626P7864o0874
11649B38282p250m1206J9312J25125j11357j043j4773k670m485L4996M7240r6050
11637A86121j689L975M5045M878M0690K3784k1642L8491k6952q6670k949J0345
11625B13427l4057P1394m7954n6059J07407n3371l2663k2834N3325M9407J3936
11614B61958j7372n2656Q3158l8159j12484J02403q0491K7260J51826r7291M6689
$$ y = [549632, 419977, 500488, 543379, 427878, 439662, 353923, 459767, 479817, 457307, 416966, 422797, 464308, 412362, 372375, 387152, 360892, 472327, 457218, 335532, 377578, 421774, 309735, 351009, 328536, 342188, 340936, 250146, 309929, 242105, 220315, 254620, 218718, 429999, 358574, 304015, 353353, 295763, 438358, 363216, 288621, 238918, 221292, 299156, 238282, 231032, 189826, 209138, 334263, 222906, 221863, 207090, 204420, 199935, 234931, 282171, 186121, 184432, 188407, 233452, 238330, 279020, 302804, 281162, 319653, 292701, 206031, 203082, 213427, 179370, 250764, 202810, 146751, 254158, 200787, 168124, 145290, 198615, 248022, 261958, 244586, 191930, 275088, 236929, 124445, 226848, 146357, 173617, 325443, 228152, 274841]
11603B74841j6618n9308O6037l7462m769O394O4184k1922q0442J00527p3636M4057
11591B61883K019r7623J40108P722p5666J18061r2645p048P8011j25309M2455
11580B51968K8929k6698M3263k2640j1368p029J6295R846J0467O5180j40452P0110
11568B87871L2932o4530P6692l5384L1704J01405j11265k7246K6301q2444N4043
11557B90079o0021J7182N9925Q170j3046j38168J07070J8509l6635Q6637j82505
11546A57197P5639O8820j37725N2403q1776M8221Q1639p6201Q7306L1298o6760
11535B40061K8978o8624k3712J116J04543Q3723p3293L9408r1997J4773L7417
11524B92393p0567O0365n9259J286N1303n3793l3049N711P1365K592k3974N4535
$$ y = [274841, 258223, 198915, 264952, 227490, 222721, 229115, 293299, 271377, 190935, 291462, 217826, 261883, 263902, 166279, 306387, 314109, 238443, 356504, 263859, 256811, 334822, 209513, 251968, 280897, 254199, 297462, 274822, 263454, 256425, 272720, 282566, 293033, 358213, 217761, 287871, 320803, 256273, 332965, 297581, 329285, 430690, 319425, 292179, 318480, 236036, 290079, 230058, 247240, 307165, 315335, 302289, 164121, 271191, 289700, 253065, 339702, 157197, 232836, 301656, 163931, 216334, 134558, 182779, 264418, 188217, 275523, 306821, 240061, 269039, 200415, 176703, 177819, 282362, 366085, 292792, 332200, 240203, 254976, 292393, 221826, 282191, 222932, 224218, 275521, 221728, 188679, 194390, 265755, 268347, 244373, 298908]
11512B98908n3492P5523J02604r7613N7230o5350J4221J1794q4118N4917r5045
11501B19579P9690M3753j8246Q7235j43629m995J11372l6612J0553j33468J1820
11490B27052J06959l5979K2174p8652N4203J2515o3529P3167m5378l6792M2900
11479B78640l3558Q9688r0012m2059R6374j12610K2627M7057q1324J61372j68978
11468A67217M3956M9524j08575J03784n7253L8933P0911P184K1312j38772N2936
11457B51157j3081r1607J57485j31455j6226N7195o9116J47142n945j6615K833
11446B71767l0401Q3392j8312n6968O8245J7900j4887o4554O0815l42o3275Q2870
11434C36250o1020J7304Q6889n6395K0619K2592j47680R7625m3864l7052J00375
$$ y = [298908, 245416, 320939, 423543, 325930, 383160, 317810, 332031, 343825, 259707, 314624, 219579, 299269, 343022, 324776, 412011, 268382, 263387, 374759, 338147, 348700, 215232, 227052, 334011, 298032, 320206, 241554, 295757, 308272, 244743, 317910, 272532, 235740, 278640, 245082, 334770, 244758, 202699, 299073, 186463, 209090, 256147, 174823, 336195, 167217, 211173, 260697, 152122, 255906, 198653, 237586, 308497, 315681, 336993, 198221, 251157, 238076, 146469, 303954, 172499, 156273, 213468, 144352, 291494, 285549, 268934, 271767, 241366, 324758, 306446, 249478, 317723, 335623, 320736, 256182, 316997, 316655, 253380, 336250, 275230, 292534, 379423, 323028, 343647, 366239, 218559, 316184, 272320, 235268, 335643]
11423C35643n308l8439N4877J69O210n3236k17o7264O856k2653q555J29534j19793
11410B17824L8904P9055j14215O8199O8871k2510K479L5693n2163R453K3962j1042
11398C44510j07682m4972K3155M8654J2513o0498K7489M8464n1211L2002l5290
11387B37134J9096M6680m9249O1152n2824j0549Q9710m0800k9910N2927Q643j5358
11375C16652K9803L5442j37466M4099L5746J16909J15924q4930L9986R129p676
11364E13618l3091j14152n4690N4692Q5178o8700M5341l6951j21580J29457K1407
11353D20529j07104N06K3332L7619N4654k1714k4936j0580P7507O2835L2063m0293
11341E04418j22369P3025J06429q0766M464r531q511P7824K8386K9253o2007j4886
$$ y = [335643, 330335, 291896, 346773, 346942, 353152, 299916, 299699, 232435, 239291, 216638, 208083, 337617, 217824, 256728, 335783, 221568, 289767, 358638, 336128, 338607, 374300, 322137, 331590, 355552, 344510, 236828, 191856, 215011, 263665, 276178, 215680, 243169, 291633, 240422, 272424, 237134, 256230, 302910, 253661, 314813, 261989, 251440, 341150, 300350, 270440, 323367, 332010, 316652, 346455, 381897, 244431, 288530, 324276, 441185, 557109, 472179, 512165, 521294, 513618, 480527, 366375, 311685, 366377, 451555, 382855, 428196, 391245, 269665, 399122, 420529, 313425, 313931, 337263, 374882, 429536, 407822, 382886, 372306, 449813, 512648, 544711, 504418, 382049, 455074, 561503, 480737, 485201, 475670, 467159, 544983, 573369, 602622, 540615, 525729]
11329E25729P056O2789R3070n7188M0419Q212r7741J53440j07643N1054J12896
11318G92093l4411L3990r4496R1021Q3668n9882l401j00064Q3708k616O6106J29105
11306I84821j82716P6398R8922q7418R7129r5144l308M306l4892O3583P106J6083
11294I44870r7599K8990K3002j04489N9189N4718j00488K9113q8375r344K5753
11283G65340j17819J28387j06227p0782O4136p5109J31255j04508o3941N2537
11273F03269n3439P9059l4933j4326L1546p7640J95872j15527M695M0532j79776
11262D79332J13380N6162Q4358P6987j48549J40831J8723o3891k2445l8189P2903
11251G69602k8232J6891r0608N859J15166l9353P067J7159j40398Q665j0340j68972
$$ y = [525729, 532785, 595574, 688644, 631456, 671875, 680087, 582346, 735786, 628143, 679197, 792093, 757682, 791672, 697176, 788197, 871865, 811983, 808582, 708518, 792226, 789610, 855716, 984821, 802105, 878503, 977425, 890007, 987136, 891992, 888684, 892990, 858098, 921681, 928787, 944870, 847271, 876261, 899263, 794774, 853963, 908681, 808193, 837306, 748931, 739587, 765340, 647521, 775908, 669681, 598899, 663035, 587926, 719181, 614673, 550732, 603269, 549830, 628889, 593956, 579630, 611176, 533536, 729408, 613881, 618576, 659108, 479332, 592712, 648874, 733232, 810219, 661670, 802501, 821224, 757333, 734888, 696699, 769602, 741370, 758261, 667653, 673512, 788678, 749325, 756392, 773551, 633153, 641818, 631478, 462506]
11239D62506J01178K2500k2320P5653j02494l8249m7607J2427K4265M722n733
11228D86848j03854J23299j5424p7438J45059j02021L1287r749n2807J05579q4767
11217D46012K896L6801K1000l4584n1794J04008m7509P0J7975j36521Q0606N545
11205D44505J9790M5812n6841l8848J1926M6370K9546l0425o6656L638k4832M5505
11193D29490m3122j16608j1200O3686P5897K6187r3488Q3019p2115N092L4430
11182C81268p6956J13054O17L1972m5266N4340K3749m2448L1888K3164r435j8331
11170D67616j3590j9375q079q6481o3672O755N4793m1820R8168q0453K238R0592
11158D06692j08179l8140m285k079N0411M207j2488n511l0554j1641Q318J691
$$ y = [462506, 563684, 586184, 563864, 639517, 537023, 498774, 451167, 463594, 487859, 492581, 486848, 382994, 506293, 490869, 413431, 558490, 456469, 487756, 478007, 425200, 530779, 446012, 448908, 485709, 506709, 472125, 420331, 524339, 476830, 476900, 494875, 358354, 438960, 444505, 464295, 510107, 453266, 414418, 426344, 472714, 502260, 471835, 405179, 408817, 383985, 429490, 386368, 269760, 258560, 322246, 398143, 424330, 330842, 413861, 341746, 346838, 381268, 304312, 417366, 417983, 449955, 404689, 459029, 482778, 440330, 472218, 495382, 485947, 467616, 454026, 434651, 426572, 340091, 276419, 283174, 337967, 296147, 394315, 313862, 316100, 406692, 298513, 260373, 256088, 254009, 304420, 308627, 296139, 290628, 260074, 248433, 256751, 258442]
11146B58442n2004N127J11648N1083L6530k2600o7698j2029q124N5355N711m7512
11134C13929P7451J739m0533J1988j7206k01k2479k5457j2283J7547O8385k2764
11122C50116P45k0108r538l425m3445R071n9977L3985P0482p3351N9862K8798
11110C43215q4510Q7824M944l0167q6620L094m2202J5021L6689k1619L6466J04116
11098C66251m6247M9797p8651l5577K9521q748j26534R0794k0992J3745L2117
11087B65476l5848J16855J4454m1541p4637O4837M4520p4746N7779J6969m1087
11076C13031J10346q3311j5806P44o73k3168k2602o2066M4716j8047J0306M9763
11064C03233p544q274l4369M1472K3410l522N7119j3390n134l734l3387N665j0385
$$ y = [258442, 206438, 211565, 323213, 374296, 410826, 388226, 320528, 308499, 300375, 355730, 361441, 313929, 391380, 393119, 352586, 364574, 347368, 347167, 324688, 299231, 286948, 304495, 372880, 350116, 350861, 330753, 321215, 317790, 274345, 283416, 223439, 257424, 327906, 254555, 314417, 343215, 258705, 346529, 351473, 321306, 234686, 237780, 195578, 210599, 247288, 225669, 262135, 366251, 320004, 369801, 291150, 255573, 285094, 276346, 149812, 240606, 219614, 233359, 265476, 229628, 346483, 360937, 319396, 244759, 309596, 354116, 279370, 337149, 354118, 313031, 423377, 340066, 324260, 325004, 324331, 301163, 278561, 216495, 261211, 243164, 253470, 303233, 295689, 287415, 253046, 294518, 317928, 314406, 371525, 358135, 353001, 349267, 315880, 321545, 311160]
11051C11160j7918J9446K0365J0926n6263l0869J3711O6444O1870J3055K5662
11040D37589k0629p7509m0651K7114M9106M9987j8171l7761m1849k3100N3229
11029C57355L0983n6544O3472N0358P018q239m7063J9380j2992j4747o2699M0285
11017C66567L6840m9454k0131N6349q1551J3392P874j8355L4239J8270J9315j2504
11005C70851J5932L978q5275j5237l957M6656J809m0061l5803l27J1919N0966
10993C21451Q416l2434J6526l1657L9778m684k839N830j9630k7483p074N938l1234
10980B40904O6666k4190l6386K0957n3512O551q1236J11768j9549k9980N3824
10969B55817o7444Q188j531o5745J15146k2942p7319m2049K4502R274m7153Q0881
$$ y = [311160, 293242, 312688, 333053, 343979, 287716, 256847, 270558, 337002, 398872, 411927, 437589, 416960, 339451, 298800, 325914, 375020, 425007, 406836, 369075, 327226, 304126, 357355, 388338, 331794, 395266, 445624, 452642, 444403, 397340, 416720, 403728, 388981, 326282, 366567, 403407, 353953, 333822, 390171, 308620, 322012, 329886, 311531, 345770, 364040, 383355, 370851, 386783, 390761, 305486, 290249, 286292, 332948, 334757, 294696, 258893, 258566, 270485, 321451, 329867, 297433, 313959, 282302, 322080, 317396, 314557, 320387, 300757, 273274, 266200, 272138, 240904, 307570, 283380, 246994, 267951, 214439, 220990, 139754, 251522, 231973, 201993, 255817, 188373, 196561, 195030, 129285, 244431, 221489, 144170, 102121, 126623, 135897, 88744, 169625]
10957A69625J160K8651j4991m7912J08762P5855n8488m3727j8158j05435J11343
10946B06685J4859o8786N3033m3380k2524l1085P9969m7987j187O0205j32836
10935F6966M5234O1561k4900O5155l8538N1060p2931J3582P1859m7436M4996j00014
10923A36594M4756M4960k1734J5942m1503K7279L4293l277j4788M0360l2422K7796
10911B58256M6200j9927O2055K4040P228j5494k9497J21182o6729N1423p546o7462
10899C63729R0529q7207Q5408P620j9641m9505N60l5248j0258K5357p1420O406
10887C06330J39347L8531j27057l9247L1220O8061J0165j23986K3576j1755l8910
10876B76275J37029m180p1519M5809j26092N0911P58R319Q1192n8219J09498n677
$$ y = [169625, 170785, 199436, 184445, 136533, 245295, 321150, 262662, 218935, 200777, 95342, 206685, 221544, 152758, 205791, 162411, 139887, 108802, 188771, 140784, 139597, 199802, 66966, 112200, 173761, 148861, 214016, 175478, 226538, 153607, 167189, 239048, 191612, 236608, 136594, 181350, 226310, 204576, 220518, 179015, 206294, 240587, 237310, 222522, 262882, 230460, 258256, 304456, 284529, 346584, 370624, 377852, 362358, 332861, 454043, 387314, 438737, 431191, 363729, 454258, 367051, 452459, 460079, 440438, 390933, 391493, 356245, 345987, 371344, 299924, 306330, 445677, 484208, 357151, 317904, 349124, 417185, 427350, 303364, 326940, 315185, 276275, 413304, 409124, 337605, 383414, 257322, 308233, 308991, 318310, 399502, 341283, 450781, 445104]
10864D45104l8642n2322m9368R1947J1512K1739N3647r6538j9671M4800K9432
10853D41640N6973k1592k7353P9747Q4823m6565k6706j0209L4604L0294K1475
10842F17131N7976m0365P64k8221J26560j6370o8984M5296K4439R0863k8794K1150
10830H01445O2172k4025M3564p8707o428J03766o2638n2139J18589M2048J6133
10819I63780L3336l4313r327J34387j3353N0091K8866j2337J5732L8139L4819
10808A229820P4417J41056q6172n3764J38797k7088O1432J4833m7851J34244R9638
10797A679362l8236q7762Q7590k8853N8886J19480Q4759J08141L467P1109J63353
10786B221296J26837K8582Q5067J85730J42619J92235J94632R6286K68003K13237
$$ y = [445104, 406462, 354140, 304772, 396719, 408231, 429970, 483617, 387079, 367408, 412208, 441640, 498613, 477021, 449668, 529415, 614238, 567673, 540967, 530758, 565362, 595656, 617131, 675107, 634742, 635506, 607285, 733845, 717475, 648491, 693787, 718226, 809089, 780295, 801445, 863617, 839592, 883156, 804449, 798021, 901787, 839149, 787010, 905599, 947647, 963780, 997116, 962803, 953476, 1087863, 1074510, 1124601, 1153467, 1141130, 1156862, 1195001, 1229820, 1304237, 1445293, 1359121, 1305357, 1444154, 1417066, 1478498, 1493331, 1445480, 1579724, 1679362, 1641126, 1553364, 1640954, 1612101, 1670987, 1790467, 1875226, 1983367, 1986834, 2057943, 2221296, 2348133, 2376715, 2461782, 2647512, 2790131, 2982366, 3176998, 3273284, 3541287, 3754524]
10776C754524K65595K23104K79793M11605L66164N11404L57087N63103N65882
10767G298261M46062N28522M62740L31733K68208K33048l587j87308k64407m90003
10757H623269l54490n47518o67456m38245n64300n79332l54682m39249l55899
10748D322098l53054l51884l11476j40869j90429k71248j34329k44944j43679
10739B180186o1023j82824j96905l4273o1857j08671o0059j66558k1066K2282
10729A309232j28892m1749n1351L9818m5794l0067q2262o5442K1387o4538P624
10718H67966q2401j43340J36766q700j2117Q122o2546J5358j7799L2302r9645
10707F33966j15595J05245k4192n5751P5911q3484N890r639p5726J06490P7191
$$ y = [3754524, 4020119, 4243223, 4523016, 4934621, 5300785, 5812189, 6169276, 6732379, 7298261, 7744323, 8272845, 8735585, 9067318, 9335526, 9568574, 9564987, 9377679, 9113272, 8623269, 8268779, 7721261, 7053805, 6615560, 6051260, 5471928, 5117246, 4677997, 4322098, 3969044, 3617160, 3305684, 3164815, 2974386, 2703138, 2568809, 2323865, 2180186, 2119163, 1936339, 1739434, 1705161, 1643304, 1534633, 1474574, 1308016, 1286950, 1309232, 1180340, 1138591, 1087240, 1127058, 1081264, 1051197, 968935, 903493, 924880, 860342, 867966, 785565, 642225, 778991, 770291, 758174, 766296, 703750, 719108, 701309, 733611, 633966, 518371, 623616, 599424, 543673, 619584, 536100, 541990, 532351, 456625, 563115, 640306]
10696F40306j21270k4267l8146L1877n726p8475k7505r4355J30892q6710n665
10685C20956J41256j81786R5589J2562j36898Q3963n2325L7667p010k5704K8818
10674C17088l246M6622o6079m24n1480K5174J34588j04090m4769N5043j49748
10663A58679O9646P0255j59258Q6878K9696q8797Q5705l3626j282q1538L5666
10652A72024R0295j09054Q1911j28319P2616M4701n2757J74274p0582K186J535
10641B78830j36110P9640p6229r092Q6225K7728O8662n3441L8430M3995J7207
10630C65845K7160k170l2535J28034K3230l8906J00952r322P9455K8798N4929
10619G25470L5529k5092K00466L4463J15040P0732n3663J95229M9977L5397R0367
$$ y = [640306, 519036, 494769, 456623, 488500, 482774, 404299, 376794, 282439, 413331, 326621, 320956, 462212, 280426, 376015, 388577, 251679, 335642, 283317, 320984, 313974, 288270, 317088, 313842, 360464, 294385, 293961, 242481, 267655, 402243, 298153, 253384, 308427, 158679, 228325, 298580, 139322, 226200, 255896, 167099, 252804, 219178, 217896, 136358, 172024, 262319, 153265, 235176, 106857, 179473, 224174, 171417, 345691, 275109, 277295, 278830, 142720, 222360, 146131, 137039, 223264, 250992, 319654, 266213, 304643, 348638, 365845, 393005, 390835, 358300, 486334, 509564, 470658, 571610, 562288, 641743, 670541, 725470, 760999, 735907, 936373, 970836, 1085876, 1156608, 1102945, 1298174, 1348151, 1383548, 1473915]
10608A473915O6761K7525L0864Q5291j26186j10377j13j95290J5755j14066k25448
10597I28631j1458r6536j3064j1392j61297l4039l1446j18797R022l2023q8038
10586C39563J2092K5855j0531o2025q9485l2262M55J55564j20713p6931J9279
10575A60861k4729R6289m2321j8473l982m2745M4251n0655m7847m4990K7007k608
10563E0058L4033L5119j10158J24493n4224L7738J21682q8642K2080J8176O0692
10552B51047n8785q5555O7512l8586L0336n6338K631Q990n4692J27675n7461o763
10540A30011M5847n6347L763j2870r8779N0242L0169M5699P3316m7694n7959M4494
10528A49892L1050K9855j20179q8634m1147J1138Q4563r9361J17256o8250J1938
$$ y = [1473915, 1540676, 1568201, 1599065, 1684356, 1558170, 1447793, 1447680, 1252390, 1268145, 1154079, 928631, 917173, 820637, 807573, 796181, 634884, 600845, 569399, 450602, 459624, 427601, 339563, 351655, 377510, 366979, 304954, 215469, 183207, 183662, 339226, 218513, 141582, 160861, 136132, 232421, 190100, 171627, 167645, 124900, 169151, 118496, 70649, 25659, 52666, 50058, 84091, 119210, 9052, 133545, 79321, 117059, 238741, 150099, 172179, 190355, 251047, 192262, 106707, 174219, 135633, 165969, 109631, 112262, 121252, 66560, 194235, 136774, 130011, 175858, 119511, 123274, 110404, 11625, 61867, 92036, 137735, 211051, 163357, 105398, 149892, 180942, 210797, 90618, 1984, -39163, -28025, 56538, -42823, 74433, 6183, 18121]
10517A8121J83452q7142N6424o9814J8959J11540k11222M1227J455O2387Q0210
10506B05597l6407k3885j04330L8189P8697n8737M2029r538j1903K4957p0594
10495G4075q7821N3360o7936L5357K5437p8143Q4160j44439N6529P8212j07036
10484g8245O7715j0344J2876N2773q4172j2656K291P1208J4022o247k0396j17037
10472a08212N9182L236k6125L7408n4759o1151O6097j5989p0284N7890m3151M0965
10460a14893O8124n1470M7160j9559j9399Q9811l8462n50m8282k0969m1476J01057
10448d8908j304m7839L6824j27812M2245J7975m2316N0122N4827l383k6992j0671
10436a07232l3924P5308k8655q4765J06708m1925N8731M9837p7811n7513M780
$$ y = [18121, 201573, 114431, 170855, 101041, 120000, 231540, 20318, 61545, 63000, 125387, 205597, 169190, 145305, 40975, 79164, 157861, 99124, 141153, 131615, 119712, 144669, 74075, -13746, 39614, -28322, 7035, 32472, -45671, 38489, -105950, -49421, 28791, -78245, -10530, -20874, -7998, 44775, -39397, -52053, -49762, 21446, 35468, 29221, 8825, -108212, -49030, -45794, -71919, -34511, -89270, -150421, -84324, -100313, -170597, -112707, -155858, -114893, -46769, -98239, -51079, -70638, -90037, -226, -38688, -39238, -87520, -108489, -149965, -48908, -50212, -98051, -61227, -189039, -146794, -128819, -171135, -121013, -66186, -69569, -96561, -107232, -141156, -65848, -94503, -179268, -72560, -114485, -55754, -5917, -83728, -141241, -136461]
10425a36461P0378m9702n8510O1203L397O6184M1641n0890p2257K378O9417m2289
10413i5511N8095J5562j2303j09208P1958K3467l9609K1388o4620J03545N7541
10402C0305j77561M3844o7764J8460J15275r9306K0041M4011j5100n2018o73l8297
10390a78783L6830J20505m284K1602J1786r9574N5646K4270n1606K2163K1636
10379a9809j25627R3123p725k5617O4601q6095J41346m3715j12890P5497N8250
10368A1339m0671n2035L3594q8606P5043R1807r5284k3510K0142n148N5962j8105
10356c5472k4726r992o3744J2412J34599n6616n3658O0203l8561R0843q0882m6023
10344a11617M0343k8027R4860n0471m402P6819l3102M7720k2952j0229o6279L1450
$$ y = [-136461, -66083, -115785, -174295, -113092, -109695, -43511, -1870, -52760, -125017, -122639, -53222, -95511, -37416, -21854, -34157, -143365, -71407, -47940, -87549, -66161, -130781, -27236, 30305, -147256, -103412, -171176, -152716, -37441, -136747, -116706, -72695, -87795, -139813, -140486, -178783, -141953, -21448, -25732, -4130, 7656, -91918, -36272, -12002, -63608, -41445, -19809, -145436, -52313, -60038, -85655, -21054, -107149, 34197, -9518, -122408, -46911, 11339, -29332, -81367, -47773, -136379, -61336, 30471, -64813, -88323, -68181, -73329, -17367, -35472, -60198, -70190, -133934, -121522, 13077, -43539, -97197, -36994, -75555, 15288, -65594, -111617, -71274, -99301, -4441, -54912, -59314, 17505, -15597, 32123, 9171, -1058, -67337, -35887]
10332c5887N8594n8063P183m0936r492O4201k6691j1738Q3654j03909L9204Q7544
10320E3664j55963O1331k6424p1614J44751j2849m6580L438J093K3305l9367M0248
10308b4967q6412J56360O4004j84411J72901j68494l2414J19867o4877K1337K3255
10297c851l2219N1818j7674l4954k9097K3376J4251l2071N2779n5788l9514P9927
10285b3017O862N5312o1510m9491P8376q0529J077L6186l1197K0653m9072J7604
10273g8746K6110m7196J85739n5692o8251P27q8273J08369K7940N173n6322O242
10261c4180N9864j08807O8112n9885k3039J19787j34025K1692P6284p4182N4876
10250c3503o7178p7647J43450M9829o9368l4285O0497j108l2237L1096q1433M8915
$$ y = [-35887, 22707, -35356, -28173, -69109, -78601, -14400, -41091, -52829, 30825, -73084, -33880, 53664, -102299, -40968, -67392, -139006, 5745, -7104, -53684, -50246, -49153, -25848, -65215, -24967, -111379, 44981, 108985, -75426, 97475, -71019, -103433, 16434, -48443, -27106, -3851, -36070, 15748, -1926, -36880, -65977, -42601, -28350, -60421, -7642, -63430, -102944, -23017, -16155, 39157, -22353, -71844, 6532, -73997, -72920, -36734, -67931, -47278, -96350, -78746, -52636, -99832, 85907, 30215, -38036, -37309, -125582, -17213, 10727, 15900, -40422, -34180, 25684, -83123, -15011, -74896, -97935, 21852, -112173, -90481, -14197, -88379, -33503, -100681, -178328, -34878, 14951, -54417, -88702, -28205, -29313, -61550, -30454, -111887, -62972]
10238f2972P54k7616J15653o8347m0861J12429k9476j9751K3001n0414k0510l5360
10226a03470j9368R5458P3786p6165n1756P6569l95q2529K8160l032k9939R1418
10214a263j4521L2817o3451K4170N3661n9226j4422J9637m9637j961N6832n2745
10202g0109P3431O0902p9343p1304K7719O0650M7779j35997K7698N9301L9940
10191D0667K2960j895l2100K0550O0782j8010M9004K7764j18297j2887n5103K7131
10179A0566O2327p1900l4158Q118J10939K8999l9188o1813k7917K1223J2424L2497
10167E2117n3977k6001Q0026j03456M1685J8613K6618O438l1668N2501j1991P7194
10155A28099j00823j08711J17692j06131L3124n081n7407J54574k5969j06469
$$ y = [-62972, -62218, -89834, 25819, -42528, -83389, 29040, -436, -20187, 2814, -47600, -68110, -103470, -122838, -27380, 46406, -29759, -81515, -4946, -5341, -87870, -59710, -62742, -92681, -1263, -15784, 17033, -46418, -22248, 31413, -27813, -42235, -22598, -72235, -74196, -17364, -70109, 3322, 64224, -15119, -86423, -58704, 1946, 49725, -86272, -58574, 727, 40667, 63627, 61732, 29632, 50182, 110964, 92954, 141958, 169722, 51425, 38538, -16565, 10566, 72893, 993, -33165, -25047, 85892, 114891, 75703, 13890, -14027, 7196, 19620, 52117, -1860, -27861, 52165, -51291, -9606, 9007, 35625, 42063, 10395, 62896, 50905, 128099, 27276, -81435, 36257, -69874, -36750, -41831, -99238, 55336, 29367, -77102]
10145g7102N3075k9276j5277L1972j128M0570j3269L4811K0753n0196K1761l4323
10133a7629R302p5428O416J49105j23066O4588J6924n4710P1455j30622J9915
10122f3750M4032l533Q8084j32944j3721N4906q333j1608K2603J1465m7663l4120
10110i4582l1891M5023P6366n5160M4726L0840l955l0555n5973p6174J07505Q9426
10098D5596p0755p1689J0773l739Q5332j4232m9184Q9499l935k5237J2687n0771
10086d5655Q603J29960j37956M3220m3536j12631J74492K0605m3441q801l5510
10075e0650M4856l969Q5075q9448N5343k3967k1554J30783j20153m2793N4918
10064A8441k1803N3271n7089k9970Q0550l5797L3864k2108j5959p359K0230J6328
$$ y = [-77102, -24027, -53303, -68580, -36608, -37736, 2834, -10435, 24376, 45129, -5067, 16694, -17629, -8327, -83755, -77339, 71766, -51300, 13288, 30212, -24498, 46957, -83665, -63750, -19718, -23251, 64833, -68111, -81832, -26926, -35259, -46867, -24264, -12799, -60462, -94582, -126473, -81450, -5084, -60244, -15518, 15322, 11367, -19188, -75161, -151335, -43830, 45596, -25159, -96848, -86075, -89814, -4482, -18714, -67898, 21601, 17666, -7571, 5116, -45655, -37052, 92908, -45048, -1828, -45364, -157995, 16497, 37102, -6339, -15140, -50650, -5794, -9763, 75312, -14136, 41207, 17240, -4314, 126469, 6316, -36477, 18441, -3362, 49909, -7180, -37150, 43400, 7603, 41467, 19359, 3400, -3959, 16271, 32599]
10052C2599J8598l5316K6701M158P1627k4833q4697O7307r9405O2569N6485j16931
10040b1138J80115o3792k8940P8921j02544J09798q4097j23217K6087k90O9867
10029D0770m8851O1052J2189r8257J46642o9350k079J36647j18571j7118J7540
10018F0614o0932J55616J823j35414K6749J978J02167O249q0482m7772l8408L4143
10006B6331K085N6270K6030l3264R5052j04495j4281Q1603n4845R7846K6633l2421
9994A72544Q50j30671K5787M238J1768L8443q5122L4525J2202n687l6905p281
9982C4691k0280N5062K9139m0220n8350R2813Q1122k9743l7647l273N8473P6439
9970B38226q5788j10197n2571L0331N2241q2352j1517K7507k1623L0593O9281
$$ y = [32599, 51197, 15881, 42582, 46740, 118367, 93534, 8837, 76144, -23261, 39308, 95793, -21138, 158977, 95185, 66245, 145166, 42622, 152420, 68323, -54894, -28807, -29097, 40770, -8081, 52971, 65160, -33097, 113545, 44195, 42116, 178763, 60192, 43074, 60614, -318, 155298, 157121, 21707, 48456, 50434, 152601, 158850, 78368, 30596, -7812, 26331, 28416, 84686, 110716, 77452, 172504, 68009, 53728, 135331, 80486, 178332, 204965, 172544, 173394, 42723, 68510, 72748, 84516, 122959, 37837, 72362, 84564, 78877, 41972, 34691, 14411, 69473, 98612, 58392, 42, 92855, 173977, 144234, 106587, 103314, 161787, 238226, 152438, 42241, -10330, 20001, 72242, -10110, -21627, 5880, -15743, 14850, 84131]
9959H4131n5236l1518R045k312J18672l8916o4005L1885J4623P1861l4034o7809
9947C6387m560P6977K9720r0888M02M489M9454O5765q7002L6747Q951m4021P3701
9934A56122K096p3801J7598L5533p0098J3621k0195p3900J3919R8598k6332J7685
9922I0846M9614j22763Q8445L0464n7114M4816q5508O1008o871j7476O8700j37765
9910F396J05894q413K8108Q5878j51343O6166l9647J1115K2501m9668M5127L8323
9898A60437l5184m3115j8064O5758J06369k8867o9716m4455R475P448K7224M4726
9886A82036N4937j28719J05825l6259j04962R252K0146L3052j7554K8214q7681
9875E8287Q7191K0486j86889R8185J8215J0690R1715j17434K6979L2113O018L3256
$$ y = [84131, 28895, -2623, 6422, 4110, 122782, 83866, 19861, 51746, 66369, 138230, 104196, 36387, 31827, 108804, 138524, 47636, 48038, 52527, 101981, 167746, 80744, 117491, 126442, 82421, 156122, 158218, 84417, 102015, 137548, 67450, 81071, 60876, -13024, 895, 99493, 73161, 90846, 140460, 17697, 106142, 136606, 79492, 124308, 38800, 99808, 92937, 75461, 144161, 6396, 112290, 103877, 131985, 217863, 66520, 132686, 93039, 104154, 126655, 76987, 122114, 160437, 125253, 82138, 64074, 129832, 236201, 207334, 137618, 93163, 102638, 110086, 137310, 182036, 236973, 108254, 214079, 177820, 72858, 82110, 102256, 135308, 117754, 145968, 58287, 145478, 165964, -20925, 77260, 95475, 106165, 197880, 80446, 107425, 139538, 145556, 178812]
9863A78812P2935m3406L2866J9272r8872R2787Q5488o4110q1479l819L4862l9815
9851A85521j0846n0458n7096J02800O1935Q2604p4784n2196j2597K7081Q6586
9840B88550q8298k4305K2078n0033O2771R807K394j8730O2623L7767l6979j2511
9828B55134K4051O4764m9799K1603r7697q1131O1099N5665K0860n6721Q668m1640
9816A84856M8385M9799j53660R3829K0541m4312J43031r564r6883k1275N5521
9805B70268M084K9498n506l1229P6113j4713o5314M3953j06878Q2852J02659j25845
9793B59942K6603l3966P2578J5789m837l9035L338P1926l4812n295L2618j08634
9781B56215M0992Q5836r08M8622j44687J5494J08938k9120k2583j60548M4995
$$ y = [178812, 251747, 208341, 241207, 260479, 161607, 254394, 339882, 275772, 194293, 190474, 225336, 185521, 174675, 124217, 67121, 169921, 231856, 314460, 239676, 187480, 174883, 201964, 288550, 200252, 175947, 198025, 147992, 210763, 220570, 222964, 204234, 266857, 304624, 267645, 255134, 279185, 343949, 294150, 315753, 218056, 136925, 198024, 253689, 274549, 217828, 226496, 184856, 233241, 283040, 129380, 223209, 243750, 199438, 342469, 332905, 236022, 214747, 270268, 274352, 303850, 298344, 267115, 343228, 328515, 263201, 307154, 200276, 283128, 385787, 259942, 286545, 252579, 325157, 340946, 336109, 297074, 300412, 372338, 337526, 332231, 364849, 256215, 297207, 383043, 382135, 430757, 286070, 301564, 410502, 381382, 358799, 198251, 243246]
9770B43246P0032j4172J38709r7586k7062R6355j4787j515j96721L6585P0020
9759C03104m2208J79879m3426k4290R4619o5198J4411j7038j5664O7177L8963
9748D90329L0788r2121L1080M5543N680O9672q2386p4471N4921O3783N5697l1359
9736E67156o1764N1382j7075J11644M0594j28040L3905L1977R1772m5787O592
9725F82356M2990p2488Q3246O604k2905k5784p9263R0740O2569m0317Q605j2757
9713G23596Q5832N4659K390p1179P4123R2661j8451K6121j2802L0026L2887R4424
9701A114287J5045k9468O8939J56197J20632J1641J9155J43490Q8528J92405J38196
9690B039047K07936J59486J52088L09128L03151L14354M10496O85787R33155J018906
$$ y = [243246, 313278, 299106, 437815, 340229, 313167, 409522, 394735, 393220, 196499, 233084, 303104, 260896, 440775, 397349, 373059, 467678, 402480, 416891, 399853, 384189, 451366, 490329, 521117, 428996, 460076, 505619, 511299, 580971, 498585, 424114, 479035, 542818, 598515, 567156, 505392, 556774, 539699, 651343, 691937, 563897, 597802, 629779, 721551, 675764, 682356, 725346, 652858, 736104, 742708, 719803, 694019, 614756, 705496, 768065, 727748, 736353, 723596, 809428, 864087, 866477, 795298, 869421, 962082, 943631, 969752, 956950, 986976, 1019863, 1114287, 1129332, 1099864, 1168803, 1325000, 1445632, 1457273, 1476428, 1619918, 1708446, 1900851, 2039047, 2246983, 2406469, 2558557, 2867685, 3170836, 3485190, 3895686, 4581473, 5514628, 6533534]
9680F533534J088185J541891J642028J438146J263755J172235O29498j73652l98139
9671A4737481o51952j274880j500275j472332j524278j447074j224018r56650
9663D686022o91376m23131k81836l40722r4202J5962P4509K29672K92505J64745
9653C632148k03128k77871k96165l45631l09159j87582j11400n3349q7901L9021
9643A798983m8631j8837J03575n7299m7528n6954l9249J73621P1145M7767j5893
9632A910700m0027J1616r6188o1362J732j59969k6523j06980m8532k6583j01464
9621A256420p4280j36013N2259o0482j09790K2054l1166p2495n7337j22663M0957
9610G07464O0683o933n5281K0542k3154q9047K8014m7548l7770J3946o4145O5412
$$ y = [6533534, 7621719, 9163610, 10805638, 12243784, 13507539, 14679774, 15309272, 15135620, 14737481, 14085529, 12810649, 11310374, 9838042, 8313764, 6866690, 5642672, 4686022, 3994646, 3571515, 3289679, 2948957, 2854755, 2870717, 2945226, 3174898, 3467403, 3632148, 3429020, 3151149, 2854984, 2509353, 2200194, 2012612, 1901212, 1847863, 1759962, 1798983, 1750352, 1731515, 1835090, 1777791, 1730263, 1673309, 1634060, 1807681, 1878826, 1926593, 1910700, 1870673, 1882289, 1786101, 1724739, 1726471, 1566502, 1539979, 1432999, 1384467, 1357884, 1256420, 1182140, 1046127, 1098386, 1037904, 928114, 950168, 919002, 846507, 789170, 666507, 707464, 768147, 761214, 705933, 726475, 703321, 614274, 642288, 594740, 556970, 570916, 506771, 572183]
9598E72183K3110o7219O596K2614l6284J33469j5277n9921L5857l5198N0708k5543
9586F05095l1090m9413M0031J5559m5849j4098j14128M951J14160k5067J0085
9575E10236k7764q2559J23531P396r2603Q933M3388N9760M1972j32505j9477M8074
9563D88382Q979O7412j16836m3511k4945Q1358K7638j16213J10890n3641N8023
9552D87536o113N1690M6166j39459K7455N9948l5037j1461o8650R1984N1823n07
9540E55375O1475j09068J502N7315M358m1181j9644J3468Q4936m1894o437q1750
9528D78455K3882J07955j22028K6711q7844l681J02087L448J09426q8738p345
9517E42328N1128j18357j4972O4580o7792K0070L4731J07453m7056l9235K8076
$$ y = [572183, 595293, 528074, 534670, 557284, 521000, 654469, 639192, 579271, 615128, 579930, 630638, 605095, 574005, 524592, 564623, 580182, 534333, 520235, 406107, 411058, 525218, 500151, 510236, 482472, 399913, 523444, 530840, 438237, 447170, 490558, 550318, 592290, 459785, 440308, 488382, 497361, 564773, 447937, 404426, 379481, 460839, 488477, 372264, 483154, 429513, 487536, 481423, 533113, 579279, 439820, 467275, 527223, 492186, 480725, 412075, 504059, 555882, 555375, 616850, 507782, 509284, 566599, 570957, 529776, 510132, 523600, 608536, 566642, 560205, 478455, 502337, 610292, 488264, 514975, 427131, 423450, 525537, 528985, 638411, 549673, 542328, 593456, 475099, 460127, 524707, 456915, 476985, 511716, 619169, 572113, 532878, 560954]
9506E60954K122J14148J4326J9211L5956m7332k4844j5857j05471Q4741O3599
9495G01553N5426j5952n4401r374R0652M5664J6076m0483K5029J09015l2926O0162
9483I50441q3027j4324m9233N4944R457j30556n3474Q9703K0566M9322m3568p804
9471G92447R0058l3976l332k3326m540J9633M6548k4531l0165j4635j7211O1549
9459H58519k9940p0630J1767P6809n8595K1431J11315p7171J13655l7373o76J22821
9447A041932r9273j6655J6444O8318N3943j14175m3951n5043M9273k8254p0531
9436H02028R0705K664K1276k0247l043R5698q9375j8500L3114k5146M9230l8460
9424H99944j1717L5427J5240J0955p5068L833k3511Q0065J5262q9627j6262R382
$$ y = [560954, 563076, 677224, 691550, 710761, 746717, 699385, 674541, 658684, 553213, 637954, 701553, 756979, 741027, 686626, 677252, 767904, 813568, 829644, 789161, 814190, 923205, 890279, 950441, 867414, 853090, 803857, 858801, 868258, 737702, 684228, 773931, 794497, 843819, 800251, 792447, 882505, 848529, 845197, 821871, 817331, 836964, 883512, 858981, 828816, 814181, 796970, 858519, 828579, 757949, 769716, 846525, 787930, 809361, 920676, 843505, 957160, 919787, 919111, 1041932, 942659, 926004, 942448, 1010766, 1064709, 950534, 906583, 851540, 900813, 872559, 802028, 892733, 895397, 916673, 896426, 893383, 989081, 899706, 881206, 914320, 889174, 938404, 899944, 888227, 923654, 938894, 949849, 874781, 878614, 855103, 935168, 950430, 860803, 844541, 853923]
9412H53923j9822K9292J6463J5157M2502k0184Q7373k8560Q690J03455J18945
9401A207234K67243L09678M63643J08040k26434p7736l43896k83658k42406j54718
9391A026990J5162j96447K6287O1235j44393N2302n5580Q5146k7498n6188P7120
9380H64136j30229P5575O3535j15375M8971l9635M2768J2639j05097J72254l6813
9369H52729J1114J7393o6600N4272m6138n7368M6691m7343P4090n9622j9667J09118
9357H68669p6579O2548K8955p4699Q5904o5489N9709K8534r9353k3290N1594R4934
9345I41437j1780k6591P2260o4356R2102M4167r0870J10569p3216J3935J2928
9334A020585m877Q1416j12752K2157Q3261M350M0340j00768Q3469N8191l7321
$$ y = [853923, 834101, 863393, 879856, 895013, 937515, 917331, 1004704, 976144, 984834, 1088289, 1207234, 1474477, 1784155, 2247798, 2355838, 2129404, 2051668, 1707772, 1424114, 1181708, 1026990, 1042152, 845705, 871992, 933227, 788834, 841136, 785556, 870702, 843204, 787016, 864136, 733907, 809482, 873017, 757642, 806613, 766978, 809746, 822385, 717288, 889542, 852729, 863843, 881236, 814636, 868908, 822770, 765402, 812093, 764750, 838840, 779218, 759551, 868669, 792090, 854638, 883593, 808894, 894798, 829309, 889018, 917552, 818199, 794909, 846503, 941437, 929657, 903066, 975326, 910970, 1003072, 1047239, 956369, 1066938, 993722, 1007657, 1020585, 1015708, 1097124, 984372, 1006529, 1089790, 1094140, 1134480, 1033712, 1117181, 1175372, 1138051]
9323A138051N9979j11249j7887M7807o9599Q1979n6593P97O2364o6595N2723N6624
9311A178401n304q206p6465J40862o0999Q571J10753q3713J0580l5503p2896J23601
9299A229682m0469M1021L1569m0260J27118k8287j2709N9329K0036R9867O5990
9288A552887M640K7032k433J00726n3397l3519K3112q047N6698M0363o2184l2654
9276A613224K7560j01486L879L6798P5181r2398k8621K176o5882J19519k5816
9265A564134n5556M9364q0195L8127j0515K1784M4780q8364O8431o8248N4645
9254A538387P6674o9962J08327J8287l2946J07839j25950K8497Q0810l4095N8317
9243A754185j8254J1617P0185M8211m6499m9830P5108n6143L3033J53119q1138
$$ y = [1138051, 1198030, 1086781, 1068894, 1116701, 1047102, 1129081, 1072488, 1073285, 1135649, 1069054, 1121777, 1178401, 1173097, 1164891, 1088426, 1229288, 1168289, 1176860, 1287613, 1203900, 1214480, 1178977, 1106081, 1229682, 1189213, 1230234, 1261803, 1221543, 1348661, 1320374, 1307665, 1366994, 1387030, 1486897, 1552887, 1557527, 1584559, 1582126, 1682852, 1629455, 1595936, 1619048, 1611001, 1667699, 1708062, 1645878, 1613224, 1640784, 1539298, 1543177, 1579975, 1655156, 1562758, 1534137, 1536313, 1470431, 1589950, 1564134, 1508578, 1557942, 1477747, 1515874, 1505359, 1527143, 1571923, 1483559, 1551990, 1483742, 1538387, 1615061, 1545099, 1653426, 1671713, 1638767, 1746606, 1620656, 1649153, 1729963, 1695868, 1754185, 1735931, 1747548, 1817733, 1865944, 1819445, 1769615, 1844723, 1788580, 1821613, 1974732, 1893594]
9232A893594K3939K4602j16886o76J70m7277P5767N1956l7285k8254m513J5132
9220A850269K8388K7125o1406P8127J2731o3344J46345k4984n9030Q3636r4691
9209A923166O6974Q5484m2924N7839M2605Q466J6344N3503K246j6920J00405k762
9197B294426J16700N4803p9201N0687K6988J2711J0193L8L7312Q1930P0074K0306
9185B696967J4095o8240p8898p5817K6412j06564j9397k4706j00267K1756o1825
9174B223516j213N7100R852R3611o7486q0204J123O0284J02850j47269n0351l1228
9162B170585J04035J19140p7229N1204m3551l2600N0399n5464J03034J036j522
9151B389067j8708k5231Q4816r8820N5088L0442J3547R9493o0065j9431k010P018
$$ y = [1893594, 1917533, 1942135, 1825249, 1824573, 1824743, 1777466, 1853233, 1905189, 1867904, 1839650, 1835137, 1850269, 1878657, 1905782, 1844376, 1922503, 1935234, 1871890, 2018235, 1993251, 1934221, 2017857, 1923166, 1990140, 2075624, 2032700, 2090539, 2133144, 2141610, 2157954, 2211457, 2213703, 2196783, 2297188, 2294426, 2411126, 2465929, 2386728, 2437415, 2464403, 2477114, 2487307, 2487345, 2524657, 2606587, 2676661, 2696967, 2711062, 2642822, 2563924, 2488107, 2514519, 2407955, 2388558, 2363852, 2263585, 2285341, 2223516, 2222303, 2279403, 2289255, 2382866, 2315380, 2235176, 2236299, 2296583, 2399433, 2252164, 2201813, 2170585, 2274620, 2393760, 2316531, 2367735, 2324184, 2291584, 2341983, 2286519, 2389553, 2390589, 2389067, 2370359, 2345128, 2429944, 2331124, 2386212, 2416654, 2430201, 2529694, 2469629, 2450198, 2448188, 2455206]
9139B455206J08703j6528J7328L4231R166k1891j53281J6093J07455Q364n1731
9128B513115p9968M6537J27424l862K8007J5807N4153J6575p2778K14j2016J0491
9116B643699J02184r5319M9798k9430R1058O5345k4371Q2960p8287Q5337R2062
9105B985036n1798M9274m1992n034M4618l3328O4766j03603m1795Q0284O6116
9094C012544n997j16555Q4441P0588P5697Q6017L422P0376J13520J8634L4590
9083C447277K4298p4433N8931O3382L4536L7718k6074J510M4306K9J7493j9891
9071C609082J46574L514Q0239J22267q8294J71287J2975J07832L8497j2408O5472
9060D257037N883m5839N0761J8286n971L1614J64130O1667J0928P9273K7783J959
$$ y = [2455206, 2563909, 2547381, 2564709, 2598940, 2608106, 2586215, 2432934, 2449027, 2556482, 2564846, 2513115, 2433147, 2479684, 2607108, 2603246, 2631253, 2647060, 2701213, 2717788, 2645010, 2645224, 2633208, 2643699, 2745883, 2650564, 2700362, 2670932, 2761990, 2827335, 2802964, 2885924, 2807637, 2892974, 2985036, 2933238, 2982512, 2940520, 2935486, 2980104, 2946776, 3011542, 2907939, 2866144, 2946428, 3012544, 3006547, 2889992, 2974433, 3045021, 3120718, 3206735, 3210157, 3280533, 3394053, 3412687, 3447277, 3471575, 3397142, 3456073, 3519455, 3553991, 3591709, 3565635, 3567145, 3611451, 3611480, 3628973, 3609082, 3755656, 3759170, 3839409, 3961676, 3873382, 4044669, 4057644, 4165476, 4203973, 4191565, 4257037, 4262920, 4217081, 4267842, 4286128, 4280157, 4311771, 4475901, 4537568, 4548496, 4627769, 4655552, 4657511]
9048D657511N0584p6059Q275Q3415K802J14581j2150O8534J50510R0357Q6099
9037E224459j43676L8665Q1284J3676J96858j9761M0102N3219j198J06667O9943
9026E660238J09142K8402R2185R5237k0215Q2939l5694m1378J79734J10548N5777
9015F316915O7592N7326Q4546Q3062R8304N5365J96655J15139J83728K1174O6565
9004G346371R1476J79140J66373P0818J36325P7292R8992J96580l3642M1928R9126
8993H470779K12183J26948J72968N1903J13945K52301R1756K60635J78212J16654
8983A0048284K47047J87800K04555O5764J23808J40374J06110J33087P0399J21643
8973A1448871J97804J34899K30816K08833K72987L11362M05309L20086M25273
$$ y = [4657511, 4708095, 4632036, 4640311, 4723726, 4726528, 4841109, 4828959, 4897493, 5048003, 5138360, 5224459, 5080783, 5119448, 5200732, 5214408, 5411266, 5391505, 5431607, 5484826, 5483628, 5590295, 5660238, 5769380, 5797782, 5889967, 5985204, 5964989, 6047928, 6012234, 5970856, 6150590, 6261138, 6316915, 6384507, 6441833, 6526379, 6609441, 6707745, 6763110, 6959765, 7074904, 7258632, 7279806, 7346371, 7437847, 7616987, 7783360, 7854178, 7990503, 8067795, 8166787, 8363367, 8329725, 8371653, 8470779, 8682962, 8809910, 8982878, 9034781, 9148726, 9401027, 9492783, 9753418, 9931630, 10048284, 10295331, 10483131, 10687686, 10753450, 10877258, 11017632, 11123742, 11256829, 11327228, 11448871, 11646675, 11781574, 12012390, 12221223, 12494210, 12805572, 13210881, 13530967, 13956240]
8964A3956240L53635L35236L27901K66255R0710K22278M53568M84461M87211N52747
8954A7530242L88153O98847N04013O23658N84809O43069Q87872R40952J030259
8945B3831874J109122J215573J476161J421579J803226J649166J954381K384689
8937C6845771K876056L416563M041313M667508N925677P480167J0660132J6976972
8929I2890159K9983260M9250736P6724117O8970224n507532m0341504m4836471
8922B27132989n5723070m4352311k8956066j8744548j3522494q976278m851676
8915E2006546k005913k22395J558727L082407M666777M751586K404356j30483
8907F6111608j743391k732095k695718j794880K69347K423346M805163M915843
$$ y = [13956240, 14309875, 14645111, 14973012, 15239267, 15329977, 15552255, 16005823, 16490284, 16977495, 17530242, 17918395, 18617242, 19121255, 19744913, 20329722, 20972791, 21860663, 22801615, 23831874, 24940996, 26156569, 27632730, 29054309, 30857535, 32506701, 34461082, 36845771, 39721827, 43138390, 47179703, 51847211, 57772888, 65253055, 75913187, 92890159, 122873419, 172124155, 248848272, 317818496, 312310964, 271969460, 227132989, 171409919, 127057608, 98101542, 79356994, 65834500, 56858222, 52006546, 50000633, 49778238, 51336965, 54419372, 59086149, 63837735, 66242091, 66111608, 64368217, 61636122, 58940404, 57145524, 57414871, 59838217, 64643380, 69559223]
8899F9559223J475103k537102m448492n297973n159199m081095k927447k303059
8891D4279959j917562j500828q70944n70842l26161j42699k27358k72083k19304
8882C8232178k30301l98986m58809k97514l57572o6668J56830O69741J260764
8873C8509663J966843K135547J254747j36223j258543j723731j771955j375437
8865C7600911m57774K34853J120559J497350J285263J50794j001493j426508j623634
8856C7380321j458554r15464n71177j82908k32395j47307n94478j008383j095403
8847C1174252j085017r51714q30386n67050m24094m01345l10467k21684r4330
8838B6288165J70002N76001Q58129J404421J787228J906273R38418n73199j352480
$$ y = [69559223, 71034326, 68497224, 64048732, 58750759, 53591560, 49510465, 46583018, 44279959, 42362397, 40861569, 39990625, 39419783, 39093622, 38950923, 38723565, 38451482, 38232178, 38001877, 37602891, 37144082, 36846568, 36488996, 36422328, 36579158, 37248899, 38509663, 40476506, 42612053, 43866800, 43730577, 42472034, 40748303, 38976348, 37600911, 37143137, 37377990, 38498549, 39995899, 41281162, 41431956, 40430463, 39003955, 37380321, 35921767, 35006303, 34435126, 34252218, 34019823, 33872516, 33278038, 32269655, 31174252, 30089235, 29137521, 28307135, 27740085, 27315991, 26914646, 26604179, 26382495, 26288165, 26458167, 27034168, 27892297, 29296718, 31083946, 32990219, 33928637, 33355438, 32002958]
8829C2002958j868004j864453j353518p67202q7864O02821J071495P59257m48951
8820B8046539j151831j552830j639781j469386j126277q80439p80163o26793n96708
8811A8222331n18741m90356l98992k70592j74442J1234j31050j02515r9025K2871
8801A6070723J47265Q5350J63473K80112M68903N85601P07473P28409O09108N75874
8791B0422291K60966m1703l98002n79748p48856p91375n70692m05695p8613R4973
8781A7163546K66172O17347N62871M50622L71266L81220M29018K36800K27353
8772B0706215M8625l23512n03941q57185p87952q48693o69748n37528l56054k29348
8762A5640879j23916O2713K08174L51776M49950N33626P60007Q60100P49338N02926
$$ y = [32002958, 30134954, 28270501, 26916983, 26149781, 26061917, 26664738, 27736233, 28495490, 28046539, 26894708, 25341878, 23702097, 22232711, 21106434, 20225995, 19445832, 18819039, 18222331, 17703590, 17213234, 16814242, 16543650, 16369208, 16380442, 16249392, 16146877, 16047852, 16070723, 16217988, 16303338, 16466811, 16746923, 17215826, 17801427, 18508900, 19237309, 19846417, 20422291, 20683257, 20641554, 20243552, 19663804, 18914948, 18123573, 17552881, 17147186, 17068573, 17163546, 17429718, 18047065, 18609936, 19060558, 19431824, 19813044, 20242062, 20478862, 20706215, 20754840, 20431328, 19927387, 19070202, 18282250, 17433557, 16763809, 16226281, 15870227, 15640879, 15516963, 15579676, 15787850, 16139626, 16589576, 17123202, 17883209, 18743309, 19492647, 19995573]
8752A9995573J33568k95823o10866r19090q50069p07003n98033j89940k94688
8743A5663629k99985k5454l3234J84766K42416M48653O83859P42906R56067P79807
8733A9343430O55678K83696j84417l41575m63915m65762n69457o79938o45345
8724A6932395q54896p67457p09589p07528n75913l59299j73135k15112j39646
8715A2429820l8395o1349R4104J74462J95490M98567O25486O39990N80890J67710
8705A5306775m1075l56854n77865n29444n46672m07764l49000j22364J41l434
8695A2372444L04608L91130N34639P11571Q27111J241611J466495J549838J490771
8686B0890218P92732Q2591o29902j024863r95566j085203p58852m15254m8934
$$ y = [19995573, 20129141, 19833318, 19222452, 18303362, 17453293, 16746290, 16148257, 15958317, 15663629, 15363644, 15338190, 15304956, 15489722, 15732138, 16180791, 16864650, 17607556, 18563623, 19343430, 19999108, 20282804, 20098387, 19756812, 19292897, 18827135, 18257678, 17577740, 16932395, 16077499, 15310042, 14600453, 13892925, 13317012, 12957713, 12784578, 12569466, 12429820, 12391425, 12330076, 12424180, 12598642, 12794132, 13292699, 13918185, 14558175, 15139065, 15306775, 15265700, 14908846, 14330981, 13801537, 13254865, 12847101, 12498101, 12375737, 12375878, 12372444, 12677052, 13068182, 13602821, 14314392, 15141503, 16383114, 17849609, 19399447, 20890218, 21682950, 21765541, 21135639, 20110776, 19115210, 18030007, 17271155, 16855901, 16806967]
8677A6806967L31005K98979M73369K84152l8529K886p7118R1798M10823N00698
8667A9085030O61732M06801K95146O3790l82261n60921j058892j075045j040615
8658A6394765r10623l97446k84765P4913M20284M64864M12121M7670k91210n68161
8648A5362412o33219m25523m00209l7716J05388K49298M64083J93690k4265j28782
8638A4725157m41262l78948l20186k88739N5543J27515L97172L41889L03324J83836
8628A4705301k66982l11161n43493m67990l10548l47972J492K83171N17619N87079
8618A3846516L21935K24002k22368n52252o00147n64829j96467k00142J40793
8609A2197041M95772L17013L81757J19260l64367o15567r41418q90380p59993
$$ y = [16806967, 17137972, 17436951, 17910320, 18194472, 18155943, 18158829, 18081711, 18173509, 18584332, 19085030, 19746762, 20153563, 20448709, 20512499, 20130238, 19569317, 18510425, 17435380, 16394765, 15484142, 15086696, 14801931, 14876844, 15297128, 15761992, 16174113, 16221783, 15930573, 15362412, 14729193, 14303670, 13903461, 13865745, 13971133, 14220431, 14684514, 14878204, 14853939, 14725157, 14283895, 13904947, 13584761, 13296022, 13351565, 13479080, 13876252, 14218141, 14521465, 14705301, 14438319, 14127158, 13583665, 13115675, 12805127, 12457155, 12458647, 12741818, 13259437, 13846516, 14168451, 14392453, 14170085, 13617833, 13017686, 12452857, 12256390, 12056248, 12197041, 12692813, 13009826, 13391583, 13510843, 13146476, 12530909, 11589491, 10699111, 9939118]
8600I939118o42187m85266m06173l27335j58789j61652m9871j88061m7468J6535
8590G488851j80956N6557n3848j29210J295j4478O6341n8531p043Q184k6045J19032
8578G270149J9468l080J07236P8248J61431k0375q4941K05435j1714K01660P8247
8567H001764M238J73391P7826K40254k1324O2045K25942M8034K63471J08679n1103
8556I133217J75738j2135J58835P0248j1201K67591J32249L37570L76838L90708
8546A1019658L49395L70816P56940O27151O10077N83910J52128Q8735j03345k93486
8536A4161979j66334k09576O114K58345K99648L51981L63047K77381j61781l11782
8526A4869022l57659m83321k46171k32378j81713M4034n5257J40091L20260Q1511
$$ y = [9939118, 9296931, 8811665, 8405492, 8078157, 7919368, 7757716, 7707845, 7519784, 7472316, 7488851, 7307895, 7364452, 7310604, 7181394, 7182689, 7168211, 7234552, 7176021, 7168978, 7177162, 7151117, 7270149, 7289617, 7286537, 7393773, 7472021, 7633452, 7613077, 7528136, 7733571, 7721857, 7923517, 8001764, 8006002, 8179393, 8257219, 8497473, 8476149, 8538194, 8764136, 8812170, 9075641, 9184320, 9133217, 9308955, 9296820, 9455655, 9525903, 9514702, 9782293, 9914542, 10252112, 10628950, 11019658, 11369053, 11739869, 12496809, 13123960, 13734037, 14317947, 14470075, 14558810, 14455465, 14161979, 13995645, 13786069, 13792183, 14050528, 14350176, 14702157, 15065204, 15342585, 15180804, 14869022, 14511363, 14028042, 13781871, 13549493, 13367780, 13411814, 13356557, 13496648, 13816908, 13898419]
8516A3898419K58242O9673J37241K69578K13981M64908M42904O96509Q53518R33955
8506A8238928J050744P90304O64978O34897N37274N86521L03511K55428J18848
8497B3181433k77495k84489l68397l54034j89620k99822j2228m9639j49954q9712
8487B1106043m73502o03863p61758r07454o48910p27138m90883m22819k61054
8478A5808662j2739j22063J96260J15209J22239K94243J59196M43966M17120N13535
8468A7935628Q50467R62568J178636J152609J110178Q69458N55137L16564O9991
8459B5001236j16981l46513m07247k12147j54287j55488k9844J49921J37973K94482
8449B4161105J42433k09072o95790q21310p77912q39893o67954m92838k59070
$$ y = [13898419, 14156661, 14226334, 14363575, 14633153, 14847134, 15312042, 15754946, 16451455, 17304973, 18238928, 19289672, 20079976, 20744954, 21379851, 21917125, 22503646, 22807157, 23062585, 23181433, 22903938, 22619449, 22251052, 21897018, 21707398, 21407576, 21395348, 21345709, 21195755, 21106043, 20632541, 20028678, 19266920, 18359466, 17710556, 16983418, 16492535, 16069716, 15808662, 15795923, 15673860, 15870120, 15985329, 16107568, 16401811, 16561007, 17004973, 17422093, 17935628, 18786095, 19748663, 20927299, 22079908, 23190086, 24059544, 24614681, 24931245, 25001236, 24884255, 24537742, 24130495, 23918348, 23764061, 23608573, 23578729, 23728650, 23866623, 24161105, 24303538, 24094466, 23398676, 22577366, 21799454, 20959561, 20291607, 19798769, 19539699]
8440A9539699P9319J51229M87637N04541M75287N76110M16867L01027J80346L11919
8430B3023981N22265O76982R85807J313795J873200K424898K811255K659307J886776
8421C8178266N49266r55308k050808k689732k888697k816199k258172j691639
8413B3376977j365550j206283r65913r18816p74438o95212p51934o31508l57898
8404A5709425l64103k14644q1556n4672K21922K60259M01648K59768P8309M3242
8394A6259598o3882N1821o0300J58537M27820M88868R05897J029139J343227J716910
8384B2257635J672227J572467N76913n76763j606311k267203k435286k405390
8376A6788289k079370j854832j457861j125433r72383p37717n31022n36018l75995
$$ y = [19539699, 19619018, 19770247, 20257884, 20762425, 21237712, 21813822, 22230689, 22531716, 22712062, 23023981, 23546246, 24223228, 25209035, 26522830, 28396030, 30820928, 33632183, 36291490, 38178266, 38727532, 37772224, 35721416, 33031684, 30142987, 27326788, 25068616, 23376977, 22011427, 20805144, 19839231, 18920415, 18145977, 17450765, 16698831, 16067323, 15709425, 15345322, 15130678, 15049122, 14994450, 15216372, 15476631, 15878279, 16138047, 16216356, 16259598, 16195716, 16247537, 16187237, 16345774, 16773594, 17262462, 18168359, 19197498, 20540725, 22257635, 23929862, 25502329, 26079242, 25502479, 23896168, 21628965, 19193679, 16788289, 14708919, 12854087, 11396226, 10270793, 9298410, 8560693, 8029671, 7493653, 7117658]
8367G117658l40051m17724k62121l24222j93082j82249k25635l1437k26797r8789
8357D815551J1343j04746N2163j95662N2506k2396j59738r199k46172K77j28512
8346D065415j91272k9865k49779J7958n517j85556l3399O0259l3656l4892K5860
8335C405556L892J00758R8786K8954L9035m762r5306K9503j5511j82390o191j82403
8323C219921k79336q7338k05118j25576k04841j72609k444o4017o7825j49662
8313A861155m2176p9429l2691N9379j67721L1521M6086j25745L7687L4634l1010
8302A591690k2869M2287j6021K676J07015r8581P9708J04785N1081J05967J26164
8291B073902K1647N548N2457l3154Q607r1882j14901p1910j55370j30468j82151
$$ y = [7117658, 6777607, 6359883, 6097762, 5773540, 5580458, 5398209, 5172574, 5141137, 4914340, 4815551, 4826894, 4722148, 4774311, 4578649, 4631155, 4608759, 4449021, 4439822, 4193650, 4193927, 4065415, 3874143, 3844278, 3594499, 3612457, 3606940, 3421384, 3387985, 3448244, 3414588, 3379696, 3405556, 3409448, 3510206, 3608992, 3637946, 3676981, 3672219, 3576913, 3606416, 3590905, 3408515, 3402324, 3219921, 2940585, 2853247, 2648129, 2522553, 2317712, 2145103, 2142659, 2078642, 2010817, 1861155, 1818979, 1739550, 1706859, 1766238, 1598517, 1630038, 1676124, 1550379, 1588066, 1622700, 1591690, 1568821, 1611108, 1595087, 1597763, 1704778, 1606197, 1685905, 1790690, 1841771, 1947738, 2073902, 2095549, 2101097, 2153554, 2120400, 2129007, 2037125, 1922224, 1850314, 1694944, 1564476, 1382325]
8280A382325p9618j06636p7009n2401j59132k0610j06105m7177L7624l3721r797
8269G27743k8919M2351r9064l5044L7371j14278J12970n7188j21479R8866q3516
8258D79813n003j1287j3724m0929J7090P4009p2383N4999q3008m8360Q2750q4719
8246C49248J6690L7997j52132o0678J20602q8719j7894J01897l3082O755n166
8235B75518p4121r715N7997j4147J7847K4189n7875M1079P006o5971O4805p3093
8223A93519P7414K7983l8355k4800o0887K6301J5824M088L1680j67013O6653Q749
8211A61156j2503L6741l3462N3955n630k9855m2958m2710Q7223l2933J0095p0456
8199G8663L1700N4542j0501m0172J11271n9179J72783J277850n67285n23862m7697
$$ y = [1382325, 1302707, 1196071, 1119062, 1066661, 907529, 886919, 780814, 733637, 771261, 737540, 727743, 698824, 741175, 642111, 607067, 644438, 530160, 643130, 585942, 464463, 563329, 479813, 474810, 463523, 449799, 408870, 425960, 499969, 427586, 482585, 399577, 351217, 433967, 349248, 365938, 403935, 251803, 191125, 311727, 223008, 205114, 307011, 273929, 280684, 275518, 201397, 191682, 249679, 235532, 253379, 277568, 219693, 260772, 267778, 201807, 266612, 193519, 270933, 298916, 260561, 235761, 174874, 201175, 216999, 221087, 252767, 85754, 152407, 161156, 148653, 185394, 151932, 205887, 200257, 170402, 127444, 84734, 171957, 139024, 149119, 78663, 110363, 164905, 154404, 114232, 225503, 166324, 339107, 1616957, 1049672, 525810, 478113]
8188D78113k06890l481m5470O2118m4292q836j7689M61J19758r2988m9661P4083
8176B65226o2283N7711L2841m1177J8468J0761l4282O5567n6967k9730m4739J12655
8164B94051k6650J5892K0129j9630J03548N1384j24577R9930o0997O86J7086r4560
8152B76292K4448j3774J9201J6690p6633J5126n6802J42323K81p8197N6053j57545
8140A67463M5133Q6737q9190M4265R3730N7817m8034o292K7952k3966K6039J2903
8128C94557j0665o3705K345L9428Q4175P558P5926M4927O8161K47567J00481J1062
8116A001817m8889j42222M54j04344j28017j19145j21338Q3200j03366k5410M4863
8105C37603q4378J47969q645j14645R8858P2675m6861J5577J00244m1421n727
$$ y = [478113, 271223, 267742, 222272, 284390, 240098, 231262, 213573, 214034, 333792, 240804, 191143, 265226, 202943, 260654, 293495, 252318, 270786, 281547, 247265, 312832, 255865, 226135, 181396, 294051, 267401, 283293, 303422, 283792, 387340, 438724, 314147, 414077, 353080, 353766, 370852, 276292, 300740, 286966, 306167, 322857, 246224, 261350, 204548, 346871, 347152, 268955, 325008, 167463, 212596, 299333, 210143, 254408, 348138, 405955, 357921, 351629, 379581, 355615, 381654, 394557, 383892, 320187, 322532, 361960, 446135, 453693, 529619, 574546, 642707, 890274, 990755, 1001817, 952928, 810706, 811160, 706816, 578799, 459654, 338316, 421516, 318150, 292740, 337603, 253225, 401194, 392549, 277904, 376762, 449437, 402576, 418153, 518397, 476976, 471249]
8094D71249L1799r1642Q459Q548r2245J11157P7255j01568M1506j37557K6440
8083C53401K20622r829O8609J03420P1168P8329m3118j8419j81860o3429q7561
8072D91333j07552O1333q1105q6454O1580o6659K3551o4364l7868M4651Q631L7855
8060B84932n862P9680L4484R249O719j6555p3527M3691m7866N166J7678j10177
8048B27612M0535R063q994o3071p9446r352o8127O6645Q1460j03873r797M9574
8036A32229L1086L0388r9793N7030L2686r897o4043m5106J2354j5523L7357m801
8024I3967k4202K7999j6286o2641N4043k1240M8472P7622j08092M4049m7869p6447
8012a0625l970m8441R2941K7649o8504P9238j2809n5606K3606j4270o2572R315
$$ y = [471249, 503048, 411406, 419865, 428413, 336168, 447325, 524580, 423012, 464518, 326961, 353401, 574023, 564194, 632803, 736223, 807391, 885720, 842602, 824183, 642323, 578894, 491333, 383781, 445114, 364009, 277555, 339135, 272476, 296027, 231663, 193795, 238446, 247077, 284932, 279070, 358750, 393234, 402483, 409202, 392647, 319120, 362811, 314945, 320111, 337789, 227612, 268147, 277210, 268216, 205145, 125699, 116347, 48220, 114865, 196325, 92452, 82655, 132229, 163315, 193703, 93910, 150940, 183626, 173729, 109686, 64580, 76934, 61411, 98768, 93967, 69765, 97764, 81478, 18837, 72880, 51640, 100112, 177734, 69642, 113691, 65822, -10625, -14595, -63036, 29905, 57554, -10950, 68288, 55479, -127, 23479, 9209, -53363, -44048]
8000d4048L1679K4735j412j21202n246R060M9324m6144O9769J1523j41207J11191
7988e1978j7236k4479N5677m5782o390n9683n0935R9273p9951Q2877k1184k4310
7976a44101N2359r8675N3630j8041J90Q6511q5054j0303P4542r0484Q4457q8181
7964a83150J1662K6111r4818R1451m0795n4064J15217n8328O7466J343j2378Q0703
7952d9580o3216L3469j49587J9251L499r5268J03263j22351m0930R3182r7182
7941c65450R1309m125n0002N4183l3119Q1420q2141J6477Q0718r1479L9946p909
7929b70172p257R1972o2566P1075j0753n6789R1669l7738j6435l703m0772k172
7917b53641Q405M6183l7572j4374J8924p0170J08930l1205k831P393o1385j2072
$$ y = [-44048, -12369, 12366, 10954, -110248, -115494, -106434, -57110, -103254, -33485, -21962, -163169, -51978, -69214, -93693, -38016, -83798, -90188, -149871, -200806, -101533, -181484, -98607, -119791, -144101, -91742, -190417, -136787, -154828, -154638, -68127, -153181, -163484, -88942, -179426, -94969, -183150, -171488, -145377, -240195, -148744, -189539, -243603, -128386, -186714, -119248, -117905, -130283, -49580, -112796, -79327, -228914, -209663, -206164, -301432, -198169, -320520, -361450, -268268, -365450, -274141, -278266, -328268, -274085, -307204, -225784, -307925, -291448, -210730, -302209, -262263, -270172, -277429, -185457, -248023, -176948, -187701, -244490, -152821, -190559, -206994, -210697, -251469, -253641, -245236, -199053, -236625, -250999, -232075, -302245, -193315, -224520, -227351, -219958, -281343, -293415]
7905b93415q1874J736P5275J02085j2802o5677N2676J7080k8630P220k7729p296
7893b61351J27736L564l2510L5827l8021m2505J5147K3349M8755L5944l4273q5758
7881b04096M9991k1148p2379O3122j25276J09817J0807n1428Q5075p1178m584
7870b31277k2950N1217K3729l7143R569n8569M5582q237p4260J16988L4073p0343
7858b21621M7660L4111n1535J3065l2236m1088K6459N3079J8081Q0556M669n8003
7846a26803O2639l832l5348N8764o5865k4764n6637L4396P7426p9366O064o1841
7834b15167q2823J9242l2725R0129K9706l6694R0342n1808k252k1290R6893m8636
7822a65083m4736k8704p1577J26164N8650r1406L6122K1803K405P8991n8860o7204
$$ y = [-293415, -375289, -373553, -298278, -196193, -208995, -274672, -221996, -204916, -233546, -226326, -254055, -261351, -133615, -130051, -162561, -126734, -164755, -207260, -192113, -168764, -120009, -84065, -118338, -204096, -154105, -175253, -247632, -184510, -309786, -199969, -189162, -240590, -155515, -226693, -231277, -254227, -203010, -179281, -216424, -206855, -265424, -219842, -228079, -302339, -185351, -151278, -221621, -173961, -139850, -191385, -178320, -210556, -251644, -225185, -172106, -154025, -73469, -68800, -126803, -64164, -67996, -103344, -44580, -110445, -135209, -191846, -157450, -80024, -159390, -153326, -215167, -297990, -278748, -311473, -221344, -191638, -228332, -137990, -189798, -192050, -213340, -116447, -165083, -209819, -238523, -310100, -183936, -125286, -216692, -180570, -158767, -156362, -77371, -136231, -203435]
7810b03435P8208Q923k23187J13333R5089P3166j9879j10537o530j0323P6797
7799a28375O210K22198m7499j34919J21852r1159N0440n852j46603J9900j4554
7788a48361m62M9917o0984j1089N9721l4321n6978N9484o3005l9458J33154l2889
7776a45271q9471J33466l4610k0810J52226p3036m2784M3234o1150L4517M4773
7765e8916L0987J3789k1175M9833n1612M5935k9607j3808R6909o8988L608O0773
7753E7728q6850J4992l3189p1025O3854J2751m9389R3523k959L2356q235j0075
7741A3482K724J0770n9957j16311P3883N4183m5121R4516m6043l8995N4179n2520
7729e5210O373L7829Q1709Q339n8846O6226Q61P8512n8840j07O4068o2252j4755
$$ y = [-203435, -125227, -116304, -339491, -226158, -131069, -57903, -77782, -188319, -194849, -205172, -128375, -122165, 100033, 52534, -82385, 39467, -51692, -1252, -7104, -153707, -133807, -148361, -148823, -98906, -159890, -170979, -111258, -145579, -202557, -143073, -206078, -245536, -112382, -145271, -234742, -101276, -135886, -156696, -4470, -77506, -120290, -77056, -138206, -103689, -58916, -27929, -14140, -35315, 14518, -37094, 8841, -20766, -34574, 62335, -6653, -3045, 57728, -29122, -14130, -47319, -118344, -54490, -41739, -91128, 2395, -564, 31792, 23557, 13482, 16206, 26976, -32981, -149292, -75409, -21226, -66347, 28169, -17874, -56869, -2690, -55210, -48837, -11008, 70701, 79040, 20194, 86420, 87281, 165793, 106953, 106846, 170914, 108662, 93907]
7716I3907n4463k6973r6859J09833n016M7196L547l3557K9772n8295J2234J498
7704B2824M6401N1961j02364O2787l889n0533N2636r6321N6024R943o8215O8154
7692D9408M2156n2312k6672J7348l0967P4700Q7743J6753J5930r798j6699j00552
7680F7038K534l518O471J06602j72364P407N141L1940Q5506j9750o6959j8807
7668C1241J13139n2234k2529K1404o9351J27698K4531k6886k4881r3213n4481
7657b5562L9516L3279p9116N4701q0091q6657J40096p7433K9042R8184p7569K1349
7645a0261m3335J7316p3736J02460P6631j47065R5881n8032M290N2157m3213M6353
7633A9446p1627L8395N4481o51l0231J8736l6292K1060P0827k7001q680K8008
$$ y = [93907, 39444, 12471, -84388, 25445, 20429, 67625, 71172, 37615, 67387, 9092, 21326, 22824, 69225, 121186, 18822, 81609, 77720, 27187, 79823, -16498, 39526, 49469, -18746, 49408, 91564, 39252, 12580, 29928, -1039, 73661, 161404, 178157, 194087, 184289, 167590, 67038, 69572, 66054, 72525, 179127, 6763, 14170, 19311, 51251, 136757, 117007, 50048, 31241, 144380, 92146, 69617, 91021, 21670, 149368, 173899, 147013, 122132, 28919, -25562, 13954, 47233, -31883, 22818, -57273, -143930, -3834, -81267, -52225, 45959, -31610, -10261, -53596, -36280, -110016, -7556, 69075, -77990, 17891, -40141, -35851, 16306, -26907, 19446, -52181, -13786, 40695, 40044, 9813, 28549, -7743, 13317, 84144, 57143, 48463, 76471]
7621G6471J22244j33571q537m350j62080J84818M0022j4092O0984j45580O2456
7610G8785r5780O3880L3589j62810J58319l7699L0957J9408q1147J40303m1465
7599A06340O6593k4690q8287N4680k8193Q5990L54j1j0716J02622J1589q5146
7587A91125k5377J04008N9088p6578J3131n3110j4286M0287Q123J06946j57820
7576A95537K8921L3334k5413N2060j19364M9194l3955L5637M5199j16603N0042
7565A94589o1867N2282l510j46119J01481j4284M4303K9476j01192K9490k5042
7554I9607P2690Q4812k0481n2240k5833O4322m8326P7501J1932Q709N8152k2076
7542C08769L5847r2857O9692L868P6718j3637j55603J29142n4060R545Q5063q141
$$ y = [76471, 198715, 65144, 56607, 52257, -109823, 74995, 115017, 100925, 161909, 16329, 78785, -16995, 46885, 80474, -82336, 75983, 38284, 69241, 88649, 7502, 147805, 106340, 172933, 148243, 59956, 114636, 86443, 172433, 172787, 172776, 162060, 264682, 276271, 191125, 165748, 269756, 328844, 252266, 265397, 212287, 198001, 238288, 246411, 353357, 195537, 224458, 257792, 232379, 284439, 165075, 214269, 180314, 215951, 261150, 144547, 194589, 132722, 185004, 181494, 35375, 136856, 122572, 166875, 196351, 95159, 124649, 99607, 172297, 257109, 236628, 184388, 158555, 222877, 174551, 252052, 263984, 272693, 330845, 308769, 344616, 251759, 321451, 325319, 402037, 388400, 232797, 361939, 307879, 317424, 402487, 394346]
7530C94346O4654K1228J0900q2903P2836P3264j5326J37527n7417m7810J45938
7519G17237P6096J28533K0463K370J39349M912p9646P3595P2187j33347r521l2059
7507I80169L1765l8887o9237O701r0729r219j61745j32264M8048j13114J9286
7496D70774r6675J5368P5984n2505Q8423j05025k2909k9337l6430j8484r795M0917
7484C20306l9708L4951P8475k3063r0517L2752j8575N0928N5975r6593R4013N0387
7472D49331J1377k3536p9614Q6692m1548M5765k4660p5722L8798k2701J37045
7461E01227O0344j26750R6042m3739K7175N0544l4489N5156k1371L7288j5559
7450E85868L8645o485j00705M0223q0507J1976J29129q9906O976J16449L2906
$$ y = [394346, 459000, 480228, 491128, 408225, 481061, 554325, 538999, 676526, 619109, 571299, 717237, 793333, 921866, 942329, 944699, 1084048, 1088960, 1009314, 1082909, 1155096, 1021749, 1012228, 980169, 1011934, 973047, 903810, 910511, 819782, 810563, 648818, 516554, 564602, 451488, 470774, 374099, 389467, 465451, 412946, 501369, 396344, 373435, 344098, 307668, 289184, 279389, 320306, 280598, 315549, 394024, 370961, 280444, 313196, 294621, 345549, 401524, 304931, 398944, 449331, 460708, 437172, 357558, 444250, 402702, 448467, 423807, 348085, 386883, 364182, 501227, 561571, 434821, 530863, 487124, 514299, 564843, 530354, 585510, 564139, 601427, 585868, 624513, 618028, 517323, 557546, 477039, 489015, 618144, 528238, 535214, 651663, 684569]
7439F84569K6983K1991p69P4525N4029J29451q6708p1831Q3693N618O0231j07072
7427H74710l5988k5999j57362J3793l2021m3141m6080p3491O2676q4819o9180
7416C83098k7116l7894J17240K9484k5756n3829P0305n963L789K6632l9921Q5128
7404E25197N3153r3262J30647m2064o0456M5866j9730r0830N2662m227n9308J10558
7392E48206q4382K0788N9041J004L7704M9140n8015p1207M746N2745P0573R3843
7380G24186j28369k5515K1003k6772J18532J41799r7402N5184J5429j29227O4960
7369G33808k514r2492J23575q4022j00701K8663l7986Q2383K2014o1308L2442
7358F43862J30641K518n1335J09397m6043j0689J72786j36344J4683R0996l7156
$$ y = [684569, 711552, 733543, 732774, 807299, 861328, 990779, 904071, 832240, 915933, 921551, 981782, 874710, 838722, 812723, 655361, 669154, 637133, 593992, 547912, 474421, 537097, 452278, 383098, 355982, 318088, 435328, 464812, 439056, 385227, 455532, 449569, 453358, 479990, 440069, 525197, 578350, 485088, 615735, 573671, 513215, 559081, 539351, 448521, 501183, 496956, 437648, 548206, 463824, 484612, 543653, 544657, 582361, 631501, 573486, 502279, 507025, 559770, 630343, 724186, 595817, 570302, 591305, 564533, 683065, 824864, 727462, 782646, 798075, 668848, 733808, 731294, 638802, 762377, 678355, 577654, 606317, 568331, 650714, 672728, 611420, 643862, 774503, 777021, 725686, 835083, 789040, 778351, 951137, 814793, 829476, 920472, 883316]
7347H83316J31305o2376l0328N5863J7499N1135J059n9149m7611m1069Q4782O2029
7335A046455j9984Q6580o5529R4790K2415p1383K7499L9894O2427M0099o6893
7324A196370k967p5631J10135L1534q28P7522q4607P657N0747r6421O0838J4011
7312A288360R5628P0694p3384N4288M9965L6917P1850O6088J3680J0355N0763
7301A735204J4401M1444P3466j45035l9376P3230k6272j60574J4706j03624r3187
7290A384383J32346j67604l4730M3526n2618M0091J4364K7857J177L9498J1106
7279A439396J0819q4151m0388L9098N6667J17131O7492R3395P726k5144L330N7051
7267A742422O6419j9172K4607J420m9757J2689p5589O947L1301m4167P3475r5214
$$ y = [883316, 1014621, 952245, 921917, 977780, 995279, 1046414, 1047473, 988324, 940713, 899644, 984426, 1046455, 1026471, 1113051, 1047522, 1142312, 1164727, 1093344, 1120843, 1160737, 1223164, 1263263, 1196370, 1193403, 1117772, 1227907, 1259441, 1258613, 1336135, 1251528, 1259185, 1309932, 1213511, 1274349, 1288360, 1383988, 1454682, 1381298, 1435586, 1485551, 1522468, 1594318, 1660406, 1674086, 1684441, 1735204, 1749605, 1791049, 1864515, 1719480, 1680104, 1753334, 1727062, 1566488, 1581194, 1477570, 1384383, 1516729, 1349125, 1314395, 1357921, 1305303, 1345394, 1359758, 1387615, 1388792, 1428290, 1439396, 1450215, 1366064, 1325676, 1364774, 1421441, 1538572, 1606064, 1699459, 1707185, 1682041, 1685371, 1742422, 1808841, 1789669, 1814276, 1815696, 1765939, 1778628, 1703039, 1709986, 1741287, 1697120, 1770595, 1675381]
7255A675381R534J49100J3700P0830L0497N6021J12145J15897j1495p5838M7501
7244B193273j0664N8978r3564j2895M264K6214p4645o6079L7705m2174P6021K4299
7232B120733j72135L4498o629O6185M6549O4778P7164j4762M8170q711J92999
7221B448839K6712p1890L8498j1100R2074P2936K8431O8589J26340J30374p7544
7210B872259R2060l9116J14243Q7250j45311n2519p6437L0945J04897j13349l7652
7199B837270o8053O7254O8775p435Q6418K6419J17447l516P0166J86079O9829
7188C450653Q5098K41036J1850p5030M5894o6130P6216n0651r2428r6009k41771
7177C288728J180j75754j46128j10622k07499J7648j03936J0982j6906j67617
$$ y = [1675381, 1684915, 1834015, 1847715, 1918545, 1949042, 2005063, 2117208, 2233105, 2221610, 2145772, 2193273, 2182609, 2241587, 2148023, 2135128, 2139392, 2165606, 2090961, 2024882, 2062587, 2020413, 2096434, 2120733, 1948598, 1983096, 1976467, 2042652, 2089201, 2153979, 2231143, 2216381, 2264551, 2255840, 2448839, 2475551, 2403661, 2442159, 2431059, 2523133, 2596069, 2624500, 2693089, 2819429, 2949803, 2872259, 2964319, 2925203, 3039446, 3126696, 2981385, 2928866, 2852429, 2883374, 2988271, 2874922, 2837270, 2769217, 2836471, 2905246, 2897811, 2984229, 3010648, 3128095, 3124579, 3194745, 3380824, 3450653, 3535751, 3776787, 3788637, 3713607, 3759501, 3693371, 3769587, 3718936, 3626508, 3530499, 3288728, 3289908, 3114154, 2968026, 2857404, 2649905, 2667553, 2563617, 2574599, 2557693, 2390076]
7167B390076P5429j27558p317j9866q7350N7314k8630l4291k4480j06340L7065
7156B124052O574L6158R282m9963n5441q712O9908M9191r1931o3807R3865j07416
7144B011760L0583M3173m3159K8097J057Q5315j41757l6924J20137r7845Q1443
7133B081880k09240K6808L274j18161J16439q2179p9903j8930L8017J9511j60674
7122A616842L7676q1999J07112j3053j01931P1243q7204J9849M1820q1782n0357
7111A478216L7457o2539J2167l9551q2905P1887m5122m8147J6136j0721q241r9463
7099A219174J81182k8699n7584l8802j33121J85823q4050q1421J17220j17783
7089A161939J16533o5521J7524K9139p3446J35146L558l7206j41890M9314N1193
$$ y = [2390076, 2465505, 2337947, 2330630, 2310764, 2223414, 2280728, 2252098, 2217807, 2193327, 2086987, 2124052, 2130626, 2166784, 2176066, 2126103, 2070662, 2061950, 2131858, 2181049, 2089118, 2025311, 2119176, 2011760, 2042343, 2085516, 2042357, 2070454, 2071511, 2156826, 2015069, 1978145, 2098282, 2000437, 2081880, 1872640, 1899448, 1902722, 1784561, 1901000, 1818821, 1738918, 1719988, 1758005, 1777516, 1616842, 1654518, 1572519, 1679631, 1666578, 1564647, 1635890, 1548686, 1568535, 1610355, 1528573, 1478216, 1515673, 1453134, 1465301, 1425750, 1342845, 1414732, 1369610, 1321463, 1337599, 1326878, 1318637, 1219174, 1400356, 1371657, 1314073, 1275271, 1142150, 1327973, 1243923, 1162502, 1279722, 1161939, 1278472, 1212951, 1230475, 1259614, 1186168, 1321314, 1324872, 1287666, 1145776, 1195090, 1246283]
7078A246283j21271O9516m5199j5219Q7961k1657j3787n9299o4563J773P8101
7067A142639K4220k9279o0227l7989P7009m3138j0684k1853M3053P0763L6473
7056A190987m1364j30729L2664l7771k2357R0401j4413R3923q5688K9843R9569
7045A205065k2912R783j03557R9334m2913M9164J4287p3568J09468m5764J3653
7034A212040j3840J890J44197j04171L8764m2531p8071J01866P4692Q0973J3304
7023A429113r87M9554n47o9322j3999q3192K1660L9150j53386P1956n9193k7212
7011A203595O9598n7086M3596j03124o1379M308j03051L0004j65493j2769P6224
7000I24423k5947O6041j84597O0749Q632k3611O5798o3195L7744m8497k028N7172
$$ y = [1246283, 1125012, 1194528, 1149329, 1134110, 1222071, 1200414, 1186627, 1127328, 1062765, 1064538, 1142639, 1166859, 1137580, 1077353, 1039364, 1116373, 1073235, 1062551, 1040698, 1083751, 1154514, 1190987, 1149623, 1018894, 1051558, 1013787, 991430, 1081831, 1067418, 1161341, 1075653, 1105496, 1205065, 1182153, 1191936, 1088379, 1187713, 1144800, 1193964, 1208251, 1134683, 1244151, 1198387, 1212040, 1198200, 1200090, 1344287, 1240116, 1278880, 1236349, 1158278, 1260144, 1334836, 1415809, 1429113, 1428126, 1477680, 1477133, 1407811, 1393812, 1310620, 1332280, 1371430, 1218044, 1290000, 1230807, 1203595, 1273193, 1216107, 1259703, 1156579, 1095200, 1099508, 996457, 1026461, 860968, 848199, 924423, 898476, 964517, 779920, 840669, 849301, 825690, 891488, 828293, 866037, 817540, 815512, 872684]
6988H72684k7253k8060m0836N2002m8034o1172M0654j6224P3289k0118K305j04629
6976F94608M4510J04513l8721O519j14833P2981l8081K7450L2365j19240Q9821
6965G61892k9951M7559r1134q5277J04533o5066P3979J6439M6758m301j03694
6954F71737L5920L2281J59411j32440p5936R1088j38182O0971o2744K0804M0655
6943G03565K7270k940r0139N5682o2670J08761n785j45563R3914p7820L0691O7531
6931G02497J772n3137P264O4948j18428J27556l9969o6142J08877m9391M6802
6920G32649o3311p3732J9509O0871O2853k6473O6232o1656J4836Q3533o8067P6834
6908H24078l1129N8426j1131j6801o4697o153K3329o9953J00752n9697j2156O8825
$$ y = [872684, 845431, 817371, 776535, 828537, 780503, 719331, 759985, 743761, 817050, 796932, 799237, 694608, 739118, 843631, 804910, 811429, 696596, 769577, 731496, 758946, 791311, 672071, 761892, 731941, 779500, 688366, 603089, 707622, 642556, 716535, 732974, 779732, 775431, 671737, 707657, 739938, 899349, 766909, 690973, 782061, 643879, 704850, 642106, 662910, 703565, 730835, 727895, 637756, 693438, 630768, 739529, 733744, 588181, 682095, 604275, 634966, 702497, 704269, 651132, 658396, 723344, 604916, 732472, 692503, 626361, 735238, 685847, 732649, 669338, 595606, 615115, 675986, 738839, 712366, 778598, 716942, 731778, 815311, 747244, 824078, 792949, 851375, 840244, 823443, 758746, 752593, 775922, 705969, 806721, 747024, 734868, 803693]
6896H03693k9114N7286p5689k3826N1141M3301M7448l4103j0453l6395K3639K4078
6884H41006j2869j9643J6034N7560k8160J0931n2565J7314J89006j4922p301r7686
6872H98705M5119J6438o3364J63814j70914M8017O2752j19357J84206r6876l0654
6861I37886P8131Q150R6983j11324l7544J35735Q57k3607K1500P6555J27462J02028
6849A412812l168N5266p4300Q9563p9654K3539M4058j89924N4543q0544m0401
6838A211790Q2501j51747L1150l2304Q1964J3681j16905R1884m7128N7536L2875
6827A255297j60962n6820M9860Q0796R3966p2033K588N7020q7074n4889M9228
6816A156977K527M9209o4245O9738o562P0234Q5893j02833J25475m8300n9709
$$ y = [803693, 774579, 831865, 756176, 732350, 783491, 826792, 874240, 840137, 829684, 793289, 816928, 841006, 828137, 808494, 824528, 882088, 853928, 864859, 812294, 829608, 1018614, 1003692, 996391, 898705, 943824, 960262, 896898, 1060712, 889798, 937815, 1000567, 881210, 1065416, 968540, 937886, 1016017, 1024167, 1121150, 1009826, 972282, 1108017, 1108874, 1085267, 1106767, 1183322, 1310784, 1412812, 1409644, 1464910, 1390610, 1480173, 1400519, 1424058, 1468116, 1278192, 1332735, 1252191, 1211790, 1294291, 1142544, 1173694, 1141390, 1223354, 1237035, 1120130, 1212014, 1164886, 1222422, 1255297, 1094335, 1037515, 1087375, 1168171, 1262137, 1190104, 1192692, 1249712, 1162638, 1107749, 1156977, 1159504, 1208713, 1144468, 1214206, 1207644, 1277878, 1363771, 1260938, 1386413, 1338113, 1278404]
6805A278404K6780M2637J29071m4984j0670Q2642j2562J85506m4522L5758J66954
6794A835014M3963J12770j70761k4221k0569l8710N9432j607k9803q8634L3863
6783A710737l9786R449J8916q5147Q1270R076N7350R7112K8011J5420L7860R8012
6771B038280n0363L3398J4173M0138J10457n7305J13492J09256N3526Q3266J07538
6760B595856J13562Q0974K45388K14007K02720K82541L57793N71073O50008Q50060
6750F163982Q84055O67059L96195R6015k29851m19734l34325j99973J24946M79830
6740G628199M94745M64065L85861m7440m95889p34646p77196o36128m19661k33110
6730E628800M3335L86707O13809Q40254O61521N21419J37898k61843n94091o07013
$$ y = [1278404, 1305184, 1347821, 1476892, 1431908, 1421238, 1503880, 1491318, 1676824, 1632302, 1668060, 1835014, 1878977, 1991747, 1820986, 1796765, 1776196, 1737486, 1796918, 1795311, 1765508, 1676874, 1710737, 1670951, 1680400, 1699316, 1614169, 1695439, 1704515, 1761865, 1858977, 1886988, 1902408, 1940268, 2038280, 1987917, 2021315, 2035488, 2075626, 2186083, 2128778, 2242270, 2351526, 2405052, 2488318, 2595856, 2709418, 2790392, 3035780, 3249787, 3452507, 3735048, 4092841, 4663914, 5313922, 6163982, 7048037, 7715096, 8111291, 8207306, 7977455, 7557721, 7223396, 7023423, 7148369, 7628199, 8122944, 8587009, 8972870, 8925430, 8429541, 7694895, 6917699, 6281571, 5861910, 5628800, 5672135, 6058842, 6672651, 7512905, 8174426, 8695845, 8833743, 8571900, 7977809, 7370796]
6720G370796m43183k71420J86808L55447N01333L13912m2097m15580p64984q46601
6710E944431q39351o73863o26828m95999l06922k48333k14904j43124j59458r2599
6700B143050n7936l0531k7307k3946n9417l7536N3764k5216O373k9590j7460j1507
6688A882741N839k0530m6915j47r053N2938j7543k8212k3418l9919R4753K3530
6676A874064p748J9201o8913N7811j9589k4461J294r0379J26325k8861q300J3183
6664A843627O3415J38024o0765j1655J8527o3518R9424n771m7582N2010m9025
6653A976711N1910k4924p7489L6718J4675N6387K0664p4286O1626o4775n016M2043
6641B014244o6866J60001m6482N0101P3005m4375R6946m7937P4719J32099K3024
$$ y = [7370796, 6927613, 6656193, 6843001, 7198448, 7699781, 8013693, 7971596, 7556016, 6791032, 5944431, 5105080, 4431217, 3804389, 3308390, 3001468, 2753135, 2538231, 2395107, 2235649, 2143050, 2085114, 2054583, 2027276, 2003330, 1943913, 1906377, 1960141, 1934925, 1941298, 1911708, 1894248, 1882741, 1888580, 1868050, 1821135, 1820988, 1811935, 1864873, 1847330, 1819118, 1795700, 1755781, 1850534, 1874064, 1866316, 1885517, 1816604, 1874415, 1854826, 1830365, 1831659, 1741280, 1867605, 1838744, 1830444, 1843627, 1907042, 2045066, 1984301, 1972646, 1991173, 1927655, 2027079, 2021308, 1973726, 2025736, 1976711, 2028621, 2003697, 1926208, 1962926, 1977601, 2033988, 2054652, 1980366, 2041992, 1977217, 1972201, 2014244, 1947378, 2107379, 2060897, 2110998, 2184003, 2139628, 2236574, 2188637, 2263356, 2395455, 2418479]
6630B418479K6155j16907N7569Q2154P0387p781j23652L0553J6308p1969K9259
6619B410555m8437l8429L570n0953k758K6688J9257o4112k7640J16846K7986K5322
6607B397895K2312n8657p565k5053k5412J01214N2414L9766J0453l9033J3142
6596B481476M8008M5645M3480j9488J3363N0839M5737j7617N0047J08884K806
6585B853180M1242J35245P5635l3251N7549J23766N2961L5135M5258N0641P8030
6574C515391Q8195R2293K8004J9965R509N2821L7733J08319K3870J01435j9453
6563D058082N7641J78032J32074J68097J42124Q2311J90971K69382K20116K38815
6553E737645K70308L05594L60133M14471L83107L28587J57663K1594J7917J02873
$$ y = [2418479, 2444634, 2327727, 2385296, 2467450, 2537837, 2530056, 2406404, 2436957, 2453265, 2381296, 2410555, 2362118, 2323689, 2327259, 2276306, 2273548, 2300236, 2319493, 2255381, 2227741, 2344587, 2372573, 2397895, 2420207, 2361550, 2353985, 2328932, 2303520, 2404734, 2457148, 2496914, 2507367, 2468334, 2481476, 2529484, 2575129, 2618609, 2599121, 2612484, 2663323, 2709060, 2691443, 2741490, 2850374, 2853180, 2894422, 3029667, 3105302, 3072051, 3129600, 3253366, 3306327, 3341462, 3386720, 3437361, 3515391, 3603586, 3695879, 3723883, 3743848, 3753357, 3806178, 3843911, 3952230, 3976100, 4077535, 4058082, 4115723, 4293755, 4425829, 4593926, 4736050, 4818361, 5009332, 5278714, 5498830, 5737645, 6007953, 6313547, 6673680, 7088151, 7471258, 7799845, 7957508, 7979102, 7997019, 8099892]
6543H099892J6615j36507M3606j5232J08509J75214m4553R3764K00615K24336
6533H766259J73346J68085K69603L66122M00270M38982N52959N44398O16970P13206
6523A3010200P96932P77646R08810J252213J398765J786206K016482K161012K551293
6514B6659559K262176K007964J371435J41999o14023j576891k151553k500141
6506B5600525k747897k482035k321466k039126j740144j517089j142861j049683
6498A0560224q13436o75327p54631m17034l76954n11939k85037k90890l40686
6489F094290j55706k40700r1642j46573j88875j02393k09750j8263j56056j52536
6479D631796q597k02662K5k10328r6463o4312j16210L1837j20883Q2708R821q3613
$$ y = [8099892, 8116507, 7980000, 8023606, 8008374, 8116883, 8292097, 8247544, 8341308, 8541923, 8766259, 8939605, 9107690, 9377293, 9743415, 10143685, 10582667, 11135626, 11680024, 12296994, 13010200, 13807132, 14584778, 15493588, 16745801, 18144566, 19930772, 21947254, 24108266, 26659559, 28921735, 30929699, 32301134, 32443133, 31829110, 30252219, 28100666, 25600525, 22852628, 20370593, 18049127, 16010001, 14269857, 12752768, 11609907, 10560224, 9746788, 9071461, 8316830, 7899796, 7522842, 7010903, 6725866, 6434976, 6094290, 5938584, 5697884, 5606242, 5459669, 5270794, 5168401, 4958651, 4940388, 4784332, 4631796, 4623199, 4420537, 4420562, 4210234, 4113771, 4049459, 3933249, 3965086, 3844203, 3926911, 3936732, 3853119]
6467C853119m1833j08654q1895p7013k20233r9788j05014p0703M7836j26550j32491
6456B836781L2181o8082J9930j14791o7387J07350j28292J8514j75266N504J50289
6445B616731j22593P8290j16773K4237L2835j82972R4533L3040P2026n8609j12656
6434B358089J25844p6428o8430J294k0316P7275p1530j0950L0677n4775N380Q705
6422B304835O0117l0445O3586p579M3776N1445K1725J3636K230N9231L6534J00951
6410B720042J42642K33151M24921L04297R3891j32195k21751j32160k56005j77348
6400B999485j33891j5093o1530L8882R0628K4615J38728k6480J05540Q4171J99537
6389C444592K13705K17348K45061J59994J79506r7195k45278m4992j57223r4496
$$ y = [3853119, 3811286, 3702632, 3620737, 3543724, 3323491, 3223703, 3118689, 3047986, 3095822, 2969272, 2836781, 2868962, 2800880, 2820810, 2706019, 2638632, 2745982, 2617690, 2636204, 2460938, 2466442, 2616731, 2494138, 2572428, 2455655, 2479892, 2512727, 2329755, 2424288, 2457328, 2529354, 2470745, 2358089, 2483933, 2407505, 2339075, 2340369, 2320053, 2397328, 2325798, 2314848, 2345525, 2290750, 2296130, 2304835, 2364952, 2334507, 2398093, 2390514, 2434290, 2485735, 2507460, 2521096, 2523326, 2582557, 2619091, 2720042, 2862684, 3095835, 3520756, 3825053, 3918944, 3786749, 3564998, 3432838, 3176833, 2999485, 2865594, 2850501, 2788971, 2827853, 2918481, 2943096, 3081824, 3055344, 3160884, 3245055, 3444592, 3658297, 3875645, 4120706, 4280700, 4460206, 4363011, 4117733, 4072741, 3915518, 3821022]
6379C821022j68710k03612q5813j37168q3709n3596k0994J4708j3472m4873q1877
6368B941906J19004K64996J82356M32627L64373R6003j68808l04186l64041k33826
6358C330404k13775j22570n9787q1227l8163m8945l5893J9474P7902K9537j2236
6347B844721N3240J1715r390L3086l6862J29590M8457J5357P4750l7145R1965
6336C219484P2075j1127J22807J79140J72212L38630K42168J46787N4644n1035
6326D485785N2213j7524P4819N5617R7701M20044M06250P86945R98701J365610
6316H726161J728970Q06371k14079p84465j149632j134699r95622o88657p14802
6307E579546l92655j57451k10697L9349L9195M3857J74509O0612R2232K12773
$$ y = [3821022, 3652312, 3448700, 3362887, 3225719, 3142010, 3088414, 3067420, 3082128, 3068656, 3023783, 2941906, 3060910, 3325906, 3508262, 3940889, 4305262, 4401265, 4232457, 3928271, 3564230, 3330404, 3116629, 2994059, 2934272, 2853045, 2814882, 2765937, 2730044, 2749518, 2827420, 2856957, 2844721, 2897961, 2909676, 2900286, 2933372, 2896510, 3026100, 3074557, 3089914, 3164664, 3127519, 3219484, 3291559, 3280432, 3403239, 3582379, 3754591, 4093221, 4335389, 4482176, 4536820, 4485785, 4537998, 4520474, 4595293, 4650910, 4748611, 5168655, 5574905, 6361850, 7360551, 8726161, 10455131, 11261502, 11047423, 10262958, 9113326, 7978627, 6983005, 6294348, 5579546, 5186891, 5029440, 4818743, 4858092, 4897287, 4941144, 5115653, 5176265, 5268497, 5481270]
6297E481270p181O9827K67834L39555O21428R41379J482949J697482Q77164m11298
6287A1360409j102324j119965j183282q91885o04247m82600k01430m9597o2980
6278E662099q1975j21769k7461o4015r6129m6219j46109N0708m4982k1434M9497
6267E112211p9070J29799q1J1144J13590J09255J08489R4886N3122M6851j2770
6256E687426p8108p8927j60742m9683j29942r6657j04637k6990P8827m445P181
6245E043303N6049J16164K39614R767J65831K25816L1473J68601J69582K34139
6235F460339K23024K84987N14719N18450P56110R33777Q54866P81283M88601L94180
6225A2210336R8584m21959o34997o64819o61352l95215k02497J69565L90266K37092
$$ y = [5481270, 5474089, 5543916, 5811750, 6151305, 6772733, 7714112, 9197061, 10894543, 11771707, 11360409, 10258085, 9138120, 7954838, 7062953, 6458706, 5976106, 5774676, 5725079, 5662099, 5580124, 5458355, 5430894, 5366879, 5270750, 5224531, 5078422, 5129130, 5084148, 5062714, 5112211, 5033141, 5162940, 5162859, 5174003, 5287593, 5396848, 5505337, 5600223, 5653345, 5700196, 5687426, 5609318, 5530391, 5369649, 5319966, 5190024, 5093367, 4988730, 4961740, 5040567, 5036122, 5043303, 5099352, 5215516, 5455130, 5464897, 5630728, 5856544, 5888017, 6056618, 6226200, 6460339, 6683363, 6968350, 7483069, 8001519, 8757629, 9691406, 10546272, 11327555, 11816156, 12210336, 12308920, 11886961, 11251964, 10587145, 9925793, 9530578, 9328081, 9497646, 9887912, 10125004]
6215A0125004N25426O38428M98124M78950M55701N89863M41370K97649K77304
6206A4327819k4134J151k40191m69339m49837o21118l26243m78272k11721K2150
6196A1530265l12263l82483k81657l11367j83872r1697J99628M37663Q99288J158299
6186A2661804R72053N76160L10376k325o36785j270397j453136j372037j325964
6177H459749q86446p22135n75554k30349m54059j53189P127j62858L8728j57883
6167E163131n1070k2149j1826o673j52800J38669j9573M3454J18583n6829K61837
6156E404754J30388R2056K10654K57301L15847J12043m4837j41346k33212j50563
6146E953085j23358l0897J3064K0541k9307R293J37846K01995K7699R0746J63427
$$ y = [10125004, 10650430, 11288858, 11786982, 12265932, 12721633, 13311496, 13752866, 14050515, 14327819, 14303685, 14304836, 14064645, 13595306, 13145469, 12524351, 12198108, 11719836, 11508115, 11530265, 11218002, 10835519, 10553862, 10242495, 10058623, 9966926, 10166554, 10604217, 11503505, 12661804, 13633857, 14210017, 14520393, 14518068, 13881283, 12610886, 11157750, 9785713, 8459749, 7573303, 6851168, 6275614, 6045265, 5591206, 5438017, 5445144, 5282286, 5321014, 5163131, 5112061, 5089912, 5078086, 5071413, 4918613, 5057282, 5037709, 5081163, 5199746, 5142917, 5404754, 5535142, 5627198, 5837852, 6095153, 6411000, 6523043, 6478206, 6336860, 6103648, 5953085, 5829727, 5798830, 5811894, 5832435, 5803128, 5812421, 5950267, 6152262, 6179961, 6270707, 6434134]
6135F434134K04703L06892K97084L38171O47499P23759P86727O78322K72875l9206
6125A0650960l02749m14684m13003k49468j14315j02849J8493K47172M64513N81516
6115A0365586O06660K86890r1314k94606n42223m53159m06523l52545k19309k81743
6105H617714q4123o8386l076n3235j16677j07530j91078k6857j22646L154J14703
6094G961963L5761K79625L25330J23447L7706m8355k60871j36455j45598j84191
6084G988362J3098N630O8890J83050J69045L66801O43358Q48196O10179K72096
6074A1168705j57336n02780m93299o54065n60850k70152k30748o2631o8060p6432
6064H092352k6286j6510R465O4223L3044k4462J13790N9405R1778P2071N3582
$$ y = [6434134, 6638837, 6945729, 7242813, 7580984, 8228483, 8952242, 9738969, 10417291, 10690166, 10650960, 10348211, 9933527, 9520524, 9271056, 9156741, 9053892, 9072385, 9319557, 9784070, 10365586, 10972246, 11259136, 11167822, 10873216, 10330993, 9877834, 9471311, 9118766, 8899457, 8617714, 8533591, 8465205, 8462129, 8408894, 8292217, 8184687, 7993609, 7966752, 7844106, 7847260, 7961963, 7997724, 8277349, 8602679, 8726126, 8763832, 8715477, 8454606, 8318151, 8172553, 7988362, 8001460, 8007090, 8075980, 8259030, 8428075, 8794876, 9438234, 10286430, 10896609, 11168705, 11011369, 10508589, 10015290, 9361225, 8800375, 8530223, 8299475, 8236844, 8168784, 8092352, 8066066, 8049556, 8059021, 8123244, 8156288, 8131826, 8245616, 8305021, 8396799, 8468870, 8522452]
6053H522452r904J09808J61455L3134N1627J569J5591K8116j0187J07568J18866
6042I130095P1840J08348M041J32431O5249J41957J38211N2034Q3804K2769J04568
6031A0055347K8476J02820N8967J02466J18951Q6373J98277Q2736J29124J23539
6021A1087076Q1866K52845K5458J93401Q9233J52537L89696J73830J70272L07514
6011A2923728J60010J47847J02086M110K59l3917q0124l1688K8434J20424N5638
6000A3396807J77685K19606J76732K55154J99367K99342M21215L22864L96398
5991A5865170K77320J23418R9743k15563j45031j76047k16774j96758j37424p8172
5981A5199882j04329j59880p3650j95595p5783n4577j81419O5436J13170J70533
$$ y = [8522452, 8512548, 8622356, 8783811, 8816945, 8868572, 8870141, 8885732, 8913848, 8903661, 9011229, 9130095, 9201935, 9310283, 9314324, 9446755, 9512004, 9653961, 9792172, 9844206, 9928010, 9950779, 10055347, 10083823, 10186643, 10245610, 10348076, 10467027, 10553400, 10751677, 10834413, 10963537, 11087076, 11168942, 11421787, 11447245, 11640646, 11729879, 11882416, 12272112, 12445942, 12616214, 12923728, 13083738, 13231585, 13333671, 13337781, 13338040, 13304123, 13223999, 13192311, 13220745, 13341169, 13396807, 13574492, 13794098, 13970830, 14225984, 14425351, 14724693, 15145908, 15468772, 15865170, 16142490, 16265908, 16365651, 16150088, 16005057, 15829010, 15612236, 15415478, 15278054, 15199882, 15095553, 14935673, 14862023, 14666428, 14590645, 14536068, 14354649, 14420085, 14533255, 14703788]
5971A4703788M25608L62718O23143O85730N12743N53320L72125L38435m3984p3854
5961A8459772j07657l36243k5941m3110p5866K85673J80327L97700L61136K18179
5951A9313970K63578M9355K5186J37996L32755N06410M70946K54840J87737j6812
5941B1525961L575j55218l0965K58087K77960O44286Q23901Q65738J273345J365785
5931B6852455J545762J687366J832451K092848J801722J623902J213427M25904
5923C9075837k83030j067318j505575j897454k105594k096652k267066k015814
5915B5837334j920139j716130j496716j358529j094502q71382q77617p31310m95169
5906A5275840m98367l46986l05426k54758j39707j93080k6865n7506j3527J0660
$$ y = [14703788, 15129396, 15492114, 16115257, 16800987, 17313730, 17867050, 18239175, 18577610, 18533626, 18459772, 18352115, 18015872, 17989931, 17946821, 17870955, 18156628, 18336955, 18734655, 19095791, 19313970, 19577548, 19626903, 19652089, 19790085, 20122840, 20629250, 21100196, 21355036, 21542773, 21525961, 21529536, 21374318, 21343353, 21601440, 21879400, 22523686, 23347587, 24213325, 25486670, 26852455, 28398217, 30085583, 31918034, 34010882, 35812604, 37436506, 38649933, 39075837, 38792807, 37725489, 36219914, 34322460, 32216866, 30120214, 27853148, 25837334, 23917195, 22201065, 20704349, 19345820, 18251318, 17379936, 16502319, 15771009, 15275840, 14777473, 14430487, 14125061, 13870303, 13730596, 13537516, 13510651, 13453145, 13439618, 13450278]
5896A3450278j76252o6284j57612p4363k49851k93667j63953k62947o8808j17515
5886A1819026k34346p1849k9595m8800j13520K5911L4673J9790N3066q0231Q2874
5875A1456999J6327j05389R3375K8100m6637m5072O231k9191N4066N5633k589
$$ y = [13450278, 13274026, 13207742, 13050130, 12975767, 12725916, 12432249, 12268296, 12005349, 11936541, 11819026, 11584680, 11512831, 11483236, 11434436, 11320916, 11346827, 11381500, 11401290, 11454356, 11374125, 11456999, 11473326, 11367937, 11461312, 11489412, 11442775, 11397703, 11403934, 11374743, 11428809, 11484442, 11481853]
$$ [...]
##END NTUPLES=NMR SPECTRUM
##END=
