##TITLE=1H_DE-80H_X3
 200.13MHz, d2o
 8 sc
 
 19ns.26.2.2025
##JCAMPDX= 6.0         $$ Bruker NMR JCAMP-DX V2.0
##DATA TYPE= NMR SPECTRUM
##DATA CLASS= NTUPLES
##ORIGIN= UXNMR, Bruker Analytische Messtechnik GmbH
##OWNER= pz
$$ XWIN-NMR		Version 3.5
$$ Wed Jan 14 11:33:57 2026 Russian Standard Time (UT+4h)  Yarkov@DPX200
##.OBSERVE FREQUENCY= 200.1313
##.OBSERVE NUCLEUS= ^1H
##.ACQUISITION MODE= SIMULTANEOUS
##.ACQUISITION SCHEME= undefined
##.AVERAGES= 8
##.DIGITISER RES= 18
##SPECTROMETER/DATA SYSTEM= spect
##.PULSE SEQUENCE= zg30
##.SOLVENT NAME= CDCl3
##.SHIFT REFERENCE= (INTERNAL, CDCl3, 0, 15.4803)
##AUDIT TRAIL= $$ (NUMBER, WHEN, WHO, WHERE, WHAT)
$$ ##TITLE= Audit trail, XWIN-NMR		Version 3.5
$$ ##JCAMPDX= 5.01
$$ ##ORIGIN= Bruker BioSpin GmbH
$$ ##OWNER= Yarkov
$$ C:/Bruker/XWIN-NMR/data/yarkov2/nmr/H-C/1/pdata/1/auditp.txt
$$ ##AUDIT TRAIL=  $$ (NUMBER, WHEN, WHO, WHERE, WHAT)
(   1,<2026-01-14 11:33:11.03 +0400>,<Yarkov>,<DPX200>,
      <created by zg, POWCHK disabled, PULCHK disabled
       configuration hash MD5:
       00 E9 B6 7A A2 85 ED C7 34 08 36 98 17 FE 4E 26
       data hash MD5: 16K
       69 EC D0 1C 06 81 C2 E5 6A 3E 15 52 86 CF E0 A3>)
(   2,<2026-01-14 11:33:19.28 +0400>,<Yarkov>,<DPX200>,
      <Start of raw data processing
       efp BC_mod = 2 LB = 0.25 FT_mod = 6 PKNL = 1 PHC0 = -5301.897 PHC1 = 7.62193 SI = 16K 
       data hash MD5: 16K
       48 50 05 67 CB BB 7C 0B 4F 08 C4 17 94 FA 2E FD>)
$$ ##END=
$$ 
$$ hash MD5
$$ 1A FE A9 26 D4 D0 B1 2A 68 6E 64 D5 68 72 29 EE
##$RELAX= 
##$RELAX= 
##$RELAX= 
##$RELAX= 
##$RELAX= 
##$RELAX= 
$$ Bruker specific parameters
$$ --------------------------
##$DU= <C:/Bruker/XWIN-NMR>
##$EXPNO= 1
##$NAME= <H-C>
##$PROCNO= 1
##$TYPE= <nmr>
##$USER= <yarkov2>
##$AMP= (0..31)
100 100 100 100 100 100 100 100 100 100 100 100 100 100 100 100 100 100 
100 100 100 100 100 100 100 100 100 100 100 100 100 100 
##$AQSEQ= 0
##$AQ_mod= 1
##$AUNM= <au_zg>
##$AUTOPOS= <>
##$BF1= 200.13
##$BF2= 200.13
##$BF3= 200.13
##$BF4= 200.13
##$BF5= 200.13
##$BF6= 200.13
##$BF7= 200.13
##$BF8= 200.13
##$BYTORDA= 1
##$CFDGTYP= 0
##$CFRGTYP= 5
##$CHEMSTR= <none>
##$CNST= (0..31)
1 1 145 1 1 1 1 1 1 1 1 1 1 1 1 1 1 1 1 1 1 1 1 1 1 1 1 1 1 1 1 1 
##$CPDPRG= <>
##$CPDPRG1= <>
##$CPDPRG2= <>
##$CPDPRG3= <>
##$CPDPRG4= <mlev>
##$CPDPRG5= <mlev>
##$CPDPRG6= <mlev>
##$CPDPRG7= <mlev>
##$CPDPRG8= <mlev>
##$CPDPRGB= <>
##$CPDPRGT= <>
##$D= (0..31)
0 0.7 0 0 0 0 0 0 0 0 0 0.03 0 0 0 0 0 0 0 0 0 0 0 0 0 0 0 0 0 0 0 0 
##$DATE= 1768375990
##$DBL= (0..7)
120 120 120 120 120 120 120 120 
##$DBP= (0..7)
150 150 150 150 150 150 150 150 
##$DBP07= 0
##$DBPNAM0= <>
##$DBPNAM1= <>
##$DBPNAM2= <>
##$DBPNAM3= <>
##$DBPNAM4= <>
##$DBPNAM5= <>
##$DBPNAM6= <>
##$DBPNAM7= <>
##$DBPOAL= (0..7)
0.5 0.5 0.5 0.5 0.5 0.5 0.5 0.5 
##$DBPOFFS= (0..7)
0 0 0 0 0 0 0 0 
##$DE= 6
##$DECBNUC= <off>
##$DECIM= 32
##$DECNUC= <off>
##$DECSTAT= 4
##$DIGMOD= 1
##$DIGTYP= 9
##$DL= (0..7)
0 120 120 120 120 120 120 120 
##$DP= (0..7)
$$ [...]
##$SUBNAM2= <"">
##$SUBNAM3= <"">
##$SUBNAM4= <"">
##$SUBNAM5= <"">
##$SUBNAM6= <"">
##$SUBNAM7= <"">
##$SUBNAM8= <"">
##$SUBNAM9= <"">
##$SW= 18.0517328524113
##$SWIBOX= (0..15)
0 0 2 0 0 0 0 0 0 0 0 0 0 0 0 0 
##$SW_h= 3612.71676300578
##$TD= 16384
##$TD0= 1
##$TE= 0
##$TE2= 300
##$TE3= 300
##$TEG= 300
##$TL= (0..7)
0 120 120 120 120 120 120 120 
##$TP= (0..7)
150 150 150 150 150 150 150 150 
##$TP07= 0
##$TPNAME0= <>
##$TPNAME1= <>
##$TPNAME2= <>
##$TPNAME3= <>
##$TPNAME4= <>
##$TPNAME5= <>
##$TPNAME6= <>
##$TPNAME7= <>
##$TPOAL= (0..7)
0.5 0.5 0.5 0.5 0.5 0.5 0.5 0.5 
##$TPOFFS= (0..7)
0 0 0 0 0 0 0 0 
##$TUNHIN= 0
##$TUNHOUT= 0
##$TUNXOUT= 0
##$USERA1= <user>
##$USERA2= <user>
##$USERA3= <user>
##$USERA4= <user>
##$USERA5= <user>
##$V9= 5
##$VALIST= <valist>
##$VCLIST= <CCCCCCCCCCCCCCC>
##$VD= 0
##$VDLIST= <DDDDDDDDDDDDDDD>
##$VPLIST= <PPPPPPPPPPPPPPP>
##$VTLIST= <TTTTTTTTTTTTTTT>
##$WBST= 1024
##$WBSW= 4
##$XGAIN= (0..3)
0 0 0 0 
##$XL= 0
##$YL= 0
##$YMAX_a= 311436
##$YMIN_a= -225481
##$ZGOPTNS= <>
##$ZL1= 120
##$ZL2= 120
##$ZL3= 120
##$ZL4= 120
##$ABSF1= 0
##$ABSF2= 0
##$ABSG= 0
##$ABSL= 0
##$ALPHA= 0
##$AQORDER= 0
##$ASSFAC= 0
##$ASSFACI= 0
##$ASSFACX= 0
##$ASSWID= 0
##$AUNMP= <proc_1d>
##$AZFE= 0.1
##$AZFW= 0.1
##$BCFW= 0
##$BC_mod= 2
##$BYTORDP= 0
##$COROFFS= 0
##$CY= -3
##$DATMOD= 1
##$DC= 0
##$DFILT= <>
##$DTYPP= 0
##$F1P= 0
##$F2P= 0
##$FCOR= 1
##$FTSIZE= 16384
##$FT_mod= 6
##$GAMMA= 0
##$GB= 0
##$INTBC= 1
##$INTSCL= 3.241238e-09
##$ISEN= 128
##$LB= 0.25
##$LEV0= 0
##$LPBIN= 0
##$MAXI= 10000
##$MC2= 0
##$MEAN= 0
##$ME_mod= 0
##$MI= 1.114404
##$NCOEF= 0
##$NC_proc= -6
##$NLEV= 6
##$NOISF1= 3.799351
##$NOISF2= 2.8
##$NSP= 0
##$NTH_PI= 0
##$NZP= 0
##$OFFSET= 15.48025
##$PC= 1
##$PHC0= -5301.897
##$PHC1= 7.62193
##$PH_mod= 1
##$PKNL= yes
##$PPARMOD= 0
##$PSCAL= 0
##$PSIGN= 0
##$REVERSE= no
##$SF= 200.130008295995
##$SI= 16384
##$SIGF1= 3
##$SIGF2= 2
##$SINO= 0.751879
##$SIOLD= 32768
##$SREGLST= <19F.Aceton>
##$SSB= 0
##$STSI= 16384
##$STSR= 0
##$SW_p= 3612.71676300578
##$SYMM= 0
##$S_DEV= 0
##$TDeff= 16384
##$TDoff= 0
##$TI= <>
##$TILT= no
##$TM1= 0
##$TM2= 0
##$TOPLEV= 0
##$USERP1= <user>
##$USERP2= <user>
##$USERP3= <user>
##$USERP4= <user>
##$USERP5= <user>
##$WDW= 1
##$XDIM= 16384
##$YMAX_p= 346932897
##$YMIN_p= -618400
$$ End of Bruker specific parameters
$$ ---------------------------------
##NTUPLES= NMR SPECTRUM
##VAR_NAME=  FREQUENCY,     SPECTRUM/REAL,   SPECTRUM/IMAG
##SYMBOL=    X,             R,               I
##VAR_TYPE=  INDEPENDENT,   DEPENDENT,       DEPENDENT
##VAR_FORM=  AFFN,          ASDF,            ASDF
##VAR_DIM=   16384,         16384,           16384
##UNITS=     HZ,            ARBITRARY UNITS, ARBITRARY UNITS
##FACTOR=    0.220516191357247, 1,           1
##FIRST=     3098.062632687, 0,              0
##LAST=      -514.654130318776, 0,           0
##MIN=       -514.654130318776, -618400,     0
##MAX=       3098.062632687, 346932897,      0
$$ Real data points
##PAGE= N=1
##DATA TABLE= (X++(R..R)), XYDATA
$$ [...]
$$ plain form
8704 21643870 20869529 20475858 20501048 20494459 20318420 20305839 20685983 21259911 22010656 23189397
8694 23189397 24680233 26428048 28270535 30004558 31829391 33576678 35334995 37303273
8686 37303273 39644441 42691139 45926765 48583632 49456999 47427666 43511837 39324066
8678 39324066 35666629 32394700 29228704 26374822 24173263 22554363 21451155 20243159
8670 20243159 19013686 17968976 17042353 16144101 15367793 14667072 14029427 13623005 13415798
8661 13415798 13190877 13023733 12935068 12940674 12959967 13058329 13231306 13294861 13254406 13319838 13266861
8650 13266861 13069515 12888927 12771361 12595462 12179444 11818829 11467030 11117090 10780364
8641 10780364 10598288 10504719 10431652 10326016 10287414 10402624 10534307 10574069 10586081 10510896
$$ packed form
8704B1643870p74341l93671K5190o589j76039j2581L80144N73928P50745J178741
8694B3189397J490836J747815J842487J734023J824833J747287J758317J968278
8686C7303273K341168L046698L235626K656867Q73367k029333l915829m187771
8678C9324066l657437l271929l165996k853882k201559j618900j103208j207996
8670B0243159j229473j044710r26623q98252p76308p00721o37645m06422k07207
8661A3415798k24921j67144q8665N606J9293R8362J72977O3555m0455O5432n2977
8650A3266861j97346j80588j17566j75899m16018l60615l51799l49940l36726
8641A0780364j82076r3569p3067j05636l8602J15210J31683L9762J2012p5185
$$ plain form
8631 10510896 10635692 10837855 11190936 11563180 11904540 12115685 12465055 12852429 13300992
8622 13300992 13854882 14386248 14771719 15081040 15379412 15797518 15957207 15447398 14559290
8613 14559290 13815961 13383405 13076016 12785323 12506016 12268441 11988615 11796444 11469670
8604 11469670 11013894 10695843 10447000 10400109 10460921 10524501 10344730 10002631 9715224 9332437
8594 9332437 9210132 9154361 8930943 8812578 8757895 8782912 8880820 8987231 9112261 9264018
8584 9264018 9453675 9791641 10160673 10540921 10756544 10918727 11038146 11255648 11292928 11180990
8574 11180990 10989352 10862834 10761692 10751379 10635576 10473953 10353118 10474438 10539621 10445953
8564 10445953 10296360 10260120 10144406 9901949 9745442 9599264 9557592 9572071 9531965 9573962
$$ packed form
8631A0510896J24796K02163L53081L72244L41360K11145L49370L87374M48563
8622A3300992N53890N31366L85471L09321K98372M18106J59689n09809q88108
8613A4559290p43329m32556l07389k90693k79307k37575k79826j92171l26774
8604A1469670m55776l18051k48843m6891O0812O3580j79771l42099k87407l82787
8594I332437j22305n5771k23418j18365n4683K5017R7908J06411J25030J51757
8584I264018J89657L37966L69032L80248K15623J62183J19419K17502L7280j11938
8574A1180990j91638j26518j01142j0313j15803j61623j20835J21320O5183r3668
8564A0445953j49593l6240j15714k42457j56507j46178m1672J4479m0106M1997
$$ plain form
8554 9573962 9723427 9843877 9838121 9960537 10161555 10415278 10660344 10850976 11042919 11200507
8544 11200507 11485012 11896798 12350165 12932652 13572469 14263636 15019581 15585748 16059635
8535 16059635 16504897 16890543 17431642 17825665 17937796 18287451 18981526 20036356 21270370
8526 21270370 22588040 23820728 25459904 27775150 30914486 35283298 41603002 50417479
8518 50417479 62001817 76493944 93032719 109142452 119379074 119829838 111325948 96671985
8510 96671985 81206706 67652598 56336370 47092269 39882902 34731657 31213603 28843639
8502 28843639 27484127 26821744 26466836 26058593 25622246 25127086 24529582 23784778 23034428
8493 23034428 22337117 21717406 21325635 21255461 21293249 21592581 22075642 22924625 24141440 25999621
$$ packed form
8554I573962J49465J20450n756J22416K01018K53723K45066J90632J91943J57588
8544A1200507K84505M11786M53367N82487O39817O91167P55945N66167M73887
8535A6059635M45262L85646N41099L94023J12131L49655O94075J054830J234014
8526B1270370J317670J232688J639176K315246L139336M368812O319704Q814477
8518E0417479J1584338J4492127J6538775J6109733J0236622M50764q503890j4653963
8510I6671985j5465279j3554108j1316228r244101p209367n151245l518054k369964
8502B8843639j359512o62383l54908m08243m36347m95160n97504p44804p50350
8493B3034428o97311o19711l91771p0174L7788K99332M83061Q48983J216815J858181
$$ plain form
8483 25999621 28711157 32680031 38303813 45918580 55849043 68109497 81628464 93802939
8475 93802939 99871876 97972022 89083490 75910706 63018935 51906772 42723674 35271175
8467 35271175 29580835 25375714 22471008 20288894 18796611 17854453 17154864 16500772 15959659
8458 15959659 15364704 14639786 13809232 13120500 12563882 12108904 11728015 11294753 10907469
8449 10907469 10566931 10229959 9804932 9483382 9122607 8771862 8386530 8073902 7835111
8440 7835111 7525771 7234571 7043899 6843714 6681127 6544407 6375423 6265549 6197595 6140630
8430 6140630 6027646 6065368 6116386 6186561 6159516 6072796 5916928 5798301 5619568 5372935
8420 5372935 5230443 5019124 4962690 4915362 4932396 4968588 4987743 4964925 4869415 4718516 4541056
$$ packed form
8483B5999621K711536L968874N623782P614767R930463J2260454J3518967J2174475
8475I3802939O068937j899854q888532j3172784j2891771j1112163r183098p452499
8467C5271175n690340m205121k904706k182114j492283r42158o99589o54092n41113
8458A5959659n94955p24918q30554o88732n56618m54978l80889m33262l87284
8449A0907469l40538l36972m25027l21550l60775l50745l85332l12628k38791
8440G835111l09340k91200j90672k00185j62587j36720j68984j09874o7954n6965
8430F140630j12984L7722N1018P0175k7045q6720j55868j18627j78733k46633
8420E372935j42492k11319n6434m7328J7034L6192J9155k2818r5510j50899j77460
$$ plain form
8409 4541056 4403366 4347877 4255382 4169550 4188212 4159055 4191754 4196197 4163969 4197040 4088482
8398 4088482 3839072 3707707 3602949 3472946 3455867 3486464 3471378 3530925 3537942 3592664 3636543
8387 3636543 3596760 3398411 3321639 3225655 3123144 3104523 3063046 3060202 3093678 3098106 3106590 3217227
8375 3217227 3346899 3361215 3386502 3406375 3385620 3329459 3384857 3526840 3751133 4014028 4303630
8364 4303630 4638574 4857562 4851857 4709213 4382606 4034923 3627017 3293241 2990721 2665802
8354 2665802 2471958 2350786 2215170 2162179 2145556 2087661 2002704 1980796 1927916 1904307 1964271
8343 1964271 1927689 1852643 1898515 1990242 2036405 2063900 1965477 1940824 1967199 2080163 2111962
8332 2111962 2139674 2179220 2300971 2490735 2732591 3005303 3302419 3706281 3962621 4105718
$$ packed form
8409D541056j37690n5489r2495q5832J8662k9157L2699M443l2228L3071j08558
8398D088482k49410j31365j04758j30003j7079L0597j5086N9547P017N4722M3879
8387C636543l9783j98349p6772r5984j02511j8621m1477k844L3476M428Q484J10637
8375C217227J29672J4316K5287J9873k0755n6161N5398J41983K24293K62895K89602
8364D303630L34944K18988n705j42644l26607l47683m07906l33776l02520l24919
8354B665802j93844j21172j35616n2991j6623n7895q4957k1908n2880k3609N9964
8343A964271l6582p5046M5872R1727M6163K7495r8423k4653K6375J12964L1799
8332B111962K7712L9546J21751J89764K41856K72712K97116M03862K56340J43097
$$ plain form
8322 4105718 4164168 4034988 3822828 3644921 3439261 3133566 2957718 2800011 2682773 2532849
8312 2532849 2412316 2380795 2257952 2064029 1906964 1740250 1644462 1549032 1482749 1413099
8302 1413099 1414242 1352987 1287682 1322300 1286808 1232258 1174063 1140026 1130226 1134642 1173884 1236580
8290 1236580 1260520 1266578 1324162 1383926 1476012 1512412 1603221 1635721 1604645 1673380 1651202 1675827
8278 1675827 1715081 1707051 1672821 1611361 1590242 1630057 1697857 1765953 1829860 2025089 2256220
8267 2256220 2539144 2908023 3235322 3433917 3476916 3375493 3364799 3279275 2974343 2660955
8257 2660955 2316814 2071847 1963037 1820535 1633507 1611778 1651554 1681740 1772579 1911574
8247 1911574 1926844 1916129 1880163 1932190 1891597 1810055 1854518 1920068 1958042 1958188 1968626 2053030
$$ packed form
8322D105718N8450j29180k12160j77907k05660l05695j75848j57707j17238j49924
8312B532849j20533l1521j22843j93923j57065j66714r5788r5430o6283o9650
8302A413099J143o1255o5305L4618l5492n4550n8195l4037r800M416L9242O2696
8290A236580K3940O058N7584N9764R2086L6400R0809L2500l1076O8735k2178K4625
8278A675827L9254q030l4230o1460k1119L9815O7800O8096O3907J95229K31131
8267B256220K82924L68879L27299J98595M2999j01423j0694q5524l04932l13388
8257B660955l44141k44967j08810j42502j87028k1729L9776L0186R0839J38995
8247A911574J5270j0715l5966N2027m0593q1542M4463O5550L7974J46J0438Q4404
$$ plain form
8235 2053030 2098539 2169912 2279880 2423604 2559281 2762376 2836338 2797029 2670377 2555970
8225 2555970 2439400 2383881 2395740 2395333 2352982 2132171 1915889 1698569 1600254 1518663 1430600
8214 1430600 1379968 1379779 1368141 1506820 1552740 1636893 1627415 1653482 1653485 1657900 1645017 1590227 1434160
8201 1434160 1440376 1338915 1403296 1380927 1435645 1405395 1511837 1445706 1926297 1694822 661373
8190 661373 959260 999917 1106724 1151672 1187154 1101988 1034364 1038873 1078493 1060704 1140219
8179 1140219 1091387 1037987 946243 981793 899595 919043 982508 973846 1010206 1093024 1111288 1216318
8167 1216318 1253929 1308711 1411374 1369310 1365563 1335402 1293914 1285371 1328518 1266815 1216179 1216735
8155 1216735 1226348 1185041 1172670 1233339 1234360 1246737 1394811 1409192 1449745 1362475 1437367 1402562
$$ packed form
8235B053030M5509P1373J09968J43724J35677K03095P3962l9309j26652j14407
8225B555970j16570n5519J1859m07m2351k20811k16282k17320r8315q1591q8063
8214A430600n0632j89j1638J38679M5920Q4153r478K6067LM415j2883n4790j56067
8201A434160O216j01461O4381k2369N4718l0250J06442o6131M80591k31475j033449
8190F61373K97887M0657J06807M4948L5482q5166o7624M509L9620j7789P9515
8179A140219m8832n3400r1744L5550q2198J9448O3465q662L6360Q2818J8264J05030
8167A216318L7611N4782J02663m2064l747l0161m1488q543M3147o1703n0636N56
8155A216735R613m1307j2371O0669J021J2377J48074J4381M0553q7270P4892l4805
$$ plain form
8143 1402562 1370423 1420246 1417128 1339500 1385648 1408395 1381702 1469669 1463731 1499951 1617824 1714570
8131 1714570 1798926 1844671 1909647 1906076 1907671 1959055 2027547 2096289 2066248 2056033 2140813 2146386
8119 2146386 2165361 2286064 2406003 2513842 2613297 2737582 2893904 3117770 3384413 3578064
8109 3578064 3764162 3864635 3932430 3958754 4144967 4291819 4576213 5022497 5541531 6280867
8099 6280867 7158777 8074304 9208111 10440676 11835634 13264781 14308196 14919986 14833181
8090 14833181 13978621 12673716 11497232 10576344 9871530 9248953 8687669 8193130 7791954
8081 7791954 7310740 6745783 6211166 5848668 5648764 5412752 5107188 4929057 4865884 4944315
8071 4944315 5028962 5240271 5529337 5878881 6338204 6790640 7269152 7633293 8046909 8247520
$$ packed form
8143A402562l2139M9823l118p7628M6148K2747k6693Q7967n938L6220J17873R6746
8131A714570Q4356M5745O4976l571J595N1384O8492O8742l0041j0215Q4780N573
8119B146386J8975J20703J19939J07839R9455J24285J56322K23866K66643J93651
8109C578064J86098J00473O7795K6324J86213J46852K84394M46284N19034P39336
8099F280867Q77910R15527J133807J232565J394958J429147J043415O11790q6805
8090A4833181q54560j304905j176484r20888p04814o22577n61284m94539m01176
8081G791954m81214n64957n34617l62498j99904k36012l05564j78131o3173P8431
8071D944315Q4647K11309K89066L49544M59323M52436M78512L64141M13616K00611
$$ plain form
8061 8247520 8467535 8682409 8852125 9123109 9458886 10035034 10788011 11588625 12592365
8052 12592365 13504320 13774973 13360074 12414998 11280748 10033619 8820560 7657086 6657718
8043 6657718 5741068 5018445 4390874 3984453 3681449 3493247 3389534 3338387 3159383 3023002
8033 3023002 3031758 3012431 3033123 2997669 3056342 3093637 3143246 3305009 3497054 3575210 3395989
8022 3395989 3127673 2888708 2641213 2404813 2225212 2094035 2060864 2081306 2086710 2097981
8012 2097981 2118586 2131693 2168383 2185655 2130570 2052560 1940646 1832158 1727755 1695845 1782836
8001 1782836 1827532 1775149 1750264 1791149 1785708 1922880 1944013 1996449 2064459 2057774 2149544 2238483
7989 2238483 2143300 2065463 1985849 1937895 1899435 1750306 1671769 1521412 1504305 1443763 1439283
$$ packed form
8061H247520K20015K14874J69716K70984L35777N76148P52977Q00614J003740
8052A2592365R11955K70653m14899r45076j134250j247129j213059j163474r99368
8043F657718r16650p22623o27571m06421l03004j88202j03713n1147j79004j36381
8033C023002Q756j9327K0692l5454N8673L7295M9609J61763J92045P8156j79221
8022C395989k68316k38965k47495k36400j79601j31177l3171K0442N404J1271
8012B097981K0605J3107L6690J7272n5085p8010j11914j08488j04403l1910Q6991
8001A782836M4696n2383k4885M0885n441J37172K1133N2436O8010o685R1770Q8939
7989B238483r5183p7837p9614m7954l8460j49129p8537j50357j7107o0542m480
$$ plain form
7978 1439283 1429340 1352969 1286728 1276213 1257945 1281675 1238558 1211590 1125575 1130714 1160713 1176045
7966 1176045 1143520 1079646 1040861 1033402 1083410 1104218 1137162 1177309 1227858 1194826 1232584 1270255
7954 1270255 1312690 1361660 1352987 1288955 1231856 1083229 1040430 967550 818342 737944 660061
7943 660061 557332 534437 474280 491901 455911 427357 501826 542904 550745 553361 558989 510775
7931 510775 467747 437928 428061 446940 450715 417641 490179 400302 322805 335058 383563 410577
7919 410577 347030 388361 445833 443445 449731 446379 535120 518199 581936 613510 628681 594521
7907 594521 576175 526892 486024 478919 449925 443891 452194 479579 523393 571292 632679 707368
7895 707368 752358 838201 894110 864336 887270 906090 855628 768330 763034 779896 846638 871721
$$ packed form
7978A439283r943p6371o6241j0515j8268K3730m3117k6968q6015N139K9999J5332
7966A176045l2525o3874l8785p459N0008K0808L2944M0147N0549l3032L7758L7671
7954A270255M2435M8970q673o4032n7099j48627m2799p2880j49208q0398p7883
7943F60061j02729k2895o0157J7621l5990k8554P4469M1078P841K616N628m8214
7931E10775m3028k9819r867J8879L775l3074P2538q9877p7497J2253M8505K7014
7919D10577o3547M1331N7472k388O286l352Q8741j6921O3737L1574J5171l4160
7907E94521j8346m9283m0868p105k8994o034Q303K7385M3814M7899O1387P4689
7895G07368M4990Q5843N5909k9774K2934J8820n0462q7298n296J6862O6742K5083
$$ plain form
7883 871721 911527 1014478 1055541 1198926 1341016 1548692 1868724 2367549 2949749 3354908
7873 3354908 3374695 3105967 2755759 2504065 2246292 2254879 2545451 2819974 2941341 2809081
7863 2809081 2486979 2073700 1765024 1600358 1470823 1393015 1283103 1229108 1210196 1255514
7853 1255514 1297545 1285902 1279448 1248293 1227697 1276691 1287331 1208049 1260637 1403100 1411379 1519009
7841 1519009 1758968 1939079 2180931 2432388 2783614 3219404 3641295 3885793 3829051 3505099
7831 3505099 3073256 2799243 2693526 2734104 2922989 3255007 3348237 3315853 3131511 2818273
7821 2818273 2584087 2462442 2387177 2377177 2364405 2363135 2399456 2521516 2602314 2755999 2872535
7810 2872535 3001464 3189361 3383991 3606840 3769246 4088163 4287231 4609328 4963454 5383257
$$ packed form
7883H71721L9806J02951M1063J43385J42090K07676L20032M98825N82200M05159
7873C354908J9787k68728l50208k51694k57773Q587K90572K74523J21367j32260
7863B809081l22102m13279l08676j64666j29535p7808j09912n3995j8912M5318
7853A255514M2031j1643o454l1155k0596M8994J0640p9282N2588J42463Q279J07630
7841A519009K39959J80111K41852K51457L51226M35790M21891K44498n6742l23952
7831C505099m31843k74013j05717M0578J88885L32018R3230l2384j84342l13238
7821B818273k34186j21645p5265j0000j2772j270L6321J22060Q0798J53685J16536
7810B872535J28929J87897J94630K22849J62406L18917J99068L22097L54126M19803
$$ plain form
7800 5383257 5707793 5984021 6137380 6221774 6346008 6344838 6354455 6370621 6298862 6191155 6043404
7789 6043404 5939369 5945928 5940882 5829434 5739387 5606756 5430565 5343724 5290948 5246068 5158859
7778 5158859 5074383 5022175 4991631 4878184 4767909 4712502 4621921 4550863 4531910 4438924 4275424
7767 4275424 4173343 4010389 3871155 3763080 3524818 3395442 3314125 3113650 2895495 2816167
7757 2816167 2686251 2597660 2471553 2398648 2371014 2277347 2221570 2110303 2057087 2052574 1996186
7746 1996186 1943170 1916921 1909740 1857025 1869871 1914939 1957723 1869890 1855280 1979180 2008346
7735 2008346 2002771 1935715 1933936 1933564 1853362 1838151 1809694 1751851 1730820 1670274 1673527 1587561
7723 1587561 1574174 1574632 1459648 1376470 1261400 1234898 1232042 1126449 1121167 1054016 1052255 959655
$$ packed form
7800E383257L24536K76228J53359Q4394J24234j170R617J6166p1759j07707j47751
7789F043404j04035O559n046j11448r0047j32631j76191q6841n2776m4880q7209
7778E158859q4476n2208l0544j13447j10275n5407r0581p1058j8953r2986j63500
7767D275424j02081j62954j39234j08075k38262j29376q1317k00475k18155p9328
7757B816167j29916q8591j26107p2905k7634r3667n5777j11267n3216m513n6388
7746A996186n3016k6249p181n2715J2846M5068M2784q7833j4610J23900K9166
7735B008346n575o7056j779l72q0202j5211k8457n7843k1031o0546L253q5966
7723A587561j3387M58j14984q3178j15070k6502k856j05593n282o7151j761r2600
$$ plain form
7711 959655 876518 822571 764161 724377 663963 594526 587940 609079 624434 596381 525673 536986
7699 536986 550574 497275 495227 458591 416810 407692 352796 343207 349406 375424 316763 369580
7687 369580 344665 325580 283272 263986 255492 272442 283930 268250 193968 182438 171853 195632
7675 195632 189998 138787 169337 76019 97218 56085 29261 -2442 -76471 -43000 11441 85215
7663 85215 104573 121013 137697 136808 39508 -26045 -2609 70620 3915 48132 129792 94757
7651 94757 150853 139345 55902 61892 59855 46861 58674 13037 -61500 -51574 66631 109473
7639 109473 119056 147352 123718 85031 81235 52168 62474 82243 73199 41001 49821 44262 -15277
7626 -15277 -36574 -112201 -70597 36596 42957 36542 21246 16681 -3304 19374 -6384 -4338
$$ packed form
7711I59655q3137n3947n8410l9784o0414o9437o586K1139J5355k8053p0708J1313
7699E36986J3588n3299k048l6636m1781r118n4896r589O199K6018n8661N2817
7687C69580k4915j9085m2308j9286q494J6950J1488j5680p4282j1530j0585K3779
7675A95632n634n1211L0550r3318K1199m1133k6824l1703p4029L3471N4441P3774
7663H5215J9358J6440J6684q89r7300o5553K3436P3229o6705M4217Q1660l5035
7651I4757N6096j1508q3443N990k037j2994J1813m5637p4537R926J18205M2842
7639A09473R583K8296k3634l8687l796k9067J0306J9769r044l2198Q820n559n9539
7626a5277k1297p5627M1604J07193O361o415j5296m565j9985K2678k5758K046
$$ plain form
7614 -4338 -39794 -32568 33084 56991 88077 59946 45518 100814 58229 39103 59096 2748
7602 2748 -3739 49075 41071 54559 42752 13910 266 35476 6161 44909 56883 51691 17274
7589 17274 -30327 -11347 42841 50485 -221 -19523 -27757 1532 -7778 -2819 -33650 -14099 4336
7576 4336 -25328 -5786 31432 37933 -19451 -9520 34396 31302 40623 5943 21949 -2312 -8755
7563 -8755 100874 98507 77144 121548 78585 149840 135769 96891 71458 48307 17079 53974
7551 53974 125577 124045 116485 96243 74022 74933 8333 -24225 31929 41750 -21432 -11536 23396
7538 23396 60807 114486 89702 52421 -9610 -12261 -83520 -14121 56333 78884 18096 -83921
7526 -83921 -52479 -23123 -4026 29247 13582 7946 12038 46878 42643 33852 59850 43946 42902
$$ packed form
7614d338l5456P226O5652K3907L1086k8131j4428N5296m2585j9126J9993n6348
7602B748o487N2814q004J3488j1807k8842j3644L5210k9315L8748J1974n192l4417
7589A7274m7601J8980N4188P644n0706j9302q234K9289r310M959l0831J9551J8435
7576D336k9664J9542L7218O501n7384R931M3916l094R321l4680J6006k4261o443
7563h755J09629k367k1363M4404m2963P1255j4071l8878k5433k3151l1228L6895
7551E3974P1603j532p560k0242k2221R11o6600l2558N6154R821o3182R896L4932
7538B3396L7411N3679k4784l7281o2031k651p1259O9399P0454K2551o0788j02017
7526h3921L1442K9356J9097L3273j5665n636M092L4840m235q791K5998j5904j044
$$ plain form
7513 42902 44278 41359 53430 69423 80162 15828 -49136 47975 42955 75347 65030 18408
7501 18408 48985 48266 65308 132254 57382 22041 45611 19251 26485 -39567 -61315 16206
7489 16206 -9898 -12775 37089 -11690 -6895 -25319 11309 37174 -37073 -46788 -60842 -32438
7477 -32438 50432 64289 27381 52656 -14872 -1796 65290 99873 130598 96254 146710 128699
7465 128699 99307 61998 99876 100690 64857 131021 94386 44714 88846 68194 53743 10252
7453 10252 100163 167808 105235 50087 49030 53332 28388 87791 116490 18594 -18122 29738
7441 29738 -77771 -64404 39378 89677 103459 100866 107053 85070 36699 70646 104545 84495
7429 84495 98809 130373 62284 66011 84275 85468 8170 22338 70523 95739 85892 106633
$$ packed form
7513D2902J376k919J2071J5993J0739o4334o4964R7111n020L2392j0317m6622
7501A8408L0577p19J7042O6946p4872l5341K3570k6360P234o6052k1748P7521
7489A6206k6104k877M9864m8779M795j8424L6628K5865p4247r715j4054K8404
7477c2438Q2870J3857l6908K5275o7528J3076O7086L4583L0725l4344N0456j8011
7465A28699k9392l7309L7878Q14l5833O6164l6635m9672M4132k0652j4451m3491
7453A0252Q9911O7645o2573n5148j057M302k4944N9403K8699r7896l6716M7860
7441B9738j07509J3367J03782N0299J3782k593O187k1983m8371L3947L3899k0050
7429H4495J4314L1564o8089L727J8264J193p7298J4168M8185K5216r847K0741
$$ plain form
7417 106633 88905 30052 140288 162083 179681 181255 149665 136993 210113 241694 204333 204273
7405 204273 197406 194558 219668 246590 201093 123143 156220 132820 186544 157910 168523 171052
7393 171052 140706 203133 196772 159912 179993 249820 277276 315666 390551 420451 433750 436352
7381 436352 418495 444599 461560 488302 489203 456943 459585 532282 553086 557713 590800 588384 586171
7368 586171 565275 447514 415969 378890 328095 355271 325562 318284 220708 279858 378486 326447
7356 326447 278112 214247 365912 353162 268235 293465 314161 310391 264519 291443 252699 265466
7344 265466 286822 343546 341719 332460 310343 302749 337704 344473 322119 320370 361716 340603 320524
7331 320524 370863 388306 469993 491846 431560 475661 504570 514644 548179 629471 770545
$$ packed form
7417A06633j7728n8853J10236K1795J7598J574l1590j2672P3120L1581l7361o0
7405B04273o867k848K5110K6922m5497p7950L3077k3400N3724k8634J0613K529
7393A71052l0346O2427o361l6860K0081O9827K7456L8390P4885K9900J3299K602
7381D36352j7857K6104J6961K6742R01l2260K642P2697K0804M627L3087k416k213
7368E86171k0896j17761l1545l7079n0795K7176k9709p278r7576N9150R8628n2039
7356C26447m8335o3865J51665j2750q4927K5230K0696l770m5872K6924l8744J2767
7344B65466K1356N6724j827r259k2117p594L4955O769k2354j749M1346k1113k0079
7331C20524N0339J7443Q1687K1853o0286M4101K8909J0074L3535Q1292J41074
$$ plain form
7320 770545 888080 1011063 1067564 1112420 1118973 1105773 1085496 954853 861170 840668 786670
7309 786670 668422 632851 574912 505931 466344 520767 558568 568498 513820 503765 535673 576735
7297 576735 638607 646994 697845 772988 840011 917315 926541 892331 867460 768904 771943 845859
7285 845859 822094 803190 798769 701004 623332 541769 539167 507841 541300 516090 509593 480185
7273 480185 436195 442953 388672 378287 385261 414673 396623 320866 342460 461453 420432 422854
7261 422854 432059 437468 372712 373165 355667 366882 494044 448096 454185 481912 497918 492051 454642
7248 454642 487710 473822 440198 405374 492769 548426 544594 559638 660074 707326 792674 874989
7236 874989 962048 1009966 1062385 956684 816239 718479 677159 587998 535518 456906 431146
$$ packed form
7320G70545J17535J22983N6501M4856O553j3200k0277j30643r3683k0502n3998
7309G86670j18248l5571n7939o8981l9587N4423L7801R930n4678j0055L1908M1062
7297E76735O1872Q387N0851P5143O7023P7304R226l4210k4871r8556L039P3916
7285H45859k3765j8904m421r7765p7672q1563k602l1326L3459k5210o497k9408
7273D80185m3990O758n4281j0385O974K9412j8050p5757K1594J18993m1021K422
7261D22854R205N409o4756M53j7498J1215J27162m5948O089K7727J6006n867l7409
7248D54642L3068j3888l3624l4824Q7395N5657l832J5044J00436M7252Q5348Q2315
7236H74989Q7059M7918N2419j05701j40445r7760m1320q9161n2480p8612k5760
$$ plain form
7225 431146 503805 512515 524693 503679 490055 474027 470212 455096 495352 428389 353073 352223
7213 352223 357472 417781 505051 500859 451175 471349 520426 494078 383254 306555 339405 440260
7201 440260 428818 374523 376871 390949 385547 383576 540367 515032 492032 434782 483837 463277
7189 463277 440507 459141 463023 466610 542736 551129 499827 462829 506523 556223 653923 543800
7177 543800 432140 517600 530505 559540 561148 556269 508002 538946 562946 558113 567767 555769
7165 555769 497002 487830 468474 503534 472723 490969 450042 469909 462412 456397 426820 501033
7153 501033 505305 494577 566436 513584 580761 588639 532558 536653 528526 528293 599533 666852 774652
7140 774652 783568 769645 777552 812447 708876 538331 519006 532957 581049 518373 568877 580836
$$ packed form
7225D31146P2659Q710J2178k1014j3624j6028l815j5116M0256o6963p5316q50
7213C52223N249O0309Q7270m192m9684K0174M9077k6348j10824p6699L2850J00855
7201D40260j1442n4295K348J4078n402j971J56791k5335k3000n7250M9055k0560
7189D63277k2770J8634L882L587P6126Q393n1302l6998M3694M9700R7700j10123
7177E43800j11660Q5460J2905K9035J608m879m8267L0944K4000m833R654j1998
7165E55769n8767r172j9356L5060l0811J8246m0927J9867p497o015k9577P4213
7153E01033M272j0728P1859n2852O7177P878n6081M095q127k33P1240O7319J07800
7140G74652Q916j3923P907L4895j03571j70545j9325J3951M8092o2676N0504J1959
$$ plain form
7128 580836 594299 535598 578279 624072 620134 659554 622603 703754 776117 886348 882459 999622
7116 999622 1032270 961031 885794 776720 723727 614474 515370 477463 496614 528178 479514
7105 479514 502852 437050 463320 512511 514990 516603 500051 427491 558981 496488 487672 485747
7093 485747 496080 565191 541189 594820 666875 693463 674974 644095 583413 492481 547561 553251
7081 553251 520750 542548 431098 344631 380622 409146 368504 392780 418691 515929 526936
7070 526936 634663 720965 789333 836504 888393 858261 827763 782057 671914 648563 588221
7059 588221 518641 535172 506157 462132 430895 401912 364621 369683 405821 385026 332664 275193
7047 275193 256635 263542 258195 287762 247942 261344 259415 274901 299452 352967 293175 327856
$$ packed form
7128E80836J3463n8701M2681M5793l938L9420l6951Q1151P2363J10231l889J17163
7116I99622L2648p1239p5237j09074n2993j09253r9104l7907J9151L1564m8664
7105D79514K3338o5802K6270M9191K479J613j6552p2560J31490o2493q816j925
7093D85747J0333O9111k4002N3631P2055K6588j8489l0879o0682r0932N5080N690
7081E53251l2501K1798j11450q6467L5991K8524m0642K4276K5911R7238J1007
7070E26936J07727Q6302O8368M7171N1889l0132l0498m5706j10143k3351o0342
7059E88221o9580J6531k9015m4025l1237k8983l7291N062L6138k0795n2362n7471
7047B75193j8558O907n347K9567l9820J3402j929J5486K4551N3515n9792L4681
$$ plain form
7035 327856 344036 351338 393072 324152 332223 332870 345532 380260 383746 358213 356819 387025 336980
7022 336980 392639 346658 387897 342122 279864 292235 285324 306813 288925 321718 392738 401713
7010 401713 371813 419951 432774 359991 375168 362520 346890 352417 351703 346937 382271 324708
6998 324708 335517 405624 385428 381216 337756 352509 199396 211005 271297 290233 334867 373810
6986 373810 393366 342455 343177 361064 362330 377572 402988 363018 367423 358966 304600 362988 373615
6973 373615 394519 395725 372201 350344 352650 319207 375614 412854 363220 332471 350177 366785
6961 366785 411910 424393 408009 365915 333287 321305 342571 364141 374559 311297 329485 395270
6949 395270 416786 416137 410597 339398 289519 294625 285082 323240 328133 392037 427928 429815 476359
$$ packed form
7035C27856J6180P302M1734o8920Q071O47J2662L4728L486k5533j394L0206n0045
7022C36980N5659m5981M1239m5775o2258J2371o911K1489j7888L2793P1020Q975
7010D01713k9900M8138J2823p2783J5177j2648j5630N527p14m766L5334n7563
6998C24708J0809P0107k0196m212m3460J4753j53113J1609O0292J8936M4634L8943
6986C73810J9556n0911P22J7887J266J5242K5416l9970M405q457n4366N8388J0627
6973C73615K0904J206k3524k1857K306l3443N6407L7240m9634l0749J7706J6608
6961C66785M5125J2483j6384m2094l2628j1982K1266K1570J0418o3262J8188O5785
6949C95270K1516o49n540p1199m9879N106r543L8158M893O3904L5891J887M6544
$$ plain form
6936 476359 521106 490730 430503 448154 438239 439046 458959 414435 433063 457117 483058 450745
6924 450745 396917 370248 317194 409312 447534 456870 406589 383045 423380 340557 308647 312304
6912 312304 369746 394042 389299 374183 357395 379225 405987 358261 396421 434582 419465 416495
6900 416495 433887 453403 480549 530881 491971 506131 555517 559405 548725 593435 576106 557636
6888 557636 523531 533219 509665 491594 433792 444272 449186 503642 513275 499168 444020 475560
6876 475560 474525 506130 483906 419239 441736 500896 546280 519830 520177 537225 600483 555280
6864 555280 513062 536607 594501 636386 628646 620902 590181 670905 682055 545425 550172 610603
6852 610603 630913 640759 700685 627652 626353 674892 691372 675799 701891 710307 653885 637597
$$ packed form
6936D76359M4747l0376o0227J7651r915Q07J9913m4524J8628K4054K5941l2313
6924D50745n3828k6669n3054R2118L8222R336n0281k3544M0335q2823l1910L657
6912C12304N7442K4296m743j5116j6788K1830K6762m7726L8160L8161j5117k970
6900D16495J7392J9516K7146N0332l8910J4160M9386L888j0680M4710j7329j8470
6888E57636l4105R688k3554j8071n7802J0480M914N4456R633j4107n5148L1540
6876D75560j035L1605k2224o4667K2497N9160M5384k6450L47J7048O3258m5203
6864E55280m2218K3545N7894M1885p740p744l0721Q0724J1150j36630M747O0431
6852F10603K0310R846N9926p3033j299M8539J6480j5573K6092Q416n6422j6288
$$ plain form
6840 637597 708222 753118 803022 774077 954991 1083426 1078701 1044961 892709 759373 758122
6829 758122 714769 673316 664117 601545 620274 608095 612137 646620 653286 718438 742201 721414
6817 721414 628591 648918 689233 748261 768982 718982 658495 674164 660641 656658 737108 778642
6805 778642 754016 699799 629990 660096 650118 654317 639103 671557 688290 660294 674087 704222
6793 704222 772344 765193 838077 881546 959675 1097516 1083832 1145799 1268558 1434605 1553641
6782 1553641 1525640 1512636 1436640 1421661 1423309 1405431 1449613 1473958 1519937 1521712 1476842 1473775
6770 1473775 1389631 1316752 1276941 1230968 1275468 1309011 1358212 1525817 1606944 1635997 1583249
6759 1583249 1571846 1554736 1552985 1506871 1443959 1396158 1450417 1519773 1569664 1534766 1471697 1450063
$$ packed form
6840F37597P0625M4896M9904k8945J80914J28435m725l3740j52252j33336j251
6829G58122m3353m1453r199o2572J8729j2179M042L4483O666O5152K3763k0787
6817G21414r2823K0327M0315N9028K0721n0000o0487J5669j3523l983Q0450M1534
6805G78642k4626n4217o9809L0106r978M199j5214L2454J6733k7996J3793L0135
6793G04222O8122p151P2884M3469P8129J37841j3684O1967J22759J66047J19036
6782A553641k8001j3004p5996j4979J648j7878M4182K4345M5979J775m4870l067
6770A473775q4144p2879l9811m5973M4500L3543M9201J67605Q1127K9053n2748
6759A583249j1403j7110j751m6114o2912m7801N4259O9356M9891l4898o3069k1634
$$ plain form
6747 1450063 1337066 1235656 1204358 1147234 1035619 1004227 1057085 1014102 1127296 1096018 1059366
6736 1059366 1133768 1236098 1341122 1322800 1205463 1130852 1118495 1052684 1009319 950662 918039
6725 918039 878973 853911 811572 809225 854230 883959 841008 834107 839407 897478 897803 960960 911627
6712 911627 818181 876945 860983 830744 799356 858029 846596 849611 811891 804085 818362 807019
6700 807019 828009 783851 762340 711725 730974 715140 730248 762373 805284 811499 766910 845042
6688 845042 858955 875589 841682 844107 862816 906606 896534 852945 852039 879523 898600 906185
6676 906185 1026872 1026586 1045660 1058343 1023006 963262 1003639 1037540 1019349 986596 930349 964275
6664 964275 955074 932557 895506 891498 908441 881668 864171 914987 925821 917258 844022 890776
$$ packed form
6747A450063j12997j01410l1298n7124j11615l1392N2858m2983J13194l1278l6652
6736A059366P4402J02330J05024j8322j17337p4611j2357o5811m3365n8657l2623
6725I18039l9066k5062m2339k347M5005K9729m2951o901N300N8071L25O3157m9333
6712I11627r3446N8764j5962l0239l1388N8673j1433L015l7720p806J4277j1343
6700H07019K0990m4158k1511n0615J9249j5834J5108L2125M2911O215m4589P8132
6688H45042J3913J6634l3907K425J8709M3790j0072m3589r06K7484J9077P585
6676I06185J20687k86J9074J2683l5337n9744M0377L3901j8191l2753n6247L3926
6664I64275r201k2517l7051m008J6943k6773j7497N0816J0834q563p3236M6754
$$ plain form
6652 890776 930465 918900 956633 941544 907281 1013128 1050602 1058416 1057394 1101139 1082130 1080086
6640 1080086 1132444 1085925 1077360 1035775 1008815 998280 1016875 1039788 1152373 1288204 1344536
6629 1344536 1426268 1500945 1526685 1437079 1315935 1293442 1249159 1199219 1156600 1170152 1143957
6618 1143957 1100100 1069349 1085165 1127617 1216612 1151683 1144959 1194320 1211333 1202819 1170802 1172090
6606 1172090 1203270 1249780 1153447 1181257 1216234 1195305 1182458 1205913 1276103 1305890 1279182
6595 1279182 1322202 1343917 1324544 1315544 1324276 1405590 1413581 1428938 1473461 1540678 1554823 1602074
6583 1602074 1603013 1647126 1721755 1789274 1822177 1833439 1840574 1777928 1800936 1792868 1657475 1558357
6571 1558357 1562408 1615731 1577345 1582233 1476075 1383559 1441485 1462547 1547588 1541874 1541656 1506553
$$ packed form
6652H90776L9689j1565L7733j5089l4263J05847L7474P814j022M3745j9009k044
6640A080086N2358m6519q565m1585k6960j0535J8595K2913J12585J35831N6332
6629A344536Q1732P4677K5740q9606j21144k2493m4283m9940m2619J3552k6195
6618A143957m3857l0751J5816M2452Q8995o4929o724M9361J7013q514l2017J288
6606A172090L1180M6510r6333K7810L4977k0929j2847K3455P0190K9787k6708
6595A279182M3020K1715j9373r000Q732Q1314P991J5357M4523O7217J4145M7251
6583A602074R39M4113P4629O7519L2903J1262P135o2646K3008q068j35393r9118
6571A558357M051N3323l8386M888j06158r2516N7926K1062Q5041n714k18l5103
$$ plain form
6559 1506553 1486861 1594183 1653415 1709383 1656390 1662576 1686910 1777050 1825391 1832613 1893428 1974400
6547 1974400 2040249 2160235 2335392 2536024 2671391 2866701 2941076 2991097 3049216 2967212
6537 2967212 2848626 2669771 2596061 2592079 2517843 2490701 2391161 2316651 2311210 2243364 2186676
6526 2186676 2075867 2031261 2049802 1981435 1958266 2005705 2021260 2022496 1973972 1977736 2031285 2054590
6514 2054590 2085569 2041705 1992251 1980924 1984914 1937522 1993838 2063045 1987704 1996842 2011968 2032464
6502 2032464 2026873 2025977 2019559 1979869 1965962 1950127 1985328 2037239 1989844 2014492 1999973 1990028
6490 1990028 2067580 2096345 2076206 2104637 2084219 2078504 2063844 2113548 2088121 2168786 2212502 2125105
6478 2125105 2125462 2215780 2245754 2265525 2250720 2342917 2304039 2262502 2273984 2334830 2316061 2351495
$$ packed form
6559A506553j9692J07322N9232N5968n2993O186K4334R0140M8341P222O0815Q0972
6547A974400O5849J19986J75157K00632J35367J95310P4375N0021N8119q2004
6537B967212j18586j78855p3710l982p4236k7142r9540p4510n441o7846n6688
6526B186676j10809m4606J8541o8367k3169M7439J5555J236m8524L764N3549K3305
6514B054590L0979m3864m9454j1327L990m7392N6316O9207p5341R138J5126K0496
6502B032464n591q96o418l9690j3907j5835L5201N1911m7395K4648j4519r945
6490A990028P7552K8765k0139K8431k0418n715j4660M9704k5427Q0665M3716q7397
6478B125105L57R0318K9974J9771j4805R2197l8878m1537J1482O0846j8769L5434
$$ plain form
6466 2351495 2455617 2417760 2425774 2561399 2550829 2576355 2625142 2643273 2655409 2657050 2668559
6455 2668559 2738783 2790441 2800409 2775363 2815763 2893507 2969836 3042189 3130267 3252236 3197907
6444 3197907 3151114 3216602 3310397 3425440 3543347 3710716 3773810 3801274 3887771 3958484 4056058
6433 4056058 4148000 4264074 4391017 4680564 4875874 5199173 5585715 6004224 6591379 7392299
6423 7392299 8632146 10298668 12771383 16042307 19456684 21669364 21047071 18348530
6415 18348530 15652793 13584515 11953743 10839716 10311795 10253657 10403151 10933260 11659499
6406 11659499 12377956 12872782 13725714 15328496 17451944 19630979 21432903 23324084 25749765
6397 25749765 27236410 26387039 23831910 21508618 20099244 19165643 18197063 16559711 14867603
$$ packed form
6466B351495J04122l7857Q014J35625j0570K5526M8787J8131J2136J641J1509
6455B668559P0224N1658R968k5046M0400P7744P6329P2353Q8078J21969n4329
6444C197907m6793O5488R3795J15043J17907J67369O3094K7464Q6497P0713R7574
6433D056058R1942J16074J26943K89547J95310L23299L86542M18509N87155Q00920
6423G392299J239847J666522K472715L270924L414377K212680o22293k698541
6415A8348530k695737k068278j630772j114027n27921n8138J49494N30109P26239
6406A1659499P18457M94826Q52932J602782K123448K179035J801924J891181K425681
6397B5749765J486645q49371k555129k323292j409374r33601r68580j637352j692108
$$ plain form
6388 14867603 13904935 13362899 13041575 12585279 11822398 11275128 11183866 11412793 12234903 13965221
6378 13965221 16644212 20122153 23761854 25568702 23865124 20120384 16701222 13932653
6370 13932653 11652559 9931780 8807665 7971893 7237840 6768600 6449875 6272379 6193568
6361 6193568 6138954 6219572 6321796 6370872 6439325 6429474 6383693 6238760 6011276 5911046 5811871
6350 5811871 5679681 5641782 5648768 5647151 5689269 5750923 5835044 5905958 6018730 6208745 6389864
6339 6389864 6631786 6901904 7213198 7732212 8439759 9229984 10262292 11720138 14116810
6330 14116810 17252469 19770273 20600396 20341039 19989073 19185520 17841968 16285545 14434730
6321 14434730 12772944 11392764 10327353 9659337 9259156 8962426 8817564 8749038 8767738
$$ packed form
6388A4867603r62668n42036l21324m56296p62881n47270r1262K28927Q22110J730318
6378A3965221K678991L477941L639701J806848j703578l744740l419162k768569
6370A3932653k280094j720779j124115q35772p34053m69240l18725j77496p8811
6361F193568n4614Q0618J02224M9076O8453r851m5781j44933k27484j00230r9175
6350E811871j32190l7899O986j617M2118O1654Q4121P0914J12772J90015J81119
6339F389864K41922K70118L11294N19014P07547P90225J032308J457846K396672
6330A4116810L135659K517804Q30123k59357l51966q03553j343552j556423j850815
6321A4434730j661786j380180j065411o68016m00181k96730j44862o8526J8700
$$ plain form
6312 8767738 8795051 9019985 9329668 9720995 10267874 10835750 11576048 12496268 13691810 14925911
6302 14925911 16441039 18634950 21798188 26625997 35095594 49486681 67851282 83265820
6294 83265820 86358421 75185059 59366445 45480891 34289462 26283046 20964111 17341639
6286 17341639 14705343 12809339 11512013 10705646 10056699 9549366 9057519 8708771 8402057
6277 8402057 8116647 7821101 7561820 7333142 7175923 7182009 7240575 7385064 7644056 7770195
6267 7770195 7740586 7362709 6951462 6618722 6351381 6179992 6096095 6134699 6089988 6231809
6257 6231809 6223259 6269780 6260406 6257527 6451511 6720830 7106010 7674797 8305854 8844958 9116700
6246 9116700 9098527 8976388 8707570 8224996 7712309 7359005 7188506 7254615 7485641 7880197
$$ packed form
6312H767738K7313K24934L09683L91327N46879N67876P40298R20220J195542J234101
6302A4925911J515128K193911L163238M827809Q469597J4391087J8364601J5414538
6294H3265820L092601j1173362j5818614j3885554j1191429q006416n318935l622472
6286A7341639k636296j896004j297326q06367o48947n07333m91847l48748l06714
6277H402057k85410k95546k59281k28678j57219O086N8566J44489K58992J26139
6267G770195k9609l77877m11247l32740k67341j71389q3897L8604m4711J41821
6257F231809q550M6521r374k879J93984K69319L85180N68787O31057N39104K71742
6246I116700j8173j22139k68818m82574n12687l53304j70499O6109K31026L94556
$$ plain form
6236 7880197 8226248 8365836 8404146 8571807 8813124 9008866 9348963 9754167 10042648 10214766
6226 10214766 10211532 9916213 9551112 9038622 8592349 8238720 8062621 7880972 7727280 7683705
6216 7683705 7570422 7349369 7102578 6893200 6744327 6680565 6795369 7143759 7774738 8516834
6206 8516834 9211921 9509326 9349140 9146740 8783640 8016601 7218494 6634618 6135036 5722894
6196 5722894 5446985 5207245 5091316 5045544 4942108 4870377 4920170 4967082 4923749 4939396 4922895
6185 4922895 4930466 4810763 4810127 4771595 4717565 4750737 4803708 4897524 5001359 5062234 5110880 5110141
6173 5110141 5115012 5128607 5114501 5157859 5216010 5234643 5309833 5364781 5395983 5397030 5429063 5481785
6161 5481785 5622022 5620767 5659202 5786978 5995517 6217558 6496489 6793433 6936204 7014689
$$ packed form
6236G880197L46051J39588L8310J67661K41317J95742L40097M05204K88481J72118
6226A0214766l234k95319l65101n12490m46273l53629j76099j81649j53692m3575
6216G683705j13283k21053k46791k09378j48873o3762J14804L48390O30979P42096
6206H516834O95087K97405j60186k02400l63100p67039p98107n83876m99582m12142
6196E722894k75909k39740j15929m5772j03436p1731M9793M6912m3333J5647j6501
6185D922895P571j19703o36l8532n4030L3172N2971R3816J03835O0875M8646p39
6173E110141M871J3595j4106M3358N8151J8633P5190N4948L1202J047L2033N2722
6161E481785J40237j255L8435J27776K08539K22041K78931K96944J42771P8485
$$ plain form
6151 7014689 7172704 7331110 7548916 7777979 8130037 8496444 9018323 9801342 10644944 11613969
6141 11613969 12641076 13763892 15313306 17463540 19934128 22400631 24467993 26135591
6133 26135591 27801065 29488422 30640064 30859847 30189730 29089058 28163466 27551235 27099135
6124 27099135 26858402 27083357 27804412 28839329 29497822 29118027 27685136 25405698 22661472
6115 22661472 19958140 17657157 15596233 13932161 12551771 11443373 10528090 9813931
6107 9813931 9147258 8617891 8272693 7947912 7729840 7546944 7434537 7337193 7219407 7109704
6097 7109704 7016273 7071337 6992438 6966841 7025636 7033390 7061541 7080422 7117570 7265664 7398614
6086 7398614 7744564 8008029 8210872 8362649 8321708 8298938 8288327 8268488 8382012 8577555
$$ packed form
6151G014689J58015J58406K17806K29063L52058L66407N21879P83019Q43602R69025
6141A1613969J027107J122816J549414K150234K470588K466503K067362J667598
6133B6135591J665474J687357J151642K19783o70117j100672r25592o12231m52100
6124B7099135k40733K24955P21055J034917O58493l79795j432891k279438k744226
6115B2661472k703332k300983k060924j664072j380390j108398r15283p14159
6107I813931o66673n29367l45198l24781k18072j82896j12407r7344j17786j09703
6097G109704r3431N5064p8899k5597N8795P754K8151J8881L7148J48094J32950
6086G398614L45950K63465K02843J51777m0941k2770j0611j9839J13524J95543
$$ plain form
6076 8577555 8770437 8992894 9352288 9838341 10395869 11031777 11859982 12845388 14013234
6067 14013234 15464413 17323616 19737401 22641464 26025889 29519475 32655881 34794938
6059 34794938 35320846 34469095 32839674 31222659 30046672 29592166 30061028 31244779 32949767
6050 32949767 34515728 35280811 34708710 32693428 29706421 26310667 22982734 19968057
6042 19968057 17434308 15308521 13650719 12387606 11379824 10602251 10026537 9592393 9227172
6033 9227172 8945334 8712885 8479592 8141867 7866181 7699794 7568210 7556683 7458265 7308351
6023 7308351 7158336 7020145 6796767 6636872 6538147 6432162 6252082 6149732 6104765 6104911
6013 6104911 6195871 6208381 6185993 6204588 6276745 6337619 6259255 6215348 6234592 6201581 6205811 6153274
$$ packed form
6076H577555J92882K22457L59394M86053N57528O35908Q28205R85406J167846
6067A4013234J451179J859203K413785K904063L384425L493586L136406K139057
6059C4794938N25908q51751j629421j617015j175987m54506M68862J183751J704988
6050C2949767J565961P65083n72101k015282k987007l395754l327933l014677
6042A9968057k533749k125787j657802j263113j007782p77573n75714m34144l65221
6033I227172k81838k32449k33293l37725k75686j66387j31584j1527r8418j49914
6023G308351j50015j38191k23378j59895r8725j05985j80080j02350m4967J46
6013F104911R0960J2510k2388J8595P2157O0874p8364m3907J9244l3011M230n2537
$$ plain form
6001 6153274 6048186 5924985 5841032 5778450 5797383 5835995 5868346 5883018 5841163 5815215 5767579
5990 5767579 5659163 5576138 5449960 5402920 5390844 5401731 5470829 5520816 5453114 5382448 5343584
5979 5343584 5337280 5284771 5339279 5320827 5343604 5212344 5137186 5105054 5007767 4844773 4808609
5968 4808609 4794292 4844179 4852066 4849294 4876527 4968809 4923443 5050220 5180778 5208085 5219041
5957 5219041 5271623 5261744 5134201 5018121 4948753 4887202 4939795 4937183 4935918 5000123 5145850
5946 5145850 5155550 5160467 5206793 5197438 5341318 5528299 5627367 5681706 5725146 5727249 5728708 5737971
5934 5737971 5730800 5724700 5774559 5734665 5701910 5661638 5681270 5701721 5678432 5716747 5807272 5857493
5922 5857493 5867608 5927087 6021087 6105037 6185371 6227842 6318931 6496699 6677678 6771243 6916591
$$ packed form
6001F153274j05088j23201q3953o2582J8933L8612L2351J4672m1855k5948m7636
5990E767579j08416q3025j26178m7040j2076J0887O9098M9987o7702p0666l8864
5979E343584o304n2509N4508j8452K2777j31260p5158l2132r7287j62994l6164
5968D808609j4317M9887P887k772K7233R2282m5366J26777J30558K7307J0956
5957E219041N2582r879j27543j16080o9368o1551N2593k612j265O4205J45727
5946E145850R700M917M6326r355J43880J86981R9068N4339M3440K103J459R263
5934E737971p171o100M9859l9894l2755m0272J9632K0451k3289L8315R0525N0221
5922E857493J0115N9479R4000Q3950Q0334M2471R1089J77768J80979R3565J45348
$$ plain form
5911 6916591 6991169 7107833 7160245 7186898 7152677 7048157 6936054 6815936 6774656 6777878 6778633
5900 6778633 6754019 6704966 6707688 6682939 6663748 6726155 6820668 6937399 7052377 7167447 7376261
5889 7376261 7421075 7364869 7263536 7332810 7358739 7449732 7516641 7579159 7746372 7943518 8033664
5878 8033664 8261529 8445286 8635537 8739283 8926757 9085639 9178088 9408384 9495843 9613183
5868 9613183 9732209 9894933 10153557 10333187 10645221 10946910 11356355 11762855 12292249 12941121
5858 12941121 13800203 15043896 16909834 19635870 23468328 28081966 32364095 33850487
5850 33850487 31631309 28298230 25712309 23677560 22259828 21602534 21547202 21857453 22570545
5841 22570545 23269282 23678271 24130550 25111752 26612428 28396254 29887701 30620822 31783625
$$ packed form
5911F916591P4578J16664N2412K6653l4221j04520j12103j20118m1280L222P55
5900F778633k4614m9053K722k4749j9191O2407R4513J16731J14978J15070K08814
5889G376261M4814n6206j01333O9274K5929R0993O6909O2518J67213J97146R0146
5878H033664K27865J83757J90251J03746J87474J58882R2449K30296Q7459J17340
5868I613183J19026J62724K58624J79630L12034L01689M09445M06500N29394O48872
5858A2941121Q59082J243693J865938K726036L832458M613638M282129J486392
5850C3850487k219178l333079k585921k034749j417732o57294n5332L10251P13092
5841B2570545O98737M08989M52279R81202J500676J783826J491447P33121J162803
$$ plain form
5832 31783625 34267462 37318834 39984876 40419846 38603682 36586348 35136521 33258829
5824 33258829 30613442 28613902 27352742 26406611 25659706 24709200 23664158 22882213 22480096
5815 22480096 22418155 22742078 23746150 25605543 28367938 31678977 34409710 34478334 31584153
5806 31584153 28260559 25468835 23178120 21290945 19817017 18751463 17840070 17074090
5798 17074090 16396681 15865315 15485511 15137559 14772276 14369795 14021030 13773737 13535579
5789 13535579 13401424 13287925 13131362 12960138 12802859 12625397 12540293 12444761 12503421 12469538
5779 12469538 12597101 12787091 12940770 12894996 12807978 12723967 12684103 12671346 12707035 12697728 12825632
5768 12825632 12808137 12855375 12901507 12955952 12984088 13073616 13194798 13324004 13381336 13467131 13593675
$$ packed form
5832C1783625K483837L051372K666042M34970j816164k017334j449827j877692
5824C3258829k645387j999540j261160r46131p46905r50506j045042p81945m02117
5815B2480096o1941L23923J004072J859393K762395L311039K730733O8624k894181
5806C1584153l323594k791724k290715j887175j473928j065554r11393p65980
5798A7074090o77409n31366l79804l47952l65283m02481l48765k47293k38158
5789A3535579j34155j13499j56563j71224j57279j77462q5104r5532N8660l3883
5779A2469538J27563J89990J53679m5774q7018q4011l9864j2757L5689r307J27904
5768A2825632j7495M7238M6132N4445K8136Q9528J21182J29206N7332Q5795J26544
$$ plain form
5757 13593675 13743675 13918329 14282608 14649562 15114642 15544987 15885172 16086265 16450461
5748 16450461 16912907 17506773 18130798 18949334 19876020 21021506 22377475 24048357 25899395
5739 25899395 28240757 30914313 33910564 36782876 39276484 40541747 40550691 39176000 37130437
5730 37130437 34840622 32790291 30990484 29705980 28707993 28047335 27548166 27431241 27326158
5721 27326158 27672511 28297394 29170677 30346733 32152510 34345587 37101853 39927831 42971256
5712 42971256 45834821 47872801 48611193 48116543 46761141 45594198 45005352 45193212 46068202
5703 46068202 47953962 50127724 52123222 53140752 54496121 57141533 62155870 69411470
5695 69411470 79850165 94928248 121601548 173669539 262328697 342655922 346932897
$$ packed form
5757A3593675J50000J74654L64279L66954M65080M30345L40185K01093L64196
5748A6450461M62446N93866O24025Q18536R26686J145486J355969J670882J851038
5739B5899395K341362K673556K996251K872312K493608J265263Q944j374691k045563
5730C7130437k289815k050331j799807j284504r97987o60658m99169j16925j05083
5721B7326158L46353O24883Q73283J176056J805777K193077K756266K825978L043425
5712D2971256K863565K037980P38392m94650j355402j166943n88846J87860Q74990
5703D6068202J885760K173762J995498J017530J355369K645412N014337P255600
5695F9411470J0438695J5078083K6673300N2067991Q8659158Q0327225M276975
$$ plain form
5688 346932897 304040366 240819806 177887676 131936848 100621422 79116799 63503787
5681 63503787 51628633 42888259 37997738 34881987 33078521 31896706 31164909 30333854
5673 30333854 29714940 29084470 28810935 28565985 28756743 29339628 30580151 31988226 33450823
5664 33450823 34357163 34567545 33684012 31933260 29778416 27659943 25726707 24209449 22754340
5655 22754340 21652769 20850961 20629727 20589181 20868587 20987388 21303253 21762010 22631441
5646 22631441 23705416 25086014 26451015 27848913 28979336 29697162 29537387 28298348
5638 28298348 26241918 23870127 21419194 19315985 17326924 15538152 13973462 12701724
5630 12701724 11542211 10739851 10054946 9485562 8981969 8702764 8300168 8013655 7754126
$$ packed form
5688C46932897m2892531o3220560o2932130m5950828l1315426k1504623j5613012
5681F3503787j1875154q740374m890521l115751j803466j181815p31797q31055
5673C0333854o18914o30470k73535k44950J90758N82885J240523J408075J462597
5664C3450823R06340K10382q83533j750752k154844k118473j933236j517258j455109
5655B2754340j101571q01808k21234m0546K79406J18801L15865M58757Q69431
5646B2631441J073975J380598J365001J397898J130423P17826j59775j239039
5638B8298348k056430k371791k450933k103209j989061j788772j564690j271738
5630A2701724j159513q02360o84905n69384n03593k79205m02596k86513k59529
$$ plain form
5621 7754126 7525668 7108886 6801684 6605700 6426592 6155631 5905872 5628538 5543996 5398863
5611 5398863 5302663 5241925 5285407 5266656 5370624 5427861 5541209 5698046 5830631 5769647 5593377
5600 5593377 5306649 4938437 4575555 4305768 4166902 4167549 4141446 4089336 3907258 3812329 3660100
5589 3660100 3489060 3420580 3343871 3243448 3132593 3089176 3097311 2976214 2818473 2711367
5579 2711367 2698950 2643122 2638616 2716575 2672882 2657652 2665707 2547606 2465411 2478396 2450043 2394795
5567 2394795 2282848 2210870 2155459 2082683 2031959 1957663 2001753 2044249 1953447 1909905 1893466
5556 1893466 1864939 1829722 1801316 1731179 1709670 1649848 1595154 1537824 1508428 1480209 1391543
5545 1391543 1355962 1399160 1341433 1378121 1353897 1428245 1352660 1270513 1260728 1211341 1228403 1175063
$$ packed form
5621G754126k28458m16782l07202j95984j79108k70961k49759k77334q4542j45133
5611E398863r6200o0738M3482j8751J03968N7237J13348J56837J32585o0984j76270
5600E593377k86728l68212l62882k69787j38866O47k6103n2110j82078r4929j52229
5589C660100j71040o8480p6709j00423j10855m3417Q135j21097j57741j07106
5579B711367j2417n5828m506P7959m3693j5230Q055j18101q2195J2985k8353n5248
5567B394795j11947p1978n5411p2776n0724p4296M4090M2496r0802m3542j6439
5556A893466k8527l5217k8406p0137k1509n9822n4694n7330k9396k8219q8666
5545A391543l5581M3198n7727L6688k4224P4348p5585q2147r785m9387J7062n3340
$$ plain form
5533 1175063 1038494 1075216 1132219 1276627 1226397 1205033 1162354 1070121 1124191 1161003 1126315
5522 1126315 1183750 1276479 1219124 1155884 1157447 1111660 1087643 1077478 1012238 878676 932381
5511 932381 938721 850537 844433 864266 855425 922345 958199 1008282 1111384 1237962 1201190 1225660
5499 1225660 1292090 1366122 1376393 1418458 1466327 1586100 1765886 1983074 2059593 2002996 1758153
5488 1758153 1549173 1365673 1198632 1135375 1079950 1031240 1097110 1083366 1106362 1106897 1074376
5477 1074376 1075603 1095309 1098406 1160241 1260600 1361475 1501644 1676872 1779206 1749480 1572114
5466 1572114 1522997 1405550 1242137 1134188 1099352 938680 903596 982880 979926 983718 955619
5455 955619 905371 843759 827567 870546 957261 986432 984079 972706 980254 969895 998021 1042608
$$ packed form
5533A175063j36569L6722N7003J44408n0230k1364m2679r2233N4070L6812l4688
5522A126315N7435R2729n7355o3240J563m5787k4017j0165o5240j33562N3705
5511I32381O340q8184o104J9833q841O6920L5854N0083J03102J26578l6772K4470
5499A225660O6430P4032J0271M2065M7869J19773J79786K17188P6519n6597k44843
5488A758153k08980j83500j67041o3257n5425m8710O5870j3744K2996N35l2521
5477A074376J227J9706L097O1835J00359J00875J40169J75228J02334k9726j77366
5466A572114m9117j17447j63413j07949l4836j60672l5084P9284k954L792k8099
5455I55619n0248o1612j6192M2979Q6715K9171k353j1373P548j0359K8126M4587
$$ plain form
5443 1042608 1180794 1327606 1474640 1597535 1627593 1554420 1536129 1380396 1233365 1141724
5433 1141724 1183408 1106280 1088903 1117897 1086523 1177009 1185163 1171774 1201028 1225301 1308133 1430736
5421 1430736 1583827 1823753 2051545 2207619 2164221 2082801 1990206 1902885 1798063 1641589
5411 1641589 1703574 1637489 1566272 1551242 1579604 1645754 1814600 1957534 2142565 2219022 2334295
5400 2334295 2473015 2502807 2379825 2309391 2219500 2028063 1920834 1902097 1824059 1797097 1747105
5389 1747105 1842248 1945408 2025503 2164208 2265470 2365706 2395677 2455833 2493461 2515057 2500708
5378 2500708 2456893 2472211 2352889 2225988 2122485 2128020 2066404 2064762 2024945 2083831 2083260 2150582
5366 2150582 2173170 2172465 2216794 2241205 2278241 2259668 2165599 2066234 2112171 2186877 2199800 2107825
$$ packed form
5443A042608J38186J46812J47034J22895L0058p3173j8291j55733j47031r1641
5433A141724M1684p7128j7377K8994l1374R0486Q154j3389K9254K4273Q2832J22603
5421A430736J53091K39926K27792J56074m3398q1420r2595q7321j04822j56474
5411A641589O1985o6085p1217j5030K8362O6150J68846J42934J85031P6457J15273
5400B334295J38720K9792j22982p0434q9891j91437j07229j8737p8038k6962m9992
5389A747105R5143J03160Q0095J38705J01262J00236K9971O0156L7628K1596j4349
5378B500708m3815J5318j19322j26901j03503N535o1616j642l9817N8886n71O7322
5366B150582K2588p05M4329K4411L7036j8573r4069r9365M5937P4706J2923r1975
$$ plain form
5354 2107825 2071366 2093990 2072402 2123949 2174616 2302624 2416212 2547878 2695421 2769221 2824543
5343 2824543 2733335 2638617 2557501 2531421 2409450 2395422 2367748 2323874 2345763 2353484 2319306
5332 2319306 2387764 2404954 2518326 2558309 2545869 2590371 2604607 2675130 2714316 2773301 2781123
5321 2781123 2922364 3027513 3076138 3092731 3142085 3292361 3278310 3229331 3310726 3395831 3368601
5310 3368601 3414568 3443782 3552469 3635792 3783361 3949042 3988608 4116378 4211262 4365924
5300 4365924 4633450 4834502 5042957 5302883 5654856 5968291 6408318 6973095 7714328 8705781
5290 8705781 9802608 10904637 11859412 12251411 12251194 12028830 11879965 12051465 12580361 13386636
5280 13386636 14637745 16404325 18472345 20419603 21774799 22255076 22084360 21827741 21956699
$$ packed form
5354B107825l6459K2624k1588N1547N0667J28008J13588J31666J47543P3800N5322
5343B824543r1208r4718q1116k6080j21971j4028k7674m3874K1889P721l4178
5332B319306O8458J7190J13372L9983j2440M4502J4236P0523L9186N8985P822
5321B781123J41241J05149M8625J6593M9354J50276j4051m8979Q1395Q5105k7230
5310C368601M5967K9214J08687Q3323J47569J65681L9566J27770R4884J54662
5300D365924K67526K01052K08455K59926L51973L13435M40027N64777P41233R91453
5290H705781J096827J102029R54775L91999k17k22364j48865J71500N28896Q06275
5280A3386636J251109J766580K068020J947258J355196M80277j70716k56619J28958
$$ plain form
5271 21956699 22504977 23299505 24217796 25007555 26000275 27221524 28366590 28701830 28157781
5262 28157781 27730778 27889419 28755011 30001072 31266345 31931001 31852077 31665149 31573583
5253 31573583 31258061 30354327 29125911 28399122 28401992 29117179 30088308 30489660 29603466 27998465
5243 27998465 26591131 25426306 24237584 23164649 22426028 22363799 22810277 23449166 23842094
5234 23842094 23443766 21976835 19926589 18047995 16433948 15176958 14271462 13720410 13516769
5225 13516769 13602629 13874926 13961544 13502081 12597892 11599984 10696286 9890812 9147822 8363595
5215 8363595 7666800 7103064 6609692 6188743 5862356 5599642 5458316 5362244 5288071 5152896
5205 5152896 5017752 4884729 4657040 4381625 4217497 4074963 3931442 3826417 3726853 3706302
$$ packed form
5271B1956699N48278P94528R18291P89759R92720J221249J145066L35240n44049
5262B8157781m27003J58641Q65592J246061J265273O64656p8924j86928r1566
5253C1573583l15522r03734j228416p26789K870P15187R71129M01352q86194j605001
5243B7998465j407334j164825j188722j072935p38621o2229M46478O38889L92928
5234B3842094l98328j466931k050246j878594j614047j256990r05496n51052k03641
5225A3516769Q5860K72297Q6618m59463r04189r97908r03698q05474p42990p84227
5215H363595o96795n63736m93372m20949l26387k62714j41326r6072p4173j35175
5205E152896j35144j33023k27689k75415j64128j42534j43521j05025r9564k0551
$$ plain form
5195 3706302 3752695 3699109 3643902 3499301 3422577 3227904 3131813 3034747 3008379 2990825 2912065
5184 2912065 2852308 2740690 2590537 2409852 2315029 2256717 2206444 2225166 2215800 2145506 2152835
5173 2152835 2137995 2128878 2110179 2074171 2017209 2010817 1967904 1932055 1936376 1917504 1861377 1748329
5161 1748329 1693448 1704308 1610987 1573519 1614046 1613325 1656139 1595205 1633300 1608450 1576003 1573363
5149 1573363 1556840 1483662 1454750 1498396 1507464 1498754 1526743 1552868 1494717 1559355 1585197 1544561
5137 1544561 1476164 1485149 1436892 1488914 1515875 1492770 1473002 1450603 1563904 1560410 1587677 1655989
5125 1655989 1754072 1787568 1725257 1635148 1581712 1566964 1554180 1537886 1549059 1592029 1573872
5114 1573872 1574649 1577337 1530437 1533095 1502155 1554584 1581727 1561404 1602724 1578448 1640088 1642138
$$ packed form
5195C706302M6393n3586n5207j44601p6724j94673r6091r7066k6368j7554p8760
5184B912065n9757j11618j50153j80685r4823n8312n0273J8722r366p0294P329
5173B152835j4840r117j8699l6008n6962o392m2913l5849M321j8872n6127j13048
5161A748329n4881J0860r3321l7468M0527p21M2814o0934L8095k4850l2447k640
5149A573363j6523p3178k8912M3646R068q710K7989K6125n8151O4638K5842m0636
5137A544561o8397Q985m8257N2022K6961k3105j9768k2399J13301l494K7267O8312
5125A655989R8083L3496o2311r0109n3436j4748j2784j6294J1173M2970j8157
5114A573872P77K688m6900K658l0940N2429K7143k0323M1320k4276O1640K050
$$ plain form
5102 1642138 1653360 1698922 1777604 1854003 1923635 1826034 1808555 1816902 1709941 1761423 1699418
5091 1699418 1662807 1677964 1743466 1843877 1879654 1864438 1808228 1829039 1817865 1887650 1957804
5080 1957804 2029262 2040720 2051225 2071774 2026772 2085996 2095291 2125468 2086344 2058239 2093446 2127385
5068 2127385 2181406 2278234 2350389 2409353 2381963 2396447 2445061 2429285 2439883 2504161 2537394
5057 2537394 2612010 2684275 2672433 2723155 2761138 2799561 2902774 2930250 2998768 3054888 3065514
5046 3065514 3193544 3367045 3376979 3328794 3404873 3438034 3465642 3499214 3593058 3674112 3727678
5035 3727678 3803580 3856875 3972723 4133406 4175715 4246556 4396988 4528735 4702374 4843900
5025 4843900 4926518 5041959 5183079 5433650 5657989 5969192 6335713 6677549 7131176 7642907
$$ packed form
5102A642138J1222M5562P8682P6399O9632r7601j7479Q347j06961N1482o2005
5091A699418l6611J5157O5502J00411L5777j5216n6210K0811j1174O9785P0154
5080A957804P1458J1458J0505K0549m5002N9224R295L0177l9124k8105L5207L3939
5068B127385N4021R6828P2155N8964k7390J4484M8614j5776J0598O4278L3233
5057B537394P4616P2265j1842N0722L7983L8423J03213K7476O8518N6120J0626
5046C065514J28030J73501R934m8185P6079L3161K7608L3572R3844Q1054N3566
5035C727678P5902N3295J15848J60683M2309P0841J50432J31747J73639J41526
5025D843900Q2618J15441J41120K50571K24339L11203L66521L41836M53627N11731
$$ plain form
5015 7642907 8247361 9074251 10067600 11350468 13094115 15593117 19140922 23798175 29046705
5006 29046705 33458475 34610839 31733405 27373768 23479998 20205733 17737863 16011180
4998 16011180 15109849 14728653 14795062 15322780 16425701 18126644 20580269 24159260 29048480
4989 29048480 35483424 43039697 50205598 55277249 57555982 57022494 52264888 44425884
4981 44425884 36860963 30602670 25523497 21583012 18849881 17021607 15822593 15343664
4973 15343664 15420124 16013349 17291188 19302702 22615719 27129267 32336398 36684404 37665607
4964 37665607 34211318 28835138 23837127 19556041 16024828 13363622 11451340 10064720
4956 10064720 9103748 8385106 7869227 7466581 7139434 6854754 6577668 6356093 6164450
$$ packed form
5015G642907O04454Q26890R93349J282868J743647K499002L547805M657253N248530
5006B9046705M411770J152364k877434m359637l893770l274265k467870j726683
4998A6011180r01331l81196O6409N27718J102921J700943K453625L578991M889220
4989B9048480O434944P556273P165901N071651K278733n33488m757606p839004
4981D4425884p564921o258293n079173l940485k733131j828274j199014m78929
4973A5343664P6460N93225J277839K011514L313017M513548N207131M348006R81203
4964C7665607l454289n376180m998011m281086l531213k661206j912282j386620
4956A0064720r60972p18642n15879m02646l27147k84680k77086k21575j91643
$$ plain form
4947 6164450 5923731 5639330 5480893 5416958 5368055 5296724 5205787 5161637 5178618 5251949 5180987
4936 5180987 5120293 5066361 5025397 5000877 5013049 4925139 4853302 4822657 4757464 4742622 4683053
4925 4683053 4643326 4545198 4409952 4387043 4367662 4435409 4387366 4300278 4268757 4301068 4253665
4914 4253665 4190903 4187497 4182492 4203288 4214033 4221033 4074001 4068975 3980828 3922758 3947410 3902809
4902 3902809 3861613 3848132 3788520 3787161 3771329 3808985 3789103 3760694 3693298 3662097 3653443 3657515
4890 3657515 3701148 3686175 3700731 3734084 3734907 3718552 3704538 3729552 3673782 3648452 3728439 3755807
4878 3755807 3810429 3810590 3809897 3873553 3937322 3977384 4027522 4032725 3983418 4107300 4256563 4272272
4866 4272272 4250416 4267074 4332673 4396065 4407701 4469097 4514046 4567293 4638797 4719253 4840350
$$ packed form
4947F164450k40719k84401j58437o3935m8903p1331r0937m4150J6981P3331p0962
4936E180987o0694n3932m0964k4520J2172q7910p1837l0645o5193j4842n9569
4925D683053l9727r8128j35246k2909j9381O7747m8043q7088l1521L2311m7403
4914D253665o2762l406n005K0796J0745P000j47032n026q8147n8070K4652m4601
4902C902809m1196j3481n9612j359j5832L7656j9882k8409o7396l1201q654M072
4890C657515M3633j4973J4556L3353Q23j6355j4014K5014n5770k5330P9987K7368
4878C755807N4622J61o93O3656O3769M0062N0138N203m9307J23882J49263J5709
4866D272272k1856J6658O5599O3392J1636O1396M4949N3247P1504Q0456J21097
$$ plain form
4855 4840350 4978126 5045806 5162138 5252095 5401185 5514305 5717691 5852081 6000854 6210626
4845 6210626 6384128 6511050 6615233 6788157 7002746 7316199 7743548 8255203 8853585 9544765
4835 9544765 10326375 11288633 12503936 14072408 16270285 19360173 23786130 29633986 35912309
4826 35912309 40838492 42149235 39571832 35095967 30808723 27460028 25366661 24645449
4818 24645449 25353551 27783244 31993025 37199836 41847920 43864257 41973701 37818400
4810 37818400 33924630 31208721 30276099 31318514 34052221 37106348 38461200 36688701
4802 36688701 32877035 28824817 25219245 22470050 20955972 20525794 21319631 23440384
4794 23440384 26688541 30259361 32563529 31926924 28442369 24182601 20181672 16681036
$$ packed form
4855D840350J37776O7680J16332Q9957J49090J13120K03386J34390J48773K09772
4845F210626J73502J26922J04183J72924K14589L13453M27349N11655N98382O91180
4835I544765P81610R62258J215303J568472K197877L089888M425957N847856O278323
4826C5912309M926183J310743k577403m475865m287244l348695k093367p21212
4818B4645449P08102K429693M209781N206811M648084K016337j890556m155301
4810C7818400l893770k715909r32622J042415K733707L054127J354852j772499
4802C6688701l811666m052218l605572k749195j514078m30178P93837K120753
4794B3440384L248157L570820K304168o36605l484555m259768m000929l500636
$$ plain form
4786 16681036 14047748 11998751 10482681 9369145 8589797 7998924 7729907 7668370 7846443
4777 7846443 8137093 8463241 8559770 8356299 7967028 7430975 7029413 6646120 6315082 6090245
4767 6090245 5899824 5672368 5545831 5529699 5563537 5736328 6008506 6314491 6888274 7522648
4757 7522648 8105023 8552027 8803206 8888297 8690544 8259261 7642812 6931941 6383906 6001374
4747 6001374 5584040 5250216 5001646 4822768 4739497 4682439 4668877 4766383 4960585 5372539
4737 5372539 5834493 6243269 6516399 6408866 6138388 5762020 5374579 4991715 4604430 4230790
4727 4230790 3935320 3694375 3506211 3365721 3236783 3087064 3032757 3049413 3045831 3085522
4717 3085522 3092171 3042408 3132218 3234933 3339755 3361430 3425084 3416402 3299953 3133727 3024916
$$ packed form
4786A6681036k633288k048997j516070j113536p79348n90873k69017o1537J78073
4777G846443K90650L26148R6529k03471l89271n36053m01562l83293l31038k24837
4767F090245j90421k27456j26537j6132L3838J72791K72178L05985N73783O34374
4757G522648N82375M47004K51179Q5091j97753m31283o16449p10871n48035l82532
4747F001374m17334l33824k48570j78878q3271n7058j3562R7506J94202M11954
4737E372539M61954M08776K73130j07533k70478l76368l87441l82864l87285l73640
4727D230790k95470k40945j88164j40490j28938j49719n4307J6656l582L9691
4717C085522O649m9763Q9810J02715J04822K1675O3654q682j16449j66226j08811
$$ plain form
4706 3024916 2866307 2712570 2644107 2548769 2501179 2473232 2447740 2485607 2446002 2495101 2565572
4695 2565572 2608961 2698375 2766835 2885062 2879286 2812132 2739434 2550845 2368466 2297833 2250339
4684 2250339 2231602 2224212 2130022 2068526 2112825 2134826 2012363 1995866 1961036 1811692 1840916
4673 1840916 1862375 1859087 1864660 1930788 1888005 1882890 1884885 1901819 1935574 1869027 1868017 1953242
4661 1953242 2006618 1990486 2061285 2046147 1969320 1941494 1978086 1939695 1848480 1757207 1769311
4650 1769311 1834689 1838499 1836265 1936090 1926556 1935040 1910387 1787681 1814044 1812833 1811811 1840210
4638 1840210 1879991 1973892 1978945 1995467 2079448 2260826 2493619 2612198 2697660 2739958 2626553
4627 2626553 2568608 2522827 2555096 2661329 2713585 2748257 2776779 2950783 3150699 3457464 3798045
$$ packed form
4706C024916j58609j53737o8463r5338m7590k7947k5492L7867l9605M9099P0471
4695B565572M3389Q9414O8460J18227n776o7154p2698j88589j82379p0633m7494
4684B250339j8737p390r4190o1496M4299K2001j22463j6497l4830j49344K9224
4673A840916K1459l288N573O6128m2783n115J995J6934L3755o6547j010Q5225
4661A953242N3376j6132P0799j5138p6827k7826L6592l8391r1215r1273J2104
4650A769311O5378L810k234R9825r534Q484k4653j22706K6363j211j022K8399
4638A840210L9781R3901N053J6522Q3981J81378K32793J18579Q5462M2298j13405
4627B626553n7945m5781L2269J06233N2256L4672K8522J74004J99916L06765L40581
$$ plain form
4616 3798045 4149638 4443653 4557100 4428732 4116199 3708451 3382669 3150485 2994474 2908859
4606 2908859 2767000 2705141 2627775 2540917 2542670 2570271 2484385 2406031 2331888 2418199 2418115 2328049
4594 2328049 2327908 2282313 2330017 2426153 2560146 2544802 2566138 2591729 2584550 2605109 2489828 2404516
4582 2404516 2368707 2269296 2080699 1985661 1956335 1868175 1839393 1810394 1752872 1719280 1695664
4571 1695664 1695165 1724910 1751302 1766886 1738431 1755399 1840902 1868143 1829247 1974149 2035383 1978414
4559 1978414 1931675 2018422 2128103 2214037 2226273 2202331 2200493 2188538 2105758 2012518 1923439
4548 1923439 1836429 1717315 1670508 1602591 1489838 1485060 1491229 1448946 1489995 1383479 1338725
4537 1338725 1357440 1367684 1337575 1384661 1317036 1283923 1299317 1353871 1396223 1345446 1333075
$$ packed form
4616C798045L51593K94015J13447j28368l12533m07748l25782k32184j56011q5615
4606B908859j41859o1859p7366q6858J753K7601q5886p8354p4143Q6311q4r0066
4594B328049j41m5595M7704R6136J33993j5344K1336K5591p179K0559j15281q5312
4582B404516l5809r9411j88597r5038k9326q8160k8782k8999n7522l3592k3616
4571A695664m99K9745K6392J5584k8455J6968Q5503K7241l8896J44902O1234n6969
4559A978414m6739Q6747J09681Q5934J2236k3942j838j1955q2780r3240q9079
4548A923439q7010j19114m6807o7917j12753m778O169m2283M1049j06516m4754
4537A338725J8715J0244l0109M7086o7625l3113J5394N4554M2352n0777j2371
$$ plain form
4526 1333075 1336101 1338649 1358939 1409989 1359459 1343542 1351123 1402304 1442455 1486441 1462412 1560629
4514 1560629 1647673 1693333 1760799 1881021 1936631 2099482 2296466 2533991 2812090 3124862
4504 3124862 3586925 4207851 4836624 5258102 5277659 4981349 4546962 4219616 4062813 3934415
4494 3934415 3949870 4068478 4323683 4818518 5362824 5644543 5605491 5275581 4943244 4698121
4484 4698121 4576129 4588299 4700616 4976640 5248698 5390581 5330284 4981461 4594202 4255632
4474 4255632 4111574 4200453 4327106 4605409 4875143 5223603 5483868 5439415 5144942 4753828
4464 4753828 4199571 3723379 3392921 3070637 2838577 2664539 2468830 2340082 2197810 2177989
4454 2177989 2179666 2101895 2050299 1979920 1936996 2053599 2079767 2122307 2167236 2169094 2103287 2151013
$$ packed form
4526A333075L026K548K0290N1050n0530j5917P581N1181M0151M3986k4029R8217
4514A560629Q7044M5660O7466J20222N5610J62851J96984K37525K78099L12772
4504C124862M62063O20926O28773M21478J9557k96310m34387l27346j56803j28398
4494C934415J5455J18608K55205M94835N44306K81719l9052l29910l32337k45123
4484D698121j21992J2170J12317K76024K72058J41883o0297l48823l87259l38570
4474D255632j44058Q8879J26653K78303K69734L48460K60265m4453k94473l91114
4464D753828n54257m76192l30458l22284k32060j74038j95709j28748j42272j9821
4454B177989J677p7771n1596p0379m2924J16603K6168M2540M4929J858o5807M7726
$$ plain form
4442 2151013 2184409 2153323 2242288 2330631 2420553 2463920 2590284 2766821 2936460 3098439 3289214
4431 3289214 3357566 3342184 3277794 3163919 3091698 3058196 2996923 3022539 3062581 3144903 3265453
4420 3265453 3391800 3582699 3747589 3718607 3699588 3705123 3598384 3584417 3701450 3871531
4410 3871531 4040303 4225919 4365373 4512154 4567528 4559965 4615745 4644997 4607093 4561647 4657355
4399 4657355 4711018 4766865 4917336 5083733 5411841 5787633 6266339 6692520 6998597 7346826
4389 7346826 7624210 7579827 7120687 6336990 5532075 4764783 4177251 3898470 3638783 3484459
4379 3484459 3492934 3614692 3696551 3675611 3527113 3369313 3204236 3136488 3073531 2921147 2795620
4368 2795620 2649450 2534096 2515165 2501829 2538868 2552566 2555159 2564996 2617661 2544290 2437461
$$ packed form
4442B151013L3396l1086Q8965Q8343Q9922M3367J26364J76537J69639J61979J90775
4431C289214O8352j5382o4390j13875p2221l3502o1273K5616M0042Q2322J20550
4420C265453J26347J90899J64890k8982j9019N535j06739j3967J17033J70081
4410C871531J68772J85616J39454J46781N5374p563N5780K9252l7904m5446R5708
4399D657355N3663N5847J50471J66397L28108L75792M78706M26181L06077L48229
4389G346826K77384m4383m59140p83697q04915p67292n87532k78781k59687j54324
4379C484459Q475J21758Q1859k0940j48498j57800j65077o7748o2957j52384j25527
4368B795620j46170j15354j8931j3336L7039J3698K593R837N2665p3371j06829
$$ plain form
4357 2437461 2329662 2215942 2182783 2141019 2120716 2086058 2003903 1929275 1899945 1954139 1984250
4346 1984250 2003985 1998425 2030972 2090219 2174781 2302970 2462496 2498792 2603235 2729224 2786001
4335 2786001 2831842 2791180 2693757 2626097 2623397 2553476 2568156 2505940 2457664 2450390 2447110 2379305
4323 2379305 2258507 2201797 2124986 2028320 1957716 1923064 1908467 1914080 1910903 1889989 1901935 1911219
4311 1911219 1837239 1733501 1692164 1603457 1583524 1531495 1539417 1610729 1572457 1570758 1630473 1552967
4299 1552967 1651311 1688484 1664648 1726008 1777882 1756094 1731740 1745954 1661974 1723929 1764635
4288 1764635 1808568 1796201 1844534 1788339 1838519 1874437 1904186 2035322 2041631 2128917 2347910
4277 2347910 2536056 2747563 2878888 2890459 2825294 2647528 2468799 2309028 2132674 2002659
$$ packed form
4357B437461j07799j13720l3159m1764k0303l4658q2155p4628k9330N4194L0111
4346A984250J9735n560L2547N9247Q4562J28189J59526L6296J04443J25989N6777
4335B786001M5841m0662r7423o7660k700o9921J4680o2216m8276p274l280o7805
4323B379305j20798n6710p6811r6666p0604l4652j4597N613l177k0914J1946R284
4311A911219p3980j03738m1337q8707j9933n2029P922P1312l8272j699N9715p7506
4299A552967R8344L7173k3836O1360N1874k1788k4354J4214q3980O1955M0706
4288A764635M3933j2367M8333n6195N0180L5918K9749J31136O309Q7286K18993
4277B347910J88146K11507J31325J1571o5165j77766j78729j59771j76354j30015
$$ plain form
4267 2002659 1820560 1699414 1718342 1703946 1716862 1621093 1566316 1523983 1494408 1324781 1222570
4256 1222570 1102429 964771 941650 894054 934793 877641 795536 787929 770848 776450 782887 755859
4244 755859 682624 657885 741744 769003 763677 663289 684040 664096 597428 620623 692932 702849
4232 702849 643162 563445 571250 600083 557127 492687 479367 477828 476221 473414 452718 429283
4220 429283 395853 410003 409936 463174 510797 519345 485316 458053 459489 483322 448251 410126 390494
4207 390494 394986 364338 327475 344186 353977 341544 326214 382896 458475 384005 468200 449099
4195 449099 384380 344681 293550 281823 285644 269997 206749 213730 269390 247996 246054 198733
4183 198733 244911 354777 338795 310461 251474 226599 202260 277558 274087 214685 230691 225042
$$ packed form
4267B002659j82099j21146J8928j4396J2916r5769n4777m2333k9575j69627j02211
4256A222570j20141j37658k3121m7596M0739n7152q2105p607j7081N602O437k7028
4244G55859p3235k4739Q3859K7259n326j00388K0751j9944o6668K3195P2309R917
4232G02849n9687p9717P805K8833m2956o4440j3320j539j607k807k0696k3435
4220D29283l3430J4150o7N3238M7623Q548l4029k7263J436K3833l5071l8125j9632
4207C90494M492l0648l6863J6711R791j2433j5330N6682P5579p4470Q4195j9101
4195D49099o4719l9699n1131j1727L821j5647o3248O981N5660k1394j942m7321
4183A98733M6178J09866j5982k8334n8987k4875k4339P5298l471n9402J6006n649
$$ plain form
4171 225042 230789 223335 194447 218213 161971 173950 238428 185518 228267 226321 213106 187665
4159 187665 204138 227281 197997 173379 160256 217775 256339 236869 226894 188769 192299 225035
4147 225035 248507 249066 209247 113506 178637 222660 219206 197353 215873 201554 162995 207989
4135 207989 240902 243972 232772 232384 204852 279880 314082 307606 256867 222838 263083 341077
4123 341077 351225 291813 305132 281963 244866 283325 281419 311286 278876 294781 302101 359287
4111 359287 367128 325623 268657 264749 283745 294024 340366 335048 314338 385395 379050 346290
4099 346290 364045 422345 429319 399215 405684 506551 441874 423982 405418 306299 278103 330905
4087 330905 346399 329802 363759 326278 400347 388317 375647 415496 446571 442482 443458 546262
$$ packed form
4171B25042N747p454k8888K3766n6242J1979O4478n2910M2749j946j3215k5441
4159A87665J6473K3143k9284k4618j3123N7519L8564j9470r975l8125L530L2736
4147B25035K3472N59l9819r5741O5131M4023l454k1853J8520j4319l8559M4994
4135B07989L2913L070j1200l88k7532P5028L4202o476n0739l4029M0245P7994
4123C41077J0148n9412J3319k3169l7097L8459j906K9867l2410J5905P320N7186
4111C59287P841m1505n6966l908J8996J0279M6342n318k0710P1057o345l2760
4099C46290J7755N8300O974l0104O469J00867o4677j7892j8564r9119k8196N2802
4087C30905J5494j6597L3957l7481P4069j2030j2670L9849L1075m089R76J02804
$$ plain form
4075 546262 553975 555268 501892 520736 507599 516506 544172 561283 542619 512207 553351 521839
4063 521839 517352 546152 589121 609276 680351 630328 615673 606046 556313 553408 544015 593975
4051 593975 561204 536453 599244 594212 579818 653888 715044 644364 582149 558633 632723 674178
4039 674178 701446 706586 672545 637893 694111 735842 700851 672866 652304 645356 641863 688056
4027 688056 730858 728328 720141 712212 723173 705326 746665 813490 809003 757564 782089 796969
4015 796969 815622 802655 709935 691483 696697 717655 692928 697751 679172 639909 653684 665095
4003 665095 716824 694863 663941 649605 692425 732213 718218 637256 614769 687344 606993 657394
3991 657394 652234 595127 581043 580564 611865 661328 626221 582713 525493 602348 655697 579453
$$ packed form
4075E46262P713J293n3376J8844j3137Q907K7666J7111j8664l0412M1144l1512
4063E21839m487K8800M2969K0155P1075n0023j4655r627m9733k905r393M9960
4051E93975l2771k4751O2791n032j4394P4070O1156p0680o2215k3516P4090M1455
4039F74178K7268N140l4041l4652N6218M1731l4991k7985k0562o948l493M6193
4027F88056M2802k530q187p929J0961j7847M1339O6825m487n1439K4525J4880
4015G96969J8653j2967r2720j8452N214K0958k4727M823j8579l9263J3775J1411
4003F65095N1729k1961l0922j4336M2820L9788j3995q0962k2487P2575q0351N0401
3991F57394n160n7107j4084m79L1301M9463l5107m3508n7220P6855N3349p6244
$$ plain form
3979 579453 543655 544886 585420 578014 577322 557395 535067 455977 470827 504374 470755 523152
3967 523152 528172 433271 435040 478932 498706 516651 443320 419676 404094 444658 501947 492208
3955 492208 497700 447310 445375 444049 514544 464019 408589 361630 291772 331595 375877 363001
3943 363001 406897 304360 248881 272808 324566 329404 311028 280485 247154 194356 226303 234304
3931 234304 249152 231041 224460 248418 256466 239570 231237 183710 180021 187854 169402 255162 261235
3918 261235 216579 206812 266024 185610 87360 126442 126810 168699 177877 145950 131615 90168
3906 90168 132846 119440 192389 178740 159398 112930 86464 152696 198360 155174 184390 153172
3894 153172 172785 139162 142579 128839 119450 101757 36385 56939 131461 162326 240894 219024
$$ packed form
3979E79453l5798J231M0534p406o92j9927k2328p9090J4850L3547l3619N2397
3967E23152N020r4901J769M3892J9774J7945p3331k3644j5582M0564N7289r739
3955D92208N492n0390j935j326P0495n0525n5430m6959o9858L9823M4282j2876
3943C63001M3896j02537n5479K3927N1758M838j8376l0543l3331n2798L1947Q001
3931B34304J4848j8111o581K3958Q048j6896q333m7527l689P833j8452Q5760O073
3918B61235m4656r767N9212q0414r8250L9082L68M1889R178l1927j4335m1447
3906I0168M2678j3406P2949j3649j9342m6468k6466O6232M5664m3186K9216l1218
3894A53172J9613l3623L417j3740r389j7693o5372K0554P4522L0865P8568k1870
$$ plain form
3882 219024 176397 229411 216824 258374 215099 141650 156577 185266 145922 242252 176960 51932
3870 51932 66497 112118 164333 182224 170378 91815 75152 171033 223773 168339 120404 127092
3858 127092 65882 101044 112586 109360 117010 129092 150262 98979 159151 201386 159698 208366
3846 208366 237629 171683 169079 141334 118312 84218 53529 57437 161637 193527 147214 91889
3834 91889 148050 175510 178743 212275 157694 114385 133968 179687 160818 156112 114385 72990
3822 72990 69692 134475 159413 129047 140368 135594 158869 154775 173308 140994 162048 121448
3810 121448 97629 117700 76743 36236 75223 135269 168169 127214 88994 93585 67628 53071
3798 53071 94590 138616 100898 15701 23956 13241 55112 58155 54458 106362 94138 113141
$$ packed form
3882B19024m2627N3014j2587M1550m3275p3449J4927K8689l9344R6330o5292j25028
3870E1932J4565M5621N2215J7891j1846p8563j6663R5881N2740n5434m7935O688
3858A27092o1210L5162J1542l226P650J2082K1170n1283O0172M2235m1688M8668
3846B08366K9263o5946k604k7745k3022l4094l0689L908J04200L1890m6313n5325
3834I1889N6161K7460L233L3532n4581m3309J9583M5719j8869m706m1727m1395
3822G2990l298O4783K4938l0366J1321m774K3275m094J8533l2314K1054m0600
3810A21448k3819K0071m0957m0507L8987O0046L2900m0955l8220M591k5957j4557
3798E3071M1519M4026l7718q5197Q255j0715M1871L043l697N1904j2224J9003
$$ plain form
3786 113141 58802 75861 64997 54789 19224 82558 36051 52748 120701 78484 88409 50765
3774 50765 60856 171873 145234 127661 51749 57546 83633 180154 106087 32514 60227 55872
3762 55872 95443 129139 108426 69888 142787 146771 181259 185956 221693 200959 123232 101138
3750 101138 167955 226393 181439 103232 92527 157053 228354 189278 162482 98963 71867 108324
3738 108324 127311 162193 179576 142097 103932 163482 214882 151620 81753 95199 98708 127069
3726 127069 108929 169568 193005 173818 198232 251046 224668 229838 255715 176224 188681 195084
3714 195084 232838 194386 163818 218596 213683 176551 138236 135968 188521 150536 76867 225351
3702 225351 226053 174715 181011 110759 123138 143816 189673 170593 138663 119999 150093 228857
$$ packed form
3786A13141n4339J7059j0864j0208l5565O3334m6507J6697O7953m2217R925l7644
3774E0765J0091J11017k6639j7573p5912N797K6087R6521p4067p3573K7713m355
3762E5872L9571L3696k0713l8538P2899L984L4488M697L5737k0734p7727k2094
3750A01138O6817N8438m4954p8207j0705O4526P1301l9076k6796o3519k7096L6457
3738A08324J8987L4882J7383l7479l8165N9550N1400o3262o9867J3446L509K8361
3726A27069j8140O0639K3437j9187K4414N2814k6378N170K5877p9491J2457O403
3714A95084L7754l8452l0568N4778m913l7132l8315k268N2553l7985p3669J48484
3702B25351P02n1338O296p0252J2379K0678M5857j9080l1930j8664L0094P8764
$$ plain form
3690 228857 227461 247861 235700 168983 213400 170517 257371 269051 197519 222883 254731 243890
3678 243890 253185 252772 231219 257127 252536 217214 233696 197509 188858 287516 239466 262005 235278
3665 235278 248549 218768 286940 299743 294757 323381 281836 244116 270066 335503 342469 259733
3653 259733 240762 238852 253713 312672 280127 309072 308877 279892 320713 312387 289048 366868
3641 366868 389446 321810 402037 367327 369744 381945 284736 290104 356062 385670 338545 388108
3629 388108 391567 364333 380329 453131 507972 567639 582231 565884 585782 550532 561924 570789
3617 570789 538832 603293 607295 674536 747360 727622 692417 675855 700476 687247 691221 679896
3605 679896 643133 589361 595767 638756 607841 632320 683279 728689 679766 710517 726352 707578
$$ packed form
3690B28857j396K0400j2161o6717M4417m2883Q6854J1680p1532K5364L1848j0841
3678B43890R295m13k1553K5908m591l5322J6482l6187q651R8658m8050K2539k6727
3665B35278J3271k9781O8172J2803m986K8624m1545l7720K5950O5437O966q2736
3653B59733j8971j910J4861N8959l2545K8945j95k8985M0821q326k3339P7820
3641C66868K2578o7636Q0227l4710K417J2201r7209N368O5958K9608m7125M9563
3629C88108L459k7234J5996P2802N4841N9667J4592j6347J9898l5250J1392Q865
3617E70789l1957O4461M002O7241P2824j9738l5205j6562K4621j3229L974j1325
3605F79896l6763n3772O406M2989l0915K4479N0959M5410m8923L0751J5835j8774
$$ plain form
3593 707578 701226 733147 748942 784288 797850 870480 881949 914916 1065372 1109177 1079680 1103113
3581 1103113 1097640 1114726 1012233 936814 978310 917680 869321 809712 795920 829311 813086
3570 813086 798059 825800 896396 895125 877500 901821 853630 755281 813094 832745 878267 963392
3558 963392 987965 982494 1038661 1047465 1050091 1099873 1095288 1142696 1198894 1177003 1187640 1279157
3546 1279157 1282112 1285419 1257323 1240580 1259023 1254123 1333352 1398182 1512853 1635725 1717218 1767307
3534 1767307 1631051 1587970 1623958 1638017 1627624 1635804 1646460 1563691 1573333 1664316 1726705 1782066
3522 1782066 1784121 1899903 1975440 2027059 2103422 2041864 1957112 1937333 1922830 1941114 1954511
3511 1954511 1971996 1940260 2000153 2162024 2220688 2349608 2582877 2752181 2807446 2795758 2722246
$$ packed form
3593G07578o352L1921J5795L5346J3562P2630J1469L2967J50456M3805k9497K3433
3581A103113n473J7086j02493p5419M1496o0630m8359n9609j3792L3391j6225
3570H13086j5027K7741P0596j271j7625K4321m8191r8349N7813J9651M5522Q5125
3558I63392K4573n471N6167Q804K626M9782m585M7408N6198k1891J0637R1517
3546A279157K955L307k8096j6743J8443m900P9229O4830J14671J22872Q1493N0089
3534A767307j36256m3081L5988J4059j0393Q180J0656q2769R642R0983O2389N5361
3522A782066K055J15782P5537N1619P6363o1558q4752j9779j4503J8284J3397
3511A954511J7485l1736N9893J61871N8664J28920K33269J69304N5265j1688p3512
$$ plain form
3500 2722246 2599368 2546751 2467284 2434898 2477768 2496945 2576024 2667888 2674476 2754074 2887201
3489 2887201 3045472 3245836 3505434 3722341 3909767 3994839 4090110 4160166 4288679 4442616
3479 4442616 4714741 4953956 5300472 5649833 6113658 6590518 7129986 7738478 8329580 8760979
3469 8760979 8969998 8812544 8469059 7904341 7253310 6519648 5806493 5269526 4788057 4405743
3459 4405743 3989353 3715693 3578233 3463814 3339617 3291555 3225706 3070039 2913282 2764363
3449 2764363 2629371 2480844 2323584 2267302 2175763 2109506 2040146 1999002 1962089 1894469 1832351
3438 1832351 1797902 1693188 1699597 1765856 1661467 1572436 1580219 1581184 1579332 1515537 1514166 1436527
3426 1436527 1341723 1298003 1257544 1158366 1095965 1106470 1236138 1227279 1227404 1226136 1233615 1112969
$$ packed form
3500B722246j22878n2617p9467l2386M2870J9177P9079R1864O588P9598J33127
3489B887201J58271K00364K59598K16907J87426Q5072R5271P0056J28513J53937
3479D442616K72125K39215L46516L49361M63825M76860N39468O08492N91102M31399
3469H760979K09019j57454l43485n64718o51031p33662p13155n36967m81469l82314
3459D405743m16390k73660j37460j14419j24197m8062o5849j55667j56757j48919
3449B764363j34992j48527j57260n6282r1539o6257o9360m1144l6913o7620o2118
3438A832351l4449j04714O409O6259j04389q9031P783R65j852o3795j371p7639
3426A436527r4804m3720m0459r9178o2401J0505J29668q859J25j268P479j20646
$$ plain form
3414 1112969 1031755 995552 1016414 962639 931021 975452 922316 890474 912259 871310 851314
3403 851314 778443 801755 854363 839728 856646 792834 831012 818266 798772 743088 728693 726803
3391 726803 694635 715816 744149 739633 739819 659782 588295 567902 568347 578913 579180 586018 517827
3378 517827 535925 560442 558697 484761 584382 570463 524470 583927 555804 511244 501507 499810
3366 499810 501339 538224 480085 527140 517386 451738 520643 507702 460047 424376 473375 449734
3354 449734 424759 373939 365774 385726 357032 328210 350652 377870 405901 449318 348875 297180
3342 297180 315960 286038 287244 260765 292677 288088 359553 397530 386887 340029 228250 311801
3330 311801 308771 309293 343297 311864 330230 335008 329594 376074 374333 323556 201371 236632 228992
$$ packed form
3414A112969q1214l6203K0862n3775l1618M4431n3136l1842K1785m0949j9996
3403H51314p2871K3312N2608j4635J6918o3812L8178j2746j9494n5684j4395j890
3391G26803l2168K1181K8333m516J86q0037p1487k0393M45J0566K67O838o8191
3378E17827J8098K4517j745p3936R9621j3919m5993N9457k8123m4560r737j697
3366D99810J529L6885n8139M7055r754o5648O8905j2941m7655l5671M8999k3641
3354D49734k4975n0820q165J9952k8694k8822K2442K7218K8031M3417j00443n1695
3342B97180J8780k9922J206k6479L1912m589P1465L7977j0643m6858j11779Q3551
3330C11801l030N22L4004l1433J8366M778n414M6480j741n0777j22185L5261p640
$$ plain form
3317 228992 279764 279853 230253 267281 231767 217883 241656 280126 240049 226750 274824 281148
3305 281148 275083 297107 340240 285093 346791 301787 306113 241706 310588 281277 203191 220658
3293 220658 294997 333582 320308 268496 292839 311805 335377 306235 181381 131425 104543
3282 104543 136009 122390 104345 187723 192726 149421 199903 191288 124847 149549 219592 267718
3270 267718 230601 215202 218122 172366 227218 217927 215769 214632 228119 257245 260019 272861 241263
3257 241263 170370 189662 201928 204346 217930 176260 206063 215650 203897 206239 216710 222876
3245 222876 192017 143255 135265 197759 237716 255265 196976 158627 204756 237036 234058 198944
3233 198944 221160 281947 297924 298638 280210 293240 306470 296962 260545 224023 281022 346834
$$ packed form
3317B28992N0772Q9m9600L7028l5514j3884K3773L8470m0077j3299M8074O324
3305B81148o065K2024M3133n5147O1698m5004M326o4407O8882k9311p8086J7467
3293B20658P4339L8585j3274n1812K4343J8966K3572k9142j24854m9956k6882
3282A04543L1466j3619j8045Q3378N003m3305N0482q615o6441K4702P0043M8126
3270B67718l7117j5399K920m5756N4852r291k158j137J3487K9126K774J2842l1598
3257B41263p0893J9292J2266K418J3584m1670K9803R587j1753K342J0471O166
3245B22876l0859m8762p990O2494L9957J7549n8289l8349M6129L2280k978l5114
3233A98944K2216O0787J5977P14j8428J3030J3230r508l6417l6522N6999O5812
$$ plain form
3221 346834 330169 247348 272441 381598 318456 290269 369433 421778 387201 374823 396426
3210 396426 408616 354416 391917 416597 506004 537945 531068 568218 535957 533672 627364 655232
3198 655232 675760 727581 735385 706024 661416 615876 624789 666523 656145 638583 632828 646830
3186 646830 651820 641229 542637 559091 585396 691645 736526 631463 615731 626137 706847
3175 706847 712345 790005 759291 752731 815491 870891 878397 975671 1032511 1077296 1144073 1231922
3163 1231922 1300904 1329447 1306336 1295986 1293307 1325925 1330177 1291605 1357309 1287446 1213859 1287799
3151 1287799 1272869 1185408 1253043 1342547 1312913 1361896 1505782 1507002 1430947 1448507 1531325
3140 1531325 1582586 1650313 1606919 1657741 1716508 1835739 2028975 2199786 2325527 2404527 2505956
$$ packed form
3221C46834j6665q2821K5093J09157o3142k8187P9164N2345l4577j2378K1603
3210C96426J2190n4200L7501K4680Q9407L1941o877L7150l2261k285R3692K7868
3198F55232K0528N1821P804k9361m4608m5540Q913M1734j0378j7562n755J4002
3186F46830M990j0591r8592J6454K6305J06249M4881j05063j5732J0406Q0710
3175G06847N498P7660l0714o560O2760N5400P506R7274N6840M4785O6777Q7849
3163A231922O8982K8543k3111j0350k679L2618M252l8572O5704o9863p3587P3940
3151A287799j4930q7461O7635Q9504k9634M8983J43886J220p6055J7560Q2818
3140A531325N1261O7727m3394N0822N8767J19231J93236J70811J25741P9000J01429
$$ plain form
3129 2505956 2509276 2420879 2318445 2116389 2013019 1879685 1761665 1730209 1704379 1682436 1634292
3118 1634292 1574527 1547867 1621368 1613068 1580353 1659045 1743828 1822641 1865557 1904054 1934093 1979970
3106 1979970 2039580 2099280 2051378 2029717 1994392 1934565 1890648 1886958 1825406 1721944 1656141
3095 1656141 1566481 1496263 1422378 1416144 1301066 1248699 1248042 1251335 1334097 1273000 1202059 1192383
3083 1192383 1172460 1189300 1225036 1175068 1099185 1002874 943918 1002220 997410 941896 855249 841393
3071 841393 793929 753486 672652 650804 588013 571299 521829 487522 471144 428172 414990 433961
3059 433961 394649 334720 351340 348653 385206 387704 281512 253080 285816 273771 241270 181266
3047 181266 202012 249643 168479 111185 153579 129104 120495 133001 206146 141034 23397 -6637
$$ packed form
3129B505956L320q8397j02434k02056j03370j33334j18020l1456k5830k1943m8144
3118A634292n9765k6660P3501q300l2715P8692Q4783P8813M2916L8497L0039M5877
3106A979970N9610N9700m7902k1661l5325n9827m3917l690o1552j03462o5803
3095A656141q9660p0218p3885o234j15078n2367o57L293Q2762o1097p0941r676
3083A192383j9923J6840L5736m9968p5883r6311n8956N8302m810n5514q6647j3856
3071H41393m7464m0443q0834k1848o2791j6714m9470l4307j6378m2972j3182J8971
3059D33961l9312n9929J6620k687L6553K498j06192k8432L2736j2045l2501o0004
3047A81266K0746M7631q1164n7294M2394k4475q609J2506P3145o5112j17637l0034
$$ plain form
3035 -6637 47330 73908 109022 73394 23235 -44304 -12298 22030 57766 88860 72278 38378
3023 38378 -15494 -65763 -30661 -44575 9404 12680 -91816 -114443 -49617 -61202 -137983 -166561
3011 -166561 -136882 -36575 -16134 -230 -57525 -77704 -60917 -125810 -125866 -169020 -174056 -175906
2999 -175906 -121152 -127121 -105609 -138302 -93062 -137005 -153806 -104030 -195311 -253785 -263468 -156388
2987 -156388 -183594 -198766 -163792 -149423 -183726 -149479 -203395 -218298 -206866 -176802 -155912 -223625
2975 -223625 -241293 -272051 -271953 -249520 -256625 -249253 -239643 -214050 -159875 -233192 -261935 -234672 -262188
2962 -262188 -264688 -271185 -233521 -238540 -235226 -250491 -253754 -246835 -272140 -354482 -315185 -252127 -212765
2949 -212765 -260842 -303361 -321382 -276871 -238572 -250555 -236012 -257105 -296683 -286820 -316189 -303848
$$ packed form
3035f637N3967K6578L5114l5628n0159o7539L2006L4328L5736L1094j6582l3900
3023C8378n3872n0269L5102j3914N3979L276j04496k2627O4826j1585p6781k8578
3011a66561K9679J00307K0441J5904n7295k0179J6787o4893n6m3154n036j850
2999a75906N4754n969K1512l2693M5240m3943j6801M9776r1281n8474r683J07080
2987a56388k7206j5172L4974J4369l4303L4247n3916j4903J1432L0064K0890o7713
2975b23625j7668l0758R8K2433p105P372R610K5593N4175p3317k8743K7263k7516
2962b62188k500o497L7664n019L314j5265l263O919k5305q2342L9297O3058L9362
2949b12765m8077m2519j8021M4511L8299j1983J4543k1093l9578R863k9369J2341
$$ plain form
2937 -303848 -289800 -311805 -328052 -282794 -302496 -287671 -254453 -255837 -292774 -325996 -320020 -303780
2925 -303780 -354951 -344242 -354168 -319042 -278410 -254668 -315311 -305425 -276158 -318589 -268333 -307874
2913 -307874 -244578 -275812 -342379 -328989 -268921 -220409 -199865 -283300 -311544 -323246 -242968 -211883
2901 -211883 -253400 -295975 -341165 -294093 -237917 -266298 -331534 -316268 -322650 -323105 -301049 -365695
2889 -365695 -342193 -331574 -367353 -338144 -289571 -240752 -243065 -254699 -320925 -300509 -307700 -306186
2877 -306186 -322065 -306592 -294321 -331443 -304146 -350284 -366833 -275402 -268110 -298843 -219998 -207440
2865 -207440 -303524 -351366 -348623 -279312 -284621 -308144 -330994 -370866 -364146 -367003 -343977 -328466
2853 -328466 -264442 -321047 -416627 -374191 -363507 -310110 -362198 -368488 -312066 -272447 -301247 -241774
$$ packed form
2937c03848J4048k2005j6247M5258j9702J4825L3218j384l6937l3222N976J6240
2925c03780n1171J0709r926L5126M0632K3742o0643R886K9267m2431N0256l9541
2913c07874O3296l1234o6567J3390O0068M8512K0544q3435k8244j1702Q0278L1085
2901b11883m1517m2575m5190M7072N6176k8381o5236J5266o382m55K2056o4646
2889c65695K3502J0619l5779K9209M8573M8819k313j1634o6226K0416p191J514
2877c06186j5879J5473J2271l7122K7297m6138j6549R1431P292l0733P8845J2558
2865b07440r6084m7842K743O9311n309k3523k2850l9872O720k857K3026J5511
2853c28466O4024n6605r5580M2436J0684N3397n2088o290N6422L9619k8800N9473
$$ plain form
2841 -241774 -231757 -362846 -402325 -440889 -418746 -471278 -422663 -427599 -373191 -324613 -307226 -283203
2829 -283203 -290149 -286681 -373453 -372957 -312166 -315502 -381794 -400265 -364485 -331240 -292804 -303612 -301656
2816 -301656 -310895 -361708 -340435 -338825 -328904 -308137 -352844 -331682 -320073 -345544 -364486 -303266
2804 -303266 -329472 -357537 -404697 -394803 -366626 -350799 -360996 -353259 -324524 -300363 -301475 -203731
2792 -203731 -252606 -310853 -296368 -270198 -324754 -373361 -378167 -254304 -236828 -235558 -314712 -304009
2780 -304009 -311357 -392335 -343122 -304828 -227113 -315275 -336568 -377714 -393317 -383542 -407635 -412165
2768 -412165 -355592 -239478 -213199 -294696 -280848 -265628 -276821 -256212 -237280 -232958 -262624 -252258
2756 -252258 -249210 -247501 -273750 -303706 -298821 -369452 -319198 -364737 -328689 -267612 -273032 -265959 -252729
$$ packed form
2841b41774J0017j31089l9479l8564K2143n2532M8615m936N4408M8578J7387K4023
2829b83203o946L468q6772M96O0791l336o6292j8471L5780L3245L8436j0808J956
2816c01656r239n0813K1273J610R921K0767m4707K1162J1609k5471j8942O1220
2804c03266k6206k8065m7160R894K8177J5827j0197P737K8735K4161j112R7744
2792b03731m8875n8247J4485K6170n4556m8607m806J23863J7476J270p9154J0703
2780c04009p348q0978M9213L8294P7715q8162k1293m1146j5603R775k4093m530
2768d12165N6573J16114K6279q1497J3848J5220j1193K0609J8932M322k9666J0366
2756b52258L048J709k6249k9956M885p0631N0254m5539L6048O1077n420P073J3230
$$ plain form
2743 -252729 -302917 -273508 -263885 -262232 -245651 -275289 -313156 -341043 -364568 -386083 -362127 -305457
2731 -305457 -299558 -214133 -213847 -306160 -280343 -286024 -305194 -298145 -295035 -363848 -231571 -234180 -320173
2718 -320173 -267851 -322241 -328903 -332618 -297129 -306033 -299096 -251084 -243640 -239828 -234925 -265673 -259843
2705 -259843 -308801 -250261 -278785 -295777 -269943 -283169 -282949 -304492 -332830 -317565 -305025 -269974
2693 -269974 -215328 -200569 -254208 -293283 -322714 -280962 -279113 -286304 -260923 -290635 -211656 -283761
2681 -283761 -302702 -230243 -269469 -266782 -243627 -259268 -296834 -325535 -345458 -243244 -230007 -308194
2669 -308194 -288297 -252896 -214186 -219310 -291319 -286426 -306663 -375935 -331530 -282203 -216817 -200274
2657 -200274 -224361 -255039 -290097 -308524 -284638 -277931 -306344 -323170 -203389 -170087 -224825 -235185
$$ packed form
2743b52729n0188K9409R623J653J6581k9638l7867k7887k3525k1515K3956N6670
2731c05457N899Q5425K86r2313K5817n681j9170P049L110o8813J32277k609q5993
2718c20173N2322n4390o662l715L5489q904O937M8012P444L812M903l0748N830
2705b59843m8958N8540k8524j6992K5834j3226K20k1543k8338J5265J2540L5051
2693b69974N4646J4759n3639l9075k9431M1752J849p191K5381k9712P8979p2105
2681b83761j8941P2459l9226K687K3155j5641l7566k8701j9923J02214J3237p8187
2669c08194J9897L5401L8710n124p2009M893k0237o9272M4405M9327O5386J6543
2657b00274k4087l0678l5058j8427K3886O707k8413j6826J19781L3302n4738j0360
$$ plain form
2645 -235185 -272919 -355397 -300526 -235837 -194161 -229174 -247645 -321654 -235500 -232278 -248617 -232285
2633 -232285 -294172 -226712 -274143 -229805 -166532 -185941 -192504 -187721 -204156 -192854 -249018 -215403
2621 -215403 -215751 -202660 -166934 -238628 -286529 -247557 -210816 -168200 -130529 -135580 -105706 -199224
2609 -199224 -178586 -115757 -116256 -25153 -20481 -3441 114843 161757 213801 249258 161554 93876
2597 93876 61991 9386 -54376 -109279 -80903 -146689 -200989 -159952 -139370 -163851 -131918 -131614
2585 -131614 -140316 -166128 -142947 -182749 -238102 -225621 -223716 -129672 -156918 -142095 -147375 -166670
2573 -166670 -168608 -115776 -141656 -144070 -168624 -204794 -173016 -137828 -79215 -70847 -150676 -213295
2561 -213295 -184724 -155442 -135304 -170556 -138261 -96178 -104215 -114835 -145651 -99192 -84105 -118741
$$ packed form
2645b35185l7734q2478N4871O4689M1676l5013j8471p4009Q6154L222j6339J6332
2633b32285o1887O7460m7431M4338O3273j9409o563M783j6435J1302n6164L3615
2621b15403l48J3091L5726p1694m7901L8972L6741M2616L7671n051K9874r3518
2609a99224K0638O2829m99R1103M672J7040J18284M6914N2044L5457q7704o7678
2597I3876l1885n2605o3762n4903K8376o5786n4300M1037K0582k4481L1933L04
2585a31614q702k5812K3181l9802n5353J2481J905R4044k7246J4823n280j9295
2573a66670j938N2832k5880k414k4554l6170L1778L5188N8613Q368p9829o2619
2561b13295K8571K9282K0138l5252L2295M2083q037j0620l0816M6459J5087l4636
$$ plain form
2549 -118741 -77811 -80653 -88602 -69895 -127432 -122664 -99978 -160311 -132217 -104982 -37923 9817
2537 9817 -23344 7990 -37004 -65316 -7309 -42567 6804 39408 35570 -43659 -101952 -122799
$$ packed form
2549a18741M0930k842p949J8707n7537M768K2686o0333K8094K7235O7059M7740
2537I817l3161L1334m4994k8312N8007l5258M9371L2604l838p9229n8293k0847
$$ [...]
##END NTUPLES=NMR SPECTRUM
##END=
