##TITLE=1H_DE-80H_X3
 200.13MHz, d2o
 8 sc
 
 19ns.26.2.2025
##JCAMPDX= 6.0         $$ Bruker NMR JCAMP-DX V2.0
##DATA TYPE= NMR SPECTRUM
##DATA CLASS= NTUPLES
##ORIGIN= UXNMR, Bruker Analytische Messtechnik GmbH
##OWNER= pz
$$ XWIN-NMR		Version 3.5
$$ Fri Dec 26 10:18:18 2025 Russian Standard Time (UT+4h)  Yarkov@DPX200
##.OBSERVE FREQUENCY= 200.1313
##.OBSERVE NUCLEUS= ^1H
##.ACQUISITION MODE= SIMULTANEOUS
##.ACQUISITION SCHEME= undefined
##.AVERAGES= 8
##.DIGITISER RES= 18
##SPECTROMETER/DATA SYSTEM= spect
##.PULSE SEQUENCE= zg30
##.SOLVENT NAME= CDCl3
##.SHIFT REFERENCE= (INTERNAL, CDCl3, 0, 15.4692)
##AUDIT TRAIL= $$ (NUMBER, WHEN, WHO, WHERE, WHAT)
$$ ##TITLE= Audit trail, XWIN-NMR		Version 3.5
$$ ##JCAMPDX= 5.01
$$ ##ORIGIN= Bruker BioSpin GmbH
$$ ##OWNER= Yarkov
$$ C:/Bruker/XWIN-NMR/data/yarkov2/nmr/H-C/1/pdata/1/auditp.txt
$$ ##AUDIT TRAIL=  $$ (NUMBER, WHEN, WHO, WHERE, WHAT)
(   1,<2025-12-26 10:17:21.93 +0400>,<Yarkov>,<DPX200>,
      <created by zg, POWCHK disabled, PULCHK disabled
       configuration hash MD5:
       00 E9 B6 7A A2 85 ED C7 34 08 36 98 17 FE 4E 26
       data hash MD5: 16K
       B7 15 34 33 94 77 D5 A4 5D 35 DC B9 1B 03 01 20>)
(   2,<2025-12-26 10:17:25.45 +0400>,<Yarkov>,<DPX200>,
      <Start of raw data processing
       efp BC_mod = 2 LB = 0.25 FT_mod = 6 PKNL = 1 PHC0 = -5306.155 PHC1 = 10.82193 SI = 16K 
       data hash MD5: 16K
       D6 B8 E1 55 07 B7 8E FA 97 74 FB 31 66 7B 64 1E>)
(   3,<2025-12-26 10:17:47.06 +0400>,<Yarkov>,<DPX200>,
      <pk PHC0 = 2.678908 PHC1 = 6.4 
       data hash MD5: 16K
       33 8B 8C 22 BB B8 60 2B BE C1 80 8B 65 DF 0E 04>)
$$ ##END=
$$ 
$$ hash MD5
$$ BC 07 B7 2D 98 96 62 88 2E 45 27 6D CC 97 B0 88
##$RELAX= 
##$RELAX= 
##$RELAX= 
##$RELAX= 
##$RELAX= 
##$RELAX= 
$$ Bruker specific parameters
$$ --------------------------
##$DU= <C:/Bruker/XWIN-NMR>
##$EXPNO= 1
##$NAME= <H-C>
##$PROCNO= 1
##$TYPE= <nmr>
##$USER= <yarkov2>
##$AMP= (0..31)
100 100 100 100 100 100 100 100 100 100 100 100 100 100 100 100 100 100 
100 100 100 100 100 100 100 100 100 100 100 100 100 100 
##$AQSEQ= 0
##$AQ_mod= 1
##$AUNM= <au_zg>
##$AUTOPOS= <>
##$BF1= 200.13
##$BF2= 200.13
##$BF3= 200.13
##$BF4= 200.13
##$BF5= 200.13
##$BF6= 200.13
##$BF7= 200.13
##$BF8= 200.13
##$BYTORDA= 1
##$CFDGTYP= 0
##$CFRGTYP= 5
##$CHEMSTR= <none>
##$CNST= (0..31)
1 1 145 1 1 1 1 1 1 1 1 1 1 1 1 1 1 1 1 1 1 1 1 1 1 1 1 1 1 1 1 1 
##$CPDPRG= <>
##$CPDPRG1= <>
##$CPDPRG2= <>
##$CPDPRG3= <>
##$CPDPRG4= <mlev>
##$CPDPRG5= <mlev>
##$CPDPRG6= <mlev>
##$CPDPRG7= <mlev>
##$CPDPRG8= <mlev>
##$CPDPRGB= <>
##$CPDPRGT= <>
##$D= (0..31)
0 0.7 0 0 0 0 0 0 0 0 0 0.03 0 0 0 0 0 0 0 0 0 0 0 0 0 0 0 0 0 0 0 0 
##$DATE= 1766729841
##$DBL= (0..7)
120 120 120 120 120 120 120 120 
##$DBP= (0..7)
150 150 150 150 150 150 150 150 
##$DBP07= 0
##$DBPNAM0= <>
##$DBPNAM1= <>
##$DBPNAM2= <>
##$DBPNAM3= <>
##$DBPNAM4= <>
##$DBPNAM5= <>
##$DBPNAM6= <>
##$DBPNAM7= <>
##$DBPOAL= (0..7)
0.5 0.5 0.5 0.5 0.5 0.5 0.5 0.5 
##$DBPOFFS= (0..7)
$$ [...]
##$SUBNAM2= <"">
##$SUBNAM3= <"">
##$SUBNAM4= <"">
##$SUBNAM5= <"">
##$SUBNAM6= <"">
##$SUBNAM7= <"">
##$SUBNAM8= <"">
##$SUBNAM9= <"">
##$SW= 18.0517328524113
##$SWIBOX= (0..15)
0 0 2 0 0 0 0 0 0 0 0 0 0 0 0 0 
##$SW_h= 3612.71676300578
##$TD= 16384
##$TD0= 1
##$TE= 0
##$TE2= 300
##$TE3= 300
##$TEG= 300
##$TL= (0..7)
0 120 120 120 120 120 120 120 
##$TP= (0..7)
150 150 150 150 150 150 150 150 
##$TP07= 0
##$TPNAME0= <>
##$TPNAME1= <>
##$TPNAME2= <>
##$TPNAME3= <>
##$TPNAME4= <>
##$TPNAME5= <>
##$TPNAME6= <>
##$TPNAME7= <>
##$TPOAL= (0..7)
0.5 0.5 0.5 0.5 0.5 0.5 0.5 0.5 
##$TPOFFS= (0..7)
0 0 0 0 0 0 0 0 
##$TUNHIN= 0
##$TUNHOUT= 0
##$TUNXOUT= 0
##$USERA1= <user>
##$USERA2= <user>
##$USERA3= <user>
##$USERA4= <user>
##$USERA5= <user>
##$V9= 5
##$VALIST= <valist>
##$VCLIST= <CCCCCCCCCCCCCCC>
##$VD= 0
##$VDLIST= <DDDDDDDDDDDDDDD>
##$VPLIST= <PPPPPPPPPPPPPPP>
##$VTLIST= <TTTTTTTTTTTTTTT>
##$WBST= 1024
##$WBSW= 4
##$XGAIN= (0..3)
0 0 0 0 
##$XL= 0
##$YL= 0
##$YMAX_a= 394774
##$YMIN_a= -261156
##$ZGOPTNS= <>
##$ZL1= 120
##$ZL2= 120
##$ZL3= 120
##$ZL4= 120
##$ABSF1= 0
##$ABSF2= 0
##$ABSG= 0
##$ABSL= 0
##$ALPHA= 0
##$AQORDER= 0
##$ASSFAC= 0
##$ASSFACI= 0
##$ASSFACX= 0
##$ASSWID= 0
##$AUNMP= <proc_1d>
##$AZFE= 0.1
##$AZFW= 0.1
##$BCFW= 0
##$BC_mod= 2
##$BYTORDP= 0
##$COROFFS= 0
##$CY= -3
##$DATMOD= 1
##$DC= 0
##$DFILT= <>
##$DTYPP= 0
##$F1P= 0
##$F2P= 0
##$FCOR= 1
##$FTSIZE= 16384
##$FT_mod= 6
##$GAMMA= 0
##$GB= 0
##$INTBC= 1
##$INTSCL= 3.241238e-09
##$ISEN= 128
##$LB= 0.25
##$LEV0= 0
##$LPBIN= 0
##$MAXI= 10000
##$MC2= 0
##$MEAN= 0
##$ME_mod= 0
##$MI= 1.114404
##$NCOEF= 0
##$NC_proc= -5
##$NLEV= 6
##$NOISF1= 3.799351
##$NOISF2= 2.8
##$NSP= 0
##$NTH_PI= 0
##$NZP= 0
##$OFFSET= 15.46924
##$PC= 1
##$PHC0= -5303.476
##$PHC1= 17.22193
##$PH_mod= 1
##$PKNL= yes
##$PPARMOD= 0
##$PSCAL= 0
##$PSIGN= 0
##$REVERSE= no
##$SF= 200.130010499638
##$SI= 16384
##$SIGF1= 3
##$SIGF2= 2
##$SINO= 0.751879
##$SIOLD= 32768
##$SREGLST= <19F.Aceton>
##$SSB= 0
##$STSI= 16384
##$STSR= 0
##$SW_p= 3612.71676300578
##$SYMM= 0
##$S_DEV= 0
##$TDeff= 16384
##$TDoff= 0
##$TI= <>
##$TILT= no
##$TM1= 0
##$TM2= 0
##$TOPLEV= 0
##$USERP1= <user>
##$USERP2= <user>
##$USERP3= <user>
##$USERP4= <user>
##$USERP5= <user>
##$WDW= 1
##$XDIM= 16384
##$YMAX_p= 422342547
##$YMIN_p= -452615
$$ End of Bruker specific parameters
$$ ---------------------------------
##NTUPLES= NMR SPECTRUM
##VAR_NAME=  FREQUENCY,     SPECTRUM/REAL,   SPECTRUM/IMAG
##SYMBOL=    X,             R,               I
##VAR_TYPE=  INDEPENDENT,   DEPENDENT,       DEPENDENT
##VAR_FORM=  AFFN,          ASDF,            ASDF
##VAR_DIM=   16384,         16384,           16384
##UNITS=     HZ,            ARBITRARY UNITS, ARBITRARY UNITS
##FACTOR=    0.220516191357247, 1,           1
##FIRST=     3095.85920136567, 0,            0
##LAST=      -516.857561640114, 0,           0
##MIN=       -516.857561640114, -452615,     0
##MAX=       3095.85920136567, 422342547,    0
$$ Real data points
##PAGE= N=1
##DATA TABLE= (X++(R..R)), XYDATA
$$ [...]
9668 38604 8993 36128 56553 44484 42843 32599 40027 23720 1455 -3749 -18530 -10781 17202
9655 17202 -1865 3572 -40041 -2342 30063 81968 52460 57009 54268 37611 36904 8938 30438
9642 30438 25670 16889 39700 55560 -11735 -7541 -7041 9004 1676 8801 13789 70919 63768 31238
9628 31238 -12399 -6382 -11008 -7117 -7532 -3501 15270 22986 22259 9436 -11024 -46499 -9558 -8152
9614 -8152 18555 -10767 12475 7438 9680 -24759 -19616 12202 20954 6863 -185 5485 1329
9601 1329 -7941 -34844 -29827 -21391 25073 -33112 -3394 12260 -2684 17295 -5423 8452 -4392
9588 -4392 -22881 4789 16811 -15946 -2032 -17054 -27142 -19941 -13096 -37771 16380 41895
9576 41895 42935 29936 28739 -5730 -15116 -42989 -47696 -4597 931 -422 -13714 5440 -35121
9563 -35121 -11815 -22211 -21018 7422 52047 42660 30559 39073 11348 -20633 -33832 -28882 8066
9550 8066 2593 23918 24561 33347 19239 3274 -6143 -36575 -45953 -2731 12790 21376 18817 -17049
9536 -17049 -4690 -18431 -590 20443 3089 17403 -17594 27078 23097 19534 45210 31924
9524 31924 39254 35291 -882 1881 -28173 -22713 -5807 -14757 -13364 7035 -2685 -14370 -31704
9511 -31704 -26334 -15567 -18950 6901 776 12874 -9202 4312 -22499 -20126 -15924 4864 29441
9498 29441 32905 8551 18111 28453 14423 37074 -5867 -19733 3263 -16864 -6271 21349
9486 21349 20100 33464 8419 29102 8782 -47117 -21177 -25296 -1877 -14020 20528 17483
9474 17483 32452 -21708 7102 -31494 -5824 -34689 1744 31372 36840 25493 9595 -10630
9462 -10630 -18406 -50732 -42534 -57833 -12859 37596 22231 50665 21989 31794 44439 16047
9450 16047 -12368 3142 -19196 -9848 -35783 -11698 45501 61148 54921 41214 32918 1785
9438 1785 -13653 3855 2532 17353 54440 53769 18845 -17682 -41230 3557 10442 24748 29719
9425 29719 -8690 -16733 5245 26228 6571 -16590 14977 -7362 29016 2852 14018 29408
9413 29408 56642 11419 40409 50936 39466 -13790 22211 31275 7038 3532 25846 29017
9401 29017 49047 62974 108164 80807 55386 46906 37322 58251 39996 79284 85762 54678
9389 54678 50859 8343 -12621 -4204 -30022 -8167 -7735 -8254 24418 36590 -6804 -26556 -26325
9376 -26325 -910 -12156 3704 22946 45495 40521 32225 53084 53112 48062 51827 66856 58364
9363 58364 12345 29098 64334 53866 12143 -2169 -24397 17266 53191 71296 41501 45025
9351 45025 79820 70716 63581 57050 49405 71610 69492 54512 53802 83401 83168 57179 30715 27968
9337 27968 52354 87333 88392 78363 109194 98222 101626 100081 70497 62943 69392 85824 60296
9324 60296 83424 65713 76348 105897 127749 132328 149627 120494 100255 62290 89866 125562
9312 125562 138363 143284 143430 140995 133175 111126 104272 151197 143622 144728 146625 159257 190865
9299 190865 180035 173845 159875 159809 187441 236761 237973 196899 240271 253638 265872 271625 289314
9286 289314 316406 311040 288486 300856 287608 333302 381492 415807 393604 391657 381124 386362
9274 386362 357282 354618 348612 347744 377208 390903 364753 353047 382971 347675 339199 333176 330952
9261 330952 356184 334566 329125 333159 321123 255357 218884 254377 273771 288205 308609 296394
9249 296394 312516 305311 296618 282875 288068 328733 311971 343316 354375 373125 361532 361675 395947
9236 395947 407853 438229 451949 459003 473318 441867 447181 476349 465765 482933 493220 477558
9224 477558 463221 456131 444105 444069 431692 446901 442267 442588 420329 424442 396061 411933 423468
9211 423468 403557 402245 419241 452238 451913 453925 488978 509014 531827 575118 630331 678020
9199 678020 720640 748071 738279 754191 750616 758312 795485 847630 926482 1001211 1046027 1103776
9187 1103776 1092905 1080395 1029807 957223 906228 947176 940255 950200 1001329 999488 975590 936785
9175 936785 855502 833876 806692 749215 708815 671637 631000 595651 554615 548270 505286 464569
9163 464569 445513 467822 459197 449196 423012 426694 412243 440649 431520 426096 443277 459157
9151 459157 423050 446407 446106 412431 407465 412215 396867 389713 444455 478919 464642 425604 418881
9138 418881 439360 448031 446088 475821 483043 500408 491020 460022 428849 437198 430506 479550 492814
9125 492814 530843 523930 506589 498034 485235 533234 504063 453720 458441 523766 548741 558821
9113 558821 560301 535576 550558 553233 528017 500915 594740 604490 641666 627043 652617 638707
9101 638707 606293 619305 657727 622343 642019 656378 673895 659392 681069 620272 584161 583609
9089 583609 629319 595532 627190 661198 654110 654599 632227 639845 610424 616856 656419 687328 681998
9076 681998 695683 697080 685219 710678 753304 769397 801956 809478 828692 811906 783214 793667
9064 793667 860900 845873 882428 897835 887616 909309 886795 907635 864982 862320 875408 896906
9052 896906 920506 909285 957696 954979 940677 957916 974344 957963 1004341 983989 1015521 1014010
9040 1014010 1008153 1025957 1018464 1014874 986614 955003 1007831 1022022 1116701 1104865 1127566 1136148
9028 1136148 1135852 1138037 1152144 1183715 1227962 1237598 1273721 1314832 1315364 1347694 1330855 1334927 1366395
9015 1366395 1400352 1450859 1445498 1437783 1460698 1444043 1427153 1443487 1489464 1602279 1605711 1628732
9003 1628732 1626186 1616597 1631996 1628780 1667686 1682694 1692070 1721321 1735673 1746417 1743402 1773977
8991 1773977 1839490 1883639 1959349 2006201 2053632 2073210 2106874 2128046 2195554 2231357 2322573
8980 2322573 2347569 2374627 2456281 2524995 2569180 2612605 2676206 2765446 2813791 2904586 2971578
8969 2971578 3053432 3155734 3236620 3344798 3441555 3531295 3579240 3605130 3654141 3761283 3863003
8958 3863003 3962989 4025571 4080686 4165748 4208963 4301145 4347126 4450139 4596173 4739040 4875210
8947 4875210 4959007 5084897 5281859 5479554 5681920 5811378 5970312 6121358 6267296 6505356
8937 6505356 6750820 7000245 7285873 7613061 8007791 8545135 9236623 10199786 11807465
8928 11807465 15371684 20553060 23563544 23154152 21744680 20749995 20218080 19951324 20014582
8919 20014582 20224118 20647354 21110805 21766173 23093349 25189456 27967332 31110053 34133643
8910 34133643 36473188 37894499 38723188 39475741 40653747 42803405 46048256 50256966
8902 50256966 54936600 59186885 62063107 63345257 63615877 63461995 63022111 62361292 61222386
8893 61222386 59267704 56750413 54314405 52611776 51885463 51898067 51812657 50886938 49216317
8884 49216317 47147166 44901229 42630584 40224248 37895029 35817390 34323134 33442169
8876 33442169 32951084 32574786 32025023 31280369 30435653 29657281 28955978 28381188 27908840
8867 27908840 27699457 27786200 28274136 29016959 29861091 30710811 31588590 32707603 34308820
8858 34308820 36266150 38190930 39440369 39585940 38504542 36538670 34408100 32541656
8850 32541656 31271154 30774479 30922907 31415948 31769415 31586533 30661658 29028703 27083348
8841 27083348 25088632 23226220 21578683 20054415 18679478 17452096 16380512 15493077
8833 15493077 14776492 14217363 13806364 13481709 13279394 13180274 13088163 13039529 12948027 12913794
8823 12913794 13032250 13344752 13998994 14879038 15775730 16286564 16241015 15821072 15168106 14531680
8813 14531680 13983065 13649551 13625816 13887826 14270297 14481654 14304640 13844734 13165570 12385622
8803 12385622 11661515 10947750 10334616 9816150 9369395 8996501 8765754 8581667 8374587
8794 8374587 8204956 8078251 7948851 7883121 7827726 7869453 7967009 8032786 8090030 8147448 8241581
8783 8241581 8381879 8563054 8925076 9591077 10483427 11528839 12443807 13109837 13481656
8774 13481656 13576386 13404326 13154784 12786824 12461189 12225064 12065496 11830175 11447801 10984030
8764 10984030 10568936 10252068 10063191 9999265 10191064 10677407 11417855 12292084 13052729 13634305
8754 13634305 13885317 13840356 13596569 13110935 12457364 11764016 11131026 10577617 10233481 9993387
8744 9993387 9871217 9872104 10064533 10368281 10955181 11797332 12827509 13812389 14614343 15148196
8734 15148196 15276383 15069749 14672958 14079170 13379482 12793163 12341086 12082673 11928588
8725 11928588 11801019 11609691 11440140 11362033 11377705 11638727 12218237 13036152 13830983 14480338
8715 14480338 14897993 14967875 14714175 14223887 13554925 12785508 12069882 11496058 11062721 10724386
8705 10724386 10377246 10008282 9607414 9222174 8888486 8648001 8562589 8547247 8656218 8772694
8695 8772694 8885990 8873224 8775695 8620186 8577409 8617531 8930707 9367895 9979882 10550029
8685 10550029 11000519 11184311 11028531 10614408 10018584 9328364 8722546 8085950 7547300
8676 7547300 7100686 6752680 6530939 6441303 6473293 6680252 7039275 7587190 8294708 9151826
8666 9151826 9909482 10348263 10490530 10245162 9758767 9238193 8742636 8371964 8181507 8225722
8656 8225722 8508915 8799398 9123794 9402304 9485716 9445473 9229492 8915985 8530942 8140865
8646 8140865 7778361 7451561 7270671 7173531 7182916 7277020 7356564 7389293 7311842 7058020 6775003
8635 6775003 6475074 6168592 5882437 5582920 5305619 5115164 4978518 4912946 4843138 4863156
8625 4863156 4943169 5116259 5446296 5860686 6257907 6537624 6626081 6580360 6393113 6167304
8615 6167304 6006158 5873167 5897774 6115469 6412531 6723897 6923578 6978552 6845161 6600658
8605 6600658 6285793 6016365 5761308 5503275 5222065 5023960 4755002 4628255 4520983 4430072
8595 4430072 4411973 4443139 4454728 4476797 4452785 4447304 4391746 4312573 4223046 4143867 4088139 3976114
8583 3976114 3927031 3900091 3936394 3994731 3920363 3930264 3962774 3952305 4009921 4094778 4122972 4170747
8571 4170747 4212206 4236044 4271473 4302001 4417849 4457689 4543330 4652968 4811040 4959347 5101176
8560 5101176 5244810 5403861 5560217 5799702 6159647 6676064 7409942 8239698 8972488 9415373
8550 9415373 9698681 9730433 9512954 9272224 9014630 8908250 8909407 9134203 9509337 9827298
8540 9827298 10027381 10117317 10027915 9876201 9636178 9303721 8907804 8494774 8157500 7820042
8530 7820042 7593409 7397608 7214888 7152361 7104131 7093903 7155118 7118282 7158922 7226259 7367723
8519 7367723 7617058 7881266 8324031 8921039 9765661 10869396 11946608 12961794 13936555
8510 13936555 14788288 15341468 15515861 15447235 15098580 14744115 14626250 14711035 14936408 15168757
8500 15168757 15385024 15649814 15742233 15520418 15034297 14275422 13389710 12394011 11512146 10786272
8490 10786272 10165306 9702651 9362306 9113054 8942948 8724289 8462568 8212832 8016188
8481 8016188 7872588 7778876 7793183 7874689 8045157 8309603 8649138 9112183 9707523 10428397
8471 10428397 11191291 11730994 11970665 11963545 11761109 11465419 11182419 10986623 10932050 10987789
8461 10987789 11196490 11444388 11643507 11665420 11462235 11084246 10601073 10047804 9559586 9062586
8451 9062586 8714974 8424741 8248607 8244588 8265183 8391686 8625236 8850838 9070050 9239685
8441 9239685 9353443 9381358 9416577 9481566 9568804 9679682 9771284 9837949 9982016 10039030 10004767
8430 10004767 9903626 9764269 9693417 9630848 9619828 9639435 9732710 9964967 10209587 10521296
8420 10521296 10904180 11235856 11628403 12118030 12763631 13678774 14885654 16558472 18668293
8411 18668293 21146562 23784402 26186974 27964011 28895532 28938795 28281307 27168551 25984423
8402 25984423 24890904 24042898 23489783 23257153 23389873 23680807 23937372 23815482 23253565
8393 23253565 22253730 20970642 19573378 18211197 16859382 15647947 14509705 13542188
8385 13542188 12803761 12149919 11674726 11378796 11220479 11257451 11397659 11663058 12190638 13001060
8375 13001060 14174615 15718018 17565624 19666345 21728000 23422133 24374209 24499775
8367 24499775 23837329 22659329 21259716 19882880 18622444 17639126 16923577 16650146 16678011
8358 16678011 16922913 17162593 17156188 16717999 15937298 14865019 13706288 12539951 11404347
8349 11404347 10309457 9347237 8506455 7722714 7093847 6648312 6231147 5877097 5576767
8340 5576767 5304662 5131539 4929745 4772078 4548824 4391625 4232904 4046049 3867026 3726937
8330 3726937 3572498 3464017 3274047 3106344 2991777 2853204 2781891 2701101 2650890 2582354
8320 2582354 2528165 2498014 2475252 2449257 2474519 2426537 2464013 2449969 2455819 2451547 2437086 2456724
8308 2456724 2437285 2353610 2274528 2191994 2102059 2009891 1903089 1824533 1751588 1743813 1646495
8297 1646495 1606742 1565971 1514056 1438187 1394922 1359547 1371120 1326855 1286629 1314401 1312245 1288734
8285 1288734 1234021 1243407 1260494 1243152 1241889 1243961 1255111 1266864 1329028 1390057 1439976 1451730
8273 1451730 1494912 1476244 1512583 1509644 1513537 1535492 1499015 1416244 1365938 1274662 1205022 1092021
8261 1092021 1044532 997389 984393 950608 922499 915657 901944 885273 866686 792855 784114 772134
8249 772134 743931 771311 769079 756001 722627 711178 666156 668410 650428 699401 663594 676830
8237 676830 653309 630451 634006 622443 631541 597839 566635 553925 570031 557688 554944 542502
8225 542502 560236 517640 505441 518279 506213 494834 499481 504280 519346 492290 466635 444486
8213 444486 445804 433168 417537 470051 444751 435897 412894 442791 414931 428287 368811 403012
8201 403012 390172 420504 391244 378652 364156 391487 358989 351287 78449 -381550 128200
8190 128200 319906 329651 351458 357299 388369 371929 376629 378216 381124 360281 370859 378753 389178
8177 389178 418678 405711 372645 430950 367952 392982 383936 389643 363586 379888 379122 426098
8165 426098 409138 405147 400407 387885 384970 364193 352493 310946 323416 350534 358050 373662
8153 373662 380612 351810 383487 336859 352319 328351 373541 356777 340820 351277 349251 307077
8141 307077 329233 347502 346899 355394 346271 394199 362326 380790 345486 348417 336340 394126 451207
8128 451207 509713 429447 469808 429770 405591 405535 396336 411228 411548 388008 371554 415149 401370
8115 401370 407654 401570 428360 382565 455808 523548 601571 599152 678917 808303 902007 1066356
8103 1066356 1335862 1571531 1742241 1843661 1795962 1723805 1535277 1411729 1289279 1146739
8093 1146739 986641 885144 776218 736803 669477 648296 571507 575209 552943 476697 459687
8082 459687 440095 450079 478365 409702 430913 420700 384267 421691 403332 466959 474929 488717
8070 488717 515238 544406 608050 670642 717580 842766 1058381 1266068 1437955 1511573 1533568
8059 1533568 1461479 1383702 1258890 1080003 971514 859008 765639 671514 570138 532220
8049 532220 450228 411562 430655 367342 378686 351662 372600 398373 396591 346921 351595 313391
8037 313391 348437 364394 367015 309578 329883 318084 325927 313191 290339 251263 261662 254000
8025 254000 265514 290421 259535 256928 206596 221751 240158 214970 188014 178477 182446 201043
8013 201043 179434 208465 201965 162296 163049 136047 160199 173862 182688 190349 174553 156766 197127
8000 197127 153504 189777 179232 181213 159037 158937 146391 153410 163520 178939 134636 136319 128100
7987 128100 93744 142712 90148 101728 74630 108343 118958 103693 103715 70539 21527 44472
7975 44472 41160 69289 64356 42345 25939 2700 52176 65144 38270 31174 33549 37435 57199
7962 57199 52435 83265 37753 11588 55046 56253 51713 31196 55738 43181 37042 46815 26731
7949 26731 19003 73060 42959 69599 39124 8345 14552 15317 -3583 9695 23535 7554 -3748
7936 -3748 -21222 -28065 -1207 36108 -1414 23752 3790 -5545 -4187 -25295 -4471 17840 26671
7923 26671 37985 3237 12200 2615 -4060 -4243 -23216 12121 21467 32459 37187 53072 4359
7910 4359 10385 -25173 39981 8108 20670 25464 11943 94 1817 -11567 38447 18254 80696
7897 80696 111896 77731 85749 72184 111433 98948 106784 96654 72282 115440 91480 76650
7885 76650 129460 65373 94541 87950 63328 97938 58760 54278 83851 86692 57182 26760
7873 26760 -7 57594 29387 47219 3546 5857 2507 -4498 24552 -24802 -25843 22249 16694
7860 16694 -18930 -20453 -38757 -5580 -57291 -10747 -2788 12000 17526 36404 17624 4042
7848 4042 -18706 -12151 -41991 -59571 -35425 -31045 -11000 14505 17975 -4372 -11820 -28818 -38485
7835 -38485 -6230 11755 22384 16696 -777 -177 9955 -2588 1252 -15839 -7918 22306 29597
7822 29597 -24801 -20759 -35774 -19024 -37165 2106 -1211 17204 10265 646 -10934 -24622 -27412
7809 -27412 19110 29667 14985 13862 71529 102583 3990 -37526 -14857 10352 -5577 -66
7797 -66 974 18152 -20874 3989 -12361 -4022 27576 12334 -3615 -35803 -59941 -42405 -48284
7784 -48284 -25427 536 -8431 8090 -11993 15066 42205 67470 40292 26775 -731 -26172
7772 -26172 -32672 -9795 787 31490 45702 21666 36898 16952 20811 16909 -10713 6058
7760 6058 17704 12776 57747 32571 27036 21428 15663 22079 11912 21173 10321 37031 29639
7747 29639 -12670 -38762 -16688 6606 7938 -4757 -1141 -11395 6502 7505 11649 16802 -14844
7734 -14844 -35405 -32721 -51079 -70893 -47282 -45916 -28381 -58988 -51983 -34170 -9351 -36781
7722 -36781 -55373 -65475 -37708 -29286 -10949 -578 -15968 -7102 16188 -11169 -35693 -37954
7710 -37954 -31588 -27113 -23692 -3707 -30548 -24490 -34771 -30893 -63745 -49929 -64267 -53443 -32116
7697 -32116 1025 -22889 -37082 -24767 -74663 -67265 -82448 -42246 -8667 -26852 -35477 30314
7685 30314 -24893 -24405 -46224 -63252 -102298 -75344 -49279 -9423 1265 33007 26561 4867
7673 4867 -43406 -12762 -33570 -83844 -57420 -15994 13902 901 3250 -29115 -65231 -66481
7661 -66481 -45881 -20533 7325 -23636 -34598 -20220 -38247 -49765 -54765 -2668 -13298 -23682
7649 -23682 -47200 -32972 -3580 17314 -32145 -19453 -17837 -39225 -28295 -30370 -6399 -1776
7637 -1776 1058 5890 -6318 -2110 -2616 -27096 -19833 -14188 -2984 -39542 143 -10171 3294
7624 3294 16059 64135 39301 71122 65567 65109 84293 74947 101589 122210 117321 141278 115980
7611 115980 135820 114964 97746 62161 25804 62177 87537 96938 66924 49582 49845 13084
7599 13084 -1039 -4355 4530 4167 -5039 -21451 24851 7523 666 -28691 -35438 -34076 -20411
7586 -20411 -35731 24213 25831 3026 -5058 13018 34350 31080 3066 19924 32239 53396
7574 53396 41596 24263 44568 9 28902 63201 75682 117307 128120 124388 101433 45258
7562 45258 73110 59826 59250 47944 66378 86246 78118 82910 115725 94130 92141 75125 75044
7549 75044 64303 71636 91263 72175 122133 143618 122992 164012 164421 161631 184942 164447 176529
7536 176529 188351 206009 192307 191420 216252 190974 207862 249551 245866 270598 263549 281232
7524 281232 314386 327149 352734 352657 390262 364804 322868 301915 249969 237771 247296 239197 249066
7511 249066 224536 212491 166637 109911 91631 103083 89814 104471 117056 103715 119900 84900
7499 84900 100211 73947 84439 93760 111566 126010 93854 103427 89310 98230 114529 120607 118851
7486 118851 147937 116020 130884 85466 98781 125421 107551 105247 110008 85165 102581 66592
7474 66592 105317 70955 67298 96997 56928 97429 63529 94983 111889 78512 103040 103919
7462 103919 73017 84207 79560 59134 66976 89133 92239 84966 94540 134346 135622 139737 146084
7449 146084 181605 225626 200686 295384 321808 320937 289463 251256 269766 288582 316343 386894
7437 386894 336053 294376 254900 228578 224709 181996 214147 245432 234389 223789 198510 133916
7425 133916 115336 104481 131379 102030 132863 166858 159452 142150 106332 128617 150455 138421
7413 138421 181172 218937 238784 222391 182736 201127 174987 164080 163632 177579 207418 177243
7401 177243 164002 202907 223486 205923 206386 226357 222843 220827 296082 329604 376610 391311
7389 391311 410923 467835 516327 547233 600833 585007 585679 561296 521131 516999 439506 395016
7377 395016 404823 410039 423727 406533 408157 426809 449371 504789 482686 484666 510292 567664
7365 567664 616285 663243 672797 642688 617212 629840 615158 559878 541685 502192 492313 442220
7353 442220 394629 358374 322683 306790 356801 336260 361563 370577 393161 332080 317461 327723
7341 327723 314066 347665 359938 357433 411898 394585 398749 394015 378053 381231 363707 405815
7329 405815 405339 380650 427141 422655 389125 396799 398857 399481 381172 485494 521991 501649 529558
7316 529558 507914 500426 533137 535308 543946 580248 624159 716623 782919 808854 834067 911935
7304 911935 952913 935127 921845 921346 924123 892600 852728 805964 800481 731405 745343 736672 724651
7291 724651 708702 694023 689519 656222 647861 621176 683991 761399 840009 891962 878826 811797
7279 811797 810815 773411 788588 835127 884220 984135 1082441 1171555 1245465 1232009 1202068 1148893
7267 1148893 1065051 1033361 992027 964384 891736 825457 709476 638296 603794 548611 544110
7256 544110 592959 572109 643255 629692 632188 643746 617869 622724 647089 648225 712031 709620
7244 709620 666065 666975 644412 627279 620844 578375 554367 541431 535969 545804 568003 565337 563461
7231 563461 551310 571510 597331 600428 593310 648906 685403 717712 774731 778841 800067 885050
7219 885050 960948 1077061 1185281 1289467 1351256 1353747 1331736 1285664 1263218 1225469 1187153
7208 1187153 1146851 1058504 977161 926648 894907 909620 938147 988560 992105 993362 1008059 1007186
7196 1007186 1001111 1028968 1064528 1092255 1189948 1226638 1292091 1298418 1314056 1333061 1350690 1374393
7184 1374393 1413802 1468900 1522674 1565172 1587204 1624548 1627356 1617003 1544480 1503999 1457194 1426440
7172 1426440 1361059 1311982 1235122 1206626 1125214 1081964 1026406 1013578 938204 911653 924125
7161 924125 897379 885839 903404 926682 950290 994759 1019487 1007585 985010 1025786 1026730 1001535
7149 1001535 1008503 1008615 1001699 959372 952332 964583 935235 939492 952699 966484 966100 971007 913607
7136 913607 866709 838368 800401 756226 665334 670325 636626 641664 642838 631031 587075 582221
7124 582221 564638 514729 502060 479843 489787 514200 543475 543364 558542 574443 540542 530638
7112 530638 549318 587425 654109 692649 703792 744006 699691 686467 637282 594157 594522 571168
7100 571168 549342 578362 596276 616116 597189 605014 607015 632219 673028 699386 691626 681665
7088 681665 671547 665729 649027 639000 662954 637457 629514 580854 539032 527620 550918 538193
7076 538193 584448 595330 606017 588462 577850 586545 552820 547691 558397 584234 619322 699669
7064 699669 691478 696369 652073 661694 689109 661882 662968 686333 661891 636814 607891 582046
7052 582046 532555 494787 447421 384428 402693 338392 367504 404566 356965 319242 333260 285808
7040 285808 246831 189226 174852 177618 177734 221451 248772 235090 224840 184541 205093 214273
7028 214273 224423 201217 182098 208611 225159 181120 182825 142401 125626 106509 94325 82386
7016 82386 110268 93231 88441 120855 144409 113478 125123 143092 124700 85400 80988 59970
7004 59970 56932 104250 123018 98595 128039 112915 50870 33875 52937 90052 107932 66845
6992 66845 90697 104295 103883 100791 73087 55234 78020 71310 62179 98354 107962 81035 57043
6979 57043 49532 43551 -3691 -7479 11907 26471 43697 51396 94080 69939 -6046 -5499 26848
6966 26848 37909 11505 -1652 37774 63984 72543 47142 25965 -3938 -2853 26486 20582
6954 20582 7335 18140 36264 76830 42312 64450 58082 42717 21658 20269 -3354 9067
6942 9067 -7195 22712 -1670 19282 15912 3608 -12525 -40241 -24785 33209 -2886 -685
6930 -685 8114 25594 26763 42258 46976 -5073 -32922 -55085 -55575 -1041 21688 60026 48227
6917 48227 12249 12739 -10424 -45215 -45624 -74795 -35011 30749 63313 47953 28516 16262 -33785
6904 -33785 -23882 -13234 -17171 29722 42895 40546 83687 48812 20018 14982 -19034 -20970 -18005
6891 -18005 -10883 33809 60672 32340 28703 22841 7375 11873 30751 7086 32791 64770 53527
6878 53527 75463 60887 41774 65432 23703 68386 45641 60912 75556 58492 60738 50837
6866 50837 48356 61397 72199 99273 107382 106299 135967 108922 177458 204383 235089 293683
6854 293683 361126 450207 523222 613793 675463 735849 760111 749969 723990 688665 646271 552355
6842 552355 460051 380173 379002 322221 297346 284303 294774 248772 282142 246976 226849 153927
6830 153927 190578 197133 165253 147515 151898 182470 190290 185054 202102 172770 134810 109489
6818 109489 132890 154014 124804 143423 157811 176711 141862 126840 159445 142685 105827 138787
6806 138787 209133 234382 267054 229059 254988 230658 266888 355876 416832 515442 594796 692205
6794 692205 801186 784941 764537 678729 657428 609500 524329 530083 460546 361210 293079 262167
6782 262167 259494 264953 201149 225161 195765 210885 181754 186870 150388 85743 84761 118694 126164
6769 126164 157877 127735 136712 152955 128930 126983 97596 106502 140373 112680 130179 119059
6757 119059 86872 94037 44522 84118 80374 117968 129372 100560 124458 85455 64734 125969
6745 125969 97634 61831 69332 113719 129786 110410 140294 105113 75628 87445 82145 151477
6733 151477 184726 172070 139088 99362 131886 118229 87354 137923 113935 128726 168350 157839
6721 157839 135515 150983 157422 133390 121125 129452 131058 142251 228192 179999 151207 124923
6709 124923 144688 148999 142448 172219 272944 255038 251444 222990 237189 219649 222366 222350 218924
6696 218924 250297 247786 246775 202900 186348 180008 216059 191620 217882 233859 237258 234010 229839
6683 229839 225169 223531 182310 237422 259734 290961 308323 281754 320817 302402 298962 262919
6671 262919 236503 226390 275071 260322 259089 232615 268045 257238 269679 211705 230908 243748
6659 243748 250437 292720 310593 279427 272340 272560 244215 288049 286361 297267 282927 272576 275871
6646 275871 252497 285040 338334 313507 315935 270927 276224 309842 310508 321360 314817 362407 341354
6633 341354 334991 349842 365285 351496 366024 351130 365308 348057 405253 427571 430714 430149
6621 430149 388242 419106 383907 329165 354984 404996 381386 420292 411685 441405 399136 434940
6609 434940 408719 400801 441480 477851 496510 568003 559027 592127 563340 545163 561923 576393
6597 576393 610576 589846 595483 604876 606955 578162 588053 555335 573952 610496 649247 658626 679206
6584 679206 729222 758464 771328 820102 814499 802274 849649 875123 928841 923783 1016425 1049382
6572 1049382 1089593 1107600 1196605 1191300 1221462 1218526 1252223 1275704 1297158 1370567 1421368 1521747
6560 1521747 1618877 1724979 1779883 1812507 1835650 1841858 1880365 1887876 1932040 2000145 2049949 2117615
6548 2117615 2187226 2209066 2279367 2354808 2449592 2554207 2615741 2778377 3027417 3171821 3323896
6537 3323896 3411799 3503261 3547387 3530139 3555812 3584329 3594549 3570954 3534655 3533488 3593007 3703782
6525 3703782 3884773 4041267 4328962 4554304 4868650 5227410 5623369 6012106 6466023 6910518
6515 6910518 7434653 7973271 8633800 9327720 10178019 11228995 12473612 13865817 15310286
6506 15310286 16635221 17658803 18232767 18246811 17813826 17022697 16030831 14901506 13783361
6497 13783361 12708034 11779863 10961465 10292520 9817908 9460728 9274794 9296278 9470059
6488 9470059 9809186 10347347 11029537 11957704 13187892 14880868 17145252 20085829 23805238
6479 23805238 27992556 31875327 34518290 35221093 34170193 31905025 29030866 25917646
6471 25917646 22806419 19962045 17425953 15230941 13379008 11818939 10496840 9443106
6463 9443106 8558363 7859254 7278211 6779958 6367350 5949111 5556753 5185027 4847129 4571873
6453 4571873 4288232 4087428 3922988 3692962 3560104 3381955 3196356 2990910 2842255 2699823
6443 2699823 2576320 2487437 2436869 2343139 2297338 2192479 2113167 2032284 1933180 1874038 1775744
6432 1775744 1766244 1755765 1715015 1665895 1646597 1600188 1517621 1428370 1392069 1362537 1341469 1348582
6420 1348582 1324360 1326175 1282388 1206617 1151761 1054389 1057504 1098983 1073247 1097604 1025735 1008185
6408 1008185 1002956 940198 979340 942623 907578 898029 851919 854125 801666 806006 792413 764375
6396 764375 813149 802224 770726 746805 710020 651401 646765 607394 645990 660072 686116 643017
6384 643017 621724 607213 583337 584803 530954 530502 578262 552710 552885 552520 532424 519446 471545
6371 471545 474571 452153 437159 484423 482359 515554 524499 460003 459834 424479 410724 380052 353262
6358 353262 425930 431650 408312 394460 365912 327674 298587 293797 351497 344930 402839 398964
6346 398964 408481 411345 383915 363149 356095 360586 373345 376458 379978 382628 355799 351804 331822
6333 331822 300234 304468 321197 370067 332108 327287 301081 283405 268674 285223 267976 313809
6321 313809 354408 381789 340733 302996 304816 305156 311264 339764 364653 367557 360396 385954 337940
6308 337940 281729 311870 287486 302528 329429 329306 332831 310025 309046 284658 224777 234526 213023
6295 213023 249508 243710 247971 289448 312670 302128 262931 234015 274759 271526 277553 322439
6283 322439 304320 341979 297535 232531 252667 211439 219298 239620 250171 244244 234503 219306
6271 219306 246091 203258 205643 194833 231743 251784 267216 306317 277542 258983 269255 269685
6259 269685 302756 353413 424076 443754 426961 378431 334838 318953 352555 301082 329420 328533
6247 328533 348071 334442 286705 274752 244518 223538 281187 305944 353861 369481 381933 438075
6235 438075 415434 394817 374076 338187 373137 391602 403901 349315 274718 271360 248635 201705
6223 201705 223982 236301 330998 280395 284394 281006 234112 235814 249797 244488 244659 238403 282762
6210 282762 314025 308962 307922 249596 277777 253279 271463 304493 305133 337713 377412 354209
6198 354209 336846 296795 313211 290773 290305 337888 310220 311917 326396 302082 303275 276243
6186 276243 274526 297295 294931 317229 303827 316867 344946 285667 307895 332341 341862 357373
6174 357373 369939 354607 353937 334715 342983 334538 391890 414864 414465 428776 438185 408582 422859
6161 422859 352310 436446 465776 521341 559870 550597 533215 471116 433486 404125 364118 416195
6149 416195 401596 387875 462072 462547 439401 433273 441485 432539 381698 457556 479623 498194 497090
6136 497090 461385 444738 480618 475714 490924 498285 532309 570877 578583 607775 604965 643598
6124 643598 652716 664431 690768 727241 759569 857465 870442 900777 912153 896002 839189 822800
6112 822800 828525 812685 806470 856684 840816 870143 843766 842161 886726 911445 961194 958626
6100 958626 1012391 1012488 1022923 1040916 1055309 1060459 1039154 1020632 1013362 1022651 989451 1006555 1003278
6087 1003278 1017099 1034208 1055081 1098506 1072346 1084972 1120412 1085679 1072650 1097668 1131132
6076 1131132 1156060 1226370 1299835 1324093 1323644 1336256 1330277 1356843 1382898 1428064 1477810 1537474
6064 1537474 1609556 1594442 1633552 1668399 1681455 1709058 1749814 1763562 1855927 1955549 2040707
6053 2040707 2090744 2133977 2198895 2224064 2263785 2300390 2374556 2427853 2492590 2520605 2547863
6042 2547863 2557846 2575976 2628534 2684547 2722333 2815925 2886648 2989674 3114357 3262377 3364519
6031 3364519 3511708 3671706 3838331 4055713 4250715 4482044 4768347 4950275 5173788 5329897
6021 5329897 5462649 5601736 5627026 5698263 5735508 5767908 5800818 5868200 5924076 5968868 6008574
6010 6008574 6012642 6046236 6107741 6153151 6174306 6253890 6328715 6532700 6730923 6976074 7250255
5999 7250255 7509310 7774378 8048499 8273537 8430157 8529773 8584461 8574189 8523459 8441092
5989 8441092 8327020 8161624 7997255 7822606 7704379 7574130 7454383 7390034 7354791 7352428
5979 7352428 7327025 7370739 7432449 7539961 7687629 7845321 8017895 8265566 8468021 8738277
5969 8738277 8944641 9093403 9196411 9283648 9343684 9309727 9248476 9131564 9005608 8859425
5959 8859425 8690433 8531479 8359798 8194859 8073367 8041293 8002045 7996707 7993756 8033800 8132901
5948 8132901 8208286 8344838 8517797 8748615 9056434 9377300 9784126 10129750 10519016 10897683
5938 10897683 11253955 11670529 12123113 12589633 13231632 13999997 14935715 15996527 17142152
5929 17142152 18319854 19382869 20096139 20452962 20338695 19774662 18889044 17777159 16598041
5920 16598041 15377332 14169476 13019448 12010342 11089149 10291255 9579226 8987650 8474245
5911 8474245 8054636 7651090 7299238 6966222 6641354 6372856 6092545 5876900 5700150 5489013
5901 5489013 5280608 5125709 4974856 4843115 4686424 4600077 4454331 4317257 4235242 4134411
5891 4134411 4024723 3960900 3898531 3820182 3732090 3657515 3605560 3544200 3512737 3438491 3386845
5880 3386845 3326401 3275375 3272295 3224712 3207058 3189594 3126849 3103088 3085255 3065622 3077376 3058072
5868 3058072 3025238 2987923 2972040 2989050 2979843 2996728 2990688 2985111 2973277 2976788 3056845 3058785
5856 3058785 3114957 3108839 3127335 3200392 3197046 3224506 3255533 3331016 3429397 3433900 3458244 3498914
5844 3498914 3478576 3455651 3463257 3492179 3550438 3609428 3639801 3726306 3724229 3809910 3838307 3820347
5832 3820347 3860836 3878429 3913231 3955850 4054007 4089691 4074378 4123342 4131910 4179338 4227508 4282116
5820 4282116 4384257 4457871 4521746 4599406 4655638 4734098 4846435 4936677 5036193 5190838 5379256
5809 5379256 5583561 5722080 5907130 6100966 6350255 6638481 6877332 7162525 7505412 7878762
5799 7878762 8268177 8660887 9134615 9632300 10230099 10885295 11578568 12367046 13211798 14157679
5789 14157679 15148741 16128839 17163406 18098490 18890412 19526804 19992132 20300212 20448208
5780 20448208 20455711 20396623 20304675 20258122 20216882 20235641 20369488 20555144 20797920 21179314 21509300
5769 21509300 21864860 22233760 22702666 23167360 23577195 23878974 24005437 24047481 23977226 23899938
5759 23899938 23825680 23687909 23501639 23239205 22883875 22456695 21933021 21338813 20765677 20176008
5749 20176008 19680190 19252951 18909252 18603806 18284613 18093716 17929558 17829779 17808996 17865125
5739 17865125 18097702 18423147 18569651 18320575 17615104 16707084 15665489 14679907 13762994
5730 13762994 12840542 12091481 11486191 10947638 10530302 10088767 9751572 9494129 9256844
5721 9256844 9060251 8891415 8759775 8692932 8618259 8598171 8581124 8761493 9097828 9683362
5711 9683362 10544890 11510230 12178280 12228773 11803775 11216386 10498372 9782196 9110365 8536797
5701 8536797 8052073 7602665 7259033 7019738 6785159 6639778 6513147 6413265 6371532 6344287
5691 6344287 6376559 6395263 6446009 6556960 6688895 6956829 7358764 7916653 8660191 9369691
5681 9369691 9732351 9696770 9340471 8871619 8317993 7731572 7238511 6790394 6456365 6182381
5671 6182381 5958572 5742890 5579314 5450692 5326733 5210213 5135628 5114591 5105676 5110038 5114410
5660 5114410 5108422 5157125 5221072 5301620 5506953 5713106 5829175 5843784 5751401 5534645 5265097
5649 5265097 4972812 4709941 4477322 4266063 4155825 4042558 3932986 3855870 3787682 3709314
5639 3709314 3613987 3523985 3523098 3508468 3501765 3473471 3466462 3475319 3466160 3476177 3502160 3538454 3584513
5626 3584513 3604837 3554948 3501458 3429394 3385180 3252239 3189981 3122529 3088003 3096695 3066783
5615 3066783 3083849 3093992 3068053 3089073 3095047 3095202 3096419 3067458 3096826 3109362 3093830 3078192
5603 3078192 3045834 2962071 2913808 2902566 2907884 2833541 2851355 2833790 2847175 2863551 2846150 2843669
5591 2843669 2807950 2721426 2650901 2596176 2585244 2483623 2411696 2333831 2244899 2226624 2182925
5580 2182925 2177056 2167360 2135966 2122177 2106056 2140802 2127723 2092060 2081538 2059973 2034032 2045527
5568 2045527 2018810 1996294 1966335 1929073 1913325 1906991 1925145 1892892 1846208 1868864 1828895 1844621
5556 1844621 1837768 1810382 1819535 1800055 1787767 1793370 1812937 1793452 1753577 1747228 1716754 1692950
5544 1692950 1641565 1607543 1592625 1570452 1604366 1585427 1524116 1492603 1502239 1480152 1474376 1476143
5532 1476143 1495100 1456896 1487927 1480808 1433863 1409121 1392867 1356874 1336869 1382252 1414783 1399128
5520 1399128 1335130 1321040 1260067 1235208 1215077 1226599 1214489 1212254 1207503 1176176 1150989 1106722
5508 1106722 1082539 1100495 1069803 1043139 1081758 1073567 1084644 1046821 1015893 994350 1036473 1044159
5496 1044159 1055567 1069503 1048532 1034323 1061038 1024542 979936 970519 967573 980245 1005367 1024503
5484 1024503 1020252 1060902 1054731 1028205 991421 992111 996347 1010834 1039969 1054141 1067062 1108291
5472 1108291 1094007 1055249 1046892 1014655 1032076 1058201 1095743 1082403 1113478 1079476 1069391 1022011
5460 1022011 1017516 1029675 1027731 999351 1056815 1035738 1060277 1034788 994119 972913 978086 990308
5448 990308 1041177 1040813 1037218 1020708 1017157 1056926 1001601 1037000 1052392 1065803 1059004 1012658 1016633
5435 1016633 1017900 1012006 998417 1017594 1038455 1016016 1002020 992378 949715 962438 966867 987824
5423 987824 1000052 1051158 1104913 1147385 1117265 1110343 1031325 1022485 1071515 1054582 1096557 1111933
5411 1111933 1124584 1171980 1167443 1134968 1134518 1074232 1098007 1091746 1141209 1185198 1219107 1211197
5399 1211197 1186463 1170003 1196037 1184701 1220679 1216554 1231917 1234466 1295607 1317915 1299401 1313001
5387 1313001 1333184 1340195 1392402 1372331 1416604 1444007 1452605 1443925 1395188 1382212 1375716 1377249
5375 1377249 1399539 1398902 1435328 1444132 1432336 1443059 1446718 1428067 1455918 1441595 1490159 1462968
5363 1462968 1481199 1476067 1503207 1532230 1537626 1553908 1583092 1599725 1613870 1598028 1600936 1600840 1618142
5350 1618142 1632647 1655511 1678826 1718941 1741550 1738013 1750372 1731558 1771578 1808373 1853666 1845289
5338 1845289 1853406 1905688 1909284 1882007 1896719 1864951 1907731 1939674 1955152 1966280 1970122 1996518
5326 1996518 2020624 2024465 2018947 2027002 2050866 2067778 2116372 2174842 2190330 2196194 2175668 2182198
5314 2182198 2208942 2210043 2246078 2306188 2380478 2408329 2461449 2454964 2468783 2478392 2498406 2446528
5302 2446528 2516045 2503498 2524129 2624254 2664302 2664874 2682419 2652094 2699650 2735743 2760744 2804301
5290 2804301 2868690 2913750 2935292 2972931 2995919 2981788 3024462 3012697 3015974 3052272 3117625 3164949
5278 3164949 3189701 3188034 3239465 3249531 3287803 3315567 3312265 3339109 3350993 3395924 3433673 3424664
5266 3424664 3467940 3499500 3543252 3569081 3578771 3612584 3603625 3693060 3743027 3750053 3754537 3777648
5254 3777648 3801769 3840565 3819320 3886575 3935746 3968774 3985691 3993179 3987509 4033426 4050092 4084931
5242 4084931 4072883 4121428 4114731 4157945 4188070 4191855 4206102 4214992 4258937 4288850 4282274 4245410
5230 4245410 4222219 4252586 4294989 4303921 4321830 4361014 4346914 4331558 4307433 4325958 4327179 4307325
5218 4307325 4326681 4323425 4350013 4371958 4331162 4354901 4332677 4301267 4297972 4288104 4254287 4271620
5206 4271620 4309184 4327653 4292079 4247815 4223413 4181854 4123165 4100822 4109220 4111522 4089177 4066179
5194 4066179 4063095 4051250 4075288 3996234 3958760 3940961 3937603 3907636 3943805 3950551 3949596 3860027
5182 3860027 3816274 3773263 3724492 3715950 3728440 3754501 3719843 3689768 3640268 3588607 3528229 3542767
5170 3542767 3549639 3531536 3524600 3479249 3476748 3476320 3435726 3379050 3351310 3315613 3301667 3286601
5158 3286601 3220850 3166499 3175854 3181892 3194811 3182753 3139534 3102405 3081524 3076667 3074189 3011893
5146 3011893 2967959 2944821 2923640 2931207 2901571 2888164 2898526 2853903 2834938 2817427 2810145 2787750
5134 2787750 2767084 2766826 2719185 2684391 2649858 2660638 2613957 2573736 2551433 2516310 2518111 2546525
5122 2546525 2539958 2525303 2536522 2499878 2437898 2406457 2414208 2417246 2435188 2443598 2449920 2427116
5110 2427116 2374625 2359280 2360124 2320597 2352887 2360073 2376907 2450613 2458901 2429641 2390347 2353394
5098 2353394 2369879 2373725 2354545 2383785 2363165 2362735 2347068 2288984 2250035 2239084 2197460 2186112
5086 2186112 2165121 2157304 2156954 2146083 2150678 2151889 2141376 2101293 2070753 2081897 2058647 2083138
5074 2083138 2080511 2052572 2004228 1986619 1981281 1957528 1953218 1934349 1934846 1925514 1929193 1930348 1928143
5061 1928143 1895533 1905410 1951448 1928502 1959879 1951368 1968444 1963739 1983124 1992773 1981675 1984488
5049 1984488 2027709 2011232 2009757 1999845 2062418 2072759 2059899 2104464 2083402 2134190 2167611 2178386
5037 2178386 2166997 2115583 2080346 2093662 2099472 2176430 2188489 2208298 2210639 2241106 2216054 2172603
5025 2172603 2178957 2179448 2171627 2182725 2184109 2169679 2155617 2142004 2164188 2133088 2079985 2107050
5013 2107050 2155446 2185370 2214754 2219126 2250747 2248356 2245594 2254782 2269495 2311894 2318220 2347225
5001 2347225 2367618 2382186 2448597 2436051 2422723 2479703 2516270 2585580 2586958 2630089 2719639 2771776
4989 2771776 2826226 2846018 2913044 2943965 2980850 3059435 3133959 3187113 3281567 3367104 3421999
4978 3421999 3438472 3446849 3489245 3509700 3622633 3672348 3716038 3813021 3891065 4003140 4102743
4967 4102743 4206609 4353926 4471160 4617226 4817990 4990374 5200763 5417158 5642158 5874165
4957 5874165 6117980 6395832 6627450 6852766 7087520 7294720 7532339 7703347 7882312 8052969
4947 8052969 8149465 8248563 8337052 8419740 8470411 8539848 8691829 8860103 8947584 9161976 9377984
4936 9377984 9625378 9839866 10186857 10619699 11123444 11718546 12372432 13110630 13935961 14700461
4926 14700461 15483597 16197403 16822655 17354498 17794002 18157543 18395567 18502691 18566914 18554179
4916 18554179 18488164 18398395 18329973 18443396 18622451 18979348 19455637 20002490 20784992 21623621
4906 21623621 22617561 23758281 25037973 26519185 28097542 29791000 31472511 32968621
4898 32968621 34148941 34862557 35052737 34714781 33918555 32813295 31448137 29935161 28357365
4889 28357365 26732327 25144592 23589665 22126503 20725273 19429753 18243906 17131015
4881 17131015 16196925 15380270 14583234 13935894 13379201 12820308 12427540 12042762 11746647
4872 11746647 11475761 11269252 11148646 11003456 10894871 10843344 10736244 10651000 10528536 10377211
4862 10377211 10207213 9986716 9855305 9692749 9550420 9537886 9459040 9447257 9415955 9438131
4852 9438131 9510114 9536804 9639483 9798521 9952785 10150493 10258755 10413363 10442614 10450877
4842 10450877 10404755 10287997 10134571 10021661 9907129 9849568 9751865 9695040 9655856 9628600
4832 9628600 9592747 9600795 9648104 9767632 9915382 10119299 10330154 10597287 10864078 11158828
4822 11158828 11497669 11841866 12160484 12476055 12752418 13012808 13189126 13312861 13416619
4813 13416619 13432689 13424272 13368321 13209131 13030903 12810451 12577333 12288615 12078437 11812212
4803 11812212 11623310 11466004 11291835 11208036 11153565 11115901 11158897 11288110 11399636 11593619
4793 11593619 11755748 12013928 12273760 12527065 12747295 12939274 13094957 13168812 13103925 13068401
4783 13068401 12888917 12687021 12418216 12131328 11796284 11451407 11063980 10739027 10444806
4774 10444806 10200439 9979748 9827570 9723868 9658962 9598366 9553531 9518395 9504695 9508073 9584960
4763 9584960 9632749 9704112 9704187 9639706 9572944 9509378 9379497 9295798 9182653 9122192 9038549 8948283
4751 8948283 8834469 8755371 8678590 8624460 8599330 8688235 8678170 8797764 8955072 9196325 9439587
4740 9439587 9722185 9924462 10125658 10282378 10371492 10340667 10222329 10070294 9882683 9632342
4730 9632342 9313956 9058109 8768269 8530805 8312787 8148159 7994907 7874312 7761937 7736155
4720 7736155 7700748 7692210 7746023 7887135 8042539 8216649 8449322 8688329 8887417 9120436
4710 9120436 9328042 9531613 9638770 9654391 9586058 9464643 9284110 9113051 8930819 8766494
4700 8766494 8640177 8535890 8421494 8318898 8222883 8181923 8132560 8133337 8173997 8308590 8457469
4689 8457469 8674215 8906665 9160565 9394358 9639028 9937961 10212490 10401248 10587396 10718845
4679 10718845 10789965 10782813 10716732 10643699 10535091 10429541 10350919 10299296 10300640 10335494 10407695
4668 10407695 10536216 10642190 10855718 11100801 11415337 11819243 12308745 12922045 13602395
4659 13602395 14356518 15198791 16055879 16899636 17763635 18606130 19387484 20061709 20687938
4650 20687938 21195108 21619580 21815403 21922021 21889410 21760276 21525845 21251271 20858450 20424403
4640 20424403 19969317 19548032 19205474 18941777 18768944 18681908 18744332 18883095 19106484 19416515
4630 19416515 19814676 20340636 20940420 21647769 22447701 23331277 24242132 25120785 25910500
4621 25910500 26577639 27016812 27210465 27101864 26758258 26290468 25887330 25519882 25287693
4612 25287693 25257838 25456447 25984468 26944056 28434487 30582657 33327990 36578588 39861277
4603 39861277 42422352 43583675 43222450 41637364 39319736 36654989 33859311 31104088
4595 31104088 28500564 26158617 24072305 22347861 20984965 19981662 19247703 18758814
4587 18758814 18434470 18237381 18095641 18011422 17878263 17704957 17539779 17412800 17323366 17323696
4577 17323696 17338442 17303942 17333835 17271250 17212267 17149953 16980698 16809094 16593380 16337132
4567 16337132 16029405 15714863 15365956 14997114 14584933 14248034 13930355 13666710 13445487
4558 13445487 13271334 13153334 13099695 13061136 13073636 13213729 13464001 13720158 14007363 14271596
4548 14271596 14527175 14760445 14895076 15009883 14994750 14820137 14561367 14147650 13672722 13202318
4538 13202318 12660896 12133918 11638724 11174769 10781886 10410991 10077947 9771314 9434643
4529 9434643 9164399 8932026 8709068 8517157 8395109 8310127 8211276 8129817 8023800 7870425
4519 7870425 7755636 7619613 7503314 7435529 7263255 7212522 7140719 7050378 6962483 6895689 6775331
4508 6775331 6685535 6563022 6488933 6363533 6335034 6284595 6287761 6214605 6121647 5995133 5908699
4497 5908699 5852117 5828111 5790830 5767385 5726204 5722675 5722595 5686509 5647858 5652697 5639856 5641801 5649621
4484 5649621 5643692 5639129 5688950 5713065 5732056 5784878 5876565 5961340 6141045 6275492 6501804
4473 6501804 6798290 7046642 7128860 7103956 7055877 6983218 6851561 6791172 6713949 6664499 6611292
4462 6611292 6582170 6651681 6739812 6881381 7159922 7437747 7867590 8416373 8962907 9440130
4452 9440130 9737686 9777257 9622590 9403651 9092784 8762091 8458477 8209440 7928533 7721723
4442 7721723 7571236 7554201 7468804 7469019 7471799 7435207 7411065 7362087 7388012 7468143 7488310 7604802
4430 7604802 7717973 7814986 7938237 8118386 8282356 8552530 8797897 9196468 9591147 10125021
4420 10125021 10694466 11315657 11963951 12788521 13735546 14833174 15872495 16990203 17933869
4411 17933869 18853889 19680059 20717595 22015037 23701759 25883143 28827341 32497178
4403 32497178 37080503 42272510 47542768 52036020 54852540 55509517 54166007 51282629
4395 51282629 47681260 43687543 39688290 35825717 32300419 29186083 26483234 24129855
4387 24129855 22199098 20638302 19488300 18494015 17686772 16872940 16123414 15314593 14646824
4378 14646824 13995030 13431851 12840951 12385081 11919680 11609973 11280143 11022593 10808108
4369 10808108 10707613 10612227 10643933 10566160 10514796 10489971 10570244 10641313 10804017 10987486 11136128
4358 11136128 11211229 11268727 11308830 11388829 11516007 11557855 11584308 11606374 11637715 11676391 11670950
4347 11670950 11666940 11680551 11733392 11811895 11929425 12200346 12455753 12633119 12778548 13028328
4337 13028328 13362685 13773889 14223160 14753631 15162435 15686659 16349278 17082729 17808263
4328 17808263 18696389 19653976 20849346 22061991 23558512 25242014 27638016 30350746
4320 30350746 33721716 37212588 40738968 43448992 45649870 46752936 47212714 47035821
4312 47035821 47376619 47514741 48067415 48440438 49503249 50424285 52817958 56629865 64179910
4303 64179910 75020497 93379520 128993791 214687282 336777713 422342547 420521624
4296 420521624 374833211 325160069 274514556 233270481 194068173 158322862 127261318
4289 127261318 102227305 81264896 68200529 60357985 55914227 51672024 47714224 43680027
4281 43680027 40459730 37378686 35012025 32727791 30969072 29239957 27922666 26532727
4273 26532727 25438526 24273082 23354842 22346526 21516910 20598352 19830181 19019973 18482387
4264 18482387 17838453 17306005 16665373 16192205 15706861 15411933 15021284 14612608 14094026
4255 14094026 13737696 13357388 13111218 12825474 12590210 12251191 11913234 11529311 11237874
4246 11237874 10976772 10789389 10555835 10371435 10229462 10100296 9981489 9815187 9597236
4237 9597236 9375219 9220559 9032639 8876745 8687312 8498668 8267720 8063009 7907664 7794953
4227 7794953 7657739 7482570 7265180 7103001 6978669 6902667 6795015 6711528 6598719 6482301
4217 6482301 6329755 6179289 6025590 6031007 6040308 6195559 6369561 6530711 6526087 6412821 6210816
4206 6210816 6049324 5851723 5710771 5493245 5333028 5116228 4939167 4802802 4706059 4606238
4196 4606238 4612040 4517744 4456161 4313189 4287327 4255094 4240154 4243828 4255729 4155960 4131049 3994164
4184 3994164 3950034 3886014 3820217 3729985 3686751 3573602 3508687 3452040 3415752 3348398 3311404
4173 3311404 3247369 3218535 3160729 3094853 3044483 3013502 2959739 2990718 2971071 2963670 2879767 2853975
4161 2853975 2792306 2757634 2677427 2651892 2555666 2526387 2481023 2476703 2452124 2421811 2344153 2346072
4149 2346072 2297398 2321212 2317933 2329708 2320892 2319672 2322373 2284231 2258515 2206491 2196125 2244119
4137 2244119 2198566 2204304 2149738 2093926 2097457 2055619 1999953 2030888 2017951 2028053 1983899 1935858
4125 1935858 1887239 1855736 1881792 1874778 1832835 1819395 1788140 1815964 1772840 1776760 1820904 1832213
4113 1832213 1865630 1865463 1888753 1914510 1878023 1846528 1803073 1755672 1773895 1762625 1781589 1766057
4101 1766057 1769723 1787038 1771786 1742751 1710084 1647048 1631801 1587483 1591781 1584279 1597272 1647979
4089 1647979 1634188 1596721 1578006 1563667 1534330 1465803 1522904 1489419 1435739 1403275 1397030 1339968
4077 1339968 1324355 1272084 1279491 1228478 1235716 1300690 1324138 1306691 1318682 1260790 1281724 1219514
4065 1219514 1226837 1219068 1246371 1261893 1256778 1204902 1211935 1215262 1244820 1207006 1221150 1191115
4053 1191115 1186009 1185924 1179254 1224435 1259626 1226308 1297220 1248395 1231744 1214177 1201069 1208139 1201834
4040 1201834 1202937 1196653 1175052 1208420 1144055 1123624 1114784 1088175 1101801 1115293 1111946 1147156
4028 1147156 1122127 1180796 1165179 1135786 1122613 1103386 1132946 1149056 1175281 1200173 1230586
4017 1230586 1262333 1304162 1332694 1435741 1567736 1782048 2035099 2314308 2546305 2670656
4007 2670656 2811277 2750282 2585932 2406251 2200260 1958044 1811195 1649574 1500900 1388800
3997 1388800 1291677 1226953 1143368 1104870 1047077 1043252 1072096 1057221 1032780 997166 992819 1021105
3985 1021105 942541 925864 898002 878135 887354 872142 887956 855568 842082 892292 843743 827876
3973 827876 784744 808385 820867 825524 794333 820410 841754 856198 805274 820659 794165 793616
3961 793616 803655 782742 767202 795236 766107 781473 784022 753100 717887 752211 749132 773365
3949 773365 776158 784227 764120 782875 756675 770658 759534 755391 766134 779765 743893 761277
3937 761277 721213 756797 737794 750728 746114 702089 708834 752009 682733 658961 662336 712071
3925 712071 732418 718201 713908 682397 675535 700830 709403 681583 690140 735957 710753 699816
3913 699816 701221 664406 678218 690623 674058 661278 652336 667411 650838 621210 604971 627983
3901 627983 633030 623311 613743 592434 596309 569257 576312 583280 638089 589051 572192 593404 620739
3888 620739 579655 600702 607573 634338 651831 672897 628592 622281 609420 609079 584094 620303
3876 620303 651419 653258 626989 603118 587203 603285 599005 602168 613845 598914 593855 602859 583079
3863 583079 556763 572887 556327 557770 572574 602815 601060 558852 522450 549575 574269 542511
3851 542511 538370 565522 575651 529201 547443 536140 543136 553968 583717 613496 602280 570588
3839 570588 552166 530608 563542 542264 556875 550701 518687 551269 566230 583549 588463 583315
3827 583315 556749 527032 538395 536717 504129 564805 575075 576334 577588 558343 540259 513631
3815 513631 524984 530546 517808 504323 492896 492398 509847 507277 508515 494060 501273 476008 497188
3802 497188 502934 500799 508781 510370 510770 498643 549218 545576 527393 533661 537716 527538 519969 507924
3788 507924 533839 550775 560415 572695 540194 537655 457951 435416 441780 488238 497543 532857
3776 532857 534621 564279 574556 523782 527662 548760 493179 522448 540656 625066 606363 604176
3764 604176 609679 586858 552625 537417 553089 572139 612806 641523 661009 639601 645010 596927
3752 596927 592541 564842 596375 563161 565661 592758 588301 597666 636017 635065 656090 729458 811099
3739 811099 852306 872874 850902 835074 825474 797513 747264 712259 691438 661622 692395 655639
3727 655639 645618 610893 595605 619673 604992 654319 621657 635776 628420 602207 593261 634409
3715 634409 630815 744612 804970 852666 860848 865300 849394 792358 710526 698856 660603 674480
3703 674480 661341 650344 621468 584428 581826 548533 564899 590156 588358 624496 637348 597614
3691 597614 614888 582169 519626 534607 511839 511984 522145 551926 561327 567338 563473 572468 564262
3678 564262 567076 527846 545887 525483 563972 608331 599364 605534 557028 561462 552675 542763 543590
3665 543590 536728 561216 620416 585423 556084 540841 579773 598328 592899 587518 616659 618208
3653 618208 636521 603390 599520 600581 573343 572219 550069 584568 560523 555861 571843 579479 601377
3640 601377 594846 615209 610022 593272 580858 576869 565125 593278 603406 647879 700965 709598
3628 709598 706325 666330 631983 607877 579798 596633 603316 643522 638606 681180 697030 670250
3616 670250 615326 618665 588397 615896 625421 668232 718616 743466 753255 733950 686490 674896
3604 674896 690837 730100 787068 801322 839520 822630 818356 773447 774805 763377 734119 768539
3592 768539 804906 840531 846745 840121 827837 802426 774922 790398 810301 827142 811059 839133
3580 839133 836304 844868 851360 875877 890341 905657 894189 870207 889862 888142 952928 961765 925190
3567 925190 944133 976723 978206 947636 938313 934460 914072 936176 954360 959021 1022145 1061779
3555 1061779 1098001 1124468 1097663 1071177 1096435 1126390 1135177 1177780 1223862 1211954 1199866 1199698
3543 1199698 1177316 1189062 1264165 1274608 1304620 1366743 1373181 1395890 1384122 1412675 1412557 1392431
3531 1392431 1389809 1415909 1475663 1560879 1642116 1671664 1658972 1658628 1664519 1694980 1727953 1780159
3519 1780159 1849190 1906867 1954192 1984446 2000840 2051001 2080671 2125123 2173289 2192578 2289620
3508 2289620 2386538 2444684 2475559 2492128 2515364 2515426 2581308 2698943 2805839 2916492 3014284
3497 3014284 3112875 3212847 3288715 3415529 3587724 3791806 3995676 4146885 4334378 4566714
3487 4566714 4761948 4992596 5169293 5325851 5460451 5557960 5624949 5708797 5852271 5970281
3477 5970281 6168829 6444522 6753777 7132085 7759833 8565342 9562919 10606176 11584868
3468 11584868 12477036 13189800 13812854 14521596 15369144 16581408 18466628 21418593 26000414
3459 26000414 33573025 45869175 60964622 71608546 73634300 69738913 63438890 56566569
3451 56566569 49676394 43064003 37024786 31950455 27857046 24702226 22442066 20922506
3443 20922506 19953275 19482492 19389457 19550409 19746406 19993281 20270855 20819552 21882063
3434 21882063 23696073 26592445 31425948 39693606 52453800 66295039 73848748 73091799
3426 73091799 67726970 60773778 53549163 46381178 39630010 33608014 28553830 24408612
3418 24408612 21111625 18605257 16674614 15099616 13851956 12797143 11974173 11293324
3410 11293324 10711272 10175776 9638326 9113606 8682363 8311899 7951179 7608725 7317369
3401 7317369 7065056 6800566 6479594 6259845 6001474 5725112 5525549 5263555 5065038 4936848
3391 4936848 4836559 4773240 4682986 4578965 4454151 4332258 4215596 4103365 4049374 3991439
3381 3991439 3991053 3910543 3817194 3770991 3750828 3675446 3583715 3471090 3416373 3384105 3349004 3321069
3369 3321069 3255966 3144918 3088723 3029129 3006497 2962150 2954205 2948799 2977486 2911366 2857834 2776713
3357 2776713 2713186 2642938 2626786 2613808 2591584 2591261 2611174 2546958 2525585 2466008 2418836 2352386
3345 2352386 2343373 2402663 2487772 2547129 2602011 2636444 2726353 2765433 2826068 2853559 2899764 2929464
3333 2929464 2954016 2929144 2866440 2826274 2776465 2751611 2751186 2706166 2649523 2604136 2536642 2411445
3321 2411445 2304770 2253530 2227290 2206402 2202552 2212194 2190846 2166772 2193973 2190410 2190047 2250534
3309 2250534 2311423 2373900 2419879 2449423 2425539 2392369 2360217 2297269 2233343 2210076 2189465
3298 2189465 2181037 2135195 2077620 1975432 1867473 1765238 1678539 1589895 1593966 1573823 1544372
3287 1544372 1459567 1457101 1401951 1324358 1228447 1188726 1173785 1167169 1118771 1150532 1130602 1121000
3275 1121000 1100497 1083947 1049348 1018733 993194 1023759 1060694 1079283 1022909 989834 1005582
3264 1005582 1001137 974034 1005531 986835 966909 945151 963546 956525 911190 876879 847705 829350
3252 829350 832716 811465 857795 873144 850866 865702 860876 837053 864121 869211 882342 865685
3240 865685 891262 856637 803055 773242 753124 810241 812879 808479 814377 789532 796183 810638
3228 810638 759476 758043 712017 707458 721244 703207 713477 747147 712639 724467 689418 702602
3216 702602 708288 696293 730345 750305 782294 779707 736891 736452 708846 695019 710437 725882
3204 725882 741929 728947 750040 752471 692132 686450 682748 704973 693425 728247 724302 764722
3192 764722 753468 721892 712474 722611 721010 779639 809636 780157 790086 801398 788731 777696
3180 777696 752625 798738 793972 810691 824628 858487 892836 935966 995585 1068131 1111038 1130260
3168 1130260 1120673 1101916 1079571 1016005 977463 953740 922775 925016 900094 890176 889398 859224
3156 859224 808916 844269 915521 925329 939951 954482 980519 960418 1014530 1056468 1135854 1174660
3144 1174660 1210206 1252347 1283504 1243118 1229677 1202561 1156766 1083738 1067604 989163 944414
3133 944414 927251 896827 878727 911362 905152 901787 877831 871125 853703 849483 863780 854672 884697
3120 884697 888323 865239 840882 850999 851058 881279 889565 903683 859623 887168 864303 821712 815545
3107 815545 800564 777672 763996 776624 767878 798724 739004 725557 716760 745211 741612 768052
3095 768052 767354 767456 749138 719306 741719 720566 673921 680915 684298 648079 637971 604445 623848
3082 623848 632483 629693 602726 604001 603815 621081 596782 587377 582744 589941 616763 610077 595587
3069 595587 556942 523021 503561 500201 507484 504295 524507 545027 524917 495490 536142 509685
3057 509685 506549 501767 536150 537581 537911 521761 505160 472986 483774 477528 463388 427594 432545
3044 432545 473688 483684 441671 442607 441179 457751 437273 424799 402770 421273 424892 396656 420033
3031 420033 399771 376029 405204 420462 454874 420103 424764 451205 377124 394748 411649 397451
3019 397451 378138 405665 406412 361729 379246 374985 352062 347107 370449 377893 399892 405927 368485
3006 368485 362200 354471 346896 343759 369233 356895 381114 359457 382014 369801 369832 326419 341618
2993 341618 307747 300823 324430 343090 342081 344896 311745 289698 230471 256124 228904 304291
2981 304291 350167 385886 375945 348898 310191 314325 263928 282777 304485 312041 356693 366809
2969 366809 355611 351626 286861 277188 291243 323848 315136 282256 321277 360895 341753 296921
2957 296921 297164 299874 304045 281994 300882 283597 291688 306688 316478 327417 305142 290030 299448
2944 299448 265710 297390 291095 315740 316612 293803 286961 315065 290424 275727 214504 260329
2932 260329 269956 271435 276503 250535 269118 314492 286438 292228 278446 272252 276880 284008 231932
2919 231932 238739 280600 299252 314897 327782 271919 222709 194768 172152 222758 255877 334112
2907 334112 381906 337129 308544 278053 265634 192966 173840 216772 280605 333357 360433 290445
2895 290445 257193 197873 185752 187253 210916 262560 290236 342613 336631 296903 256554 257041
2883 257041 232319 234520 244001 307902 309584 292926 291480 303967 309996 249203 222913 259645 252419
2870 252419 251693 245434 282687 304762 270913 281560 292912 233008 236790 256752 244648 266219
2858 266219 277911 279715 275222 275298 287352 283265 254616 249318 293036 287281 227459 237777 253035
2845 253035 267803 321863 310610 320403 292316 279274 231174 204927 203388 257956 305880 355631
2833 355631 337470 312022 252473 210843 235865 189982 228725 259902 285456 322578 316736 247891
2821 247891 196173 182851 188946 193509 234651 291981 322055 346941 291251 263971 221455 155534
2809 155534 168934 166859 255978 279880 277163 294766 264318 240007 225641 226050 259499 244214
2797 244214 245258 258345 256629 235760 245500 221458 196242 152852 181078 187574 246952 303192
2785 303192 322223 312835 288425 267636 255337 222039 243078 221019 183711 200252 241257 266508
2773 266508 272255 224248 184448 184235 203543 248955 239812 274811 218533 231424 279720 256673
2761 256673 224729 238387 225734 227407 195664 189957 195362 195149 248477 251125 224707 270908 210758
2748 210758 186357 179436 202028 199914 240761 278897 266286 252653 254173 245726 206761 143390
2736 143390 191922 242042 246824 285376 268978 223659 232073 206383 173360 123908 173728 209417
2724 209417 267798 247265 228771 216372 211176 166615 157257 151691 181697 214273 230155 234820
2712 234820 219309 191840 206391 216328 204579 209556 169860 174342 188177 187670 175842 208597 198215
2699 198215 189502 214655 233526 252215 211744 220124 216562 247692 212811 202279 208652 204648 208331
2686 208331 197745 244942 242140 223792 219424 197344 184386 210488 216082 227963 200584 198762
2674 198762 185949 179549 190693 220891 225130 261824 239349 243864 227764 225976 173155 163157 167415
2661 167415 223161 224573 261258 253885 206859 163069 135865 134723 140753 186448 244942 235032 268937
2648 268937 258076 245309 187889 165961 143847 160875 189069 227666 239097 226651 191947 184844
2636 184844 180765 188919 210741 246138 215720 233144 244635 262784 221474 252599 223790 196058
2624 196058 209108 200252 219447 244149 241884 288818 271692 285190 335459 363049 355830 358206
2612 358206 387103 390419 353132 317853 296483 254968 260644 222159 215823 231762 238405 252010
2600 252010 232094 237090 265919 263588 243296 225082 230990 219050 218968 241421 215372 169796 181418
2587 181418 175260 242042 247098 252412 211543 181045 172843 209714 190650 238165 196433 199181 210577
2574 210577 221172 207472 224937 188870 179473 169155 221563 230784 211108 212249 228749 217271
2562 217271 210696 224961 242015 219220 228528 232966 232441 217734 238835 224379 251852 228769 197567
2549 197567 154529 180576 192920 215677 229657 220045 210481 195862 141708 181056 165136 176441
2537 176441 198323 215083 206375 191715 154053 164426 146999 191079 238449 234295 251793 205042
2525 205042 178821 154509 164819 184639 191815 200011 256599 236029 252145 232772 203825 196478
2513 196478 204181 240647 221600 199696 213597 191813 236720 233382 239723 231673 249631 258751 263035
2500 263035 255472 240753 176675 190903 190464 218634 219055 188801 221943 265579 229225 241853 217291
2487 217291 243553 237269 246783 237245 244185 219998 239746 204197 245466 247860 261712 236684 253607
2474 253607 266786 239829 235592 258232 238435 268659 225265 193201 221982 216103 270752 296867
2462 296867 302931 292564 254289 233551 254234 217509 210087 200214 237480 289776 272047 237512
2450 237512 241151 235354 250865 254101 306591 314856 279093 293220 268197 247184 249527 261094 265476
2437 265476 293202 346309 344014 355696 338531 333168 319757 342199 334587 379729 359855 360467 318794
2424 318794 325084 332808 314044 326359 349113 331249 394040 376021 397443 398749 386771 404662
2412 404662 402991 396640 435415 466447 510830 512317 502465 490048 443815 453288 430534 439519 474655
2399 474655 521074 535546 549235 547499 559785 524846 520956 528995 607045 641035 617986 598376
2387 598376 602887 580765 583283 561621 604871 620569 692808 778855 793078 790773 792572 757117
2375 757117 779899 767254 832756 891898 976301 1044363 1076624 1107853 1184126 1294749 1543022
2364 1543022 1949568 2361518 2504378 2555950 2625996 2737649 2847738 3011018 3280282 3762582
2354 3762582 4474685 5638328 7256994 9934675 16807266 30436822 41154031 40664848
2346 40664848 35604613 30496412 25960472 21434438 17186889 13591701 10907624 8787045
2338 8787045 7052382 5931719 5196553 4794669 4639145 4573605 4279002 3878870 3568105
2329 3568105 3281035 2984184 2761899 2572033 2421831 2313454 2175041 2066715 1933585 1832803
2319 1832803 1815527 1767708 1686918 1631834 1621076 1585860 1475568 1401060 1319821 1245887 1238513
2308 1238513 1237511 1303449 1277578 1202697 1159231 1074975 1023582 1011446 991649 1018919 1004501 1010205
2296 1010205 1028782 974943 923127 882962 881997 845870 826949 851198 828103 825180 820673 770457
2284 770457 767775 707100 711065 708322 693686 698682 723992 717993 728298 693586 686462 630073 606651
2271 606651 593362 589331 607528 598642 581080 591746 572604 535682 541728 515642 511584 487733
2259 487733 501297 492006 499528 519776 511263 510348 523778 517649 549997 514563 482473 454871 458148
2246 458148 465175 454693 460833 485092 474577 463175 453410 430033 433628 409830 421019 436556
2234 436556 443842 480104 460559 462633 406822 329902 354139 344959 353662 390509 403213 479428
2222 479428 468616 400634 339813 274813 251053 291408 350361 414416 414216 425632 389114 333156
2210 333156 310561 299993 292782 305455 261190 318896 327527 348900 343495 337674 310204 291057
2198 291057 266973 305563 308745 324882 307873 315886 309818 295294 330553 325762 331198 337102 285110
2185 285110 307340 329443 322149 280819 257784 289393 291274 268447 261305 255477 254553 280134 267186
2172 267186 327662 278708 193616 188742 248482 259207 267188 238909 240412 277100 286436 278479 295595
2159 295595 330739 309527 229044 222772 214600 239546 258148 279665 332039 329354 293715 249376
2147 249376 234583 210768 197008 208865 232921 289459 279879 267059 289655 257397 202711 213562
2135 213562 190308 213556 232687 237788 257912 240758 211491 192650 190687 213722 216924 242565
2123 242565 217674 229622 257358 233456 250331 247699 217389 204381 221018 211633 184960 223027
2111 223027 236622 245382 205417 216820 170663 155967 148465 185120 212161 254954 294793 289368
2099 289368 267351 271261 218044 205807 194017 170204 176049 208039 253829 220493 228456 249885
2087 249885 215868 207925 227423 222273 227452 236144 287769 330504 398874 418161 410810 394090 361356
2074 361356 270065 288938 232034 249882 283294 293992 285298 266880 256463 228503 163209 149605
2062 149605 199085 223180 298806 310785 285015 239857 187913 177304 174337 161433 175239 185923
2050 185923 216985 259822 250334 202817 171011 167368 147269 134073 179042 214724 208781 184375
2038 184375 209410 218707 217877 194007 180400 217143 206637 175954 183724 208377 222179 221110 216156
2025 216156 246799 230574 195796 217849 197972 185839 168068 170913 182350 178157 181745 204006
2013 204006 157301 162814 177794 170469 169603 193572 208595 221970 233752 204068 149585 170540
2001 170540 194493 177031 163661 148306 206063 240476 217779 178933 146892 172728 139814 150247
1989 150247 193414 199045 236311 258602 217741 198131 158527 121498 119085 123980 151455 181907
1977 181907 222731 195707 188308 168711 160255 152541 165655 184560 174403 170472 185716 190991 177686
1964 177686 198716 168548 111505 115595 92612 141943 149052 216098 217707 195349 156529 143860
1952 143860 131311 181996 192533 191422 170826 194857 212148 178218 140524 142546 137490 169890
1940 169890 130842 166427 205689 211619 174834 185813 170546 179240 176884 196413 194046 189026 163465
1927 163465 161403 169630 156966 156514 152591 141935 165762 176230 175395 186202 177240 195581 178404
1914 178404 184571 195211 187277 190902 194277 163073 152748 189893 180593 159929 157987 157313 175152
1901 175152 193199 195436 185664 184844 164882 195476 172303 160754 183914 187892 149987 167455 126117
1888 126117 138823 140829 175175 155403 177915 164868 154580 125832 152690 137134 156191 132279
1876 132279 133535 169350 202292 169190 186633 164177 179975 153878 163962 149315 153517 165965
1864 165965 202153 171431 170590 189478 134911 118658 138123 125657 144976 170519 182830 201709
1852 201709 212269 194613 206718 173014 200487 207402 200169 189271 207112 180602 179733 175160 195176
1839 195176 168831 158302 142270 128838 157687 168021 160778 195123 205585 188323 161540 155093
1827 155093 176326 139128 170437 184642 178977 206264 188387 166092 141041 132686 170876 165914
1815 165914 178582 174367 163653 120569 133810 132782 178678 206008 216987 180314 177124 153775
1803 153775 150589 139726 135987 117945 170145 137560 159881 157772 172159 144370 154346 123626
1791 123626 156024 136008 182056 165108 170307 128722 153072 178028 211107 159585 164192 168332
1779 168332 186577 163517 146291 147227 162567 147993 159870 148156 142291 146837 124199 128971 130359
1766 130359 149335 142391 152332 155205 106035 116004 125870 140916 142878 132561 149197 154957 134302
1753 134302 160522 172963 194780 193803 165054 166040 161109 164606 177471 154691 160300 171491 133331
1740 133331 147418 157862 167308 126805 154978 150626 161947 156666 166211 151684 158437 113626 148605
1727 148605 140140 152876 160488 149782 167511 149593 142570 181150 157098 160364 177587 190620
1715 190620 148004 131978 109718 117952 119406 124735 110452 168254 135213 129584 129405 146520 146923
1702 146923 158588 159665 184822 156060 195591 161481 139631 164955 139432 137997 154177 139663
1690 139663 179676 140577 116491 110653 123621 174878 159229 170155 166540 177646 184424 153356
1678 153356 123271 135656 171921 189698 201449 194275 188069 137522 133020 135872 133823 164990 154677
1665 154677 141493 120593 124718 163461 172242 146122 122125 155484 180595 163699 177736 132079
1653 132079 157549 157297 126200 123419 158554 123172 130429 111975 125763 115710 164648 166622 136296
1640 136296 126484 152667 117327 151563 156242 138472 114344 132137 139080 125319 146774 145440
1628 145440 135377 127143 120626 150373 158205 151214 105513 99122 86440 109626 117684 156957 184810
1615 184810 148206 122941 121808 131696 137840 128778 133243 131891 152690 149331 146541 149057 133706
1602 133706 189641 215234 187529 175103 171102 137082 125880 63194 77335 135461 144320 125279
1590 125279 127274 86833 114054 106949 151582 129517 148668 157125 153756 163399 159895 150783 159936
1577 159936 187012 181007 158628 120932 89732 92686 125038 136923 157753 216246 148211 131130
1565 131130 132115 121462 100986 125629 170323 157445 122237 105503 102476 160305 155784 175340
1553 175340 218403 217969 221839 190353 145388 102469 118309 162689 167397 147844 130751 84637
1541 84637 99977 75510 96380 94583 108860 168258 166425 144068 167843 162037 167208 116684 93764
1528 93764 153570 138940 137938 171316 192395 175318 145509 135685 121120 146361 146301 138581 181769
1515 181769 208098 205778 196562 143287 119588 123874 129871 110545 147090 177021 170249 118291 129816
1502 129816 89016 115598 91508 105757 154029 179759 176294 197889 176087 146636 105468 125792
1490 125792 136218 151771 187846 207447 159288 154524 128214 88283 72983 92979 128699 138596
1478 138596 192964 193252 165341 124203 102038 87329 153813 166846 171348 174129 162662 158525 157782
1465 157782 130823 102464 116690 141810 158672 185867 134610 148942 171970 157483 130591 129432
1453 129432 148329 188133 171259 181971 162823 145213 145768 157226 109144 156624 140712 141897
1441 141897 142595 150280 137144 109300 110967 122159 126264 175670 186245 160884 133895 113428 88370
1428 88370 84213 93016 93859 109634 138383 154406 162412 144221 139455 127850 96042 117379 157374
1415 157374 159003 163047 150725 167104 123189 96275 53142 42639 107538 141069 183615 210724
1403 210724 178174 144343 142841 117778 125530 98346 134148 177388 192621 167085 142500 71108
1391 71108 79430 105547 143887 149233 193650 208256 201936 180403 176986 131877 143597 145107 156682
1378 156682 136512 97679 117251 126695 147151 180154 165339 134696 156258 166859 152943 112464
1366 112464 117677 138514 121416 110384 112815 116570 141576 162791 151431 141183 119106 130653
1354 130653 111605 152593 142416 135199 141003 121883 138752 128022 106923 84906 113664 137771
1342 137771 144395 131737 145983 144951 152787 116871 100789 84056 112120 146611 161799 184881
1330 184881 172831 136719 139933 110162 78473 81848 82089 133468 159256 193873 199298 130731 47227
1317 47227 101045 69304 113616 153547 187687 194889 169160 160858 140805 121731 115692 125552 106716
1304 106716 151470 137946 150172 121199 144257 107695 105867 85382 100751 112241 146375 117021
1292 117021 138652 120353 131202 149280 141814 134368 138364 84161 87872 107452 127227 140915
1280 140915 143159 153958 139090 117962 124058 112344 86755 136823 136466 121812 131057 159032 166057
1267 166057 150375 162270 166906 134525 100158 94257 120099 140909 131918 128997 142059 133770 111304
1254 111304 71482 67485 57585 99114 98585 136305 139678 188464 130073 104085 54815 83290 61251
1241 61251 84485 121028 180714 182962 190797 139719 81290 50735 72089 105897 122105 177102
1229 177102 154361 146225 129644 92414 114153 143725 133609 122673 128113 117145 112859 119302
1217 119302 152204 125319 141246 129698 99891 72107 97893 83624 136401 134040 143903 128666
1205 128666 140065 145541 134144 108364 104257 114671 115618 134815 131084 127748 142467 145279 90298
1192 90298 129346 141987 143427 85559 106839 102186 156953 152535 178227 140285 110041 69946
1180 69946 87086 99394 155606 149602 164001 147337 127754 113636 69990 61355 90647 78317
1168 78317 97110 137363 173793 178293 198735 122015 91353 32817 66120 93645 177984 153600
1156 153600 177413 158204 164353 130385 114978 104322 112494 84953 128779 136789 135725 146841
1144 146841 117628 140798 170266 150969 123717 89358 85189 143535 158964 210829 146646 144856
1132 144856 142569 133217 137482 113424 82131 100720 104001 138833 139449 112488 121641 144920 126355
1119 126355 86087 75087 92381 92004 96785 129843 109617 139531 140080 93267 111209 57588 51704
1106 51704 55934 111042 122766 150387 131581 131066 80497 63011 63050 66225 64824 104780 93247
1093 93247 134361 152466 192591 136510 103708 66750 106309 107412 141997 156572 157547 148149 129934
1080 129934 108465 97091 68221 110754 103280 130221 158227 169928 182485 144752 124033 110540
1068 110540 101331 111151 82477 109097 120376 138458 116424 94477 101210 123135 77927 82036
1056 82036 108607 98842 113923 101944 94272 98305 144269 132041 126761 153632 117221 95378 119358
1043 119358 110330 110280 115988 138680 105849 97042 74374 110507 85373 100217 105259 82263 122714
1030 122714 115135 105796 126740 102349 112907 76370 63042 96640 101379 109853 127780 141965
1018 141965 167073 115958 80423 61439 49397 75142 132677 113362 132481 125865 153938 109609
1006 109609 95618 63204 87255 100374 103032 140604 187261 154184 190240 146308 136265 118204
994 118204 110412 112919 112136 135219 162126 132955 115315 64873 91918 118592 97820 133930 125416
981 125416 113288 79917 104913 142263 125308 124007 117686 119034 134428 95573 77727 89597
969 89597 88509 128590 161966 171549 157424 100245 86099 80748 72398 73922 118622 138328 144592
956 144592 133816 162659 118945 91811 38679 53847 67448 98042 110536 119435 93103 85684
944 85684 72326 77584 88988 82053 102895 132648 153552 158736 155906 158688 96998 71942 66949
931 66949 87176 114102 140562 156866 150459 157297 142946 98336 106223 93989 75777 92012 122455
918 122455 124672 127021 87126 108541 86923 82858 155523 135985 155742 143937 99013 79510
906 79510 62121 113103 152188 130005 145414 101343 74717 104033 72085 54951 91306 135710
894 135710 147340 156264 191638 136485 126249 81785 91631 76976 105091 146693 154821 134308
882 134308 145141 104558 106348 92719 55529 77043 93341 153869 156443 157916 165687 109092 104190
869 104190 75478 61043 93606 109538 145082 176675 172440 103791 101655 76206 74333 39166
857 39166 56916 119840 135420 160510 147952 138842 123289 87104 56259 49847 89101 136642
845 136642 135674 122962 136701 118292 101739 78794 102907 93105 103339 146094 148890 124106 126090
832 126090 161407 136780 106190 107780 102852 96702 102568 112630 94411 88059 52632 72550 98578
819 98578 130669 125997 83929 66166 60163 39071 97988 128171 137739 140911 142823 129169 88557
806 88557 86962 77309 115505 153427 153101 174436 192252 159195 122592 99879 65267 73934 106233
793 106233 133244 129804 176817 128624 117257 103042 102761 62134 72690 68980 103865 135553 161874
780 161874 148100 151827 132991 106364 123479 114544 140333 159069 181434 109319 120772 70275
768 70275 68794 47743 84590 71282 92501 123123 149760 133263 130222 89035 76390 67239 102531
755 102531 86564 112515 131553 134320 148078 119843 84267 97830 134599 117706 98196 107067
743 107067 84843 97017 100645 120695 107379 157508 151246 146097 115575 71635 73316 75146 82331
730 82331 132513 114535 107284 109683 123180 109970 98639 51501 76793 108176 147682 136533
718 136533 143175 173243 123320 62744 49627 55043 92860 140143 139252 130819 115613 137211 112289
705 112289 73079 72297 83115 59310 79290 110989 139802 129532 135050 100004 84962 66515
693 66515 121350 124800 112933 104427 130544 92810 129535 89276 85036 86754 110697 114505 143941
680 143941 109230 120765 101320 156696 140201 105120 77375 84227 33374 64261 77200 123089
668 123089 119370 149064 155967 139170 113909 104372 72808 27463 50605 86301 104373 119862
656 119862 162713 114180 96708 96156 70435 87331 111380 73394 129308 167207 153819 105407
644 105407 113399 79393 67217 58426 60082 72781 140146 117949 132589 113267 90243 76440
632 76440 36504 36792 95461 133000 115709 126236 171048 135611 130471 95330 67511 67938 74990
619 74990 86268 128566 138330 133358 118487 110250 95594 102196 91676 125815 84782 79742 117437
606 117437 110335 84522 92325 91791 115534 106855 90825 72090 85450 95994 88623 117461 104490
593 104490 111138 134699 123170 109772 86142 55677 40751 81013 68856 111132 138065 116491
581 116491 92318 111783 94533 62351 83218 95418 95348 129015 130006 141417 149222 91849 64667
568 64667 29552 79426 83322 108190 110367 131582 92589 77388 82451 93550 90786 141574 109815
555 109815 141589 151389 141860 102309 80800 77415 52554 55078 89807 103999 107438 139328 109874
542 109874 91970 80625 90213 84723 79418 137708 123155 124874 93321 108900 76714 59930 67988
529 67988 92693 78684 71817 83131 91724 123854 125157 104358 89101 122272 153208 123879 123647
516 123647 105455 77384 87827 60404 60428 85452 59343 57505 86618 78805 86506 105583 114560
503 114560 102475 116936 109841 99496 103334 115764 83201 82499 96919 84619 98863 105994 126668
490 126668 124900 113824 67967 56674 48579 42063 61566 70675 109728 113881 127616 98158 99797
477 99797 37305 74459 80897 119698 137500 146544 112725 135033 111947 133633 60733 79106
465 79106 121191 144377 98757 84853 87568 90508 64242 75718 80911 73614 103847 77436 100107
452 100107 97048 86011 86774 95441 112870 126307 129595 162447 131664 120614 96033 82348 84515
439 84515 96986 119133 136464 106675 102639 126040 109345 118871 111718 123714 133037 107841 114362
426 114362 68453 91340 89973 109756 146986 151930 132669 133955 109318 88685 65911 96075
414 96075 90904 118513 68412 46422 54750 83450 99025 119795 114232 108469 83995 55758 75363
401 75363 114396 102239 79699 73841 73763 96200 91778 84689 93792 105368 113002 111948 100148 92259
387 92259 128920 99574 95264 55994 81416 91657 93693 89268 100658 109162 116591 81717 89246
374 89246 110231 123436 98990 105760 97761 73431 107745 146587 167218 138142 143784 141980 130471
361 130471 72102 111200 59656 93696 108660 110128 88281 80022 60031 67518 89391 119407
349 119407 113268 113362 145691 127231 82570 63437 80852 81000 106374 102033 105913 116496 106088
336 106088 92497 73173 106052 105693 122580 140865 138918 119894 109867 89208 94319 94302 104201
323 104201 53575 58120 76672 97626 99263 97119 103188 117546 105475 111287 84270 79676 59091
310 59091 63153 118031 122235 114233 63012 45837 31082 43572 55996 101111 140296 118987 119558
297 119558 118780 111554 86112 83189 67669 48525 67704 133424 112680 102626 96416 81873 70255
284 70255 88288 111777 83485 104925 108938 109439 119632 128452 105757 131856 119194 158384 113674
271 113674 113060 112313 112417 71963 69782 88192 98380 71804 70729 54745 76322 86440 80309 76566
257 76566 99343 113526 123205 109787 112497 104590 104379 89600 71941 103275 100473 131350 130796 116800
243 116800 106153 93553 70166 92381 112545 87615 106010 117037 119303 124461 126490 91871
231 91871 75343 70565 65266 78735 108104 86945 118846 138736 102673 96658 64639 57492 42272
218 42272 66467 73816 110056 108362 100963 80253 96516 35779 22074 36740 67164 71384 80753
205 80753 91783 60436 62823 75166 61176 71704 36923 75053 93027 73908 51424 84796
193 84796 47294 32707 51836 93918 110260 95864 90161 82090 64668 65256 63511 59196 53304
180 53304 67988 52417 62314 56961 52991 33525 31329 23836 39203 23484 16364 50248 36081
167 36081 48830 38413 31158 13369 29057 42625 74176 35228 12523 23028 42338 10689
155 10689 49660 31713 50526 64657 53649 32618 34780 11404 1353 -27668 18619 15229
143 15229 39711 29277 31554 26114 18347 14221 -2985 -4509 5967 -13772 10165 37653 15307
130 15307 -12948 13807 -40818 -40410 -29207 -7579 23400 32840 40318 44643 35981 22876 17249
117 17249 -3285 -19086 -28924 4104 16298 1611 -28890 -15218 -8936 -12471 -27331 -7196 -258
104 -258 8844 18143 18955 6618 4996 -16348 -1831 -5672 -25557 -31206 -59260 -77940 -64279 -71773
90 -71773 -59820 -57801 -25673 -11047 -19565 -50796 -43206 -57726 -71364 -53029 -79369 -96457 -87223
77 -87223 -66450 -58783 -87177 -74648 -99611 -100349 -102860 -84065 -69859 -47583 -64833 -76244 -87965
64 -87965 -65400 -93049 -83910 -79706 -56840 -57772 -93186 -83197 -87835 -93040 -100974 -122763 -119447 -93136
50 -93136 -97435 -64212 -69920 -83240 -106075 -123639 -124472 -135824 -152451 -136719 -164361 -159026 -124831
37 -124831 -117533 -137126 -150579 -171417 -166520 -148039 -124800 -116771 -138270 -129629 -142892 -132187 -163792
24 -163792 -169613 -162918 -158274 -136281 -141489 -164905 -156356 -145183 -140879 -155424 -169702 -136900 -160724
11 -160724 -142457 -174417 -169316 -144308 -166874 -172886 -163754 -188963 -179981 -204830 -204608
0 -204608
$$ Imaginary data points
##PAGE= N=2
##DATA TABLE= (X++(I..I)), XYDATA
16383 -482425 -456950 -418519 -369795 -370529 -373890 -355636 -365606 -369705 -322380 -322616 -307074 -303385 -319906
16370 -319906 -278134 -273708 -269301 -295091 -263252 -245867 -240624 -223785 -206881 -195517 -175786 -188428
16358 -188428 -195706 -192097 -164829 -145253 -149650 -97973 -77624 -66392 -72147 -116062 -108736 -88325
16346 -88325 -86090 -54295 -15614 -2528 -7276 -6286 -3250 2986 9461 -1928 12595 32730 56420
16333 56420 62263 69206 70410 90927 97879 109423 108101 143378 160152 193402 180340 195381 194947
16320 194947 213597 241231 240344 250588 222861 238318 209682 195391 240619 275229 267994 289449
16308 289449 301718 315886 319169 350339 341957 356903 374692 372874 381200 399001 391123 405350
16296 405350 437749 425362 428156 425740 422301 429341 457323 466504 456793 454496 479100 502680 516483
16283 516483 518805 504651 539785 534471 560207 564918 569991 589338 594095 596082 597989 614697 653347
16270 653347 672331 672856 626210 621722 601989 591667 595356 607796 679419 687435 694114 693399 659388
16257 659388 671615 710609 723308 725555 734190 749033 752584 746960 758422 744135 728273 756086
16245 756086 765929 779801 789445 813443 794617 773807 791044 799889 821686 808226 831489 836485
16233 836485 837356 822676 880836 886550 867584 854265 853210 858897 892067 915278 912263 934110 905138
16220 905138 890518 903110 904085 903688 941623 922151 933535 945538 953705 921617 939306 945793 949001
16207 949001 980116 939574 946177 966295 967472 980862 989325 951748 949795 971859 1036838 1011100
16195 1011100 1014796 1020634 982522 1015553 1007676 984739 1007338 1015376 996492 986165 983660 1026639
16183 1026639 987534 1000766 1010314 1061691 1094998 1104772 1114387 1113009 1042118 1044895 1061513 1087978
16171 1087978 1112487 1095557 1110086 1128881 1094559 1097852 1090077 1113750 1094608 1067572 1101440 1110456
16159 1110456 1110339 1111140 1087914 1059145 1051655 1068529 1066681 1070896 1101115 1118754 1124751 1139461 1119654
16146 1119654 1126426 1078784 1124816 1161554 1166147 1176258 1147902 1153493 1158206 1154166 1137897 1142944
16134 1142944 1132835 1163268 1155059 1181203 1172705 1201363 1171336 1171909 1182080 1193859 1159653 1179015
16122 1179015 1197810 1224466 1222053 1187972 1182327 1155384 1161828 1171062 1182353 1196741 1154972 1187012
16110 1187012 1155129 1115663 1156614 1177628 1214446 1208010 1211217 1223542 1207406 1201413 1154686 1131205
16098 1131205 1131990 1165233 1222245 1225503 1192370 1220763 1138554 1172616 1202011 1194910 1224358 1246531
16086 1246531 1213873 1256069 1219135 1209839 1220017 1198963 1231675 1191545 1237064 1254948 1222384
16075 1222384 1203862 1190167 1191892 1169391 1165426 1248724 1214687 1225318 1254442 1255060 1253372 1212384
16063 1212384 1182374 1191666 1168272 1179652 1193509 1213656 1198064 1195670 1228318 1229913 1221312 1220034
16051 1220034 1183059 1223549 1238612 1255347 1259312 1230168 1243327 1235204 1167702 1184875 1181217 1244404
16039 1244404 1242768 1265932 1234475 1224248 1210414 1216504 1210097 1232003 1202148 1250303 1234871 1218804
16027 1218804 1226190 1179252 1210361 1217261 1228778 1218716 1198329 1175260 1206718 1196727 1210707 1168332
16015 1168332 1205636 1204801 1232456 1242282 1237829 1216244 1230571 1188678 1212534 1247223 1232379 1236612
16003 1236612 1221535 1222445 1189462 1213824 1192593 1219613 1245195 1244990 1237462 1261312 1226950 1253138
15991 1253138 1232054 1221629 1239530 1221791 1231336 1184166 1215841 1229412 1231425 1237399 1270161 1202293
15979 1202293 1223145 1231279 1259855 1236715 1248508 1261118 1268489 1259001 1270644 1220998 1200375 1189538
15967 1189538 1211195 1249640 1289567 1327956 1275915 1259282 1241690 1203440 1229056 1232182 1219565
15956 1219565 1261534 1220165 1239132 1256806 1241773 1240941 1215198 1223156 1234396 1231781 1237008 1208871
15944 1208871 1184855 1197187 1190132 1219728 1208624 1220741 1224441 1219944 1231956 1241714 1245840 1239346
15932 1239346 1249330 1285556 1255754 1208778 1253175 1233859 1250586 1229037 1256193 1274419 1255281
15921 1255281 1271342 1257496 1216680 1232281 1171795 1198687 1213714 1198928 1220790 1246255 1276333
15910 1276333 1273481 1253549 1240168 1265564 1232368 1249156 1230455 1265573 1246282 1255539 1250485 1224453
15898 1224453 1250340 1250505 1242790 1225356 1239575 1224281 1236733 1220484 1240950 1224510 1246330 1204755
15886 1204755 1177036 1213854 1259885 1287066 1292765 1297209 1293418 1252153 1239551 1222089 1209038 1226428
15874 1226428 1269107 1300996 1238152 1238908 1250074 1230422 1245742 1249600 1258448 1292951 1272627 1245343
15862 1245343 1215233 1218868 1230414 1238275 1257100 1252780 1257309 1250550 1279080 1269398 1264901 1260442 1262414
15849 1262414 1254955 1243409 1247975 1247417 1253051 1247769 1220235 1211918 1234271 1237683 1238494 1237354 1265119
15836 1265119 1253524 1215701 1170658 1221142 1210958 1227242 1245797 1239908 1251313 1260953 1277662 1255227
15824 1255227 1254515 1230216 1240752 1238681 1267797 1262417 1271909 1276836 1296425 1261826 1264805 1252115 1272171
15811 1272171 1279497 1270960 1299129 1316456 1297790 1253214 1218379 1208660 1230479 1242486 1249788 1262409
15799 1262409 1300191 1262099 1195194 1150295 1187171 1221840 1230289 1251299 1283536 1280557 1294671 1289087
15787 1289087 1275664 1253788 1237477 1248447 1271817 1264472 1249078 1269906 1283714 1271720 1270866 1282202
15775 1282202 1266012 1271868 1281119 1271511 1248321 1236647 1234147 1251431 1287809 1278145 1291389 1285374
15763 1285374 1274371 1246398 1262623 1243669 1253315 1268646 1287084 1255539 1263484 1291197 1283067 1272424
15751 1272424 1259840 1251654 1244373 1249501 1239671 1261465 1266550 1285226 1286752 1288696 1237818 1237163 1235177
15738 1235177 1224305 1257667 1254705 1310131 1316251 1318490 1269373 1237814 1207625 1228665 1250593 1304900
15726 1304900 1326731 1304977 1303104 1307433 1259899 1227183 1226492 1266805 1269202 1287561 1256247 1253700
15714 1253700 1262999 1231479 1228886 1236312 1266133 1305345 1326329 1261337 1284777 1264516 1260172 1231674
15702 1231674 1260243 1243331 1258724 1278487 1235542 1260529 1283162 1274569 1272075 1228941 1216737 1235468
15690 1235468 1251218 1282117 1274065 1253760 1273714 1311836 1277131 1257819 1277687 1308780 1304876 1307036
15678 1307036 1276470 1290510 1295473 1278749 1313771 1282082 1271226 1254521 1244135 1219691 1283660
15667 1283660 1297810 1315254 1256456 1281329 1260016 1274670 1307833 1293499 1274814 1281822 1234615
15656 1234615 1237365 1241639 1250047 1300914 1280771 1293298 1292053 1259952 1212765 1233618 1250938 1280801
15644 1280801 1281289 1294348 1313629 1319042 1281744 1252679 1274577 1254272 1298283 1319398 1345138 1373626
15632 1373626 1311286 1272324 1249991 1218770 1292568 1295658 1297457 1303520 1272257 1283836 1270952 1285527
15620 1285527 1326402 1308065 1297480 1292601 1299678 1306262 1280615 1293399 1259887 1238345 1212001 1254376
15608 1254376 1317945 1324644 1300759 1306158 1307407 1304853 1322286 1293062 1298007 1272716 1300451 1287495
15596 1287495 1284602 1289963 1262640 1263176 1303232 1296011 1315898 1355147 1328986 1337566 1267111 1276082 1280223
15583 1280223 1280436 1270253 1273874 1302550 1362427 1341125 1321877 1278213 1302306 1243911 1292924 1323457
15571 1323457 1349431 1340238 1324608 1328151 1339751 1284409 1264038 1242098 1270838 1345799 1359520 1354813
15559 1354813 1314438 1299457 1293461 1272260 1241533 1266368 1261416 1301177 1319941 1382077 1343398 1268827
15547 1268827 1304546 1261544 1285178 1283792 1324228 1316647 1309586 1292390 1273462 1270901 1306763 1280230
15535 1280230 1300250 1277703 1268969 1316661 1313682 1281795 1246658 1278308 1262129 1272714 1282274 1303230
15523 1303230 1277021 1305456 1309696 1314098 1301405 1312963 1308534 1326361 1301256 1312361 1320613 1370440
15511 1370440 1332247 1362263 1342324 1313888 1326866 1307026 1313106 1313583 1303766 1319311 1281907 1259748
15499 1259748 1275041 1293165 1332015 1349419 1322205 1324400 1261703 1251362 1256770 1283757 1285927 1312857
15487 1312857 1324624 1330669 1303140 1282964 1251028 1258096 1257674 1281550 1319105 1348413 1360605 1344324
15475 1344324 1300785 1251830 1234052 1268193 1324447 1319913 1309876 1313883 1338387 1284091 1255739 1246182
15463 1246182 1244779 1278507 1302457 1301725 1361249 1363330 1323603 1307229 1304491 1288745 1276909 1244284
15451 1244284 1255298 1302357 1304854 1331614 1360754 1329207 1329644 1312207 1305251 1309746 1261215 1288540
15439 1288540 1317134 1296739 1327400 1353037 1346169 1299329 1298807 1305486 1340486 1326914 1356526 1332166
15427 1332166 1352425 1323380 1328280 1294599 1301477 1312734 1327770 1335962 1339804 1304660 1301052 1299612
15415 1299612 1295816 1306414 1326485 1315971 1297068 1292271 1270633 1300965 1326458 1340200 1356267 1336731
15403 1336731 1295630 1277380 1288726 1314971 1290337 1314951 1313228 1309567 1319503 1343767 1359569 1331552
15391 1331552 1325945 1330689 1326382 1348552 1364987 1364111 1328182 1298352 1330183 1314073 1288261 1315012
15379 1315012 1300003 1356504 1359050 1375910 1320143 1279756 1247480 1286875 1296802 1278964 1302582 1369925
15367 1369925 1361538 1334466 1332358 1322401 1318879 1309103 1323442 1297746 1314986 1322720 1332580 1338279 1325914
15354 1325914 1310355 1326952 1288278 1331526 1328756 1290296 1273334 1295097 1353252 1319103 1305187
15343 1305187 1307416 1326264 1323121 1334281 1331074 1319480 1312900 1301142 1245982 1269303 1291481 1336206
15331 1336206 1347275 1368918 1351200 1304978 1298936 1313570 1316137 1358281 1396902 1394274 1402587 1379921
15319 1379921 1328245 1297933 1334006 1321725 1341866 1345849 1409782 1365063 1320526 1288363 1291215 1304863
15307 1304863 1285607 1319739 1340785 1345292 1342703 1318040 1289244 1307354 1255475 1294107 1324118 1341497
15295 1341497 1346104 1343028 1334999 1341984 1327021 1309912 1329989 1301205 1330964 1353446 1357027 1349672
15283 1349672 1359519 1347442 1360700 1332057 1335012 1337816 1350096 1345716 1350994 1347136 1328360 1338718
15271 1338718 1352324 1343665 1305664 1317971 1322107 1365506 1339311 1337244 1330278 1352206 1382102 1399929
15259 1399929 1391130 1357863 1374515 1354983 1337105 1307629 1346836 1321404 1303665 1321615 1338387
15248 1338387 1356180 1343272 1330252 1327933 1302700 1326184 1356960 1389070 1381749 1396769 1364806 1321573
15236 1321573 1267732 1269978 1341030 1369782 1372556 1401607 1372034 1381608 1360082 1293193 1308043 1312932
15224 1312932 1386995 1389007 1423404 1381566 1379286 1379227 1332234 1319351 1334377 1319982 1343127 1360279
15212 1360279 1392605 1375590 1315016 1338612 1365743 1340058 1347528 1376641 1385689 1372523 1347028 1398843
15200 1398843 1358888 1367250 1358093 1303612 1339012 1338144 1362586 1364027 1353460 1379827 1340767 1334204
15188 1334204 1355730 1341681 1374748 1385873 1416700 1408081 1382776 1388166 1356505 1331258 1337727 1367600
15176 1367600 1401573 1390572 1362509 1381517 1347404 1346920 1325300 1344351 1340534 1384781 1390684 1363894
15164 1363894 1329544 1307778 1283495 1329083 1315680 1336863 1402706 1398833 1398685 1353050 1332890 1304447
15152 1304447 1314775 1337512 1375258 1371603 1426478 1364991 1335532 1330000 1324208 1305591 1353831 1393168
15140 1393168 1421263 1435895 1415997 1381047 1334107 1344113 1353914 1363122 1341997 1390600 1391613 1431977
15128 1431977 1404793 1383192 1384299 1377977 1382656 1375295 1380298 1372590 1372033 1378561 1388736 1360686 1364058
15115 1364058 1336582 1385608 1384080 1388651 1376190 1399654 1343405 1325153 1318861 1315268 1340179 1349936
15103 1349936 1398888 1422892 1400759 1370412 1337397 1339058 1339379 1354317 1378541 1398979 1386997 1381129
15091 1381129 1373177 1361596 1337069 1324540 1318308 1367509 1406103 1435498 1429705 1360562 1306947 1323368
15079 1323368 1310193 1321474 1392141 1376998 1433159 1392661 1362297 1361334 1330545 1346921 1334481 1347762
15067 1347762 1408063 1413985 1433029 1378508 1363159 1356984 1300872 1351122 1398583 1367697 1381887 1365234
15055 1365234 1386214 1348137 1364533 1336717 1359736 1387520 1429579 1444420 1433614 1394685 1420883
15044 1420883 1386663 1325901 1336306 1361898 1404296 1416064 1393186 1390928 1388500 1354223 1352469 1337782
15032 1337782 1357975 1370202 1403013 1413911 1385984 1401378 1348382 1360568 1376862 1363635 1366582
15021 1366582 1380466 1360007 1408951 1402366 1393520 1322539 1337946 1391588 1395747 1428804 1449362 1400697
15009 1400697 1384345 1360957 1338173 1349116 1337514 1387278 1388888 1431063 1459255 1422302 1400600
14998 1400600 1361019 1358178 1354935 1364210 1422595 1403338 1419647 1439653 1407234 1351606 1367225 1359906
14986 1359906 1412638 1395543 1422239 1441151 1457651 1393442 1338768 1331404 1357696 1381219 1402141
14975 1402141 1417372 1439473 1399061 1418137 1383876 1370468 1382424 1402162 1390142 1410244 1388945
$$ [...]
##END NTUPLES=NMR SPECTRUM
##END=
