##TITLE=1H_DE-80H_X3
 200.13MHz, d2o
 8 sc
 
 19ns.26.2.2025
##JCAMPDX= 6.0         $$ Bruker NMR JCAMP-DX V2.0
##DATA TYPE= NMR SPECTRUM
##DATA CLASS= NTUPLES
##ORIGIN= UXNMR, Bruker Analytische Messtechnik GmbH
##OWNER= pz
$$ XWIN-NMR		Version 3.5
$$ Thu Dec 25 10:05:56 2025 Russian Standard Time (UT+4h)  Yarkov@DPX200
##.OBSERVE FREQUENCY= 200.1313
##.OBSERVE NUCLEUS= ^1H
##.ACQUISITION MODE= SIMULTANEOUS
##.ACQUISITION SCHEME= undefined
##.AVERAGES= 8
##.DIGITISER RES= 18
##SPECTROMETER/DATA SYSTEM= spect
##.PULSE SEQUENCE= zg30
##.SOLVENT NAME= CDCl3
##.SHIFT REFERENCE= (INTERNAL, CDCl3, 0, 15.456)
##AUDIT TRAIL= $$ (NUMBER, WHEN, WHO, WHERE, WHAT)
$$ ##TITLE= Audit trail, XWIN-NMR		Version 3.5
$$ ##JCAMPDX= 5.01
$$ ##ORIGIN= Bruker BioSpin GmbH
$$ ##OWNER= Yarkov
$$ C:/Bruker/XWIN-NMR/data/yarkov2/nmr/H-C/1/pdata/1/auditp.txt
$$ ##AUDIT TRAIL=  $$ (NUMBER, WHEN, WHO, WHERE, WHAT)
(   1,<2025-12-25 10:05:14.06 +0400>,<Yarkov>,<DPX200>,
      <created by zg, POWCHK disabled, PULCHK disabled
       configuration hash MD5:
       00 E9 B6 7A A2 85 ED C7 34 08 36 98 17 FE 4E 26
       data hash MD5: 16K
       51 67 92 15 84 D2 C5 3D AF 00 87 8A 54 F0 A4 CA>)
(   2,<2025-12-25 10:05:19.90 +0400>,<Yarkov>,<DPX200>,
      <Start of raw data processing
       efp BC_mod = 2 LB = 0.25 FT_mod = 6 PKNL = 1 PHC0 = -5299.955 PHC1 = 10.82193 SI = 16K 
       data hash MD5: 16K
       4F DA C0 5E 55 72 4E 73 FB F4 24 D8 A2 73 D5 F9>)
$$ ##END=
$$ 
$$ hash MD5
$$ 3F 55 25 DA 9F E5 07 2C 84 E5 7B 36 46 46 2B 5B
##$RELAX= 
##$RELAX= 
##$RELAX= 
##$RELAX= 
##$RELAX= 
##$RELAX= 
$$ Bruker specific parameters
$$ --------------------------
##$DU= <C:/Bruker/XWIN-NMR>
##$EXPNO= 1
##$NAME= <H-C>
##$PROCNO= 1
##$TYPE= <nmr>
##$USER= <yarkov2>
##$AMP= (0..31)
100 100 100 100 100 100 100 100 100 100 100 100 100 100 100 100 100 100 
100 100 100 100 100 100 100 100 100 100 100 100 100 100 
##$AQSEQ= 0
##$AQ_mod= 1
##$AUNM= <au_zg>
##$AUTOPOS= <>
##$BF1= 200.13
##$BF2= 200.13
##$BF3= 200.13
##$BF4= 200.13
##$BF5= 200.13
##$BF6= 200.13
##$BF7= 200.13
##$BF8= 200.13
##$BYTORDA= 1
##$CFDGTYP= 0
##$CFRGTYP= 5
##$CHEMSTR= <none>
##$CNST= (0..31)
1 1 145 1 1 1 1 1 1 1 1 1 1 1 1 1 1 1 1 1 1 1 1 1 1 1 1 1 1 1 1 1 
##$CPDPRG= <>
##$CPDPRG1= <>
##$CPDPRG2= <>
##$CPDPRG3= <>
##$CPDPRG4= <mlev>
##$CPDPRG5= <mlev>
##$CPDPRG6= <mlev>
##$CPDPRG7= <mlev>
##$CPDPRG8= <mlev>
##$CPDPRGB= <>
##$CPDPRGT= <>
##$D= (0..31)
0 0.7 0 0 0 0 0 0 0 0 0 0.03 0 0 0 0 0 0 0 0 0 0 0 0 0 0 0 0 0 0 0 0 
##$DATE= 1766642713
##$DBL= (0..7)
120 120 120 120 120 120 120 120 
##$DBP= (0..7)
150 150 150 150 150 150 150 150 
##$DBP07= 0
##$DBPNAM0= <>
##$DBPNAM1= <>
##$DBPNAM2= <>
##$DBPNAM3= <>
##$DBPNAM4= <>
##$DBPNAM5= <>
##$DBPNAM6= <>
##$DBPNAM7= <>
##$DBPOAL= (0..7)
0.5 0.5 0.5 0.5 0.5 0.5 0.5 0.5 
##$DBPOFFS= (0..7)
0 0 0 0 0 0 0 0 
##$DE= 6
##$DECBNUC= <off>
##$DECIM= 32
##$DECNUC= <off>
##$DECSTAT= 4
##$DIGMOD= 1
##$DIGTYP= 9
##$DL= (0..7)
0 120 120 120 120 120 120 120 
##$DP= (0..7)
$$ [...]
##$SUBNAM2= <"">
##$SUBNAM3= <"">
##$SUBNAM4= <"">
##$SUBNAM5= <"">
##$SUBNAM6= <"">
##$SUBNAM7= <"">
##$SUBNAM8= <"">
##$SUBNAM9= <"">
##$SW= 18.0517328524113
##$SWIBOX= (0..15)
0 0 2 0 0 0 0 0 0 0 0 0 0 0 0 0 
##$SW_h= 3612.71676300578
##$TD= 16384
##$TD0= 1
##$TE= 0
##$TE2= 300
##$TE3= 300
##$TEG= 300
##$TL= (0..7)
0 120 120 120 120 120 120 120 
##$TP= (0..7)
150 150 150 150 150 150 150 150 
##$TP07= 0
##$TPNAME0= <>
##$TPNAME1= <>
##$TPNAME2= <>
##$TPNAME3= <>
##$TPNAME4= <>
##$TPNAME5= <>
##$TPNAME6= <>
##$TPNAME7= <>
##$TPOAL= (0..7)
0.5 0.5 0.5 0.5 0.5 0.5 0.5 0.5 
##$TPOFFS= (0..7)
0 0 0 0 0 0 0 0 
##$TUNHIN= 0
##$TUNHOUT= 0
##$TUNXOUT= 0
##$USERA1= <user>
##$USERA2= <user>
##$USERA3= <user>
##$USERA4= <user>
##$USERA5= <user>
##$V9= 5
##$VALIST= <valist>
##$VCLIST= <CCCCCCCCCCCCCCC>
##$VD= 0
##$VDLIST= <DDDDDDDDDDDDDDD>
##$VPLIST= <PPPPPPPPPPPPPPP>
##$VTLIST= <TTTTTTTTTTTTTTT>
##$WBST= 1024
##$WBSW= 4
##$XGAIN= (0..3)
0 0 0 0 
##$XL= 0
##$YL= 0
##$YMAX_a= 329884
##$YMIN_a= -200817
##$ZGOPTNS= <>
##$ZL1= 120
##$ZL2= 120
##$ZL3= 120
##$ZL4= 120
##$ABSF1= 0
##$ABSF2= 0
##$ABSG= 0
##$ABSL= 0
##$ALPHA= 0
##$AQORDER= 0
##$ASSFAC= 0
##$ASSFACI= 0
##$ASSFACX= 0
##$ASSWID= 0
##$AUNMP= <proc_1d>
##$AZFE= 0.1
##$AZFW= 0.1
##$BCFW= 0
##$BC_mod= 2
##$BYTORDP= 0
##$COROFFS= 0
##$CY= -3
##$DATMOD= 1
##$DC= 0
##$DFILT= <>
##$DTYPP= 0
##$F1P= 0
##$F2P= 0
##$FCOR= 1
##$FTSIZE= 16384
##$FT_mod= 6
##$GAMMA= 0
##$GB= 0
##$INTBC= 1
##$INTSCL= 3.241238e-09
##$ISEN= 128
##$LB= 0.25
##$LEV0= 0
##$LPBIN= 0
##$MAXI= 10000
##$MC2= 0
##$MEAN= 0
##$ME_mod= 0
##$MI= 1.114404
##$NCOEF= 0
##$NC_proc= -7
##$NLEV= 6
##$NOISF1= 3.799351
##$NOISF2= 2.8
##$NSP= 0
##$NTH_PI= 0
##$NZP= 0
##$OFFSET= 15.45601
##$PC= 1
##$PHC0= -5299.955
##$PHC1= 10.82193
##$PH_mod= 1
##$PKNL= yes
##$PPARMOD= 0
##$PSCAL= 0
##$PSIGN= 0
##$REVERSE= no
##$SF= 200.13001314686
##$SI= 16384
##$SIGF1= 3
##$SIGF2= 2
##$SINO= 0.751879
##$SIOLD= 32768
##$SREGLST= <19F.Aceton>
##$SSB= 0
##$STSI= 16384
##$STSR= 0
##$SW_p= 3612.71676300578
##$SYMM= 0
##$S_DEV= 0
##$TDeff= 16384
##$TDoff= 0
##$TI= <>
##$TILT= no
##$TM1= 0
##$TM2= 0
##$TOPLEV= 0
##$USERP1= <user>
##$USERP2= <user>
##$USERP3= <user>
##$USERP4= <user>
##$USERP5= <user>
##$WDW= 1
##$XDIM= 16384
##$YMAX_p= 388654857
##$YMIN_p= -1591991
$$ End of Bruker specific parameters
$$ ---------------------------------
##NTUPLES= NMR SPECTRUM
##VAR_NAME=  FREQUENCY,     SPECTRUM/REAL,   SPECTRUM/IMAG
##SYMBOL=    X,             R,               I
##VAR_TYPE=  INDEPENDENT,   DEPENDENT,       DEPENDENT
##VAR_FORM=  AFFN,          ASDF,            ASDF
##VAR_DIM=   16384,         16384,           16384
##UNITS=     HZ,            ARBITRARY UNITS, ARBITRARY UNITS
##FACTOR=    0.220516191357247, 1,           1
##FIRST=     3093.21145744185, 0,            0
##LAST=      -519.505305563932, 0,           0
##MIN=       -519.505305563932, -1591991,    0
##MAX=       3093.21145744185, 388654857,    0
$$ Real data points
##PAGE= N=1
##DATA TABLE= (X++(R..R)), XYDATA
$$ [...]
11873b73225K08988j87643k87223N52149N11421k97403j43589P926k24158J07780
11863b4977J13963J83060k50751m44823K08708J12101m4417L21678K08725n96672
11853b13405m27700N28776N32260k49889m04456K6515J03062J89412L47577k66843
11843A65309k29419l206J71593J05905k14716J03683M5274o4965j17301k06814
11833b44657k3443M60833m5641j14962J6712K7389K33962l30003n2825j34187
11823b06822l36710L01298M72045k08608k38179R5083K14149K28508l83561r9898
11813a62695l4385l63260K14900N75582L32649j73665m57572J2673M52453k50581
11803A46099k93982j33733j92266K86586K93160K79222k84025o33919K09765M36405
$$ y = [-273225, -64237, -251880, -539103, 13046, 524467, 227064, 83475, 91401, -132757, -24977, 88986, 272046, 21295, -423528, -214820, -102719, -147136, 174542, 383267, -213405, -641105, -112329, 419931, 170042, -234414, -207899, -104837, 84575, 432152, 165309, -64110, -67316, 104277, 210182, -4534, 99149, 144423, 79458, -37843, -244657, -268100, 192733, 147092, 32130, 48842, 76231, 310193, -19810, -72635, -206822, -543532, -242234, 229811, 21203, -216976, -121893, 92256, 320764, -62797, -162695, -197080, -560340, -345440, 230142, 562791, 389126, -68446, -55773, 396680, 146099, -147883, -281616, -473882, -187296, 105864, 385086, 101061, -532858, -323093, 113312]
11793A13312k22209o9997K46950L39271k80987n08453J50777j438j08435L19215
11783b1994L96407j99726l66170o5126L21512l34688l11672K12478L13471K79247
11773B23739j51725J0852k59036P4822P1091k42520J26014J93474j35924P9494
11763i719K07212J28092k23081r22245Q2294L29579J6134L59310J20568J04591
11753A92735q3632j47712J2860m1021j25670j3556j1687L56827j300k27790K06007
11742A16061l14942k24417J53011J24362M31698o3188n6598K80467k5976J33251
11732E53729l84811o48948k05315J43658K98239M00533J13633j59982l52619K6184
11722b15699K97304l10968m2700L35432J86128k66509m07959N72494O52832k94714
$$ y = [113312, -108897, -178894, 68056, 407327, 126340, -382113, -231336, -232774, -341209, -21994, 374413, 174687, -191483, -256609, 64903, -269785, -581457, -368979, -55508, 223739, 72014, 82866, -176170, -101348, -30257, -272777, -146763, 46711, -89213, -9719, 197493, 325585, 102504, -819741, -737447, -407868, -391734, -32424, 88144, 192735, 109103, -38609, -25749, -66770, -192440, -205996, -217683, 139144, 137844, -89946, 116061, -198881, -423298, -270287, -145925, 285773, 222585, 165987, 446454, 420478, 553729, 168918, -480030, -685345, -541687, -243448, 157085, 270718, 110736, -241883, -215699, 81605, -229363, -272063, 63369, 249497, -17012, -424971, 147523, 800355, 505641]
11712E05641o91264J61611J29525j56421R2799j46202j23916q8880N50191J23954
11702C57038k07028L41046L89944m86778l38811J87582J69534J11937o53632J25127
11692d041J03368k34800N57917N1050m78287Q0492M18493J69210j08092k52544
11682C02766J22341k10313p8108K44873P0559M81896k32267n01125r4999r2965
11672A2658O4876k50403q9712L51561k0667J68600N18278r23l65812l69504L37811
11661C56763p6766o81791M97842L38452j42367k89787K7197J36541l28010p4195
11651b36121J61116J59356K21209L81124k62484k02655K91421J74928m02507o19275
11641c33888L77220N7178J29981P7165j57917q75K51470K12949n05340j66415
$$ y = [505641, -185623, -24012, 105513, -50908, 41891, -104311, -228227, -317107, 233084, 357038, 150010, 491056, 881000, 394222, 55411, 242993, 412527, 524464, -129168, -4041, 99327, -135473, 422444, 473494, -4793, 75699, 494192, 663402, 555310, 302766, 425107, 214794, 136686, 381559, 452118, 934014, 701747, 200622, 105623, 12658, 77534, -172869, -262581, 88980, 68313, 236913, 755191, 754268, 388456, 18952, 356763, 279997, -401794, 96048, 434500, 292133, 2346, 29543, 166084, -161926, -236121, -75005, 84351, 305560, 686684, 424200, 221545, 512966, 687894, 285387, -333888, 43332, 100510, 230491, 307656, 149739, 148864, 400334, 613283, 107943, -58472]
11631e8472M05370r789m67249K54790K84091q805k3095k7558K22343m67002k379
11620A02245O97540l87803n54029k46353j04259K42634N75628K01810l62367o98063
11610e33017L60928J031741L9920l12926p20136j76760L03369o4424k03422J44228
11600a30499L71172j94046K5879K38686L67766n22353l99221K77822P1362J2428
11590A18996J63635L12635j10905J3695k12535l67332k31636L96142L46420m24372
11580D743j2777J14976M21942P5884k54342k21794L8873L65344J70826j05332
11570E98343m60946j36338M46050J39770o36926o8441M07831J72124J42969k74517
11560C29919n2831K27246J33882k876j43796Q2476l49507P4791K8858n2402K55000
$$ y = [-58472, 346898, 337109, -130140, 124650, 408741, 399936, 376841, 349283, 571626, 104624, 102245, 799785, 411982, -142047, -388400, -492659, -250025, 325603, 527413, 165046, -533017, -172089, 859652, 899572, 586646, -133490, -310250, -6881, -71305, -274727, -130499, 240673, 46627, 72506, 311192, 678958, 156605, -242616, 35206, 106568, 118996, 282631, 595266, 484361, 498056, 285521, -81811, -313447, 82695, 429115, 4743, -8034, 106942, 528884, 604768, 350426, 128632, 167505, 532849, 703675, 598343, 137397, 1059, 447109, 586879, -50047, -118488, 289343, 461467, 604436, 329919, 277088, 504334, 638216, 635340, 491544, 574020, 224513, 299304, 328162, 275760, 530760]
11549E30760n9562J66668J19485j10167K24151o05118n45492L30080K89405J92792
11539E33002K84360k03756J4508N1093K46974n6979p00806j117n951K05336M24119
11528G90783o1004n96877J4685M16467P457l57227k3808M5022M22982L01594k35331
11517G24743j82297j58712P28569n7594o57683r3861J67323M38138m20795l82214
11507A05617L66344K86457r1353J5735k08792M36154J12332k92473J51300k70159
11497F11162O8556k17283k84398M89842l1015j25620L52310M3311P0685o0596
11487I16954l71603M2510m89757Q9581M92570k88482M5506L63486k4545j50626
11477F25594K01056j10922l59905j37589J86670J94187j2252J55646J42401m46078
$$ y = [530760, 471198, 637866, 757351, 647184, 871335, 266217, -279275, 50805, 340210, 533002, 817362, 613606, 628114, 679207, 926181, 869202, 168396, 167279, 161328, 366664, 790783, 729779, 132902, 147587, 564054, 571511, 214284, 190476, 235498, 658480, 960074, 724743, 542446, 383734, 1112303, 1054709, 397026, 303165, 470488, 908626, 487831, 105617, 471961, 758418, 667065, 682800, 474008, 910162, 1022494, 730021, 881321, 611162, 679718, 462435, 178037, 667879, 636864, 511244, 863554, 906865, 977550, 916954, 545351, 587861, 98104, 187685, 680255, 391773, 437279, 800765, 776220, 625594, 826650, 715728, 355823, 218234, 404904, 599091, 586839, 742485, 884886, 438808]
11467D38808k85204n9236r1736K74454K35712j78203Q9706J17285K95611o5515
11457G71682n63835k6223J1704K66003L51608j40944K07877J60222j44268o74257
11447B19569j30934L77639K80559j08751K83139M84428j9303k1399k07785J3346
11437A170508l80229m00722N6500K6482J6983O60883L15194n24275k93897J4207
11427F61634K84916J56934m13833j41347m8972K43855M64950r3761k16575m24944
11417D72857j34386M56913R8073l81489j19232J70675J95587J08784J20967L3384
11407A022133l42428k21642N28399K54151J3225k19902l63532o4791K26328j62805
11397F69136k13005K7828L25724K08728l55995L65596J41106j75786J40258M2513
$$ y = [438808, 153604, 94368, 2632, 277086, 512798, 334595, 424301, 541586, 837197, 771682, 207847, 181624, 193328, 459331, 810939, 669995, 877872, 1038094, 893826, 219569, 88635, 466274, 746833, 638082, 921221, 1405649, 1386346, 1364947, 1157162, 1170508, 790279, 389557, 446057, 472539, 489522, 1150405, 1465599, 941324, 647427, 661634, 946550, 1103484, 689651, 548304, 499332, 743187, 1208137, 1114376, 897801, 472857, 338471, 795384, 893457, 511968, 392736, 563411, 758998, 867782, 988749, 1022133, 679705, 458063, 986462, 1240613, 1253838, 1033936, 670404, 605613, 831941, 669136, 456131, 483959, 809683, 1018411, 662416, 1028012, 1169118, 993332, 1133590, 1176103]
11387A176103r1024K16241k6544l42338k88724J8670L17252j42568n39522k04081
11377I3465M68564M66836j22749k59935N48947K06236k79072M7367m85812n81428
11367A02419j56743M12584L19031n8790m2654M17330l8695k85177j49366n26552
11357f613J3550M53356L61915k5240j36230k91791J05264O34267n64698m25300
11347A18480L41882K14300j43855P9758Q1534k34152k49220L85402J26746m30461
11337B90414K97906K66548q4736k59647j29322M78821J2108p03j45446m72965
11327B52978Q7399L96187K04729m08241k34040K18168j50953O1003M18180j66601
11317F78809k08171j72395J47673N58025J30718k46400k88672j51941J55451q5129
$$ y = [1176103, 1085079, 1301320, 1274776, 932438, 643714, 662384, 979636, 837068, 297546, 93465, 562029, 1028865, 906116, 646181, 1195128, 1401364, 1122292, 1169659, 683847, 102419, -54324, 358260, 677291, 618501, 575847, 993177, 954482, 669305, 519939, -6613, 6937, 460293, 822208, 796968, 660738, 368947, 474211, 1108478, 543780, 118480, 460362, 674662, 530807, 610565, 692099, 457947, 208727, 594129, 720875, 290414, 588320, 854868, 770132, 510485, 381163, 859984, 872092, 871389, 725943, 252978, 340377, 736564, 941293, 533052, 299012, 517180, 366227, 427230, 845410, 678809, 470638, 298243, 445916, 1003941, 1134659, 888259, 599587, 447646, 603097, 517968]
11307E17968K17894j72206k95294K28942j00440n7229K10903O1367M3202K63768
11297I18875J3841N6496J72295j80384l73520L02619M58296l81904p3295j13202
11287H00117M79698J79657o4102J43208K96416J97413j04501o2831L33204M47318
11277B645597m47417m69971j36916N78443p7948k90357k9530j86662L4853K48492
11267A868584M20748j24646k37426l13822k52486K86079N07463j50645n21261
11258A482588l14997k39620N58117K7775k23564k3467K79564N44082j65782p27589
11248A197107m64973P28806L29985m35280J19589K78994n1705j43937k55721k83375
11238A019490n00434J97163N17792P1699K43813O7l22108J72873o1770k81088
$$ y = [517968, 735862, 563656, 268362, 497304, 396864, 339635, 550538, 611905, 655107, 918875, 932716, 989212, 1161507, 981123, 607603, 910222, 1368518, 986614, 913319, 800117, 1279815, 1459472, 1395370, 1538578, 1834994, 2032407, 1927906, 1865075, 2198279, 2645597, 2198180, 1728209, 1591293, 2169736, 2091788, 1801431, 1771901, 1585239, 1620092, 1868584, 2289332, 2164686, 1927260, 1613438, 1360952, 1647031, 2154494, 2003849, 1482588, 1167591, 927971, 1486088, 1513863, 1290299, 1266832, 1546396, 2090478, 1924696, 1197107, 732134, 1460940, 1790925, 1355645, 1475234, 1754228, 1702523, 1558586, 1302865, 1019490, 519056, 716219, 1234011, 1305710, 1549523, 1549590, 1227482, 1400355, 1338585, 1057497]
11228A057497j26274l61924N20630P323k49349M54233j0613l36175j627M63569
11218A417290J61669o9278k10498j94969m18057L63839J85422l70038J53966o8145
11208I51201J10282r0097p9473J04519M79014l23980m62907M24066J91596K9437
11198A333658m37257k48399M18016M94695m00356n75602m86841j8561N80880K39424
11188H99657K28044l69506n6075K62313L7828n0030P0841k03115k18566n0965
11178E50426J07683N52426m35139l17076L22257k15885P562L18768J62667K28930
11168A282619J75779k31700j60653Q6491Q3647n9141l83835r5455J02686P9463
11158H79901M09846J53044Q4145j06256l89318K69605m4054m53813o387N1581
$$ y = [1057497, 931223, 569299, 1089929, 1097252, 847903, 1302136, 1291523, 955348, 953721, 1417290, 1578959, 1509681, 1299183, 1104214, 686157, 1049996, 1235418, 865380, 1019346, 951201, 1061483, 971386, 891913, 996432, 1475446, 1151466, 688559, 1112625, 1304221, 1333658, 896401, 648002, 1066018, 1560713, 1160357, 584755, 97914, 79353, 660233, 899657, 1127701, 758195, 702120, 964433, 1002261, 952231, 1023072, 819957, 601391, 550426, 658109, 1210535, 775396, 458320, 780577, 564692, 572254, 891022, 1053689, 1282619, 1458398, 1226698, 1066045, 1152536, 1236183, 1177042, 793207, 697752, 800438, 879901, 1289747, 1442791, 1526936, 1420680, 1031362, 1300967, 1256913, 803100, 796713, 848294]
11148H48294J30748N10291K24232Q1360n40621j13356K20925j54395j57027m6635
11138A003816P05148J92967o29014J02319O59562j14006m902l04557m16150p4661
11128A120522M07015N91319l38612k07670J48137L38711R6938k99388O0574j34180
11118A783366j03000J22075K46488Q7886K9676o301R5420m33805K48861P08390
11108B779056m84289R6149q562j1844K53097m70947m0221J63909n61745L78484
11098B093087o8933l97906M02441J02614K98593K522k3669K8851m12693m2391
11088A982516j26615m4001K64790m73284p2555J7861L04432M40155l27525n114
11078A960660K16862j04707N3156j5301J75870K09261l29073J19457Q6795n26616
$$ y = [848294, 979042, 1489333, 1713565, 1794925, 1254304, 1140948, 1361873, 1207478, 1050451, 1003816, 1708964, 1901931, 1272917, 1375236, 2034798, 1920792, 1915890, 1611333, 1195183, 1120522, 1527537, 2118856, 1780244, 1572574, 1720711, 2059422, 2156360, 1856972, 1917546, 1783366, 1680366, 1802441, 2048929, 2136815, 2166491, 2160190, 2255610, 1821805, 2070666, 2779056, 2294767, 2390916, 2382354, 2370510, 2623607, 2152660, 2112439, 2276348, 1714603, 2093087, 2024154, 1626248, 2028689, 2131303, 2429896, 2432418, 2408749, 2437600, 2024907, 1982516, 1855901, 1811900, 2076690, 1603406, 1530851, 1548712, 1853144, 2293299, 1965774, 1960660, 2177522, 2072815, 2125971, 2110670, 2286540, 2495801, 2166728, 2286185, 2372980, 1846364]
11068A846364K79948L9990j27141J06221j32199j49498L03563L43200J77623M01900
11058C089971M8025L2629k32108j45278n310l34461k02575M54945L6204k98642
11048B443400k50624K03538N58369L7316N63986M73626m35714j30759L49929M32749
11038D245816m31689j64275K3918L91532M02675L5163L18246M99476K4357M85900
11028E831119P01583j08406O2786O26213J066483M84789K02715L55581O66235
11019I889098Q13497R81012R14767J010362J217333J063141J441503J803611J994092
11010B1128416J901026J482044P40258P81622R87743K22590k57933m68329o65816
11001B5851621q63199j567405j559446j520234j525056j036473j303064j676526
$$ y = [1846364, 2126312, 2166302, 2039161, 2145382, 2013183, 1863685, 2167248, 2510448, 2688071, 3089971, 3137996, 3170625, 2938517, 2793239, 2787929, 2453468, 2250893, 2705838, 2742042, 2443400, 2192776, 2396314, 2954683, 2991999, 3555985, 4029611, 3593897, 3463138, 3813067, 4245816, 3814127, 3649852, 3673770, 4065302, 4467977, 4503140, 4821386, 5320862, 5345219, 5831119, 6532702, 6424296, 6487082, 7113295, 8179778, 8664567, 8867282, 9222863, 9889098, 10702595, 11683607, 12598374, 13608736, 14826069, 15889210, 17330713, 19134324, 21128416, 23029442, 24511486, 25251744, 26033366, 27021109, 27243699, 26985766, 26517437, 25851621, 24988422, 23421017, 21861571, 20341337, 18816281, 17779808, 16476744, 14800218]
10993A4800218j201572n15813r04915j539994l75881p8885q72116p86522m41870
10984H082650k16027p28813j093511J53212K93457n27990k79982m44087O2110
10975E301019m83316k64570K13335m59383o31350l6490l49034J7075M96003J62654
10965C965943l67658m98103K5933n5744k30448j88999k137o1666k56350L9147
10955B369918k07176n8150L69989k15855m61745L50365M85292K07012o08348m72796
10945A758506K22793j94746K6401l66253k69866L03376L1038K02437K91454k29332
10935A775808j07815j91030M8856J31946l02260k05493m2353L87838L27767l39578
10925A483686J69875l31475m67134L84952J18998r7024l02814j20561L81635p2503
$$ y = [14800218, 13598646, 13082833, 12177918, 10637924, 10262043, 10183158, 9311042, 8524520, 8082650, 7866623, 7137810, 6044299, 6197511, 6490968, 5962978, 5682996, 5238909, 5301019, 4817703, 4553133, 4766468, 4307085, 3675735, 3639245, 3290211, 3307286, 3803289, 3965943, 3598285, 3100182, 3126115, 3070371, 2839923, 2650924, 2648787, 2587121, 2330771, 2369918, 2162742, 2104592, 2474581, 2258726, 1796981, 2147346, 2632638, 2839650, 2231302, 1758506, 1981299, 1786553, 1812954, 1446701, 1176835, 1480211, 1511249, 1713686, 2005140, 1775808, 1667993, 1476963, 1525819, 1657765, 1355505, 1150012, 1107659, 1495497, 1823264, 1483686, 1653561, 1322086, 854952, 1239904, 1358902, 1261878, 959064, 838503, 1220138, 1147635]
10915A147635L17377K46931k56747k12621M1249J62155l85118l70880N05817Q571
10905A204369l53422N82736L02785K7256k75658n6363J09165m15478J54391P2732
10895A352513m16683K6788J06807L29703j42911o29998M40382j3829l48544N89540
10885A293768K27428m30713k76205O9308j03760q8713j24606O6339L4433Q2507
10875G49786R3246j13280K96105L1689j62407P9584j15277j82122K8495R864J96203
10864I11886Q6873j96173J63774j10947l33163R0168L77704K070j61334J77957
10854A008815p4137k68737K88577K73525l00635j32650K99019l4934l79348P529
10844F87024L88951K2439l01860J67898J04124l00591n5192N04687K74298k11182
$$ y = [1147635, 1465012, 1711943, 1455196, 1242575, 1283824, 1445979, 1060861, 689981, 1195798, 1204369, 850947, 1433683, 1736468, 1763724, 1488066, 1431703, 1540868, 1125390, 1279781, 1352513, 935830, 962618, 1069425, 1399128, 1256217, 626219, 1066601, 1052772, 704228, 1293768, 1521196, 1090483, 814278, 883586, 779826, 691113, 566507, 632846, 667279, 749786, 843032, 729752, 1025857, 1057546, 895139, 974723, 859446, 677324, 705819, 715683, 911886, 998759, 802586, 966360, 855413, 522250, 612418, 990122, 992192, 830858, 1008815, 934678, 665941, 954518, 1228043, 927408, 794758, 1093777, 1058843, 679495, 687024, 1075975, 1098414, 796554, 964452, 1068576, 767985, 712793, 1217480, 1491778, 1280596]
10834A280596N8548k82008J85874K09589j67563k62094l26960K48833J04835m21641
10824F28009j07324L55726K09773L57656q1059j23386k49384l1846N50264k64725
10814A243704k39224k44862K72439L0401j78568K05051j4097Q2667k48887k96764
10804F11860J78806M55088J74918M41062r7018m06907k94318J40539k79340n27826
10794C96864K99110Q67775N15189n06461p14795L16186K00362l91534K41365J9306
10784A243367k10692K70417M11065J85566j95617J07383k06004n51442J58124
10775A212167K45860r197P4684M4957L87419K24912J59853P5291j6027o6653m88156
10764A845110N49801M98520l9683J47001K9483L33548K36468m40050J45864n0635
$$ y = [1280596, 1339144, 1057136, 1243010, 1452599, 1285036, 1022942, 695982, 944815, 1049650, 628009, 520685, 876411, 1086184, 1443840, 1362781, 1239395, 990011, 958165, 1508429, 1243704, 1004480, 759618, 1032057, 1062458, 883890, 1088941, 1074844, 1157511, 908624, 611860, 790666, 1245754, 1420672, 1861734, 1764716, 1357809, 1063491, 1204030, 924690, 396864, 695974, 1563749, 2078938, 1572477, 857682, 1173868, 1374230, 982696, 1224061, 1243367, 1032675, 1303092, 1714157, 1899723, 1704106, 1811489, 1605485, 1054043, 1212167, 1458027, 1448830, 1523514, 1568471, 1955890, 2180802, 2340655, 2415946, 2399919, 2333266, 1845110, 2394911, 2893431, 2853748, 3000749, 3030232, 3363780, 3600248, 3160198, 3306062, 3255427]
10754C255427k26639L83844k293r6069k38145j01914N18324K404j51965q3019
10744C259955K08494J09280J96796K20303k68335j71064Q8170L32815M12262k53297
10734D135379J06082O26146j73493J043813J124472N06071P87154J75909O03665
10725H935198J070718Q18483Q41149L90079P88376J425365P05158J023570J94525
10716A6192621r22096q30359j176067m25751p15138j265412j246941r25861k08480
10707H476516k21999o58131j078740p87321k33177o94813o24503m4007j22470
10698D011355l1270k48643o02966j3395o2769k16207k3371k93696J88517J1309
10688B718864m88536m81209l7595J88171j39968k46771R0276K28254l834J14410
$$ y = [3255427, 3028788, 3412632, 3410339, 3314270, 3076125, 2974211, 3492535, 3494939, 3342974, 3259955, 3468449, 3577729, 3774525, 3994828, 3726493, 3555429, 3643599, 3976414, 4388676, 4135379, 4241461, 4867607, 4694114, 5737927, 6862399, 7368470, 8155624, 8331533, 8935198, 10005916, 10824399, 11665548, 12055627, 12844003, 14269368, 14974526, 15998096, 16192621, 15270525, 14440166, 13264099, 12838348, 12123210, 10857798, 9610857, 8684996, 8476516, 8254517, 7596386, 6517646, 5730325, 5497148, 4802335, 4177832, 4133825, 4011355, 3980085, 3731442, 3128476, 3115081, 3052312, 2836105, 2812734, 2519038, 2707555, 2718864, 2230328, 1749119, 1711524, 1899695, 1759727, 1512956, 1603232, 1831486, 1827652, 1942062]
10678A942062l68636r7601L66423o71047l63805K87464M86712J62899m80245J05551
10668A369777K7949n07792m5918r0899L8411M71898j67830J69335k52262n74628
10658D38041K95414M79640L40299k32817o40985j35318L15760k7705r4425k52717
10648D85187j44720r1566R8743J88152P4423L66204K78493q1542l37381m94101
10638C41892n1746L39347L0703l97426J02532M60545n629l80353J10381K37684
10628G87930L177j78947k95955M83949K87932k09689o94725m9610L11033k22800
10618B22295p1081L14802L29515O803k10007m04879p3380J31233M57784J1603
10608G14688k49307Q2383J40251j01572l84045j57948K45793N73323K57453k53262
$$ y = [1942062, 1573426, 1475825, 1842248, 1171201, 807396, 1094860, 1581572, 1744471, 1264226, 1369777, 1397726, 889934, 844016, 753117, 791528, 1263426, 1095596, 1264931, 1012669, 438041, 733455, 1213095, 1553394, 1320577, 679592, 544274, 860034, 832329, 737904, 485187, 340467, 248901, 347644, 535796, 610219, 976423, 1254916, 1173374, 835993, 341892, 290146, 629493, 660196, 262770, 365302, 825847, 820218, 439865, 550246, 787930, 791107, 612160, 316205, 800154, 1088086, 878397, 183672, 134062, 445095, 222295, 151214, 466016, 795531, 802334, 592327, 187448, 114068, 245301, 703085, 714688, 465381, 547764, 688015, 586443, 202398, 44450, 290243, 863566, 1121019, 867757]
10598H67757R4387N11437M6527k79007j28935L12088N7051N9176J38443p745M60925
10587B132104P8308J13826M92799J09961l43601l37629j990P5998l57097k22487
10577A740192l42220m92963N25894L31762m0179p78297k91063M63525k51228k89099
10567E76324J0037n4149j54615R5000K60842L43023l21823l42064l06499l08829
10557b02753P7842N6261K05201K0407K13806M0254L89012k63643o67035K50672
10547A20024K18910k18425k04960P9946Q4586j02580r0597N80542j40262m49750
10537a22566K28491J24860K88221j91849k80182K92984m47931k59935J52265J39628
10527g6014L91369J85950j09363n7940k71148M010L0638l36191N0127J72484J05223
$$ y = [867757, 962144, 1473581, 1520108, 1241101, 1112166, 1424254, 1481305, 1540481, 1678924, 1671179, 2132104, 2210412, 2324238, 2817037, 2926998, 2583397, 2245768, 2243778, 2319776, 1962679, 1740192, 1397972, 905009, 1430903, 1762665, 1722486, 944189, 653126, 1116651, 865423, 576324, 586361, 532212, 377597, 472597, 733439, 1076462, 754639, 412575, 106076, -202753, -124911, -68650, 136551, 156958, 370764, 411018, 800030, 536387, -130648, 120024, 338934, 120509, -84451, -4505, 80081, -22499, -113096, 467446, 327184, -122566, 105925, 230785, 519006, 327157, 46975, 339959, -107972, -367907, -215642, -76014, 315355, 501305, 391942, 334002, 62854, 66864, 97502, -238689, -188562, -16078, 89145]
10516H9145R781R4780j20569J6782M54049o0955k98439k19730k73445O9155J90233
10505d9213L51446j16722n02410R730L42699K2348M25530K56411l87946j63403
10495A88470m72211L66312p5266m48003J19156J77760K57243M30521J87366k60943
10485D70405j91278n97373J98810J85754m2762l3628k05393L63757K9843j71234
10475F901n861J12381R0312P3455l33436l0601J6481o9067J34449p310J25625
10464A13329J25388J52683n5135k95664K14349r7478l50055L63344K6635l12965
10454a15569J27818j08403L84147r6441m86842N15504J17584j73881l31576j35831
10444c03490L14203p6987P1272N9951l12909J06035L61271J41715k79292k02440
$$ y = [89145, 98926, 193706, 73137, 89919, 543968, 483013, 184574, -35156, -308601, -239446, -49213, 302233, 185511, -316899, -307169, 35530, 57878, 483408, 739819, 351873, 188470, -283741, 82571, 7305, -440698, -321542, -143782, 113461, 543982, 731348, 470405, 279127, -318246, -119436, 66318, 23556, -10072, -215465, 148292, 178135, 6901, 1040, 113421, 203733, 277188, -56248, -86849, -70368, -139435, -4986, -12296, 113329, 238717, 391400, 336265, 40601, 254950, 157472, -192583, 170761, 197396, -115569, 12249, -96154, 287993, 191552, -295290, 220214, 337798, 163917, -167659, -303490, 10713, -66274, 4998, 64949, -247960, -141925, 219346, 361061, 81769, -120671]
10434a20671J67434N30827K8078k89413m86160j87423o4600M8087L96352J67222
10424A89733K43635k77497J65738L18193l75293k19831o02375J00078K30400M6377
10414a80842j8523J12385q1994K09324Q4253Q1820N7994p28778J65658L51851
10404E3148L15215l11640m46831J44498j49517n4102J82498L47521N15154o4156
10394E31788q93287J22059L33460J43913j92502o77033N10580K93628j01299J8985
10384I0292N586j11035K18162j4439k85626K3825K7611J78198J90308k63784m68129
10373d09031M6972J57931R9292n4381L09373L33171l41115j72822j90114l79307
10363f00031L3049J11778O0225L41740n7312L45757K99842k40001l02685j84262
$$ y = [-120671, 46763, 577590, 605668, 316255, -169905, -357328, -421928, -373841, 22511, 189733, 433368, 155871, 321609, 639802, 264509, 44678, -557697, -457619, -227219, -180842, -199365, -86980, -168974, 40350, 124603, 206423, 264417, -464361, -298703, 53148, 368363, 56723, -390108, -245610, -395127, -449229, -266731, 80790, 595944, 531788, -361499, -239440, 94020, 237933, 45431, -631602, -121022, 172606, 71307, 90292, 95878, -15157, 203005, 188566, -97060, -73235, -45624, 132574, 322882, 59098, -409031, -362059, -204128, -104836, -159217, 150156, 483327, 142212, -30610, -220724, -600031, -566982, -455204, -394979, -53239, -110551, 235206, 535048, 295047, -7638, -191900]
10353a91900p9048j02567m05700K38873O69179L68017j61828n43004K27899L24594
10343C44515m88313n75996Q7191N53195O77685j11306q10611J80456J11337o2889
10333i4736j24122j68364K38736J14496J89940K77205n22209o26014P5942Q0131
10323e58995N30953O7655j88068n6026l01844L44826J29467m71790l44917L48536
10313e00203M91927n6794n69603l09032M00682M61163k371m21747L14133K75068
10303H3223J79914k98374m58218J07732j66093j10152K17454K57786K71147j05332
10293b0913r289j84795j75869N11533J68040j83189q5452j42780K8459j35265
10283b29520j64579K70686j16058l00645L34858K66167N23834k52240l54863J24387
$$ y = [-191900, -270948, -373515, -779215, -540342, 128837, 496854, 335026, -207978, 19921, 344515, -143798, -719794, -632603, -79408, 598277, 486971, -323640, -143184, -31847, -94736, -218858, -387222, -148486, -33990, 155950, 433155, -89054, -715068, -639126, -558995, -28042, 39613, -148455, -204481, -506325, -161499, -32032, -503822, -848739, -500203, -8276, -65070, -634673, -943705, -543023, -81860, -84231, -505978, -191845, 83223, 263137, -35237, -493455, -385723, -551816, -661968, -444514, -186728, 84419, -20913, -30202, -214997, -390866, 120667, 288707, 105518, 20066, -122714, -94255, -229520, -394099, -123413, -239471, -540116, -205258, 60909, 584743, 332503, -22360, 102027]
10273A02027q3656q4238j58147k43110K40713M28167J21372J70800m91642l68407
10263c66121K10975l7685j50329p9109L45687L03717l11903m96026L93246M04182
10253B16634J5391K28579j71192k52492m6585L41175l7406p06732l84767L43016
10243d54379J08400K96462M89896J55326J75213j11223l47512k79700j95825m3481
10233b06823p2077j19281J33684J42832K04617p1836j03351M04259q928m27445
10223a24349l14173L4061K31550J84924j94818R173p2148L23155K45331m01438
10213g8732J79548N63742j69700p92905j86932K1341K6201l2742M86464L66335
10203C82620p3407J55718Q8945k30241k51946O5611r0913k36123k50453N28983
$$ y = [102027, 18371, -65867, -224014, -467124, -226411, 201756, 323128, 493928, 2286, -366121, -155146, -192831, -343160, -422269, -76582, 227135, -84768, -580794, -187548, 216634, 232025, 460604, 289412, 36920, -9665, 331510, 294104, -412628, -797395, -454379, -345979, -49517, 440379, 595705, 770918, 659695, 312183, 32483, -163342, -206823, -278900, -398181, -264497, -121665, 82952, 11116, -92235, 312024, 303096, -124349, -438522, -404461, -172911, 12013, -182805, -173632, -245780, 77375, 322706, -78732, 100816, 664558, 494858, -298047, -484979, -463638, -437437, -470179, 16285, 382620, 309213, 464931, 553876, 323635, 71689, 137300, 46387, -189736, -440189, 88794]
10193H8794M76023m17711j10655J80494J27930j50890j2241Q5531k04296l9346
10183B3633J55494m59867q4462N81998J53517K00101k71939k8646q3107l71341
10173a84619P1867k47829m47234N04300j50741j93598O39400K3066K51917j10455
10163A56074Q4224J84083p27455j04530L97019l79267k73297K05625j01359K22066
10153c36817N87962M87729k62219m50971J84878K78911n15285k65844O57567N5550
10143D21461l25256K4314J84425J79052k12637j80930j73795l88878O83857M85648
10133F97261m82855J62276J37915n1369q6046m00157j3014j37391m07490L75732
10123b05138K71853K8528J57459j59124k88241j93559L15384J56372k37502k97153
$$ y = [88794, 564817, 147106, 36451, 216945, 344875, 193985, 181744, 267275, 62979, 23633, 179127, -280740, -365202, 216796, 370313, 570414, 298475, 269829, 186722, -184619, -112752, -360581, -807815, -303515, -454256, -647854, -8454, 14612, 266529, 156074, 240298, 424381, -303074, -407604, -10585, -389852, -663149, -457524, -558883, -336817, 251145, 738874, 476655, 25684, 210562, 489473, -25812, -291656, 365911, 421461, 96205, 120519, 304944, 483996, 271359, 90429, -83366, -472244, 211613, 697261, 214406, 376682, 514597, 463228, 377182, -22975, -35989, -173380, -580870, -205138, 66715, 95243, 252702, 93578, -194663, -388222, -72838, 83534, -153968, -451121]
10113d51121K53741J59699K57288K96331l59912j75256J04993m12041k87055L76263
10103b37070M85572J80674o02631j09620K50896K93647M90113j47001m00437N582
10093B09725M35038K0805o82165j87694L80622j04338r9978M9048K68443N32653
10083H22159j05998l7137j85160r4884R0190j81783l52250K2813M04413J90775
10073E73138j09585k73912j2166p2760L15369K40302l4939k51781j65817L4638
10063B42487l06054J0258J0224q7006K66109q0505L07707J70442l64258J32323
10053C01727l40443j28622L84036j97898N7390m2041K82180Q70252K809n68323
10043F21067j27023j22402J72368l57549j92223K43757R6493K53513J18628K79897
$$ y = [-451121, -197380, -37681, 219607, 515938, 156026, -19230, 85763, -326278, -613333, -237070, 248502, 429176, -173455, -283075, -32179, 261468, 751581, 604580, 204143, 209725, 644763, 665568, -16597, -204291, 176331, 71993, -27985, 21063, 289506, 822159, 716161, 679024, 493864, 398980, 489170, 307387, -44863, -22050, 382363, 573138, 463553, 189641, 177475, 104715, 420084, 660386, 625447, 373666, 207849, 242487, -63567, -53309, -43085, -130091, 136018, 55513, 363220, 533662, 169404, 301727, -38716, -167338, 216698, 18800, 76190, 34149, 316329, 1186581, 1189390, 621067, 494044, 371642, 544010, 186461, -5762, 237995, 334488, 588001, 706629, 986526]
10033I86526J09541k29673m8000j06458r3210K83816l4307l19389l18302L68318
10023E98862P39539o39236P1592N75144p8995q5082j30723K35065m01959j007040
10013a22833p5744O39343J61568Q3162j36479L17766J04610j41628j18868k25712
10003D85185J35494m57132Q0147M19282k92593p9611J07115k0849Q2644k22817
9993B36865M33879K62643o04135K43098j32452J48247o7060n66799L25804K23146
9983E03236l23093Q5710Q6815L52490P1974k51617q1479m07540k563M9102P2452
9972A55487J83192o1517J05690l0997j176j13346m91034K42122K26139m72965
9962b58405M10806J07685L06848k19871n37946O75132p9078j51039L1522l13125
$$ y = [986526, 1096067, 866394, 818394, 711936, 618726, 902542, 868235, 548846, 230544, 598862, 1338401, 699165, 770757, 1345901, 1266906, 1181824, 1051101, 1286166, 884207, -122833, -198577, 440766, 602334, 685496, 549017, 866783, 971393, 829765, 710897, 485185, 620679, 163547, 243694, 662976, 370383, 290772, 397887, 377038, 459682, 236865, 670744, 933387, 329252, 572350, 439898, 588145, 521085, -45714, 280090, 503236, 180143, 265853, 352668, 705158, 777132, 525515, 444036, 36496, 33933, 83035, 155487, 338679, 277162, 382852, 351855, 350679, 237333, -253701, -11579, 214560, -258405, 152401, 260086, 566934, 347063, -190883, 484249, 405171, 254132, 285654, -27471]
9952b7471K20551L38017k93240K23832m39549r8409J01239m6961Q11300r7827
9942F91482m6166k30013j35515L78105M4684j08089j94257k72965L62258L71112
9932H60636l92177j38147k28152J83944K80430j34098K07463j54980r8867L09775
9922F95827k79188k51434J64295m0349J93579k60760K576M19217r4087j24070
9912D25606j28995k54707K42275J21563l86021J69534J75475p245j91817K61755
9902D27423L03400k3095l58679J095j78577k90120P52154K03242n379K99769L71359
9891A502592R5839l4147j45588p1938J06996j67260K77862j86495q9583j11438
9881A176840n55551J26441M53002L3420j21613n247R967J50666m13632m6376l37309
$$ y = [-27471, 193080, 531097, 237857, 461689, 22140, -76269, 24970, -21991, 789309, 691482, 645316, 415303, 279788, 657893, 702577, 594488, 400231, 127266, 489524, 860636, 468459, 330312, 102160, 286104, 566534, 432436, 639899, 484919, 386052, 695827, 416639, 165205, 329500, 289151, 482730, 221970, 224546, 643763, 549676, 425606, 296611, 41904, 284179, 405742, 19721, 189255, 364730, 357485, 165668, 427423, 730823, 707728, 349049, 350144, 171567, -118553, 633601, 836843, 831464, 1131233, 1502592, 1598431, 1564284, 1418696, 1346758, 1453754, 1286494, 1564356, 1377861, 1288278, 1176840, 621289, 747730, 1200732, 1234152, 1112539, 1107292, 1117259, 1267925, 854293, 807917, 470608]
9870D70608l84209K27260L58960M28238l7682R6594K38743l21686m4523L61313
9860A393616k95465K5929M23869J78473o29226j52763O19533r370o98937j70979
9850F84680K55356j6451Q4407j0088M8765k88648l2876m4078k62722J68931j49771
9839D37505p145K9652K54534k29982O3816J98217j22806m02976j5137K60517m7786
9828D18409K08837j34243O7160k62878J73421J38349k75512n34132J6843K76474
9818I2728N5497J87861j20822M35290l21471j66328o1541m4823O4265l04783k08739
9807c92866K15669M77265K0808j05229j69695j75771l47875M87351P50426n18722
9797B41361m82521M94947L81296m07219j70396j95850l07882k0202K09244L95330
$$ y = [470608, 86399, 313659, 672619, 1100857, 1063175, 1159769, 1398512, 1076826, 1032303, 1393616, 1098151, 1124080, 1547949, 1726422, 1097196, 944433, 1563966, 1554596, 855659, 684680, 940036, 923585, 1007992, 997904, 1046669, 758021, 725145, 681067, 418345, 587276, 437505, 430360, 460012, 714546, 484564, 548380, 746597, 623791, 220815, 205678, 466195, 418409, 627246, 493003, 560163, 297285, 470706, 609055, 333543, -200589, -183746, 92728, 148225, 336086, 215264, 650554, 329083, 162755, 101214, 56391, 120656, -184127, -392866, -177197, 300068, 320876, 215647, 45952, -129819, -477694, 9657, 760083, 241361, -241160, 253787, 635083, 227864, 57468, -138382, -446264, -466466, -257222, 138108]
9787A38108P3205K63462N94965r8003n60363l82779m1274J67060m20834j97079
9777d63532L96355O09196Q2615k78875j87145N6990l52545J99345N54463j84553
9767D32314m97789k36629O32094J80608k79945J60571J3629O8438j05058k324
9757C65909k23553j11235k58351m4910l97697P20429P49076l44444j51123j63672
9747A40429J76900n43892Q8248M77266n4320l93709K19178j75655k37708M62395
9737A59132J07418m9151l80231N92352K72327n71807j71569j86498K81052m04169
9727c51144n6516L85660J05924K32457L914k76106O13314j0327p79811k80905
9717d13540j22955N12513L1299n2683O77738l41051m9415L51018l19822L655k93385
$$ y = [138108, 211313, 474775, 1069740, 971737, 411374, 28595, -12679, 154381, -266453, -463532, -67177, 542019, 624634, 345759, 158614, 215604, -136941, 62404, 616867, 432314, -65475, -302104, 329990, 510598, 230653, 391224, 404853, 473291, 368233, 365909, 142356, 31121, -227230, -272140, -669837, 50592, 799668, 455224, 304101, 140429, 317329, -226563, -138315, 338951, 284631, -109078, 110100, -65555, -303263, 159132, 266550, 217399, -162832, 429520, 701847, 130040, -41529, -228027, 53025, -351144, -407660, -22000, 83924, 316381, 320295, 44189, 657503, 647176, -132635, -413540, -536495, -23982, 7317, -45366, 632372, 291321, 241906, 592924, 273102, 276757, -16628]
9706a6628J15805p2419l38987N06319M48050j15279M6355K51119k70869k74230
9696B79236j27407M84085k62200j58775M11402k75501k20115j48103K74772K77629
9686E35023j04249k93155K64603Q2583j33476m60855j86596O13910J23850J27460
9676E69098j48705j53262q0119R9421L09606l58002k07342Q7015L01475k14414
9666B04771j62550L15408L37469o00582l11633N48330J75786j53608j51187K35523
9656D37727Q5588k86460j79807R1205k91866P1043M54963L10378K56377m35895
9646E13253k62151J70934K16559p6900l01058m5143K23449j20440k0044P2830
9636C71289j6921k69328k63545N36461N36161q9239J85110q1563j006536l8765
$$ y = [-16628, 99177, 26758, -312229, 194090, 642140, 526861, 573216, 824335, 553466, 279236, 151829, 635914, 373714, 214939, 626341, 350840, 130725, -17378, 257394, 535023, 430774, 137619, 402222, 484805, 351329, -109526, -296122, 317788, 441638, 569098, 420393, 267131, 187012, 286433, 596039, 238037, 30695, 117710, 419185, 204771, 42221, 357629, 695098, 94516, -217117, 331213, 506999, 353391, 202204, 437727, 523315, 236855, 57048, 148253, -143613, -72570, 382393, 692771, 949148, 513253, 251102, 422036, 638595, 561695, 260637, 215494, 438943, 318503, 298459, 371289, 354368, 85040, -178505, 357956, 894117, 804878, 989988, 908425, -98111, -136876]
9626a36876M98526N13053o86696o47717N90914K98395j20683J97962l1495k04515
9616B70868j24060p2410P11088m09155m44299K81747k83243K31357J72999Q3079
9606D17971q9902j23433j32353K05052J94772n283j04396j81837K75800J24930
9596E81321K2349r1476m2465k26926L7751N93981L3098o76955m06272N81822M86697
9585H92925m31002p253L62570r2938K1555P4335k45113j01044K7478J83956L58402
9574A043871k67699k27273j04281J73505L9850J23835J88347k55991l37102k8298
9564C48764L94869J9304l82157j79907K47977P92538J02381q5206J9928j20334
9554A158157l31902j02532L71036L39282q4297J30554O21633j5787J44345J8413
$$ y = [-136876, 361650, 874703, 188007, -459710, 131204, 429599, 308916, 506878, 475383, 270868, 146808, 74398, 785486, 376331, -67968, 213779, -69464, 161893, 334892, 417971, 328069, 204636, 72283, 277335, 472107, 466824, 362428, 180591, 456391, 581321, 603670, 512194, 469729, 242803, 280554, 874535, 907633, 230678, -175594, 406228, 892925, 461923, 454670, 817240, 724302, 745857, 820192, 575079, 474035, 501513, 685469, 1043871, 776172, 548899, 444618, 618123, 657973, 781808, 970155, 714164, 377062, 348764, 743633, 762937, 380780, 200873, 448850, 1241388, 1343769, 1258563, 1278491, 1158157, 826255, 723723, 1094759, 1434041, 1349744, 1480298, 2101931, 2086144, 2230489, 2248902]
9544B248902K13444L76485m5139l41717l6941J72094L69630l13806o44603J13193
9534B111542j95388k8564o6485q34685j76755j2049L0008L91222M4146P9454P4122
9523A416568O0450j19741k37054j96536j75539l26276L01813N64121l63486o3592
9513H60728P61884J84855n30890m56047k51348M5020R984J67702K02092k66267
9503G27713L02934N70226l98307l31150k02136M87698r9827n35892j75964R0807
9493D36102J54910L05753J17305L07717P3513n65775K25095k7763k47076j39237
9483F40544j08468L74771L972j58053j45071q5895J19592j04838O5241P01017
9473A302812P1615m25323l2014P9606J04022n10379m12179n8833L57681N87963
$$ y = [2248902, 2462346, 2838831, 2793692, 2451975, 2415034, 2587128, 2956758, 2642952, 1998349, 2111542, 1916154, 1887590, 1821105, 986420, 809665, 797616, 827624, 1218846, 1262992, 1342446, 1416568, 1477018, 1357277, 1120223, 923687, 748148, 421872, 723685, 1287806, 924320, 860728, 1622612, 1807467, 1276577, 820530, 569182, 614202, 624186, 791888, 993980, 727713, 1030647, 1600873, 1202566, 871416, 669280, 1156978, 1057151, 521259, 345295, 436102, 591012, 896765, 1014070, 1321787, 1395300, 829525, 1054620, 1026857, 779781, 640544, 532076, 906847, 910819, 752766, 607695, 521800, 641392, 536554, 601795, 1302812, 1374427, 949104, 917090, 996696, 1100718, 590339, 178160, 119327, 477008, 1064971]
9463A064971j22573K8535j73230j14930L05517l4568k8165m02963n19540N45023
9453E48077L61860k41950J64137k9587L79425j46927n36168j31258j77514L38508
9443E28603j879q9868N79688L04527P3501j46602m89606n23099j42203k1858J09741
9432A80945J29342K45609M28972o4203m20050j64737L15831o0018l54010L14507
9422E52188N82017l12073p00166R3539M63014K6750n46045R2938K94618L19478
9412H66258O701j54968R6640J21011J1035k66811j32794L41151L39493j78575
9402A049141k25062K25557Q89970P04659m83602n15849m388N39460N4069o26570
9392A607385k34192l40178j64747J61675n10181p6665J32931O6463N57094K68906
$$ y = [1064971, 942398, 970933, 797703, 682773, 988290, 953722, 925557, 522594, 3054, 548077, 909937, 667987, 832124, 802537, 1181962, 1035035, 498867, 367609, 190095, 528603, 526724, 436856, 1016544, 1321071, 1394572, 1247970, 758364, 235265, 93062, 71204, 180945, 310287, 555896, 984868, 920665, 500615, 335878, 651709, 591691, 237681, 552188, 1134205, 822132, 121966, 215505, 678519, 705269, 159224, 252162, 546780, 866258, 872959, 717991, 814631, 935642, 946677, 679866, 547072, 888223, 1227716, 1049141, 824079, 1049636, 1939606, 2644265, 2160663, 1644814, 1640426, 2179886, 2233955, 1607385, 1373193, 1033015, 868268, 1029943, 519762, 443097, 576028, 642491, 1199585, 1468491]
9382A468491O253l18977m83005l02528j4635K00309q0732j11713L18727J81135
9372H63325k6187J1818q6882j70885j04265L61516R7655k44521k06899l29745
9362A64930K69281J74080J34645P1971k49967J78670O13993k98659k17093k43948
9352E97903o8503J39022k42218L10531r729j58078M28118J73001J23597k77930
9342A015714n50028M30044l21589P5833M00805n40965R7273O33871L17892l33438
9332A225412o05996M55647n5064l94383M07824j83840j73401r2j90867M65510
9322I50750M0053K4592K09018p4755K45548k95326l27813R7822K20334R0607j34070
9311A046760K1183N83022j14591K49982J43848p66289p1583N58746L10272k56168
$$ y = [1468491, 1474744, 1155767, 672762, 370234, 355599, 555908, 475176, 363463, 682190, 863325, 837138, 848956, 762074, 591189, 486924, 848440, 946095, 701574, 494675, 164930, 434211, 608291, 742936, 814907, 564940, 743610, 1357603, 1058944, 841851, 597903, 529400, 668422, 426204, 736735, 727006, 568928, 997046, 1170047, 1293644, 1015714, 465686, 895730, 574141, 649974, 1050779, 509814, 607087, 1240958, 1558850, 1225412, 619416, 1075063, 1019999, 625616, 1033440, 849600, 676199, 676107, 485240, 950750, 990803, 1015395, 1224413, 1149658, 1395206, 1099880, 772067, 869889, 1090223, 1180830, 1046760, 1067943, 1650965, 1536374, 1786356, 1930204, 1163915, 1092332, 1651078, 1961350, 1705182]
9301A705182l45260K47382M84575J50831K14987j52371j60044j33515q0760L9541
9291A970548j83441J96325K11949k58656L90755M77411m79667k53662p9234L85658
9281B377986j14403o3405M58871o74201m66358L79117K40816j35639m07047j74986
9271A420751L20230L8121K47005L15252l08858L6422j70677L880k09141J21800
9261A814785L10692m84537m23890j13717M92962Q35363N601l05726K33298l4529
9251B330302L44778j29852o5313l9173n12132K60384J17100L05576L65256k40488
9241B736438L5531L1664j33416K65367j59885l93534k27614J85049M40184l05354
9231B474430l07125L58878L80834k51341m15556K59400M05583m00309l97431K80280
$$ y = [1705182, 1359922, 1607304, 2091879, 2242710, 2457697, 2305326, 2145282, 2011767, 1931007, 1970548, 1787107, 1983432, 2195381, 1936725, 2327480, 2804891, 2325224, 2071562, 1992328, 2377986, 2263583, 2200178, 2659049, 1984848, 1518490, 1897607, 2138423, 2002784, 1595737, 1420751, 1740981, 1779102, 2026107, 2341359, 2032501, 2068923, 1898246, 1902126, 1692985, 1814785, 2125477, 1640940, 1217050, 1103333, 1596295, 2431658, 2437259, 2131533, 2364831, 2330302, 2675080, 2545228, 2479915, 2440742, 1928610, 2188994, 2306094, 2611670, 2976926, 2736438, 2771969, 2803633, 2670217, 2935584, 2775699, 2382165, 2154551, 2339600, 2779784, 2474430, 2167305, 2526183, 2907017, 2655676, 2240120, 2499520, 2905103, 2504794, 2107363, 2387643]
9221B387643M76380k13159o8985M63737K57649N55591K27761K47970o8030p50505
9211C516052k3885K52872J3161K49569J10393M34552P75839j92852o1021K29895
9201E304575J12390n18079o64645M16713n4842n28117K56227P02331Q5917j22212
9191D990258j99666J27289o80003n81988K04353j90863n4667k24592O1367n4448
9181C397040Q5733K23702r2296l60425p4276k51384k83174L44112J9872o01283
9171B407621k41423O60968j8451l42418L69987O21260p3783r56358j31262L86449
9161B682590R2946k64716j93411J94567P63362L19485l41652l78238K46117K14178
9151C335228m99167L2092K24132r4236k5154N62302j42896k60661M15177K33320
$$ y = [2387643, 2864023, 2650864, 2581879, 3045616, 3303265, 3858856, 4086617, 4334587, 4266557, 3516052, 3492167, 3745039, 3758200, 4007769, 4118162, 4552714, 5328553, 5135701, 5074680, 5304575, 5416965, 4898886, 4234241, 4650954, 4596112, 4067995, 4324222, 5026553, 5112470, 4990258, 4790592, 4917881, 4237878, 3655890, 3860243, 3669380, 3614713, 3390121, 3451488, 3397040, 3482773, 3706475, 3614179, 3253754, 3179478, 2928094, 2644920, 2989032, 3008904, 2407621, 2166198, 2827166, 2808715, 2466297, 2836284, 3457544, 3383761, 2427403, 2296141, 2682590, 2775536, 2510820, 2317409, 2511976, 3275338, 3594823, 3253171, 2874933, 3121050, 3335228, 2836061, 2868153, 3092285, 2998049, 2972895, 3535197, 3392301, 3131640, 3546817, 3780137]
9141C780137n65488o00852P29076M73741l03914m91955M32689n1669j89690N11068
9131C723143M36615k77311j89886Q0349l19266J37228j30906L595M9718L29637
9121C842916N84495l13342o4677L06757k29449l76919k28428j02153J18238J03238
9111C640676M37562K94889j36320N03140J45782k45754j18453J17948k20215j28155
9101D291100M16285O8041k29964O1989J45856j1921O6966J22753j46069l55757
9091D429279L14205M81798j01735j6939L63646k42961l47813J3566K74345m1782
9081E125609r1576J67679K70401m7180K56959P4550o50700J03062N44540R6515
9071E849859l05909k77808K77915J81974P1288l44505m67886Q5149O07412J33318
$$ y = [3780137, 3214649, 2613797, 3342873, 3816614, 3512700, 3020745, 3453434, 3401765, 3212075, 3723143, 4159758, 3882447, 3692561, 3772910, 3453644, 3590872, 3459966, 3463561, 3513279, 3842916, 4427411, 4114069, 4049392, 4356149, 4126700, 3749781, 3521353, 3419200, 3537438, 3640676, 4078238, 4373127, 4236807, 4739947, 4885729, 4639975, 4521522, 4639470, 4419255, 4291100, 4707385, 4775426, 4545462, 4607451, 4753307, 4741386, 4808352, 4931105, 4785036, 4429279, 4743484, 5225282, 5123547, 5106608, 5470254, 5227293, 4879480, 4893046, 5167391, 5125609, 5034033, 5201712, 5472113, 5424933, 5681892, 5756442, 5105742, 5208804, 5753344, 5849859, 5543950, 5266142, 5544057, 5726031, 5797319, 5452814, 4984928, 5070077, 5677489, 5810807]
9061E810807j00287P3212P472J80314j27508K12684R8854L74666Q0110n29967
9051F080357l02235M43233P40395J31627n18196m32569O1865J91385P04312K33499
9041G333673L78851P5763o15032J93398K35498K92384j72919m61786P0264N60564
9031G890658J79475K69134J00688L98070K10829n6192K79420J55319m782Q4154
9021I506773j39685j0610L81552J39494o3436J10745O16894P53221N7934l97987
9011A0954895n44120L5063N06508M35060m3587M56829M58452o464o29239K85981
9001A1909378N00918k71992P4388M22686J18533k21573J92762O26763L54226K72396
8991A3978485M00131K1077p7592O39974Q4917K19517k1851M02539O64601O12552
$$ y = [5810807, 5710520, 5783732, 5791204, 5971518, 5844010, 6056694, 6155548, 6530214, 6610324, 6080357, 5778122, 6221355, 6961750, 7093377, 6575181, 6142612, 6204477, 6395862, 7100174, 7333673, 7712524, 7788287, 7173255, 7366653, 7602151, 7894535, 7721616, 7259830, 7330094, 7890658, 8070133, 8339267, 8439955, 8838025, 9048854, 8992662, 9272082, 9427401, 9422619, 9506773, 9367088, 9356478, 9738030, 9877524, 9814088, 9924833, 10541727, 11294948, 11352882, 10954895, 10410775, 10445838, 10952346, 11387406, 11343819, 11800648, 12259100, 12252636, 11623397, 11909378, 12410296, 12138304, 12212692, 12635378, 12753911, 12532338, 12725100, 13351863, 13706089, 13978485, 14378616, 14399693, 14322101, 14962075, 15046992, 15266509, 15244658, 15647197, 16311798, 16924350]
8981A6924350L76787O10834L11566j9380M76404M82988O04210K14281L65704P07849
8971B1055593O82614P97392M06845j316J55841R65786P43182P93952O26999N29569
8961B6756457P77024M69114L52621N41228N20678L66783P14566M19561J044938
8952C1962970P95344M49504N30046Q49238R11097J333128J502042J958316J517839
8943D1809524J544012J608935K008823K116668K692611L581656M737617N138156
8935F5238002O984100Q345597J1298967J5206525K1958204K8176614M3578059
8928B00786068O3415349Q5980592L8472848j1849258j2592063l2103520l7401474
8921B94708542k2789823j1389896p813760o410694o631747n044393p295976o834605
$$ y = [16924350, 17301137, 17911971, 18223537, 18204157, 18680561, 19163549, 19767759, 19982040, 20347744, 21055593, 21738207, 22535599, 22942444, 22941128, 23096969, 24062755, 24805937, 25599889, 26226888, 26756457, 27533481, 28002595, 28355216, 28896444, 29417122, 29783905, 30498471, 30918032, 31962970, 32758314, 33207818, 33737864, 34587102, 35498199, 36831327, 38333369, 40291685, 41809524, 43353536, 44962471, 46971294, 49087962, 51780573, 55362229, 60099846, 65238002, 72222102, 80567699, 91866666, 107073191, 129031395, 157208009, 200786068, 264201417, 350182009, 388654857, 376805599, 364213536, 332110016, 294708542, 271918719, 260528823, 252715063, 246304369, 239672622, 234628229, 227332253, 220497648]
8913B20497648m405484l036047m426854n302041n881619n235298l576928j772712
8905A86860665l446894m936391n039400n545337n872338n948607p278043q076764
8897A40716891q048222o754405n523027l791095k973421l005296l804382l487066
8889A03329977l200725k431402j135720J63122J641101J819577K012067K670986
8881A04868983K376193J662183J042473Q89471J542930L703404O558326J0180745
8873A32824708Q843736M267826J25390l013726m849164o800517p294944m917322
8865A19185987k500703K41260J756031q66859k757667n136217o254637o214157
8857I7453038o943082o020334n369473m925697m291509m093151k990628j990079
$$ y = [220497648, 216092164, 213056117, 208629263, 203327222, 197445603, 192210305, 188633377, 186860665, 183413771, 178477380, 173437980, 167892643, 162020305, 156071698, 148793655, 140716891, 132668669, 125914264, 120391237, 116600142, 113626721, 110621425, 106817043, 103329977, 100129252, 97697850, 96562130, 96725252, 98366353, 100185930, 102197997, 104868983, 107245176, 108907359, 109949832, 110839303, 112382233, 116085637, 122643963, 132824708, 141668444, 145936270, 146061660, 143047934, 138198770, 131398253, 124103309, 119185987, 116685284, 116926544, 118682575, 117815716, 115058049, 109921832, 103667195, 97453038, 90509956, 84489622, 79120149, 74194452, 69902943, 65809792, 62819164, 60829085]
8849F0829085k384577j981759j591002j032066j489462j892947p26358n39022
8841D9191892j31757L00957o5068N17422N80546J580740K849223K125670J024591
8832E7974216j036151j885639k085965k946846k045748j265478o17376J330671
8824D7421684J792384J108193N2998j532237j698268k225504k759761k202029
8816C9957460j947249p28539q69703q99341m01788k92396j50494o85345o22085
8807C3360520q6915j16659r4392q5656l98671J47367j51741L41719K39195l52597
8797C2802170P47056R32274J828857K189862K810506K961111K129840R53605L82883
8788D7738164m68127p50029n07040n45648p36125r77223q86945j108919j551978
$$ y = [60829085, 58444508, 56462749, 54871747, 53839681, 52350219, 50457272, 49730914, 49191892, 49060135, 49361092, 49296024, 49813446, 50393992, 51974732, 54823955, 56949625, 57974216, 56938065, 55052426, 52966461, 50019615, 47973867, 46708389, 46091013, 47421684, 49214068, 50322261, 50375259, 48843022, 47144754, 44919250, 42159489, 39957460, 38010211, 37281672, 36411969, 35512628, 35110840, 34818444, 34667950, 33982605, 33360520, 33273605, 33156946, 33062554, 32976898, 32578227, 32725594, 32573853, 32915572, 33154767, 32802170, 33549226, 34481500, 36310357, 38500219, 41310725, 44271836, 46401676, 47355281, 47738164, 47270037, 46520008, 46012968, 45467320, 44731195, 43753972, 42867027, 41758108, 40206130]
8779D0206130j414631j077422n75629k53043L91707M14923J116129K428403K491633
8770D3728200J908715J384232P91867K01568p39231j363901j724840j862997k087437
8761D0236176k011575j373637p48675o55280J44313R19065J508443J849738K142652
8752D2011220L146378K742695K511332J593685l08517j038571j660708j534305
8744D7463209k464453k406637k580775k127074j379915m21407J033044J085834
8736C8201826P97252Q98682K005793K312513J825793R65663J059133N41298l56690
8727D8251263m00570j732862k547193k649413k255223k274741k218247j849884
8719C2323130j149007j56709O9177N84379L19271n09754j669495j293327k71860
$$ y = [40206130, 38791499, 37714077, 37138448, 36885405, 37277112, 37692035, 38808164, 41236567, 43728200, 45636915, 47021147, 47813014, 48014582, 47275351, 45911450, 44186610, 42323613, 40236176, 38224601, 36850964, 36102289, 35447009, 35591322, 36510387, 38018830, 39868568, 42011220, 45157598, 47900293, 50411625, 52005310, 51696793, 50658222, 48997514, 47463209, 44998756, 42592119, 40011344, 37884270, 36504355, 36082948, 37115992, 38201826, 38999078, 39897760, 41903553, 44216066, 46041859, 47007522, 48066655, 48607953, 48251263, 47850693, 46117831, 43570638, 40921225, 38666002, 36391261, 34173014, 32323130, 31174123, 31017414, 31086591, 31670970, 31990241, 31480487, 29810992, 28517665, 28245805]
8710B8245805k2660l69782j89749Q34155Q14521Q51942P59783m02988m77880o67693
8700B9375454N51247R59363Q86787J461887J371097O98757M84998o88942j711744
8691C3388904j517706j619507j690993j437385j285544j141866j278291o51188
8683B2766424n3629L17100L14764Q68541K010609J939833K048953J614204J216422
8674C3043221J57294p17770r78675j608119j989359q78530k85170o39064M66444
8665B6570272M88364J386932R16467N42212P38409n8882L11281r92121k073469
8656B7829465j380311q21568r84561q59849l42142M13925L08016N83252O72769
8647B5418996n97538m46028n64618r95624j495344j259044n82157j053617l27762
$$ y = [28245805, 28223145, 27853363, 27663614, 28497769, 29312290, 30164232, 30924015, 30521027, 30043147, 29375454, 29926701, 30886064, 31772851, 33234738, 34605835, 35304592, 35789590, 35100648, 33388904, 31871198, 30251691, 28560698, 27123313, 25837769, 24695903, 23417612, 22766424, 22712795, 23029895, 23344659, 24213200, 26223809, 28163642, 30212595, 31826799, 33043221, 33200515, 32482745, 31504070, 29895951, 27906592, 27028062, 26742892, 26103828, 26570272, 27058636, 28445568, 29362035, 29904247, 30642656, 30583774, 30895055, 29902934, 27829465, 26449154, 25627586, 24643025, 23783176, 23441034, 23854959, 24162975, 24746227, 25418996, 24821458, 24375430, 23810812, 22815188, 21319844, 20060800, 19478643, 18425026, 18097264]
8638A8097264J6831M7380K06402r5302P24296J039975O98926R44395P63320L39074
8628B2782561K74216m57986j03039j86967o34947r5178j09041Q75386J588521
8619B3933526P65526L05134j06428n93008p83777j273577j249925r60375r92977
8610A9044119k71676l34064n76286j1990m45978k75788l37375L2718j17291j81602
8600A6524787K48347O7963M9537K0245k24820q71352k43928K83695K36584J44253
8590A6235311K63096L37737k45981M44351L03374L35331J91858j7009j04043k61797
8580A7482228N71846K52323K71911J07851J15814K37176M56196K41679L55757
8571B0092781N03688O10609J128026L80264P92526J285302J390309K340983K096091
$$ y = [18097264, 18114095, 18161475, 18367877, 18272575, 18996871, 20036846, 20735772, 21680167, 22443487, 22782561, 23056777, 22598791, 22495752, 22308785, 21673838, 21578660, 21469619, 22345005, 23933526, 24699052, 25004186, 24897758, 24304750, 23520973, 22247396, 20997471, 20037096, 19044119, 18772443, 18438379, 17862093, 17850103, 17404125, 17128337, 16790962, 16823680, 16706389, 16524787, 16773134, 16841097, 16890634, 16910879, 16686059, 15814707, 15570779, 15854474, 16091058, 16235311, 16498407, 16836144, 16590163, 17034514, 17337888, 17673219, 17865077, 17848068, 17744025, 17482228, 18054074, 18306397, 18578308, 18686159, 18801973, 19039149, 19495345, 19737024, 20092781, 20596469, 21207078, 22335104, 22715368, 23507894, 24793196, 26183505, 28524488, 30620579]
8562C0620579J723588R46355M45302J92641m41870q85597r57740l05044N6388
8553C1394602M74300J268290J612141P84573O78856M96658m45174j547997j883228
8544C2833021j199286j003235r19789p36625o75358J97411j57444j87575M5391
8535B8196511l25494k55200k22419M339P96643P58587R14980J319749Q30414J716830
8525C3734940K592011L125475L205046K343226K832414K399352J386958K54641
8517E1874063q67029j079552m49687K50457M66599L95377J134538J314286R65156
8508E4004208O56024j287679k028427k757054l085067j925039k315538j982955
8500C9278473j433647j378008o32722j042944r89924q76282j469524q64702j74851
$$ y = [30620579, 32344167, 33290522, 33735824, 33928465, 33486595, 32600998, 31643258, 31338214, 31394602, 31868902, 33137192, 34749333, 35533906, 36212762, 36709420, 36264246, 34716249, 32833021, 31633735, 30630500, 29710711, 28974086, 28298728, 28496139, 28338695, 28151120, 28196511, 27871017, 27615817, 27393398, 27397737, 28194380, 28952967, 29867947, 31187696, 32018110, 33734940, 36326951, 39452426, 42657472, 45000698, 47833112, 50232464, 51619422, 51874063, 51007034, 49927482, 49477795, 49728252, 50194851, 50590228, 51724766, 53039052, 54004208, 54660232, 53372553, 51344126, 48587072, 45502005, 43576966, 41261428, 39278473, 37844826, 36466818, 35834096, 34791152, 33801228, 32924946, 31455422, 30590720, 30415869]
8491C0415869j75287k22128l85460R04746R05808M96748J031403J157583J923748
8482C6053030K377301K318251K015652J61980p17117n19021j354620r30667n83366
8473C8821423k82503R0561P11511J547466J411861J26858l78915j009938k162329
8464C8875995j578771j043442q80261n61824r8962N37303P90468M86263J187396
8455C7714165R25992J13621J2475P7277O00162Q38228N38300n3962q16869o65730
8445C9283659k80339k79015k11000K98388J61852l43713l36973J1339l37598n16655
8435C7449945J99843J081246J961604K438316L223204L565514L425327M493569
8427E7838568O410689P803877Q499376P348673N831214K659363j525473m151635
$$ y = [30415869, 30240582, 30018454, 29632994, 30537740, 31443548, 31940296, 32971699, 34129282, 36053030, 38430331, 40748582, 42764234, 42926214, 42209097, 41690076, 40335456, 39404789, 38821423, 38538920, 38629481, 39340992, 40888458, 42300319, 42427177, 42048262, 41038324, 38875995, 37297224, 36253782, 35373521, 34811697, 34712735, 35250038, 36040506, 36526769, 37714165, 38640157, 38753778, 38766253, 38843530, 39443692, 40281920, 40820220, 40766258, 39949389, 39283659, 39003320, 38724305, 38513305, 38811693, 38973545, 38629832, 38292859, 38304198, 37966600, 37449945, 37649788, 38731034, 40692638, 43130954, 46354158, 49919672, 53344999, 57838568, 64249257, 72053134, 80552510, 87901183, 93732397, 96391760, 94866287, 90714652]
8419I0714652o032797n984679n621596m124322j954991j065098j97512J700306
8411F7433963J966199K508240K123656R30528l24362k889296l874292m309340
8403F3565296m796581m248724l930995l470770k265453k200257j533510q32765
8395D0286241m92586O44875N49240J189433K236427K939035M168973N005244O323930
8386F2850812O983593N750169L215611N17030k592830m833824o262275n730429
8378E9897857n436498m820293k457852j694516q59087M57258J686274K252103
8370D9025246J381132O78371M0768k024461l417312l566869l670001l270563l490096
8361C1686215k801227k295225k307656j333509j104779j235680j229139n99204
$$ y = [90714652, 84681855, 78697176, 73075580, 68951258, 66996267, 65931169, 65733657, 67433963, 69400162, 71908402, 74032058, 74962586, 74638224, 71748928, 67874636, 63565296, 58768715, 54519991, 50588996, 47118226, 44852773, 42652516, 41119006, 40286241, 39793655, 40438530, 40987770, 42177203, 44413630, 47352665, 51521638, 56526882, 62850812, 69834405, 75584574, 78800185, 79317215, 76724385, 71890561, 65628286, 59897857, 54461359, 49641066, 47183214, 45488698, 44629611, 45086869, 46773143, 49025246, 50406378, 51084749, 51125517, 49101056, 45683744, 42116875, 38446874, 35176311, 31686215, 28884988, 26589763, 24282107, 22948598, 21843819, 20608139, 19379000, 18779796]
8353A8779796j04055j139173p78752m41627o85172k73318o09967m49520m89657
8344A3808555o81520J37822j9171r27905j80135n84403l90713O3924o82611J9702
8334A0563545m18960k78224K26787P7833K6951j0958j93932k26035L36143J79514
8324A0282664N59324L3076o40095j70571J53957O8938l70122q29591q59382J7557
8314H245755k17750r4430p42396q53219J40277n33148l20008K50044M04776q591
8304F271310k98379J42113K08914m11054m78854k57462l20082k96229m7577Q53648
8294E366348j4000l08929N29262M7446p5810j24697M04872M04808n29980K97679
8284E996999N85010q661j46721n41910m24392J92672k24437l43098j47513o6805
$$ y = [18779796, 18675741, 17536568, 16757816, 16316189, 15631017, 15357699, 14747732, 14298212, 13808555, 13127035, 13264857, 13245686, 12317781, 12137646, 11553243, 11162530, 11226454, 10543843, 10563545, 10144585, 9866361, 10093148, 10170981, 10197932, 10186974, 9993042, 9767007, 10103150, 10282664, 10841988, 10875064, 10234969, 10064398, 10218355, 10287293, 9917171, 9087580, 8228198, 8245755, 8028005, 7933575, 7191179, 6337960, 6478237, 5945089, 5625081, 5875125, 6279901, 6271310, 5972931, 6115044, 6323958, 5912904, 5434050, 5176588, 4856506, 4560277, 4512700, 5366348, 5352348, 5043419, 5572681, 5620127, 5544317, 5419620, 5824492, 6229300, 5699320, 5996999, 6582009, 6573348, 6426627, 5884717, 5460325, 5652997, 5428560, 5085462, 4937949, 4871144]
8274D871144n1333l46984l5966m03569p38358K1494J89365N63203k14751m49827
8264C404418R6579J31445J60601k44032m16271j79222J9844K07359N57808m08675
8254C329854J71899l90192m12449L55191P8262K54972n40687n43524L20023L23832
8244B947181o5632J39631n03091l33965M24692J25661k2762k09542K65250l43995
8234B423428k64778L54949K49431j41390n18839L9236l09209j30509P08317K93906
8224B704542k49368l94673j15974K68488j50632j84127J93097j94353P7021M18602
8214B372623j29617k9484k68733j0026J61262k65739o2950P8027O30791j19969
8204B356185m17129l45273j67832O35184J05020j13638l7555k45391j04134N97825
$$ y = [4871144, 4819811, 4472827, 4436861, 4033292, 3294934, 3316428, 3505793, 4068996, 3854245, 3404418, 3500997, 3632442, 3793043, 3549011, 3132740, 2953518, 2973362, 3180721, 3738529, 3329854, 3501753, 3111561, 2699112, 3054303, 3132565, 3387537, 2846850, 2303326, 2623349, 2947181, 2881549, 3021180, 2518089, 2184124, 2608816, 2734477, 2711715, 2502173, 2767423, 2423428, 2158650, 2513599, 2763030, 2621640, 2102801, 2142037, 1832828, 1702319, 2410636, 2704542, 2455174, 2060501, 1944527, 2213015, 2062383, 1878256, 2071353, 1877000, 1954021, 2372623, 2243006, 2213522, 1944789, 1934763, 2096025, 1830286, 1767336, 1845363, 2476154, 2356185, 1939056, 1593783, 1425951, 2061135, 2166155, 2052517, 2014962, 1769571, 1665437, 2263262]
8194B263262L44995q5709j410866o63146J161772L39809J93494m92500j00133
8185A550978O88090L26621n8272m85877n35661k98063J7930J8932K98829l16511
8175A206996M45824K02542m4588m68507l04936J093632o71603p33333L31393P63062
8165A820482K71149p61266L46837Q16657r13926N424N42241j89459p6374p31289
8155A130476M69616N80034r10410M90696j15690k78286N53955r3747N01736J1869
8145B340249O4865K67135m39488l55195k87766j38894M01916K06067k91338L43728
8135B111279J37712j51791n94275j96172K35834j64443J37645j73141M84975L56063
8125B183686l06722j87609J02932J01218P1372K78888K10694L87397M77428J112573
$$ y = [2263262, 2608257, 2522548, 1111682, 448536, 1610308, 1950117, 2143611, 1651111, 1550978, 2239068, 2565689, 2507417, 2021540, 1485879, 1187816, 1205746, 1224678, 1523507, 1206996, 1652820, 1855362, 1810774, 1342267, 1037331, 2130963, 1459360, 726027, 1057420, 1820482, 2091631, 1330365, 1677202, 2493859, 1579933, 1585357, 2127598, 1938139, 1861765, 1130476, 1600092, 2180126, 1269716, 1760412, 1644722, 1366436, 1920391, 1826644, 2328380, 2340249, 2405114, 2672249, 2232761, 1877566, 1589800, 1450906, 1852822, 2058889, 1767551, 2111279, 2248991, 2097200, 1502925, 1306753, 1542587, 1378144, 1515789, 1342648, 1827623, 2183686, 1876964, 1689355, 1792287, 1893505, 1964877, 2243765, 2454459, 2841856, 3319284, 4431857]
8115D431857O40396p6265q1828N26938L48798o84701m42737r57798q20293l5090
8105B849277K39504k64379p56660o64217K11503M03978l5581k75892m03427L76329
8095A680435L8380k6747L01531m90056k55417j0327k13118J63888K53691l15348
8085A126912p1355K25320K91886M10975M25558K61605k95188j81191Q30389R33871
8075C958782N28942L67836K9522m71757j02148j40794q44811o46444m06476R1625
8065B364277m7248l64691P5795j82927k81069O9916l19918r2263P50224l02484
8055A669612n01674n5872J05225J95631m60798K3813L76986K6801j35709J05119
8045A349134j14304Q1240l56973l8350K52387j07782R5170Q9765J70254m65756
$$ y = [4431857, 5072253, 4995988, 4914160, 5441098, 5789896, 5105195, 4662458, 3704660, 2884367, 2849277, 3088781, 2824402, 2067742, 1403525, 1615028, 2019006, 1983425, 1707533, 1304106, 1680435, 1718815, 1692068, 1993599, 1503543, 1248126, 1237799, 1024681, 1188569, 1442260, 1126912, 1055557, 1280877, 1572763, 1983738, 2409296, 2670901, 2375713, 2194522, 3024911, 3958782, 4487724, 4855560, 4885082, 4413325, 4311177, 4170383, 3325572, 2679128, 2272652, 2364277, 2317029, 1952338, 2028133, 1845206, 1564137, 1634053, 1314135, 1221872, 1972096, 1669612, 1167938, 1112066, 1217291, 1412922, 952124, 975937, 1352923, 1379724, 1244015, 1349134, 1234830, 1316070, 959097, 920747, 1173134, 1065352, 1160522, 1250287, 1420541, 954785]
8035I54785m36587K10206J30095k38510L94910O56560J70948o96334m59963M53608
8025A139718l78840n79146k08917M92803R70017M5578j47084n7274n71967m8031
8015F56857J96636m01548k19130O0117L98784Q2128J4091M78048l9616m56639
8005G69728l31395j28864j27559K53506L14793k2663k10000j89634K28029L23285
7995H79226n04669m76849L93706J60851L0760Q3171O2757J62733m56952l15932
7985A8802L09694j54235k51420L16342P2573j88181l66632M52259O72740p46512
7975A35430k49642M95597n1501J4338J2195j59489r3751j12297J26357K65417
7965C82654l0901m5030k35389l07780J65137K71474K17315p2591M5200l54984
$$ y = [954785, 518198, 728404, 858499, 619989, 1014899, 1671459, 1842407, 1146073, 686110, 1139718, 760878, 181732, -27185, 465618, 1435635, 1481213, 1334129, 1276855, 704888, 656857, 853493, 451945, 232815, 292932, 691716, 773844, 787935, 1265983, 1226367, 769728, 438333, 309469, 181910, 435416, 750209, 727546, 517546, 327912, 555941, 879226, 374557, -102292, 291414, 452265, 483025, 566196, 628953, 791686, 334734, 18802, 328496, 174261, -77159, 239183, 311756, 123575, -243057, 209202, 881942, 135430, -114212, 381385, 329884, 344222, 356417, 196928, 103177, -9120, 117237, 382654, 351753, 306723, 71334, -236446, -71309, 200165, 417480, 344889, 390089, 35105]
7955C5105l03312P06048O09101n94253o68468L46062J68573j22346j53271J61705
7945A84944J2779k03903K90438J01357j11811k38281n4382L51648n8816k84231
7935a0258J49342j26129k65563K44148K87264M09418n75881l53773K53282l10274
7925b98424L9175K57716K52536J98379j28214k93687j9704J16594j28239L2797
7915B8929M1132o1983q7459O6695K23980q1313k44972R6590L40902R0637j25122
7904B88016j31722O0675K05182k33071j11048O1680k05809J65900L00675k05482
7894A94996j97555J96385M5140R9198m10921M2749O06251k17666j1233k77388
7884F9956k50239N13626l64716k47471N21800j61333r1416m98174l11007J099250
$$ y = [35105, -268207, 437841, 1046942, 452689, -215779, 130283, 298856, 176510, 23239, 184944, 197723, -6180, 284258, 385615, 273804, 35523, -18859, 332789, 273973, -10258, 139084, 12955, -252608, -8460, 278804, 688222, 112341, -241432, 11850, -298424, -259249, -1533, 251003, 449382, 321168, 27481, 7777, 124371, -3868, 28929, 70061, 8078, -79381, -12686, 211294, 129981, -114991, -18401, 322501, 413138, 288016, 156294, 216969, 422151, 189080, 78032, 139712, -66097, 99803, 400478, 194996, -2559, 193826, 238966, 338164, -72757, -30008, 576243, 358577, 347344, 69956, -180283, 333343, -31373, -278844, 242956, 81623, -9793, -507967, -818974, 280276]
7874B80276J60233n153o1372l99982j00673K75661R8640k46417n41235Q6108M12471
7863d1443N17039L28220p39813n19588j20307N80922N20145l43642O7151j31649
7853A17035j53503L69575j85938m62726R971R9115M39961J70962L164M69576n26191
7842C51001o02306K95916K47105k71284n2400k5714J19917q3118K45000J11493
7832C35610n18591m98791M86689O12547n71729n1101Q9890K30932M96400l46222
7822B65634m8691j25743m92882P8701j1229j4219K97689J56210J70889k39520
7812C6839l55201L52568K77697l06167j52804m00857J09437K40148k36395L9235
7802c95500K63852J98969k55917K54834J93336l9282l31157n62336M1094K19807
$$ y = [280276, 440509, 435356, 373984, -25998, -126671, 148990, 247630, 1213, -540022, -453914, -41443, 475596, 803816, 64003, -455585, -575892, 5030, 525175, 181533, 248684, 117035, -36468, 333107, 147169, -315557, -305586, -206471, 233490, 404452, 407616, 877192, 351001, -251305, 44611, 291716, 20432, -31968, -57682, 62235, -20883, 224117, 335610, -182981, -681772, -195083, 417464, -154265, -205366, -115476, 115456, 611856, 265634, 216943, 91200, -401682, -322981, -334210, -348429, -50740, 105470, 276359, 36839, -318362, 34206, 311903, 5736, -147068, -547925, -438488, -198340, -434735, -395500, -131648, 67321, -188596, 66238, 259574, 220292, -110865, -673201, -632107, -412300]
7792d12300J77901K59272n1990K2453N8412l60789J82158L68507k12546J95282
7782B26360l06954j88041L47803K79746K11954n28640l82197L33698N13946K55503
7772G63178m76577n89860K51055O8478p500l33049N3162N58984j59570l5286m6550
7761D6465j8219J84208m93783l46499K65383J88747O95593m65890n67029K54418
7751b56606Q4048M63376j28864m29132Q5961M49889O1255o84540o04705L36975
7741f22343L95082N5637r2816P8251K65333L34438M26943q05989n31990K06722
7731b90732j8999K85659J49271K4970P223l81361K82680Q5965l98751K89862M5046
7720H0833p8344J9298J48653J64086q7715m18126J9533J32161Q3392l727j85695
$$ y = [-412300, -234399, 24873, -27117, -4664, 53748, -307041, -124883, 243624, 31078, 226360, -80594, -268635, 79168, 358914, 570868, 42228, -339969, -6271, 507675, 763178, 286601, -303259, -52204, 16274, 8774, -324275, -271113, 287871, 128301, 93015, 46465, 28246, 212454, -281329, -627828, -362445, -173698, 521895, 56005, -511024, -256606, -172558, 290818, 161954, -267178, -181217, 268672, 329927, -354613, -959318, -622343, -227261, -171624, -264440, -186189, 79144, 413582, 840525, 34536, -497454, -290732, -309731, -24072, 125199, 150169, 157392, -223969, 58711, 144676, -254075, 35787, 80833, 2489, 21787, 170440, 334526, 246811, -171315, -151782, -19621, 63771, 60044, -125651]
7709a25651J52946J13259J16182m35145k953K39483l24961J19849M33876J4075
7699C00960m29818k17706J109N47133J94576j47555k23364l95065K13038L84810
7689B28118Q3463n46769j32206J73550K41634p722l95776J94525M37021N92067
7679H67905m11503r03151r7754N23367j75104j7813J23636J30053L72046K9027
7669D40709r1817j11500k11823K59366L45648n25939q2862K24973K04356L08124
7659G59235j57626m69796K61849K63352k5470k79898m82548K71480K06560j01328
7649B45810j76502j47228J46379K80032r84N9383k91082j90174L78337j44031
7639A59940l6183K50615K57501l49339k6799j42740j38730K80643K6798r234j58467
$$ y = [-125651, 27295, 140554, 256736, -178409, -181362, 58121, -266840, -146991, 286885, 300960, -128858, -346564, -345455, 201678, 396254, 248699, 25335, -369730, -156692, 228118, 311581, -235188, -367394, -193844, 47790, 40068, -355708, -161183, 275838, 867905, 456402, -446749, -544503, -21136, -196240, -214053, -90417, 39636, 411682, 440709, 348892, 237392, 25569, 284935, 630583, 104644, 21782, 246755, 451111, 759235, 601609, 131813, 393662, 657014, 631544, 351646, -130902, 140578, 347138, 245810, 69308, -77920, 68459, 348491, 347507, 406890, 115808, -74366, 303971, 159940, 123757, 374372, 631873, 282534, 255735, 112995, -25735, 254908, 281706, 272472, 114005]
7628A14005n6204L92111O23036l23604n13748P8011Q8396J81252r3307J36769
7618F26717k24314J6324m1020j99648J84268o6870J40320k29440q5171J84555
7608C05721P3002J64792k63440m79812K10620K41526K15684j55150n47643O40704
7598D06004j0822n13575J38312M32053j39705k50348O02782L81019k69684n05925
7588B70111k4958K14667K51342k04800m63411J35761M12832P6392j31935j34623
7578D01378M78334J46956q4919l07161k24189N2587J13966J64737m05878j06571
7568B29240M01496M16715m27589j27058N68110L00108m1580k51950o0733n70873
7558D35886n63983R8606L65857J39757L08288k3382L3770N23802J31094l98702
$$ y = [114005, 57801, 449912, 1072948, 749344, 235596, 313607, 402003, 583255, 489948, 626717, 402403, 418727, 377707, 178059, 362327, 295457, 435777, 206337, 121166, 305721, 378723, 543515, 280075, -199737, 10883, 252409, 468093, 312943, -234700, 406004, 395182, -118393, 19919, 451972, 312267, 61919, 664701, 1045720, 776036, 270111, 245153, 459820, 711162, 506362, 42951, 178712, 591544, 667936, 536001, 401378, 879712, 1026668, 941749, 634588, 410399, 462986, 576952, 741689, 335811, 229240, 630736, 1047451, 619862, 492804, 1060914, 1361022, 1319442, 1067492, 1006759, 435886, -128097, -29491, 336366, 476123, 784411, 761029, 794799, 1318601, 1449695, 1050993]
7548A050993n91582M71741K47514n85818j933N60648J92285l42530J0208j39679
7538H71847M9293K79520L54927o8741n81491L52616N35510k10177k2645J94055
7528A754714J14729N8821L3138L8866p0769j53633k33173k26343K04250K87756
7518A808356k59280k07211L424K13346j36395J11195M5290l78095j35351k48503
7508H16776j99686Q2970R301K79479O0791k77420J93157L01688j02996j9675l08163
7497H36222k68487J2905j01622J82684K51995j74553K0403m240o0802L87669l40434
7486G41740R7310M03843n83368l26492K28652J24373p0202j25239K42482K11864
7476I44963n64292n8789K53890p4651K10462r63n1895J12279Q9008k6262J6627
$$ y = [1050993, 459411, 931152, 1178666, 592848, 590915, 1151563, 1343848, 1001318, 1011526, 871847, 921140, 1200660, 1555587, 1486846, 905355, 1257971, 1793481, 1583304, 1560659, 1754714, 1869443, 1928264, 1961402, 2000268, 1929499, 1775866, 1542693, 1316350, 1520600, 1808356, 1549076, 1341865, 1345289, 1558635, 1422240, 1533435, 1578725, 1200630, 1065279, 816776, 617090, 700060, 709361, 988840, 1049631, 772211, 965368, 1267056, 1164060, 1144385, 836222, 567735, 580640, 479018, 661702, 913697, 739144, 759547, 755307, 694505, 1082174, 741740, 839050, 1242893, 659525, 333033, 561685, 686058, 615856, 490617, 733099, 944963, 380671, 321882, 575772, 501121, 711583, 710620, 658725, 771004, 860012, 833750, 850377]
7465H50377M1355Q8175J33606l10888k60805L68802N00466K35346j77668m48077
7455A020689M29176M35493j00428J01689k63014J42882J50300l79930M4960l08709
7445A273108R268N54253O8907j36110l10946l42675J75780K65946n3535l61823
7435A142173m29468N42588N241j34366J3008n43059M1950K21078K95616k57417
7425H97344l86527N11308J6049k65425O8175M49714K24691m1046l67672J46387
7415A252998q6345j6015O8254l06436l2270L97494M99254k1336P9510k05715k36988
7404A392405J83468M54836k68856n84918n5196J37984M13232K09642K25898j19495
7394A989000l89860J18654k01409K12642J43534n8151O9021J42728M2405j50053
$$ y = [850377, 891732, 979907, 1113513, 802625, 541820, 910622, 1411088, 1646434, 1468766, 1020689, 1449865, 1885358, 1784930, 1886619, 1623605, 1766487, 1916787, 1536857, 1581817, 1273108, 1282376, 1836629, 1905536, 1769426, 1458480, 1115805, 1291585, 1557531, 1503996, 1142173, 712705, 1255293, 1260534, 1126168, 1139176, 596117, 638067, 859145, 1154761, 897344, 510817, 1022125, 1038174, 772749, 840924, 1290638, 1515329, 1474283, 1106611, 1252998, 1166653, 1150638, 1218892, 912456, 880186, 1277680, 1776934, 1755598, 1835108, 1629393, 1392405, 1575873, 2030709, 1761853, 1176935, 1121739, 1259723, 1672955, 1882597, 2108495, 1989000, 1599140, 1717794, 1516385, 1729027, 1872561, 1814410, 1883431, 2026159, 2068564, 1918511]
7384A918511j9964L15370K41533P0239L97966K64859k19955j14577L83049J62645
7374C399676m89950l17083K42462K40511l8105J08877l3800p13283k62885R9942
7364B236362j61326R8835L57712J77266j36844J5562O37956r4096o72159L86649
7354B845917k69175m62746k04015o0417L30871j91463j773M54094j02865j81980
7344B156448J41805j26819j01172J767R6693J28728o62191k92517K19040O68709
7334B230491Q3438o45266j50703P18541R53245k87570k66598j35356O2554K88906
7324B851682J41111r1887l32191j98293L76581M78956N04121r1826m05235L22190
7314C555209L94409K03849k79513k43663K61506j75219K83610M23372j08280k7192
$$ y = [1918511, 1898547, 2213917, 2455450, 2525689, 2923655, 3188514, 2968559, 2853982, 3237031, 3399676, 2909726, 2592643, 2835105, 3075616, 3037511, 3146388, 3112588, 2399305, 2136420, 2236362, 2075036, 2173871, 2531583, 2708849, 2572005, 2587567, 3225523, 3131427, 2459268, 2845917, 2576742, 2113996, 1909981, 1849564, 2180435, 1988972, 1987199, 2441293, 2338428, 2156448, 2298253, 2171434, 2070262, 2072029, 2168722, 2297450, 1635259, 1342742, 1561782, 2230491, 2313929, 1668663, 1517960, 2236501, 3189746, 2902176, 2635578, 2500222, 2562776, 2851682, 2992793, 2900906, 2568715, 2370422, 2747003, 3225959, 3730080, 3638254, 3233019, 3555209, 3949618, 4153467, 3873954, 3630291, 3891797, 3716578, 4000188, 4423560, 4315280, 4288088]
7304D288088p29193m26249p0641Q7988P04528L34138l53678N0403K9967K59593
7294D174944J08196o54041j66395j23262N16522n4951m54578K30963l2474L6587
7284C581511K38667N51485N42695j08512N22908O70261k83191l24273j03862j78640
7274E109049n91962p18464J57681J07706l77140j84550l73603K01572K28708L21559
7264C880556k17853m84329O39029K77800k72473M1469p653k07205J74523J8641
7254C842505Q5076l56701k6063M69934j52035k65287m10744q0500L5535k24555
7244B917165K31825M6648k21850K76120M8396j15001J61926k4010K2199k65796
7234C077622l19884P25375M49266J49181J06838p1897M89097J37280K8131O23129
$$ y = [4288088, 3558895, 3132646, 3062005, 3149993, 3854521, 4188659, 3834981, 3885384, 3915351, 4174944, 4283140, 3629099, 3462704, 3339442, 3855964, 3801013, 3346435, 3577398, 3544924, 3581511, 3820178, 4371663, 4914358, 4805846, 5328754, 5999015, 5715824, 5391551, 5287689, 5109049, 4517087, 3798623, 3956304, 4064010, 3686870, 3502320, 3128717, 3330289, 3558997, 3880556, 3662703, 3178374, 3817403, 4095203, 3822730, 3864199, 3856546, 3649341, 3823864, 3842505, 3927581, 3570880, 3544817, 4014751, 3862716, 3597429, 3186685, 3106185, 3141720, 2917165, 3148990, 3195638, 2973788, 3249908, 3298304, 3183303, 3345229, 3321219, 3343418, 3077622, 2757738, 3483113, 3932379, 4081560, 4188398, 4116501, 4605598, 4742878, 4771009, 5394138]
7224E394138J91706J64281K31785k98517k26163l40518K2310M11526M2058l26200
7214E266406o45663k10662N63951K64203j13738j70589J7333j03010N34930N05353
7204E908514j78508m19844L57650M85504P6387k9739K76709P26413l84693L71367
7194G189760K25513j65467M30415j7749l3573L0781j81603L30750l57893p42064
7184F708870J68122l73286n50135K04108k02414m96727n91313L08921r9875p49023
7174D327248j6835N13326k522m64443K44869K55506j7496K54726J40092j32659
7164E101812j72173k01335K10348j15020J0289K61479n13261j38369M27003j70057
7154D700716R4751k51413q8521l38990m23420N10530k89790n6240L98566l35397
$$ y = [5394138, 5585844, 5750125, 5981910, 5683393, 5457230, 5116712, 5139022, 5550548, 5592606, 5266406, 4620743, 4410081, 4974032, 5238235, 5124497, 4953908, 4971241, 4868231, 5403161, 5908514, 5730006, 5310162, 5667812, 6153316, 6229703, 6199964, 6476673, 7203086, 6818393, 7189760, 7415273, 7249806, 7680221, 7662472, 7628899, 7659680, 7478077, 7808827, 7450934, 6708870, 6876992, 6503706, 5953571, 6157679, 5955265, 5458538, 4867225, 5176146, 5076271, 4327248, 4310413, 4823739, 4821217, 4356774, 4601643, 4857149, 4839653, 5094379, 5234471, 5101812, 4929639, 4728304, 4938652, 4823632, 4833921, 5095400, 4582139, 4443770, 4870773, 4700716, 4795467, 4544054, 4455533, 4116543, 3693123, 4203653, 3913863, 3857623, 4256189, 3920792]
7144C920792p27799K51980O76694k93142p42280J9512O26836l09182j92887j3005
7134C217519P4902k39956l1062M06362m49224m33283L06805L87991n97355m0576
7124B602123K43642L90970L13190j1888N6899k48483q00L0482k84104k54499K1707
7113B859239l95269R6924O67013l22880k8420J2781K68552R0184l34582P11956
7103C625498j4239m67379K8602L83594L5385k99268n37361o3638M7897k69721
7093B469370N3025m0518J71883L19366J64882j8560O5968L60705r4764k36018
7083C215339l00768j2731L81845k52315k04717l1076R7681M58925J68257k9245
7073C491195J97334N4859k67607O839L07471J58880l29166j10283m13691j67895
$$ y = [3920792, 3192993, 3444973, 4121667, 3828525, 3086245, 3105757, 3732593, 3423411, 3230524, 3217519, 3292421, 3052465, 3021403, 3427765, 2978541, 2545258, 2852063, 3240054, 2642699, 2602123, 2845765, 3236735, 3549925, 3538037, 3594936, 3346453, 3345653, 3376135, 3092031, 2837532, 2859239, 2463970, 2560894, 3227907, 2905027, 2876607, 2889388, 3157940, 3248124, 2913542, 3625498, 3611259, 3143880, 3172482, 3556076, 3591461, 3292193, 2754832, 2691194, 2739091, 2469370, 2522395, 2481877, 2653760, 2973126, 3138008, 3119448, 3185416, 3546121, 3451357, 3215339, 2914571, 2901840, 3283685, 3031370, 2826653, 2795577, 2893258, 3352183, 3520440, 3491195, 3688529, 3743388, 3475781, 3482620, 3790091, 3948971, 3619805, 3509522, 3095831, 2927936]
7063B927936J58811O3551k62518r16111J71278K29498K18669j33535k98519Q674
7053B167734J09339o8455k1148K6174k27318p4021m98182J20500J67208k61606
7043A440225j3918L8914R932k73021J91342O65762J58746j55726k41118L66151
7033B187289L5940q10486j61946L8838L0037K91669j37398J49224j57948j9126
7023A446093J058221j65702p47807l50786L6542N54835Q8076o3218K85275J40147
7013B281676k58359m4409L74429K53272m59644m89001K65570K46440o7550k06224
7003A896200L44266J2469m88171k15245j11907J3455n09569m3579K23262p2294
6993A048887L16221L8416l05573m42186l4615J65886N58828l54023l67361K67346
$$ y = [2927936, 3086747, 3150298, 2887780, 1971669, 2142947, 2372445, 2591114, 2457579, 2159060, 2167734, 2277073, 2208618, 2187470, 2213644, 1986326, 1912305, 1414123, 1534623, 1701831, 1440225, 1426307, 1465221, 1475153, 1202132, 1393474, 2059236, 2217982, 2062256, 1821138, 2187289, 2223229, 1412743, 1250797, 1289635, 1319672, 1611341, 1473943, 1623167, 1465219, 1446093, 2504314, 2338612, 1590805, 1240019, 1276561, 1831396, 1919472, 1856254, 2141529, 2281676, 2023317, 1978908, 2353337, 2606609, 2146965, 1657964, 1923534, 2169974, 2102424, 1896200, 2240466, 2252935, 1764764, 1549519, 1437612, 1451067, 941498, 897919, 1121181, 1048887, 1365108, 1403524, 1097951, 655765, 621150, 787036, 1345864, 991841, 624480, 891826]
6983H91826L04837J27797o68723L7409K50410l3873k15268N0776M07050k45318
6973I06923J9209N55999N5465q71851l50862M13216M46756k84653k23580L28692
6963I95314m03778M2199L75061M69481k09939o33520k15201L19930M05614J7509
6953A162670m36563l73662J61260K50531J84868L61709k43652m23153J07807M72009
6943A223824o8655m37926l5533L96902o0829l78641K36140j2896m09914j60880
6933B91592L45498L98954m54639j55409L64010M8553O2393n2159k4909r1054O6291
6922G99121K53600Q2512r7473l85355q85036q3525P42837K58592q9593j30961
6912D64719L42590K92709K4289K81220l87920r50068j37445M42775J49597L4292
$$ y = [891826, 1196663, 1324460, 655737, 693146, 943556, 909683, 694415, 745191, 1152241, 906923, 926132, 1482131, 1537596, 665745, 314883, 728099, 1174855, 890202, 666622, 995314, 591536, 633735, 1008796, 1478277, 1268338, 634818, 419617, 739547, 1145161, 1162670, 726107, 352445, 513705, 764236, 949104, 1310813, 1067161, 644008, 751815, 1223824, 1155169, 717243, 681710, 1078612, 1017783, 639142, 875282, 862386, 452472, 291592, 637090, 1036044, 581405, 425996, 790006, 838559, 900952, 848793, 823884, 732830, 799121, 1052721, 1135233, 1037760, 652405, -232631, -316156, 426681, 685273, 595680, 464719, 807309, 1100018, 1124307, 1405527, 1017607, 67539, -69906, 372869, 522466, 556758]
6902E56758l17145q3040k07532N78469Q07243p12971n60592M65975K46908L8451
6892H12524o151j37204P590l45333j20772K78388o2542m0589M69640l4855l80336
6881D40360L78637M48762k85992k49210J81662J15932j5224K47870N82791n29874
6871A315714n86363K89024j32945n7768R5793L90720J89341j21439O60957N59655
6861B602689n3470K07524L25527l19702j05588J40417r9888k66109l41829k3561
6851B066010n2323j03481J21529Q6668j68441j42668l51946k21366K15099j8781
6841A430300j36541m64190j1565P44634Q2347k90726j35297j2329L029l00067
6831I09595J54012L29858m26854O4172N73498L9775j46159n55113l10942O28802
$$ y = [556758, 239613, 156573, -50959, 527510, 1334753, 621782, 61190, 527165, 774073, 812524, 806373, 669169, 676759, 331426, 210654, 489042, 426500, 385911, 855551, 820696, 440360, 818997, 1267759, 981767, 732557, 914219, 1030151, 1014927, 1262797, 1845588, 1315714, 729351, 1018375, 885430, 827662, 923455, 1314175, 1503516, 1382077, 2043034, 2602689, 2549219, 2756743, 3082270, 2762568, 2656980, 2797397, 2697509, 2431400, 2089571, 2066010, 2013687, 1910206, 2031735, 2118403, 1949962, 1807294, 1455348, 1233982, 1449081, 1430300, 1293759, 829569, 818004, 1562638, 1644985, 1354259, 1218962, 1206633, 1209662, 909595, 1063607, 1393465, 966611, 1030783, 1604281, 1644056, 1497897, 942784, 631842, 1260644]
6821A260644p3132m47415j77305K25296O06045L59130j51156Q7921m00354l03068
6811I86606O94669k76264l54547Q8752L41437L32268l4361M43529O11215K57594
6801C090898j19840k7342l06723p1455k58611m45917R6435n0966p00920n70855
6791F34704K93596O47270L75367o05967k72834j27437R3359K04162m19677m29321
6781C93222j60940O01820M26005k69811J82592K19906k33047l78993P0919q1604
6771G70069K33789O3781O4112J40864K7738L73771j91851k64335l13364r5791
6761H08783k07902N1586M42820M7076j48784j63785L12503M24837l663p5057l94277
6750A094137m20638O05552L72959j35790o5819j73535j34980k00869N59310O51825
$$ y = [1260644, 1187512, 740097, 562792, 788088, 1394133, 1753263, 1602107, 1690028, 1289674, 986606, 1681275, 1405011, 1050464, 1139216, 1480653, 1812921, 1778560, 2222089, 2833304, 3090898, 2971058, 2943716, 2636993, 2565538, 2306927, 1861010, 1957445, 1906479, 1205559, 634704, 928300, 1575570, 1950937, 1344970, 1072136, 944699, 1038058, 1242220, 822543, 393222, 232282, 834102, 1260107, 990296, 1172888, 1392794, 1159747, 780754, 851673, 770069, 1003858, 1067639, 1131751, 1272615, 1300353, 1674124, 1482273, 1217938, 904574, 808783, 600881, 652467, 1095287, 1142363, 993579, 829794, 1142297, 1567134, 1563471, 1488414, 1094137, 673499, 1279051, 1652010, 1516220, 1450401, 1276866, 1141886, 941017, 1500327, 2152152]
6740B152152l78596m13569j43307M37573R8811m20091r4342j01858J73969K07335
6730A518077J57597j44007j24883m25900J12579j664K12118K47890m19769J60537
6720A292575n5452O87518L41584l89792k95758k48345K65580K2896k93447m06852
6710I20507K2279J90269L48123O9872L71074o4039k18479L97000r3846L25045
6700B267805o10642n88445J76716j96104J94703J68929O9128k1437J12466K32316
6690A805435L13934n76648l35603J83562L13929K82305l50587o6756L43078N36528
6680B449177N1094m62026j87157m48602o4371L86303K44879J83966k87846R1275
6670A956692J75229k87829J4352N42784k35060l27082k78047M59417J62301o15888
$$ y = [2152152, 1773556, 1359987, 1216680, 1654253, 1753064, 1332973, 1238631, 1136773, 1310742, 1518077, 1675674, 1531667, 1406784, 980884, 1093463, 1091799, 1303917, 1551807, 1132038, 1292575, 1237123, 1924641, 2266225, 1876433, 1580675, 1332330, 1597910, 1620806, 1327359, 920507, 942786, 1133055, 1481178, 1551050, 1922124, 1858085, 1639606, 2036606, 1942760, 2267805, 1657163, 1068718, 1245434, 1049330, 1244033, 1412962, 1482090, 1460653, 1573119, 1805435, 2119369, 1542721, 1207118, 1390680, 1704609, 1986914, 1636327, 1569571, 1912649, 2449177, 2500271, 2038245, 1851088, 1402486, 1338115, 1724418, 1969297, 2153263, 1865417, 1956692, 2131921, 1844092, 1858444, 2401228, 2166168, 1839086, 1561039, 2020456, 2182757, 1566869]
6660A566869j56181R7365K13672M40398N69334q6018m47102M7476K5138j70820
6650B100131l23552k01794k54951J13410P89719N17194l38531m67489L12401R8268
6640B344806J39635o9393j94665m02665n2585N30492R4546j13498k51085Q7175
6630B112763M8774O99979m9355o02177r0676L86176L94360m57293r9516J30095
6620B473130p3342k38594M20542L65514k06359N5028J68263j05961q5022L01693
6610C074892J60928j93336j00599J76364K16625l70344l7552L07866K65961J28258
6600C629063Q2783m20938k90391Q59987R6345l63545j35077n7717L04694n3748
6590C651456J5345K21093k9509M24547O59756o46758k60163K59841L50134O08338
$$ y = [1566869, 1410688, 1508053, 1721725, 2162123, 2731457, 2645439, 2198337, 2245813, 2270951, 2100131, 1776579, 1574785, 1319834, 1433244, 2222963, 2740157, 2401626, 1934137, 2246538, 2344806, 2484441, 2415048, 2220383, 1817718, 1765133, 2295625, 2390171, 2276673, 2025588, 2112763, 2161537, 2861516, 2812161, 2209984, 2119308, 2505484, 2899844, 2442551, 2343035, 2473130, 2399788, 2161194, 2581736, 2947250, 2740891, 2795919, 2964182, 2858221, 2773199, 3074892, 3235820, 3042484, 2941885, 3118249, 3334874, 2964530, 2926978, 3234844, 3500805, 3629063, 3711846, 3290908, 3000517, 3860504, 3956849, 3593304, 3458227, 3400510, 3705204, 3651456, 3666801, 3887894, 3858385, 4282932, 4942688, 4295930, 4035767, 4295608, 4645742, 5254080]
6580E254080m44960K47915P4764l14335O31670K82429l11907p0165M37164M52676
6570F239331L96787K76542N00549L19818K171N87907L41378M59047M66792N23909
6560A0114231K92675J30295k60463r7448N32645N4427M83161N97448M43558K01892
6550A2492421K4614K26199K01058p75148n57564j38933r2534L33641j8955M53205
6540A2148004O45824J56854M72619P80209Q24789P09304N74037R81874J130042
6531A8423556J268892J602499R91570R18017J371532J473618K131810K477618
6523C0659112K995002L516838L615390M108511L778298K262516J728357L27234
6515E2991258j091579k097236k944674l046007l511268l514871k803539k206268
$$ y = [5254080, 4809120, 5057035, 5131799, 4817464, 5449134, 5731563, 5419656, 5349491, 5786655, 6239331, 6636118, 6912660, 7413209, 7733027, 7735198, 8323105, 8664483, 9123530, 9590322, 10114231, 10406906, 10537201, 10276738, 10179290, 10711935, 10766362, 11249523, 11846971, 12290529, 12492421, 12517035, 12743234, 12944292, 12169144, 11611580, 11472647, 11380113, 11713754, 11694799, 12148004, 12793828, 12950682, 13423301, 14203510, 15028299, 15737603, 16311640, 17293514, 18423556, 19692448, 21294947, 22286517, 23204534, 24576066, 26049684, 28181494, 30659112, 33654114, 37170952, 40786342, 44894853, 48673151, 50935667, 52664024, 52991258, 51899679, 49802443, 46857769, 43811762, 40300494, 36785623, 33982084, 31775816]
6507C1775816j825463j220815j298184j116207n3715N31265L73814q025n00361
6498B6658125J094812J601864J082525J516158J535357L129070M005028M106984
6490D4729923N578411P513318J0114914J1732094J1044701R091882N336619k73502
6482A04868360n012136q585018j0475225j0340782r676544q744837p175337n250483
6474C9607998l636748l170682l160468k523402j979143j781173j677654r39986
6466B0738742q07178j407939j151066o00442n99049q07097q64675o95798n60053
6457A3245445k80354l84090q79530q46618l73271j780k64461q73931n68383m24594
6447H348433L6032O32375j52450p60981o18064m75671l05515l7530J8120J70330
$$ y = [31775816, 29950353, 28729538, 27431354, 26315147, 26261432, 26792697, 27166511, 27158486, 26658125, 27752937, 29354801, 30437326, 31953484, 33488841, 36617911, 40622939, 44729923, 50308334, 57821652, 67936566, 79668660, 90713361, 99805243, 105141862, 104868360, 99856224, 91271206, 80795981, 70455199, 60778655, 52033818, 44858481, 39607998, 35971250, 32800568, 29640100, 27116698, 25137555, 23356382, 21678728, 20738742, 19931564, 18523625, 17372559, 16772117, 16173068, 15365971, 14501296, 13805498, 13245445, 12965091, 12581001, 11701471, 10854853, 10481582, 10479802, 10215341, 9341410, 8773027, 8348433, 8384465, 9016840, 8864390, 8103409, 7485345, 7009674, 6704159, 6666629, 6684749, 6855079]
6437F855079m64341m71194l7077J78406J00318l81383q406K30779o03578m34541
6427D964062N6419R5527P7217j91176l01731L209K14454J29467L8036k07883M2689
6416D920290k80134p17211m27889p8588J37811M34502L14796N5914k0317k14417
6406D124757J08333n04137l90976R6925K6174n16366l29740M07050M12519P5565
6396C510104m49496q1578K19883J47297k26495m38226M0796L42435k08424k19545
6386B636751M6021k20737m7478J74310N00096K76501q13375j44287N19116L4767
6376B961685n35627m72311M6636K21432J03256j08012Q9349R8690M31314L72421
6366C208833m88575p63297m1267N98722R5022j87097k98820K03319j57708k67262
$$ y = [6855079, 6390738, 5919544, 5882467, 6060873, 6161191, 5779808, 5771402, 6002181, 5398603, 4964062, 5020481, 5116008, 5193225, 5002049, 4700318, 4703527, 4917981, 5047448, 5085484, 4877601, 4920290, 4640156, 3922945, 3495056, 3416468, 3554279, 3988781, 4303577, 4359491, 4339174, 4124757, 4233090, 3728953, 3337977, 3434902, 3461076, 2944710, 2614970, 3022020, 3434539, 3510104, 3060608, 2979030, 3198913, 3346210, 3119715, 2681489, 2722285, 3064720, 2856296, 2636751, 2682772, 2462035, 2414557, 2588867, 3088963, 3365464, 2552089, 2407802, 2926918, 2961685, 2426058, 1953747, 2000383, 2221815, 2325071, 2217059, 2306408, 2405098, 2836412, 3208833, 2720258, 1956961, 1915694, 2514416, 2609438, 2422341, 2123521, 2326840, 2169132, 1901870]
6356A901870K96008L06819P1690k47216j09513K43815j8470j29965k23040p6986
6346B015012p1623J42104J03521o3376j48499l02257J20749R5991j70899K35284
6336A956007q4384l07472N09480L59192K10868J36297m89873N54J4796L8307k59798
6325B083974k56196M12829L93428j74399J62500l3749k82756J8669o02351K17323
6315A939272J27711j24908J04866j41465j45347P8093j58662J00318o8192q7152
6305A624534J50527K80655L97915O9866l16812P0277J3484l13521J46257j21347
6295B001835k592J10392m823K74180k73029m00009K90138K73094j22950q9467
6285B056769l88148p4549p966J46993L06131n7123J00040J99472k69120M164M54589
$$ y = [1901870, 2197878, 2504697, 2576387, 2329171, 2219658, 2463473, 2445003, 2315038, 2091998, 2015012, 1943389, 2085493, 2189014, 2125638, 1977139, 1674882, 1795631, 1891622, 1720723, 1956007, 1871623, 1564151, 2073631, 2432823, 2643691, 2779988, 2290115, 2290669, 2305465, 2343772, 2083974, 1827778, 2240607, 2634035, 2459636, 2622136, 2588387, 2305631, 2324300, 1721949, 1939272, 2066983, 1942075, 2046941, 1905476, 1760129, 1838222, 1679560, 1779878, 1711686, 1624534, 1775061, 2055716, 2453631, 2523497, 2206685, 2276962, 2290446, 1976925, 2123182, 2001835, 1999243, 2109635, 2104812, 2378992, 2105963, 1705954, 1996092, 2269186, 2146236, 2056769, 1668621, 1594072, 1586106, 1733099, 2039230, 1982107, 2082147, 2281619, 2012499, 2016663, 2471252]
6274B471252J24823J88990N8633k10890J03809O4158J85439N1889L1901j78236
6264B891768k49867o51768j12346M00144N7594n4512k25956l34640M2818M98100
6254B261335K55885R8700k29845P31441Q49729m30905l66206l44289j17746k37062
6244B471037n94065m6537P7838k98285K02000M73028j03916j83759R1337R1967
6234B180645j06196l53097k01215L67210K92223K4348l71601k22783N06727M93801
6224B610062j86065k44020m29286Q7637o27m3595K09985j34579K06395L24682
6214B400589m519l35627j84931J80581q3649k69165J27406K07006l25189M0633
6204A753135L40137M79292J32534o11210l58890j10351N18836J40525l64278j34906
$$ y = [2471252, 2596075, 2785065, 2843698, 2632808, 2736617, 2800775, 2986214, 3038103, 3070004, 2891768, 2641901, 1990133, 1877787, 2277931, 2335525, 2281013, 2055057, 1720417, 1763235, 2261335, 2517220, 2615920, 2386075, 3117516, 3967245, 3536340, 3170134, 2825845, 2708099, 2471037, 1876972, 1830435, 1908273, 1609988, 1811988, 2285016, 2181100, 1997341, 2088678, 2180645, 2074449, 1721352, 1520137, 1887347, 2179570, 2203918, 1832317, 1609534, 2116261, 2610062, 2423997, 2179977, 1750691, 1838328, 1837701, 1794106, 2004091, 1869512, 2075907, 2400589, 2396070, 2060443, 1875512, 2056093, 1972444, 1703279, 1830685, 2037691, 1712502, 1753135, 2093272, 2572564, 2705098, 2093888, 1734998, 1624647, 2143483, 2284008, 1919730, 1784824]
6194A784824N37639J6368k56256L89387J79218j16326n94906q2769L73966K65133
6184B496278J20140j1378k80438n7627J27953K82607p7339l41675L74670O4780
6174B697971J4393O64341k40036q07941k91511M32372L04097l60425K47345M72039
6164C132645k93618K59910J91117Q4102K4138m43995j91001l15289J20598P21620
6154C290227l55952o53490J35595M56266M71397m82350l5692K62759J09131J61712
6144C359603j69927K82207M8137j79554m30584j40881N53433Q19587K11746k79053
6134D074714j57523N64964N82823j01951O1040m7140K94856J42053j71186M05059
6124E647709q5779o23090p65679j55953P10791J18951Q2888O00839j97096N84807
$$ y = [1784824, 2322463, 2338831, 2082575, 2471962, 2651180, 2534854, 1939948, 1857179, 2231145, 2496278, 2616418, 2605040, 2324602, 2266975, 2394928, 2677535, 2600196, 2258521, 2633191, 2697971, 2712364, 3376705, 3136669, 2328728, 2037217, 2469589, 2773686, 2413261, 2660606, 3132645, 2839027, 3098937, 3290054, 3374156, 3398294, 2954299, 2763298, 2448009, 2568607, 3290227, 2934275, 2280785, 2416380, 2872646, 3344043, 2861693, 2826001, 3088760, 3197891, 3359603, 3189676, 3471883, 3520020, 3340466, 2909882, 2769001, 3322434, 4142021, 4353767, 4074714, 3917191, 4482155, 5064978, 4963027, 5024067, 4976927, 5271783, 5413836, 5242650, 5647709, 5561930, 4938840, 4173161, 4017208, 4727999, 4846950, 4929838, 5530677, 5333581, 5918388]
6114E918388o3457n91232K67811l99181M73776M66470q7035M40676m2353m14234
6104E969629k24332q48763J0317K53505k66499R4666J25799L91420M80257K9995
6094F015994l19016m69319m3942M80701j06952k47844L40748N08985M42578K8865
6084F630798L8228m38240j49490M80728J17831j86963Q7300M02301P12974J13009
6074G808476j18696L91872k30441O6345L20701l46345J53219M22451O76740O50445
6064I794767k65187o0160K13665P9294N77576m5788J87043n1159N5880J33750
6054A0619681o3262L17941L20644p0653J51498L64546L22773R01111M75499K83583
$$ y = [5918388, 5854931, 5263699, 5531510, 5132329, 5606105, 6072575, 5985540, 6426216, 6383863, 5969629, 5745297, 4896534, 4906851, 5160356, 4893857, 4988523, 5114322, 5505742, 5985999, 6015994, 5696978, 5227659, 5183717, 5664418, 5557466, 5309622, 5650370, 6159355, 6601933, 6630798, 6669026, 6230786, 6081296, 6562024, 6679855, 6492892, 6580192, 6982493, 7695467, 7808476, 7689780, 8081652, 7851211, 7917556, 8238257, 7891912, 8045131, 8467582, 9144322, 9794767, 9529580, 9469420, 9683085, 9762379, 10339955, 10294167, 10481210, 10430051, 10485931, 10619681, 10556419, 10874360, 11195004, 11124351, 11275849, 11640395, 11963168, 12864279, 13339778, 13623361]
$$ [...]
##END NTUPLES=NMR SPECTRUM
##END=
