##TITLE=1H_DE-80H_X3
 200.13MHz, d2o
 8 sc
 
 19ns.26.2.2025
##JCAMPDX= 6.0         $$ Bruker NMR JCAMP-DX V2.0
##DATA TYPE= NMR SPECTRUM
##DATA CLASS= NTUPLES
##ORIGIN= UXNMR, Bruker Analytische Messtechnik GmbH
##OWNER= pz
$$ XWIN-NMR		Version 3.5
$$ Wed Dec 24 10:26:53 2025 Russian Standard Time (UT+4h)  Yarkov@DPX200
##.OBSERVE FREQUENCY= 200.1313
##.OBSERVE NUCLEUS= ^1H
##.ACQUISITION MODE= SIMULTANEOUS
##.ACQUISITION SCHEME= undefined
##.AVERAGES= 8
##.DIGITISER RES= 18
##SPECTROMETER/DATA SYSTEM= spect
##.PULSE SEQUENCE= zg30
##.SOLVENT NAME= CDCl3
##.SHIFT REFERENCE= (INTERNAL, CDCl3, 0, 15.4825)
##AUDIT TRAIL= $$ (NUMBER, WHEN, WHO, WHERE, WHAT)
$$ ##TITLE= Audit trail, XWIN-NMR		Version 3.5
$$ ##JCAMPDX= 5.01
$$ ##ORIGIN= Bruker BioSpin GmbH
$$ ##OWNER= Yarkov
$$ C:/Bruker/XWIN-NMR/data/yarkov2/nmr/H-C/1/pdata/1/auditp.txt
$$ ##AUDIT TRAIL=  $$ (NUMBER, WHEN, WHO, WHERE, WHAT)
(   1,<2025-12-24 10:26:02.18 +0400>,<Yarkov>,<DPX200>,
      <created by zg, POWCHK disabled, PULCHK disabled
       configuration hash MD5:
       00 E9 B6 7A A2 85 ED C7 34 08 36 98 17 FE 4E 26
       data hash MD5: 16K
       0B 2B BE 8A E8 B7 9E ED 52 68 76 FD E8 98 12 43>)
(   2,<2025-12-24 10:26:11.00 +0400>,<Yarkov>,<DPX200>,
      <Start of raw data processing
       efp BC_mod = 2 LB = 0.25 FT_mod = 6 PKNL = 1 PHC0 = -5299.955 PHC1 = 10.82193 SI = 16K 
       data hash MD5: 16K
       5B EA 82 81 D4 1C 27 78 73 C9 63 09 DA 31 0A 2A>)
$$ ##END=
$$ 
$$ hash MD5
$$ 73 0B C6 F1 85 FC 26 E7 EB 27 52 F6 CB 1C 91 2B
##$RELAX= 
##$RELAX= 
##$RELAX= 
##$RELAX= 
##$RELAX= 
##$RELAX= 
$$ Bruker specific parameters
$$ --------------------------
##$DU= <C:/Bruker/XWIN-NMR>
##$EXPNO= 1
##$NAME= <H-C>
##$PROCNO= 1
##$TYPE= <nmr>
##$USER= <yarkov2>
##$AMP= (0..31)
100 100 100 100 100 100 100 100 100 100 100 100 100 100 100 100 100 100 
100 100 100 100 100 100 100 100 100 100 100 100 100 100 
##$AQSEQ= 0
##$AQ_mod= 1
##$AUNM= <au_zg>
##$AUTOPOS= <>
##$BF1= 200.13
##$BF2= 200.13
##$BF3= 200.13
##$BF4= 200.13
##$BF5= 200.13
##$BF6= 200.13
##$BF7= 200.13
##$BF8= 200.13
##$BYTORDA= 1
##$CFDGTYP= 0
##$CFRGTYP= 5
##$CHEMSTR= <none>
##$CNST= (0..31)
1 1 145 1 1 1 1 1 1 1 1 1 1 1 1 1 1 1 1 1 1 1 1 1 1 1 1 1 1 1 1 1 
##$CPDPRG= <>
##$CPDPRG1= <>
##$CPDPRG2= <>
##$CPDPRG3= <>
##$CPDPRG4= <mlev>
##$CPDPRG5= <mlev>
##$CPDPRG6= <mlev>
##$CPDPRG7= <mlev>
##$CPDPRG8= <mlev>
##$CPDPRGB= <>
##$CPDPRGT= <>
##$D= (0..31)
0 0.7 0 0 0 0 0 0 0 0 0 0.03 0 0 0 0 0 0 0 0 0 0 0 0 0 0 0 0 0 0 0 0 
##$DATE= 1766557561
##$DBL= (0..7)
120 120 120 120 120 120 120 120 
##$DBP= (0..7)
150 150 150 150 150 150 150 150 
##$DBP07= 0
##$DBPNAM0= <>
##$DBPNAM1= <>
##$DBPNAM2= <>
##$DBPNAM3= <>
##$DBPNAM4= <>
##$DBPNAM5= <>
##$DBPNAM6= <>
##$DBPNAM7= <>
##$DBPOAL= (0..7)
0.5 0.5 0.5 0.5 0.5 0.5 0.5 0.5 
##$DBPOFFS= (0..7)
0 0 0 0 0 0 0 0 
##$DE= 6
##$DECBNUC= <off>
##$DECIM= 32
##$DECNUC= <off>
##$DECSTAT= 4
##$DIGMOD= 1
##$DIGTYP= 9
##$DL= (0..7)
0 120 120 120 120 120 120 120 
##$DP= (0..7)
$$ [...]
##$SUBNAM2= <"">
##$SUBNAM3= <"">
##$SUBNAM4= <"">
##$SUBNAM5= <"">
##$SUBNAM6= <"">
##$SUBNAM7= <"">
##$SUBNAM8= <"">
##$SUBNAM9= <"">
##$SW= 18.0517328524113
##$SWIBOX= (0..15)
0 0 2 0 0 0 0 0 0 0 0 0 0 0 0 0 
##$SW_h= 3612.71676300578
##$TD= 16384
##$TD0= 1
##$TE= 0
##$TE2= 300
##$TE3= 300
##$TEG= 300
##$TL= (0..7)
0 120 120 120 120 120 120 120 
##$TP= (0..7)
150 150 150 150 150 150 150 150 
##$TP07= 0
##$TPNAME0= <>
##$TPNAME1= <>
##$TPNAME2= <>
##$TPNAME3= <>
##$TPNAME4= <>
##$TPNAME5= <>
##$TPNAME6= <>
##$TPNAME7= <>
##$TPOAL= (0..7)
0.5 0.5 0.5 0.5 0.5 0.5 0.5 0.5 
##$TPOFFS= (0..7)
0 0 0 0 0 0 0 0 
##$TUNHIN= 0
##$TUNHOUT= 0
##$TUNXOUT= 0
##$USERA1= <user>
##$USERA2= <user>
##$USERA3= <user>
##$USERA4= <user>
##$USERA5= <user>
##$V9= 5
##$VALIST= <valist>
##$VCLIST= <CCCCCCCCCCCCCCC>
##$VD= 0
##$VDLIST= <DDDDDDDDDDDDDDD>
##$VPLIST= <PPPPPPPPPPPPPPP>
##$VTLIST= <TTTTTTTTTTTTTTT>
##$WBST= 1024
##$WBSW= 4
##$XGAIN= (0..3)
0 0 0 0 
##$XL= 0
##$YL= 0
##$YMAX_a= 56495
##$YMIN_a= -34752
##$ZGOPTNS= <>
##$ZL1= 120
##$ZL2= 120
##$ZL3= 120
##$ZL4= 120
##$ABSF1= 0
##$ABSF2= 0
##$ABSG= 0
##$ABSL= 0
##$ALPHA= 0
##$AQORDER= 0
##$ASSFAC= 0
##$ASSFACI= 0
##$ASSFACX= 0
##$ASSWID= 0
##$AUNMP= <proc_1d>
##$AZFE= 0.1
##$AZFW= 0.1
##$BCFW= 0
##$BC_mod= 2
##$BYTORDP= 0
##$COROFFS= 0
##$CY= -3
##$DATMOD= 1
##$DC= 0
##$DFILT= <>
##$DTYPP= 0
##$F1P= 0
##$F2P= 0
##$FCOR= 1
##$FTSIZE= 16384
##$FT_mod= 6
##$GAMMA= 0
##$GB= 0
##$INTBC= 1
##$INTSCL= 3.241238e-09
##$ISEN= 128
##$LB= 0.25
##$LEV0= 0
##$LPBIN= 0
##$MAXI= 10000
##$MC2= 0
##$MEAN= 0
##$ME_mod= 0
##$MI= 1.114404
##$NCOEF= 0
##$NC_proc= -8
##$NLEV= 6
##$NOISF1= 3.799351
##$NOISF2= 2.8
##$NSP= 0
##$NTH_PI= 0
##$NZP= 0
##$OFFSET= 15.48246
##$PC= 1
##$PHC0= -5299.955
##$PHC1= 10.82193
##$PH_mod= 1
##$PKNL= yes
##$PPARMOD= 0
##$PSCAL= 0
##$PSIGN= 0
##$REVERSE= no
##$SF= 200.130007854429
##$SI= 16384
##$SIGF1= 3
##$SIGF2= 2
##$SINO= 0.751879
##$SIOLD= 32768
##$SREGLST= <19F.Aceton>
##$SSB= 0
##$STSI= 16384
##$STSR= 0
##$SW_p= 3612.71676300578
##$SYMM= 0
##$S_DEV= 0
##$TDeff= 16384
##$TDoff= 0
##$TI= <>
##$TILT= no
##$TM1= 0
##$TM2= 0
##$TOPLEV= 0
##$USERP1= <user>
##$USERP2= <user>
##$USERP3= <user>
##$USERP4= <user>
##$USERP5= <user>
##$WDW= 1
##$XDIM= 16384
##$YMAX_p= 520645420
##$YMIN_p= -1664698
$$ End of Bruker specific parameters
$$ ---------------------------------
##NTUPLES= NMR SPECTRUM
##VAR_NAME=  FREQUENCY,     SPECTRUM/REAL,   SPECTRUM/IMAG
##SYMBOL=    X,             R,               I
##VAR_TYPE=  INDEPENDENT,   DEPENDENT,       DEPENDENT
##VAR_FORM=  AFFN,          ASDF,            ASDF
##VAR_DIM=   16384,         16384,           16384
##UNITS=     HZ,            ARBITRARY UNITS, ARBITRARY UNITS
##FACTOR=    0.220516191357247, 1,           1
##FIRST=     3098.50484580327, 0,            0
##LAST=      -514.21191720251, 0,            0
##MIN=       -514.21191720251, -1664698,     0
##MAX=       3098.50484580327, 520645420,    0
$$ Real data points
##PAGE= N=1
##DATA TABLE= (X++(R..R)), XYDATA
$$ [...]
5246C647993j251611P00058k97218P20873p2478k63534L57314p7600L61714n00314
5236C325197N5441Q684J2789M41227o86779K6451L00034m51654J415092j172458
5226C274024J70447J51219M1800M3684n7596l38297N28811L35811n89255N31721
5216D092369n46170J28875M60328r92801L00116j98091L30584J92865m5582m54280
5206C268213J32683q2843j48283J53569k11901L70131O18175R0380l22506M51112
5196D318730o71219L67399j030857j19071k11118L38595K56419P76666n37882
5187C487662O43054K70711l51133J211474j821857P86157l67095m33485J49285
5178C574773k41257l40203N47004J26295J78791n78235K40379J19809j89431K61944
$$ plain form
5246 3647993 2396382 3096440 2799222 3520095 3447617 3184083 3541397 3463797 3825511 3325197
5236 3325197 3380638 3389322 3402111 3843338 3156559 3183010 3483044 3031390 4446482 3274024
5226 3274024 3444471 3595690 3637490 3681174 3623578 3285281 3814092 4149903 3560648 4092369
5216 4092369 3546199 3675074 4135402 3142601 3442717 3244626 3575210 3768075 3722493 3268213
5206 3268213 3400896 3318053 3169770 3323339 3111438 3481569 4099744 4190124 3867618 4318730
5196 4318730 3647511 4014910 2984053 2864982 2653864 2992459 3248878 4025544 3487662
5187 3487662 4130716 4401427 4050294 5261768 3439911 4226068 3858973 3425488 3574773
5178 3574773 3333516 2993313 3540317 3666612 3845403 3267168 3507547 3627356 3437925 3699869
5168C699869l25021L37486m3670o807p8054J76332o14286P62393m81076J71918
5158C599084k22968N18990L90950m8911K84156p65494P70136j6576j43820l05513
5148D060034k31805j99064K54275l84755k40494k0222k00644O51787j9460M68465
5138D138117K1727j00425O16847J40821m76626M68071p01244J49028J04908o31072
5128C730152J86047k97443Q74158l88200N15293n43600O23568K38769n09512L05551
5118D734783k82510L78743m70275R7980l5832L97893k83124L28013j71892l34828
5108D358951K1856j6930N25309o47523M35289N93709J7927m85299j86781m00454
5098D216054N29884J31019k12698M938m73745J022735m14941R95025q45958N49186
$$ plain form
5168 3699869 3374848 3712334 3668664 3661857 3583803 3760135 3145849 3908242 3427166 3599084
5158 3599084 3376116 3895106 4286056 4237145 4521301 3755807 4525943 4509367 4365547 4060034
5148 4060034 3828229 3629165 3883440 3498685 3258191 3237969 3037325 3689112 3669652 4138117
5138 4138117 4159844 4059419 4676266 4817087 4340461 4808532 4107288 4256316 4361224 3730152
5128 3730152 3916199 3618756 4492914 4104714 4620007 4076407 4699975 4938744 4429232 4734783
5118 4734783 4452273 4831016 4360741 4458721 4422889 4820782 4537658 4865671 4693779 4358951
5108 4358951 4380807 4363877 4889186 4241663 4676952 5270661 5288588 4803289 4616508 4216054
5098 4216054 4745938 4876957 4664259 4669197 4195452 5218187 4803246 5798271 4952313 5501499
5088E501499J01285k24554N59951j037403o071K39711K57903m83298P12981m12163
5078E209841N48723k90832l98373l42133J84M89061N45214Q13296m13811Q29566
5068F990736m17612J67860j70812o88560K92946J75728r5230J7992j072415Q53251
5058F053884J05394K21805K87030j47695O39420m6531l28498p50780O05338p14783
5048E924584J510801q94522J347163m48005Q74377l09329n10633O81302m86087
5039G689651J072729J63743P92640m66837P92412j30415N12511L60085J66600
5030A0953119P82950M78601L30213O44750k4613J956402J214764L009029J382529
5021B0727744L660083M335843P948652J3912642J9462867K1620871J5248832O025749
$$ plain form
5088 5501499 5602784 5378230 5938181 4900778 4894707 5134418 5392321 4909023 5622004 5209841
5078 5209841 5758564 5467732 5069359 4727226 4727410 5216471 5761685 6574981 6161170 6990736
5068 6990736 6573124 6740984 6570172 5881612 6174558 6350286 6255056 6273048 5200633 6053884
5058 6053884 6159278 6381083 6668113 6520418 7159838 7113307 6784809 6034029 6639367 5924584
5048 5924584 7435385 6540863 7888026 7440021 8314398 8005069 7494436 8175738 7689651
5039 7689651 8762380 8926123 9718763 9251926 10044338 9913923 10426434 10786519 10953119
5030 10953119 11736069 12214670 12544883 13189633 13165020 15121422 16336186 19345215 20727744
5021 20727744 24387827 28723670 36672322 50584964 70047831 91668702 106917534 112943283
5013A12943283q601010j6651803j8348917j5552328j1671828p508444n860145
5006B8748808m005211l125682k156995k259672k027518j061698n10483l5142l95249
4997A3171158n07101N71689J41549m152k28319r58862J84025m48337l93145L42267
4987A1870772q92269K41065K14448l22139R26196l28323L38212O55219n36488
4978A2166693O9027j9714l1428K69095O36796l40839J162273n19269M14091L16853
4968A4123578m68731Q96706m3024Q70520J79810J056189q5631P50804Q213M68273
4958A7756707N12422Q62939K281669J168979L040263L039168N442654R277819
4950D3382620J5158306J8333309J5914324J1076433O240083m573934j3100994
$$ plain form
5013 112943283 104342273 87690470 69341553 53789225 42117397 34608953 28748808
5006 28748808 24743597 21617915 19460920 17201248 15173730 14112032 13601549 13566407 13171158
4997 13171158 12664057 13235746 13377295 13373143 13144824 12185962 12369987 11921650 11528505 11870772
4987 11870772 10978503 11219568 11434016 11111877 12038073 11709750 12047962 12703181 12166693
4978 12166693 12235720 12216006 12184578 12453673 13090469 12749630 13911903 13392634 13806725 14123578
4968 14123578 13654847 14551553 14508529 15379049 15558859 16615048 16529417 17280221 17288434 17756707
4958 17756707 18269129 19132068 21413737 22582716 25622979 28662147 34104801 43382620
4950 43382620 58540926 76874235 92788559 103864992 110105075 105531141 92430147
4943I2430147j5388497j5965390j1960752q577077n281283m568382k526849k890245
4935B5271672j765599j597839j035834l61793p18390q0502j009166l16552k2949
4926A8363048K47456M8596J014055N4607L66285Q0416o39483K29260p33251M42596
4916A9473585k39310j86114J31466l91175R5017n47860o57451q46889k48735m81533
4906A6101001L6770j62894l8919k18523j77158R77131n57320J186707r8031N5873
4896A7104637p6894q99012m36162j925k80578J42054m13987o00692O28451n26575
4886A4639317K75957o00849N7495j81128J97838k74601J33375l40889k07338L04549
4876A4003726j22822J17009K3992K10338O16748Q3088j46310k1127R9285N51977
$$ plain form
4943 92430147 77041650 61076260 49115508 40538431 35257148 30688766 28161917 25271672
4935 25271672 23506073 21908234 20872400 20510607 19792217 19711715 18702549 18385997 18363048
4926 18363048 18610504 18659100 19673155 19727762 20094047 20174463 19534980 19764240 19030989 19473585
4916 19473585 19234275 19048161 19179627 18788452 18883469 18335609 17678158 16831269 16582534 16101001
4906 16101001 16137771 15974877 15935958 15717435 15540277 16517408 15960088 17146795 17048764 17104637
4896 17104637 17027743 16128731 15692569 15690644 15410066 15552120 15138133 14537441 15165892 14639317
4886 14639317 14915274 14314425 14371920 14190792 14388630 14114029 14247404 13906515 13699177 14003726
4876 14003726 13880904 13997913 14021905 14232243 14848991 14932079 14785769 14764642 14863927 15415904
4866A5415904j047384Q54400j25780L85044r945k07090k55769J51214Q1849k299
4856A5240144N51312p45122R23835j178714r7750p00095j95746Q569K68129M66085
4846A4540647q37224N41437o89514R83779m06625N38089k47320m73975N77570
4837A4526864n45788l41664K83785j51849L78974K80523K03815O13139l27830
4828A4919969j94641o99419q4137n00924K23447o08952Q47264q04077p0657k67794
4818A2760079M61005M62999J39423L51972n22612q1717r22459l53143o8045l68702
4808A1858800L52446O2682K5434P83757l95256O10222p35681R6250m93841J54406
4798A2319219l68514r8365n24392L24816K50643j9230K99175r7639M77244n00318
$$ plain form
4866 15415904 14368520 15222920 15097140 15482184 15472239 15265149 15009380 15160594 15242443 15240144
4856 15240144 15791456 15046334 15970169 14791455 14693705 13993610 13797864 13806433 14074562 14540647
4846 14540647 13703423 14244860 13555346 14539125 14132500 14670589 14423269 13949294 14526864
4837 14526864 13981076 13639412 13923197 13771348 14150322 14430845 14634660 15247799 14919969
4828 14919969 14725328 14025909 13941772 13440848 13664295 13055343 13902607 13098530 13027873 12760079
4818 12760079 13221084 13684083 13823506 14175478 13652866 13571149 12648690 12295547 12227502 11858800
4808 11858800 12211246 12273928 12299362 13083119 12687863 13298085 12562404 12658654 12164813 12319219
4798 12319219 11950705 11852340 11327948 11652764 11903407 11884177 12183352 12085713 12562957 12062639
4788A2062639L83916l18658J11048K21023L87293l26876K68424l12955n2577n27629
4778A1895648M0666n40707l52984J96370Q2071K30699L05999n3945Q6690O4772
4768A1955279j77431j56469l53987m4682k90210N20441l56074M94556O16857J45976
4758A2354256L1140L95490m02182N92077k40113m54951o5813n86065j47399K44671
4748A1721111j07512j94701J26999O88468k01495K8577Q8034k47656K51666k80976
4738A1872515m50479p1757o5377l80011Q89318o20685Q90076l61903K80660J85380
4728A2167737n75007O51118j84818P94518o55793J70332L1377K1353N22030j37490
4718A2805357K1190r55309Q24475m60817J79396K68803o72627J000322l93224
$$ plain form
4788 12062639 12446555 12127897 12238945 12459968 12847261 12520385 12788809 12475854 12423277 11895648
4778 11895648 11936314 11395607 11042623 11238993 11321064 11551763 11857762 11803817 11890507 11955279
4768 11955279 11777848 11621379 11267392 11222710 10932500 11452941 11096867 11591423 12208280 12354256
4758 12354256 12385396 12780886 12378704 12970781 12730668 12275717 12209904 11623839 11476440 11721111
4748 11721111 11613599 11418898 11545897 12234365 12032870 12061447 12149481 11901825 12153491 11872515
4738 11872515 11422036 11350279 11284902 10904891 11794209 11173524 12063600 11701697 11982357 12167737
4728 12167737 11592730 12243848 12059030 12853548 12197755 12368087 12399464 12420817 12942847 12805357
4718 12805357 12826547 11871238 12695713 12234896 12414292 12683095 12010468 13010790 12617566
4709A2617566J63701M9539L11525J10365P64347l95905O65885k263L13375M15308
4699A5013443m64966P66429j30103N26182l4136l93706J15056l91256j75380P00562
4689A5532125q10821K17170M77637r38445M70186l35423n16890J030943p97657
4680A4328825l4377K3556j75532L46705L00500k8515M18387M36872L53301K85115
4670A6254837l77724m79433N27659k17996J000653k73245O3201K89753j053729
4661A5733976K81282j250711J13970J21945p2904K12634j02521k90452M72527
4652A5219746K81482O63836l05628M70731L64696K48413J77921n65312J83036
4643A6738921N19185L43473P87985O81066q4768O99224l63890L49202l87302L80653
$$ plain form
4709 12617566 12781267 12830806 13142331 13252696 14017043 13621138 14287023 14284760 14598135 15013443
4699 15013443 14548477 15314906 15184803 15710985 15676849 15283143 15398199 15006943 14831563 15532125
4689 15532125 14721304 14938474 15416111 14477666 14947852 14612429 14095539 15126482 14328825
4680 14328825 14294448 14318004 14142472 14489177 14789677 14761162 15179549 15616421 15969722 16254837
4670 16254837 15877113 15397680 15925339 15707343 16707996 16434751 16497952 16787705 15733976
4661 15733976 16015258 14764547 14878517 15000462 14927558 15140192 15037671 14747219 15219746
4652 15219746 15501228 16165064 15859436 16330167 16694863 16943276 17121197 16555885 16738921
4643 16738921 17258106 17601579 18389564 19070630 18985862 19685086 19321196 19670398 19283096 19663749
4633A9663749N21359J40032M90812R4687j18712R44521R84791P74775J852256
4624B5348270K027873K359747J285846q8800r44863j044557j206771k115600q71129
4615B4750016j554134m04581l53598r89334L02761o52566P51857o24070k311q73333
4605B0350707k12156p36700K90240r71888m60130K54503p0501K69369o28667l02908
4595A7781869l1373j00299N4980M73917j90394J156799q61694N02970l52016k18251
4585A8216508M25539L90550m72502J70193o50343n21939L82260r56276r9532j32655
4575A6751803k62467J85215l60614j088142N5233j03113L83568K98194q33772
4566A5025905J64426P3848n75877k45891p65622k1280K91940L76773l98623K07297
$$ plain form
4633 19663749 20185108 20325140 20815952 20910639 20791927 21736448 22721239 23496014 25348270
4624 25348270 27376143 29735890 31021736 30932936 29988073 28943516 27736745 25621145 24750016
4615 24750016 23195882 22791301 22437703 21448369 21751130 21098564 21850421 21226351 21224040 20350707
4605 20350707 20138551 19401851 19692091 18720203 18260073 18514576 18444075 18713444 18084777 17781869
4595 17781869 17750496 17650197 17705177 18179094 17988700 19145499 18283805 18786775 18434759 18216508
4585 18216508 18642047 19032597 18560095 18730288 18079945 17558006 17940266 16983990 16884458 16751803
4575 16751803 16489336 16674551 16313937 15225795 15281028 15177915 15561483 15859677 15025905
4566 15025905 15190331 15264179 14688302 14442411 13676789 13655509 13947449 14324222 13925599 14132896
4556A4132896p16036K82650K91503p94487K99781m19962Q70350n75542m72865
4547A2898288l66813j4155K94163o90762j41144l80572l13277P40832j040173
4538A0986387K89534J45615m20058O97199q67037L39819o52876L16096L2884K43256
4528A1110819q02877Q19493J04514q6239O080m94836J25203J70467m6395K61602
4518A1167831n80608n69358L41454n68160j66402l29891N44020m42087N20727
4509I917526j359095Q23078q0730R23839k99734k16345k57289J46260M40084l43059
4499I694535l0053k58439Q04343J13093N6294r36887K37570L82495K8885j34601
4489I957235R0268o45608P7405j93898L17682l37792L85587K85608J32766o27273
$$ plain form
4556 14132896 13416860 13699510 13991013 13196526 13496307 13076345 13946695 13371153 12898288
4547 12898288 12531475 12517320 12811483 12120721 11979577 11599005 11285728 12026560 10986387
4538 10986387 11275921 11421536 11001478 11698677 10831640 11171459 10518583 10834679 10867563 11110819
4528 11110819 10307942 11127435 11231949 11145710 11151790 10656954 10782157 10952624 10906229 11167831
4518 11167831 10587223 10017865 10359319 9791159 9624757 9294866 9838886 9396799 9917526
4509 9917526 8558431 9381509 9300779 10224618 9924884 9708539 9451250 9597510 10037594 9694535
4499 9694535 9664482 9406043 10210386 10323479 10379773 9442886 9680456 10062951 10091836 9957235
4489 9957235 10047503 9401895 9479300 9285402 9603084 9265292 9650879 9936487 10069253 9441980
4479I441980L26876n229P91779P3606n44484N28552m49745O79142p93422J68285
4469A0217340j54079P67390k22279o573o09073J95413Q5162N27027o37519n71875
4459I590934J012375K56341J375353L37657N47635J263338J386099N18241J229640
4450A7517613n61686N77714L7599p89644o96487j028416m09662J02741K3464j244387
4440A3528849l61772l69248l61853p69262q97804m55752J15743K23596O88038
4431A1340535L20422j24565J036684k2245L02969L46092r458L39560Q19093k38035
4421A4111052N61486l0184J80995Q53355o31847O3463m05017m39463n46584l42233
4411A3375023j029326M05903j23987K90091L25187o51883O87492l08093j75922
$$ plain form
4479 9441980 9768856 9763627 10555406 10629012 10084528 10613080 10163335 10842477 10049055 10217340
4469 10217340 10063261 10830651 10608372 10601799 9992726 10188139 10273301 10800328 10162809 9590934
4459 9590934 10603309 10859650 12235003 12572660 13120295 14383633 15769732 16287973 17517613
4450 17517613 16955927 17533641 17571240 16781596 16085109 15056693 14647031 14749772 14773236 13528849
4440 13528849 13167077 12797829 12435976 11666714 10768910 10313158 10428901 10652497 11340535
4431 11340535 11660957 11536392 12573076 12550831 12853800 13199892 13190434 13529994 14349087 14111052
4421 14111052 14672538 14642354 14823349 15676704 15044857 15108320 14703303 14263840 13717256 13375023
4411 13375023 12345697 12751600 12627613 12917704 13242891 12591008 13278500 12970407 12794485
4402A2794485J3902m53361P47935L4792n9396l53572k89226K92232p3330J101954
4392A3756415j048884J131323m29661l49973J72214j839963Q97145J814N57424
4383A2847854P1732J45997M9953l64373M40801j680260l8749o19619L22109j64450
4373A1010995M6813p57605O92788J027779n02801J092492r35305O92039l11982
4364A2055213K0952l29373N44437L27934J279069J229348J268584J151090K367552
4355A9914806K007004O00556K155036n14487Q65376m61364j691125j276327k215651
4346A9383824j103629j010705j482322n03906r59995K51313l78975r85430J10747
4337A3320922q38657l4867M54770q92638L67594J74664L23653L40451n46670q0026
$$ plain form
4402 12794485 12808387 12355026 13102961 13137753 13078357 12724785 12435559 12727791 12654461 13756415
4392 13756415 12707531 13838854 13409193 13059220 13231434 11391471 12288616 12290430 12847854
4383 12847854 12919586 13065583 13115536 12751163 13191964 11511704 11472955 10853336 11175445 11010995
4373 11010995 11057808 10300203 10992991 12020770 11517969 12610461 11675156 12367195 12055213
4364 12055213 12076165 11746792 12291229 12619163 13898232 15127580 16396164 17547254 19914806
4355 19914806 21921810 22522366 24677402 24162915 25028291 24566927 22875802 21599475 19383824
4346 19383824 18280195 17269490 15787168 15283262 14323267 14574580 14195605 13210175 13320922
4337 13320922 12482265 12447398 12902168 12009530 12377124 12551788 12875441 13215892 12669222 12589196
4327A2589196n84472N57332j53115J26010J67490K24924k66191M54709j579959
4318A1535924J322585m32387m1411M56400r99127M84412l07663M87775n89743
4309A1916765J199543m00684J056981j3251K2425k16842L01428K84377L31565
4300A4482307Q48038R3949J750937J21401J71300l48514l47850J73223o55306
4291A6289485k3433q15283j053530N54719l60439L89705k21023m35846L03648
4282A4628003k5737p36575n1965m83935k83211L8871n48402k32340J4714l15081
4272A2004342R5144m77365k53224q06046L73438N39620j374711Q04638j143582
4263I762254L72434l6618n00943M71756L26099M52521K26744l19136o93731j21011
$$ plain form
4327 12589196 12004724 12562056 12408941 12534951 12702441 12927365 12661174 13115883 11535924
4318 11535924 12858509 12426122 12384711 12841111 11841984 12326396 12018733 12506508 11916765
4309 11916765 13116308 12715624 13772605 13759354 13781779 13564937 13866365 14150742 14482307
4300 14482307 15330345 15424294 17175231 17296632 17467932 17119418 16771568 16944791 16289485
4291 16289485 16266052 15450769 14397239 14951958 14591519 14981224 14760201 14324355 14628003
4282 14628003 14602266 13865691 13813726 13329791 13046580 13085451 12537049 12304709 12319423 12004342
4272 12004342 12099486 11622121 11368897 10562851 10936289 11475909 10101198 10905836 9762254
4263 9762254 10134688 10098070 9597127 10068883 10394982 10847503 11074247 10755111 10061380 9940369
4253I940369K2368j110210O51148n35101M22838k38451j250312N06085p84147
4244G624587M34939m41078P41032o62059O15838o52926N9512J84042p19082J071175
4234H255980K20675j53702l64469o08063L47987m82549L22814O26603o20985J333286
4224H877577j390101N68933n53084o78753J69134j08219J44862R4133K47622n08829
4214F863275K60358q60710K09966l06846M46956j66890p95016l16004n89831L86522
4204E131780N7599N30616J93374N45750l48004N03961q56536J57429l50282J55981
4194E721668o9327N3103K23358m37837L11661m35449L77952m1369N76536o77902
4184E602394K50894p01557k25358l00667r8166L65165m08006J2635j75227N27829
$$ plain form
4253 9940369 9962737 8852527 9503675 8968574 9391412 9152961 7902649 8408734 7624587
4244 7624587 8059526 7618448 8359480 7697421 8313259 7660333 7719845 7903887 7184805 8255980
4234 8255980 8476655 8322953 7958484 7350421 7698408 7215859 7538673 8165276 7544291 8877577
4224 8877577 7487476 8056409 7503325 6824572 6993706 6885487 7030349 7124482 7372104 6863275
4214 6863275 7123633 6262923 6472889 6166043 6612999 6446109 5651093 5335089 4745258 5131780
4204 5131780 5189379 5719995 5913369 6459119 6111115 6615076 5758540 5915969 5565687 5721668
4194 5721668 5652341 5705444 5928802 5490965 5802626 5367177 5745129 5703760 6280296 5602394
4184 5602394 5853288 5151731 4926373 4625706 4527540 4892705 4484699 4497334 4322107 4849936
4174D849936N6775o68131J036917j071672P89992l52598k14121Q28601n17641
4165D738058L79453k84587j23073j98223K6853p11233M25162n30591M36767j0246
4155D148340n06943L70489l53309K69413L35958m82771P55749o03148k41499k75915
4145C416364Q9382n8188M71968Q07311o62229O01756l32664q0656Q883n96622
4135C665305L06090n30767j52259L84152n41069J99186q30056Q35199J36346N16350
4125C988477r453m32413M9990M3411m43916l42575L14422k38092J040130n19467
4115C450514P35129m92413j70806M08698m87620K26612j63530n87239J69343j64275
4105B924413K62703N57888l39092L78047K85677l52381l70490Q7347o98181L17312
$$ plain form
4174 4849936 4906711 4238580 5275497 4203825 4993817 4641219 4427098 5255699 4738058
4165 4738058 5117511 4832924 4709851 4511628 4538481 3827248 4252410 3721819 4158586 4148340
4155 4148340 3641397 4011886 3658577 3927990 4263948 3781177 4536926 3933778 3692279 3416364
4145 3416364 3505746 3447558 3919526 4726837 4064608 4666364 4333700 4253044 4261927 3665305
4135 3665305 3971395 3440628 3288369 3672521 3131452 3330638 2500582 3335781 3472127 3988477
4125 3988477 3979024 3546611 3596601 3640012 3196096 2853521 3167943 2929851 3969981 3450514
4115 3450514 4185643 3693230 3522424 3931122 3443502 3670114 3506584 2919345 3088688 2924413
4105 2924413 3187116 3745004 3405912 3783959 4069636 3717255 3346765 3434112 2735931 3053243
4095C053243r39245N28254q1978k6000L1094O19964q1686O741K09963m41973P54225
4084C632602q43892R02107n67183Q5598l23692j18127L22543q2326L90661k67549
4074C130742N04177N2800n1868l43300p81681p9833k32603l70999M53603m41188
4064A839850M0456N45849j97574O35373M29582K84343J57121m62355J19232p20673
4054B671204O88873m72215P80778M64524K14311K15431p30438n8287j409714Q39125
4044C203592j458236Q95052o91105L12450P9723m95668O22281n64199J210915
4035C114805J5852K03392M31638m58468K65448k68670j76182Q11746j77015L62938
4025D125484p5841k69025k39574l6821o15095Q11797o06481O7974m13728r175
$$ plain form
4095 3053243 2113998 2642252 2560274 2534274 2565368 3185332 3103646 3110387 3320350 2878377 3632602
4084 3632602 2788710 3690817 3123634 3209232 2885540 2767413 3089956 3007630 3398291 3130742
4074 3130742 3634919 3687719 3635851 3292551 2510870 2431037 2198434 1827435 2281038 1839850
4064 1839850 1880306 2426155 2228581 2863954 3293536 3577879 3735000 3272645 3391877 2671204
4054 2671204 3360077 2887862 3668640 4133164 4347475 4562906 3832468 3774181 2364467 3203592
4044 3203592 1745356 2640408 1949303 2261753 2341476 1845808 2468089 1903890 3114805
4035 3114805 3130657 3334049 3765687 3307219 3572667 3303997 3127815 3939561 3762546 4125484
4025 4125484 4049643 3780618 3541044 3504223 2889128 3700925 3094444 3162418 2748690 2739515
4015B739515p5420n55028M24245K35906L77296R1741m908N49982o43666J00313
4005C239976k4823n14480Q21562j96646Q01409l217p61967M02715r40695k9489
3995B794345L53458p29090P38741o04827L93789Q1449J81431j01189L24272j3636
3985C418743J14374n95192l62489j91662k11827l93433L00249J056572M60027
3976C595362L20934o09677j74805n63454n16419J20355j39190p6313P62475n26837
3966B192431P93696J14632n88722M69752l44892p8889k7413l00566n31497m88585
3956A209947J84146R0715N82243j05138M08979K38326l97753P8532l79611M97306
3946B407692n23587M13779m51373M88462J7542n74690N39601j097052Q28732m68858
$$ plain form
4015 2739515 2664095 2109067 2533312 2769218 3146514 3238255 3233347 3783329 3139663 3239976
4005 3239976 3215153 2700673 3522235 3325589 4126998 4123781 3361814 3764529 2823834 2794345
3995 2794345 3147803 2418713 3157454 2552627 2946416 3027865 3209296 3108107 3432379 3418743
3985 3418743 3533117 2937925 2575436 2383774 2171947 1778514 2078763 3135335 3595362
3976 3595362 3916296 3306619 3131814 2568360 2051941 2172296 2033106 1956793 2719268 2192431
3966 2192431 2986127 3100759 2512037 2981789 2636897 2558008 2530595 2230029 1698532 1209947
3956 1209947 1394093 1484808 2067051 1961913 2370892 2609218 2211465 2289997 1910386 2407692
3946 2407692 1884105 2297884 1846511 2334973 2352515 1777825 2317426 1220374 2049106 1580248
3936A580248O6796j749L08606j12094j86525k94629K28516j98549k21912P53978
3926A922686m11311l5465p4040m58727K20972L56386j77439N62360P9623O18272
3916B603317Q4756n7524o75753j9357m15198k13962j96026k47022Q8042L13794
3906A265067l27853M75306O0186J08963J6520n07902L40011o78136L0332j008445
3896b25951O27288j10832P48767M81697K0145N29231n37015L14354j004772M72530
3886A315442J99157J67908k2784j03964J48282j91148k83331J81974J86902l79250
3876A219188J44070l51467l51853q67630K10175j63253N51161O94239J87867K64174
3866A536671J42469j97996l80625K13595l35802J72763n1123k68867r5521L27044
$$ plain form
3936 1580248 1647044 1645295 1953901 1841807 1655282 1360653 1589169 1390620 1168708 1922686
3926 1922686 1511375 1475910 1401870 943143 1164115 1520501 1343062 1905422 1985045 2603317
3916 2603317 2688073 2630549 1954796 1935439 1520241 1306279 1110253 863231 951273 1265067
3906 1265067 937214 1412520 1472706 1581669 1598189 1090287 1430298 752162 782494 -225951
3896 -225951 401337 290505 1039272 1520969 1541114 2070345 1533330 1847684 842912 1315442
3886 1315442 1514599 1682507 1659723 1555759 1704041 1512893 1229562 1411536 1598438 1219188
3876 1219188 1363258 1011791 659938 -207692 2483 -160770 390391 1084630 1272497 1536671
3866 1536671 1679140 1481144 1100519 1314114 978312 1151075 1099952 831085 735564 1062608
3856A062608J4355K68654N10358k90114Q20032n99599o37622Q074j161153M67291
3846D62884o14526O54241k40937j8697N81626k16583N60728j09115M9623L39133
3836A448377K54260m22617J033837j080092O58235j52840n87302M95528p24171
3827I23215o1586J38132m2810m2198K0672m08161Q40233j40904L813K6853J697
3816A258956j14197l80119R5370m35650L13550m88066P45899j82033l3943M35239
3806A215006m70728K55334k18284J81393R8754K52430o5092K63109l39643k32701
3796I39578K74483P7723J03574J63455n15616n2261n53830l24469k26831L66255
3786B52061j8727M12816J42495k20098Q32995o22217K24565k46178l4771j76756
$$ plain form
3856 1062608 1076963 1345617 1855975 1565861 2385893 1786294 1148672 1156746 -4407 462884
3846 462884 -151642 502599 261662 242965 824591 608008 1168736 1059621 1109244 1448377
3836 1448377 1702637 1280020 2313857 1233765 1892000 1739160 1151858 1647386 923215
3827 923215 861629 999761 956951 914753 935425 527264 1367497 1226593 1230406 1257259 1258956
3816 1258956 1144759 764640 860010 424360 737910 249844 995743 813710 779767 1215006
3806 1215006 744278 999612 781328 962721 1061475 1313905 1248813 1511922 1172279 939578
3796 939578 1214061 1291784 1395358 1558813 1043197 990936 437106 112637 -114194 252061
3786 252061 233334 646150 788645 568547 1401542 779325 1003890 757712 722941 546185
3776E46185j35386k33502M02050L6979M87733O79428p2815R5863o8237q87195
3766H51103q54137k25102m87677O15683k1083O62689J69980j04099L04863P8911
3756I91131j46899J29873l68677j9885K04619o98423O94084j89331M13165O26347
3746A636004o45595r9381l07393p9883j22419j92469m45837M37114L26666j58220
3736C48587K07919k02550L47419j32811P34553n47965K07501J02027o41472O43510
3726A066718o59916P36743n39949K36878k05860m25308N25774l73925R0538j34636
3716C17057j54561J3945L13107m67070N80747K10258L17903P72882n60865J43697
3706A487100m23764k28843n07556J76712m3208M33599j31141j20700K25442k60785
$$ plain form
3776 546185 410799 177297 579347 616326 1104059 1783487 1710672 1806535 1738298 851103
3766 851103 -3034 -228136 -715813 -100130 -121213 541476 711456 607357 912220 991131
3756 991131 844232 974105 605428 585543 790162 91739 785823 596492 1009657 1636004
3746 1636004 990409 891028 583635 503752 381333 188864 -256973 180141 506807 348587
3736 348587 556506 353956 701375 568564 1303117 755152 962653 1064680 423208 1066718
3726 1066718 406802 1143545 603596 840474 634614 209306 735080 361155 451693 317057
3716 317057 162496 176441 489548 22478 603225 813483 1131386 1904268 1343403 1487100
3706 1487100 1063336 834493 326937 503649 460441 894040 762899 642199 867641 606856
3696F06856M2866m09637L11374l28553L22332j070252Q11283n52596O12122O51560
3686I97355L65078O65996m19702j6713l33627m91467o90920L38042l89414O26750
3676F51378k93395L39816l86562j23695l70862K15010L96528k8839K98387k58235
3666D39531J69361J89817l03273j19912P38705N915K44784l6778p15519O91345
3656A303976r88662J37180r8759o07290P36609r0985k57505N33317k98193M2527
3646D12215Q44771p51440J90681J7722o59738N44738l67869L1328O12360J48474
3636A023242J019118j71263k02152o45697k80068p19802K01334p48891Q56106
3627C31927j34606K32102L33471l69603L16921k36847L47776j45539J76317k21780
$$ plain form
3696 606856 649722 240085 551459 222906 545238 -525014 286269 -266327 345795 997355
3686 997355 1362433 2028429 1608727 1592014 1258387 766920 76000 414042 24628 651378
3676 651378 357983 697799 311237 187542 -183320 31690 428218 399379 697766 439531
3666 439531 608892 798709 495436 375524 1114229 1120144 1364928 1328150 612631 1303976
3656 1303976 315314 452494 353735 -253555 483054 392069 134564 667881 369688 412215
3646 412215 1256986 505546 696227 713949 54211 598949 231080 262408 874768 1023242
3636 1023242 2042360 1871097 1668945 1023248 743180 23378 224712 -524179 331927
3627 331927 197321 429423 762894 393291 710212 473365 821141 675602 851919 630139
3617F30139K04700k73595K63569j784J53978M2196k96463N2531p32748O15480
3607F58003q52728P13492o8341j08064Q07886l78602R29040j361726N34411q29750
3597D3621N50508J96511m05951L21657l80037M55983l86700K73872k55481J49876
3587E63859K51781N65713l87456N05382j11250n58397O21117j005270M32986j98032
3577F80433l4157M4092k46531l45708Q57561J53393n50087M45838j067249Q42065
3567G79650m88082k6496J84790K91413q2828N68717J5112K4043J80336j143311
3557C03344L14680k86775l40419L31678J64713n6078J114501r31816Q52532l67888
3547A098472l53058M5118o10454K49717j29726j1197j50065K12243k7713N61583
$$ plain form
3617 630139 834839 561244 824813 823029 977007 1019203 722740 775271 42523 658003
3607 658003 -194725 518767 450426 342362 1150248 771646 1700686 338960 873371 43621
3597 43621 594129 790640 384689 706346 326309 782292 395592 669464 413983 563859
3587 563859 815640 1381353 993897 1499279 1388029 829632 1450749 445479 878465 680433
3577 680433 646276 690368 443837 98129 955690 1109083 558996 1004834 -62415 779650
3567 779650 291568 265072 449862 741275 658447 1227164 1242276 1266319 1446655 303344
3557 303344 618024 331249 -9170 322508 487221 431143 1545644 613828 1466360 1098472
3547 1098472 745414 790532 180078 429795 300069 288872 138807 351050 323337 884920
3537H84920O696k4484J35695k3130n41143J69423l42455K81582k63955O10741
3527H93890k589j55007L29245L0861M91276n61079K02900j90740j02984j2681
3517I23092q295Q5326p8489K68093j33540k521K65163j41122m92029L1864n17041
3506B00501R2816j37017Q46365J4159M60936K99356J29283P41353j025070M98234
3496B120916r07152N63279n24065P16229m06706Q45843j18069M58946j01543k46939
3486B400739m1696m31937l9282n34074j2300k34482M60861j71965J337829q09051
3476A924642J393136K94839M94117l51061k59476J39594l68334P83494q60315
3467C190636N07433l41465l92940O35223j94167J159655O5503P57306k8732r28937
$$ plain form
3537 884920 891616 867132 1002827 979697 438554 607977 265522 547104 283149 893890
3527 893890 891301 736294 1065539 1096400 1587676 1026597 1229497 1038757 935773 923092
3517 923092 914797 1000123 921634 1189727 1056187 1053666 1318829 1177707 685678 717542 200501
3506 200501 293317 156300 1002665 1016824 1477760 1777116 1906399 2647752 1622682 2120916
3496 2120916 1213764 1777043 1252978 1969207 1562501 2408344 2290275 2749221 2647678 2400739
3486 2400739 2359043 1927106 1887824 1353750 1341450 1106968 1567829 1395864 2733693 1924642
3476 1924642 3317778 3612617 4106734 3755673 3496197 3635791 3267457 4050951 3190636
3467 3190636 3698069 3356604 2963664 3598887 3404720 4564375 4629878 5387184 5358452 4429515
3457D429515k90497r4688K4888M23993J36304O58680Q25524Q52343J362005J750880
3447A0078947K299359J477212L09446j771265k092897j985018j476125j151749
3439E687910j29636p29007M51139k70948O5642M67748q75537J026980k16915J59682
3429E637058M88311m79778O99117J6848J55287L75668R57305R39368J963595J899954
3419A2652733K292653j42501p13274k296965k493398j784318j857406k32342j84154
3410E241028l67682O50449n28204J12795K30501j514361M02815j555910Q7575
3401B759006l74416M85620k136J083579Q18520L20964Q7825r06465k52735n52894
3391C466868n41418q71566m34466K503M58767N15679J04955K78919j90815J61276
$$ plain form
3457 4429515 4139018 4044330 4069218 4493211 4629515 5288195 6113719 6966062 8328067 10078947
3447 10078947 12378306 13855518 14164964 12393699 10300802 8315784 6839659 5687910
3439 5687910 5558274 4829267 5280406 5009458 5075100 5542848 4667311 5694291 5477376 5637058
3429 5637058 6125369 5645591 6344708 6361556 6516843 6892511 7849816 8789184 10752779 12652733
3419 12652733 14945386 14802885 14089611 11792646 9299248 7514930 5657524 5425182 5241028
3410 5241028 4873346 5523795 4995591 5108386 5338887 3824526 4227341 2671431 2759006
3401 2759006 2384590 2870210 2868074 3951653 4770173 5091137 5178962 4272497 4019762 3466868
3391 3466868 2925450 2053884 1619418 1621921 2080688 2596367 2701322 2980241 2789426 2950702
3381B950702j028131k7941o41915m08410M03551k59097q2500O47163k39477K21713
3371A535658J15520n34168J456383p71660J277077q35745K01656p70778m72962
3362A200981L73018o71564M74793N8805K45324k52493M17844n87774K16101l8282
3352A436753K5857j0042k76398r21084L48891K90691L61828P4786m8755O1396
3342A343923M10293n2629p85153N43499L5692N35933L89276K70955L6765O13058
3332C341612l10775N7570k06290l78933j22591K43519o13508N12021J48480K34820
3322B905925R59783n97884N30295j180122K96192p63716m69893j18376o69K47002
3312A808537K76292M35207k17288m4675j04496j0039K09099J53876N03426J51197
$$ plain form
3381 2950702 1922571 1894630 1252715 844305 1247856 988759 906259 1553422 1313945 1535658
3371 1535658 1651178 1117010 2573393 1801733 3078810 2243065 2444721 1673943 1200981
3362 1200981 1573999 902435 1377228 1436033 1681357 1428864 1846708 1258934 1475035 1436753
3352 1436753 1462610 1452568 1176170 255086 603977 894668 1256496 1331282 1282527 1343923
3342 1343923 1754216 1701587 916434 1459933 1495625 2031558 2420834 2691789 2728554 3341612
3332 3341612 3030837 3088407 2882117 2503184 2380593 2624112 2010604 2522625 2671105 2905925
3322 2905925 3865708 3267824 3798119 2617997 2914189 2150473 1680580 1562204 1561535 1808537
3312 1808537 2084829 2520036 2302748 2258073 2153577 2143538 2352637 2506513 3009939 3161136
3302C161136m56258Q38080o54475N44094n25326J24011n06203N57913j61833q3119
3292B838020J87400q32364N43177j119266N93752q50421n1697l70834L21570m76482
3282G82855J64027l47925J92449N80974j67530J04371m31219K35795J50270K44324
3272A508391n6533M17032r97745J278008j814782M39645n34687R3059M31388J50216
3262I13992l62360J56391M8814l08588j41747m80929K24076J4901K37316j54718
3252A47148J48692j86820O71323k90011N27912o61679J038430o48247K79351k73910
3242G52189m01429K26275L02399N65416k68077J20907p47950P8070n04801J70171
3232B93170l15643K03722j3527k87962M31856m42985K79914L48296q00N6120J36722
$$ plain form
3302 3161136 2704878 3542958 2888483 3432577 2907251 3031262 2525059 3082972 2921139 2838020
3292 2838020 3025420 2193056 2736233 1616967 2210719 1360298 1308601 937767 1259337 782855
3282 782855 946882 598957 791406 1372380 1204850 1309221 878002 1113797 1264067 1508391
3272 1508391 1451858 1868890 871145 2149153 334371 774016 239329 332388 763776 913992
3262 913992 551632 708023 756837 448249 306502 -174427 49649 64550 301866 147148
3252 147148 295840 109020 780343 490332 1018244 356565 1394995 746748 1026099 752189
3242 752189 350760 577035 879434 1444850 1176773 1297680 549730 627800 122999 293170
3232 293170 -22473 181249 167722 -120240 311616 -131369 148545 496841 496041 552161 688883
3221F88883n19947J043629l51804J15513j21436k37759L70547p5722o299k24700
3211F80905M49961q84777K60278n56685l95841L32809k28345J89037L37186L51916
3201E36444M47636K18783j71858l76686k92899N21193R5327l00924J31749p49427
3191E9338N38006J06971n11003N56360p43047N89335m60785j75769r4350k49644
3181c84588J010797k15226P70265k79845K67620j54668R3755n04450n86425L102
3171B0337l50618K18217M3014M65525N51286o4389j04135o613p18042k72289n8090
3160b75797j06542l66156M37917K96104R70485j18584J78535J43147O06445J89364
3150A954918k00680k69989o86587J4772l22352j129658L60531o77551L78046K41110
$$ plain form
3221 688883 168936 1212565 860761 976274 854838 617079 987626 911904 905605 680905
3211 680905 1130866 246089 506367 -50318 -446159 -113350 -341695 -152658 184528 536444
3201 536444 984080 1202863 1031005 654319 361420 882613 977940 677016 808765 59338
3191 59338 597344 704315 193312 749672 6625 595960 135175 -40594 -134944 -384588
3181 -384588 626209 410983 1181248 901403 1169023 1014355 1108110 603660 17235 20337
3171 20337 -330281 -112064 -69050 396475 947761 883372 779237 772624 54582 -217707 -275797
3160 -275797 -382339 -748495 -310578 -14474 956011 837427 1015962 1159109 1765554 1954918
3150 1954918 1754238 1484249 797662 812434 490082 -639576 -279045 -956596 -578550 -337440
3140c37440m1970J63754L53867O99695K67390n5533j21948K70337m09889r2594
3130F95669j79919k72755j84682Q17684K2002M73295m41294J32545l28826j19319
3120F14400m2358n9186R6118k28683J21933o16985p0469j64614K52217K77522
3110A79895j13212M29008n39081J067760l28668M77249r7301N688J18564p57604
3100D42298N91680r73223L61067k89918L39419P71364p13040N46230L6038j29388
3090I82527j097653P14169j71427K58276j75392q09149J055805o45198P82368
3081H94326q60342O29611j77390J43612j8675k62504K3918K13874K16561k22858
3071E80133n39805k94457K22752L62315K42720n01542Q51477o32808O49579j40616
$$ plain form
3140 -337440 -379410 -215656 138211 837906 1105296 1049763 927815 1198152 788263 695669
3130 695669 515750 242995 58313 875997 897999 1371294 930000 1062545 733719 614400
3120 614400 572042 512856 608974 380291 502224 -114761 -185230 -349844 -97627 179895
3110 179895 66683 495691 -43390 1024370 695702 1172951 1075650 1081338 1199902 442298
3100 442298 1033978 60755 421822 131904 471323 1242687 529647 1075877 1111915 982527
3090 982527 -115126 599043 427616 685892 510500 -298649 757156 111958 894326
3081 894326 33984 663595 486205 629817 611142 348638 372556 586430 802991 580133
3071 580133 40328 -254129 -31377 330938 573658 72116 923593 290785 940364 799748
3061G99748m56681k78669J47829k54861L81835k61670k29016P05247l14193L97381
3051F36950l11232K09263K46831N87388m54428l3263k11844j24836o27376K54332
3041A71785m33909l33145P31176m43860M24972n31284J000206m9374M87055n03851
3031E19771q8297q9824P4429k60171j40030m26457O93872M55311l22830J24861
3021E40635j60617J7660L44732m01180k66518N35613k26227R22383q47259j39197
3011C20025o51485K77027n12804o2290j38200P93938j53443Q55462J01897n23118
3001C07009J083392r63092M66836j009569o36205j24377P0170J16509R6510O84628
2991I1811L02881O80508l68261M6008m96846J25270q62026M39943O2294p06641
$$ plain form
3061 799748 343067 64398 212227 -42634 339201 77531 -151485 553762 239569 636950
3051 636950 325718 534981 781812 1369200 914772 881509 669665 544829 -82547 171785
3041 171785 -262124 -595269 135907 -307953 117019 -414265 585941 536567 1023622 519771
3031 519771 431474 341650 416079 155908 15878 -410579 283293 738604 415774 540635
3021 540635 380018 397678 742410 341230 74712 610325 384098 1306481 459222 320025
3011 320025 -331460 -54433 -567237 -629527 -767727 26211 -127232 728230 830127 307009
3001 307009 1390401 427309 894145 -115424 -751629 -876006 -805836 -689327 -592817 91811
2991 91811 394692 1075200 706939 752947 256101 381371 -480655 -40712 21582 -685059
2981f85059J294498m77468N43202m42509o6569P0385O8397n41640M9051l40769
2971e28481M27833L02509j35991L96020n1374P90543o73041j53707m86942L44047
2961B31416K38141k61164k23156k64506L25364K95122J19079k77688L14895K15009
2951G12512O6535k27740n27279J8074k06892p7421n07874l59230M18856J25422
2941e65037P14177N30138l20812R29526l32600N07054n14182p03773j04932o16217
2931d76658M21934N7955O41473j10979M11658m88787L30335p27766O7862M61177
2921E88204o09159N38604r36679Q54630n01565M91334q01150O47789o6220J90797
2911C96585j04237n17897O60676L0931L52423k26248K98748r06697J112811j176231
$$ plain form
2981 -685059 609439 131971 675173 232664 166095 236480 304877 -236763 -187712 -528481
2971 -528481 -100648 201861 65870 461890 410516 1201059 528018 374311 -112631 231416
2961 231416 469557 208393 -14763 -279269 46095 341217 460296 182608 497503 712512
2951 712512 779047 551307 24028 42102 -164790 -242211 -750085 -1109315 -690459 -565037
2941 -565037 149140 679278 358466 1287992 955392 1462446 948264 244491 139559 -476658
2931 -476658 -54724 3231 644704 533725 945383 456596 786931 59165 127027 588204
2921 588204 -20955 517649 -419030 435600 -65965 425369 -375781 272008 205788 396585
2911 396585 292348 -225549 435127 466058 818481 592233 890981 -15716 1097095 -79136
2901g9136L28690o50426K43269N18320k75162Q31061p66840M10954N5759M4242
2891F60731j27550k1443m61137M70497j48953n98814L65655m22232N60950n53691
2881b75987N36848o95650O92893P25091j28830K77178m12294J92159j39014m48404
2871C23990o34505J47119m78736Q66501L52840j47332L78658K41086o52188j57266
2861B40167k23860q54656N34282n39636N50848J22988l49954J130218k50171M95816
2851H56042l84518L07522n0893p873m08858o1828J26087N13603J19489n88187
2841D20586O18706j086484L41565m46786m48813R9779j67405K73590R03566J18222
2831F26526n1847L01827n14965l28440j49053o22744O26035l41571M58247k21581
$$ plain form
2901 -79136 249554 -400872 -157603 360717 85555 916616 149776 560730 616489 660731
2891 660731 533181 511738 50601 521098 372145 -226669 138986 -283246 277704 -275987
2881 -275987 260861 -434789 258104 983195 854365 1131543 719249 911408 772394 323990
2871 323990 -310515 -163396 -642132 224369 577209 429877 808535 1049621 397433 240167
2861 240167 16307 -838349 -304067 -843703 -292855 -169867 -519821 610397 360226 856042
2851 856042 471524 779046 728153 720280 311422 249594 375681 889284 1008773 420586
2841 420586 1039292 -47192 294373 -152413 -601226 -501447 -668852 -395262 508304 626526
2831 626526 574679 876506 361541 33101 -115952 -738696 -112661 -454232 4015 -217566
2821b17566L08566M41630K13919k52029j89598r7985k3894J69991p04420K38535
2811a12851r14392J204984p1190L20208p5341K70360j04493J26320m77928l68479
2801b02802j623j88914O13446m57771O66671l22048N95502m84935J73022j53628
2791B36920k8768l6018q4900m2137k00420M28990k35188P94905j61041m42188
2781B30155L59505n05822N03266q49930m91573P01973k51279O88110o30330L28500
2771H2575J09466L7912M22709J9062n01155N63837m24466K76055l68041k52747
2761c4793p5675l98463P70455k36513R6154N60098j58086K07734K72501r89282
2751A4130M18103m01248q0606J51621j36667P03960l4036N53105l89776L4275
$$ plain form
2821 -217566 91000 532630 746549 494520 304922 206937 183043 353034 -351386 -112851
2811 -112851 -1027243 177741 106551 426759 351418 621778 517285 643605 165677 -202802
2801 -202802 -204425 -393339 220107 -237664 429007 106959 702461 217526 390548 236920
2791 236920 208152 172134 87234 45097 -155323 273667 38479 833384 672343 230155
2781 230155 589660 83838 587104 -262826 -754399 -52426 -303705 384405 -245925 82575
2771 82575 192041 229953 652662 671724 170569 734406 309940 585995 217954 -34793
2761 -34793 -110468 -508931 261524 25011 121165 681263 523177 730911 1003412 14130
2751 14130 432233 30985 -49621 102000 -34667 669293 635257 1188362 798586 832861
2741H32861J91158n47337J76469o32563k17164l817J15331L70621L18885k23477
2731C80967Q29928n33803J25940p61549J26765O5521l58711M75301j06424M35861
2721F79796Q5961r0889o4563R3244Q2211O07050p99594j50695k06579m21219M93396
2710C08119k61321k24740M81284k23013Q32254m27055K02359n73206r2657J51484
2700A73508m95715J40583j12684j53919Q81992n2167j65409J086563p46143O12631
2690A169240k56014o99789J60417o91659n3148l46055K44426L40192R55567K09603
2680A032780M02961j48976j48411l93906l55357p12650k39779k62673N7389L90232
2670c78390L56637O62062k10264R44085k21800M10007r95725N84805j051191K58484
$$ plain form
2741 832861 1024019 476682 653151 20588 -196576 -200393 -85062 285559 604444 380967
2731 380967 1210895 677092 803032 41483 168248 233769 -124942 350359 243935 679796
2721 679796 765757 674868 610305 703549 785760 1392810 593216 442521 235942 -185277 308119
2710 308119 46798 -177942 303342 80329 912583 485528 687887 114681 22024 173508
2700 173508 -322207 -181624 -294308 -448227 433765 381598 216189 1302752 556609 1169240
2690 1169240 913226 213437 373854 -317805 -370953 -717008 -472582 -132390 823177 1032780
2680 1032780 1435741 1286765 1138354 744448 389091 -323559 -563338 -826011 -768622 -378390
2670 -378390 -21753 640309 430045 1374130 1152330 1562337 566612 1151417 100226 358710
2660C58710r83983M53149N66138j20801O99074p30549L47594k73076N62502n7600
2650H21158M59488n37098M87035m48014m04414K4253o6964M8678L91697n71371
2640B04448m11577L98811l98173j5125K02057o52550Q78350K02069N89456j05707
2630H92059n62854K42691K40127j39676n13260M11134o61214P22171l99414K23869
2620D55633K56826J62147N28191l39211k34381j198819K64969j9044l61872P89445
2610C03884p61009J143129j16703M23326k58247N29012n6173R04580O26959k13345
2600B525413P01850l47918M58702j166962n7892l54806q6888o66747m43177r37687
2590c76112M85482l76720P93995J39448n67499R54217n20004N16684j89728k13067
$$ plain form
2660 358710 -625273 -172124 394014 273213 972287 241738 589332 316256 878758 821158
2650 821158 1280646 743548 1230583 782569 378155 402408 335444 384122 775819 204448
2640 204448 -207129 191682 -206491 -221616 -19559 -672109 206241 408310 997766 892059
2630 892059 329205 571896 812023 672347 159087 570221 -90993 631178 231764 455633
2620 455633 712459 874606 1402797 1063586 829205 -369614 -104645 -123689 -485561 303884
2610 303884 -457125 686004 569301 992627 734380 1263392 1207219 2111799 2738758 2525413
2600 2525413 3227263 2879345 3338047 2171085 2113193 1758387 1671499 1004752 561575 -376112
2590 -376112 109370 -267350 526645 666093 98594 1052811 532807 1049491 859763 646696
2580F46696m53546R13582j036168L29590k37166L98989J96593k72482j86408M46559
2570G46239K92725L00117J37572l26468K13735j97359N14875j196439O04478o57586
2560D31889J38896K60857p82707K20457J23902L31157M5167L825k00668J90507
2550G63282M70991P825m20524q3718j95607O42477n744J64129J26782m8714N86556
2539B007735j55788P67864m26487N50939n79835o59389o05025p67269J11072m37040
2529a93223K01023o93825J184880j92335J023693J49088o96633J001729p09291
2520A075106Q1028m39431k51913J34458L06159J81608K63648k5268J93348k90108
2510A228635L91143m97164o0035m93176K06214J8378n03988L94992n29768O80178
$$ plain form
2580 646696 193150 1106732 70564 400154 162988 561977 758570 486088 299680 746239
2570 746239 1038964 1339081 1476653 1150185 1363920 1166561 1681436 484997 1089475 431889
2560 431889 570785 831642 48935 269392 393294 724451 769618 773443 572775 763282
2550 763282 1234273 1242098 821574 737856 542249 1184726 1178982 1343111 1469893 1421179 2007735
2539 2007735 1851947 2619811 2193324 2744263 2164428 1505039 900014 132745 243817 -193223
2529 -193223 7800 -686025 498855 306520 1330213 1479301 782668 1784397 1075106
2520 1075106 1156134 716703 464790 599248 905407 1087015 1350663 1325395 1518743 1228635
2510 1228635 1619778 1122614 1062579 569403 775617 793995 290007 684999 155231 835409
2500H35409k92998L0346J12392P0891J98895k33845K93516m53269J029576m67926
2490A122987l2340k14768m86710J20382L18285L9679K19813M8163N71233r5896
2480A610828K71449q26007m84451j58727O8120L77808j74464P08139n65882P64713
2470A591526j029194P67820q2558r3582M74505o62812L18631l98178O36425l16503
2460A206080K9106O12074j77202P87849l50804m84917P1402n85084M73940j28519
2450A453925j11891l27933P98273n60332N18033J06866n60172Q74842m34384M10034
2440B167261j13049O9121J46834J29651K29890l35055M71286l36543K12050M40625
2430C082071r00462R7986K24657M09028K5820n48m7452O808J34007o75369j63860
$$ plain form
2500 835409 542411 572757 685149 756040 954935 721090 1014606 561337 1590913 1122987
2490 1122987 1090647 875879 389169 509551 827836 867515 1087328 1135491 1706724 1610828
2480 1610828 1882277 1056270 571819 413092 481212 859020 684556 1392695 826813 1591526
2470 1591526 562332 1330152 1247594 1154012 1628517 965705 1284336 886158 1522583 1206080
2460 1206080 1235186 1847260 1670058 2457907 2107103 1622186 1693588 1108504 1582444 1453925
2450 1453925 1342034 1014101 1812374 1252042 1770075 1876941 1316769 2191611 1757227 2167261
2440 2167261 2054212 2123333 2270167 2399818 2629708 2294653 2765939 2429396 2641446 3082071
2430 3082071 2181609 2279595 2504252 2913280 2939100 2938552 2891100 2897908 3031915 2356546 2192686
2419B192686L57654m60461L30815L89947L25987k3277K25973j51739K82156O04422
2409D074163o05761J284011p52872q5400K84927n38053Q47507n89117Q49524N5354
2399D824283N18560k05805P94857q38190K2815l8422J23693k70382j90298k84809
2389D456302J2143K07500J85151J82695P13274K23123N89262K31074m31136K60514
2379F629902M9364L26960J48621Q47705m80136J114252K03522m42142N17918m61896
2369H454070J152836o63935J062717l76574J199695j28530J110777J31215N32350
2360A2474621j92430R31173P40698K17854K067912O41075K568613J708644J866213
2351B3024373M099725N481131N023696K219410J350228m57415J077034J519187
$$ plain form
2419 2192686 2550340 2089879 2420694 2810641 3136628 3113351 3339324 3187585 3469741 4074163
2409 4074163 3468402 4752413 3999541 3914141 4199068 3661015 4508522 3919405 4768929 4824283
2399 4824283 5342843 5137038 5931895 5093705 5116520 5078098 5201791 4931409 4741111 4456302
2389 4456302 4468445 4675945 4861096 5043791 5757065 5980188 6569450 6800524 6369388 6629902
2379 6629902 6679266 7006226 7154847 8002552 7522416 8636668 8840190 8398048 8915966 8454070
2369 8454070 9606906 8942971 10005688 9629114 10828809 10700279 11811056 11942271 12474621
2360 12474621 12282191 13213364 13954062 14171916 16239828 16880903 19449516 21158160 23024373
2351 23024373 27124098 32605229 37628925 39848335 41198563 40741148 41818182 43337369
2343D3337369M222552M684906R182005J1527661J5590289K2146063M4821906R0045749
2335B45558500J47421933J23695273L969714n2922215j07209444j02400128o8884673
2328A89228960m7716883l3219533k5764502j7917122j2874383q180785m660727
2321C8895025j794888O37010R39245k272421k455601m802036l253603l399714
2313B2493017k017106k399441q10890j068948p01871n51704j310680m78315r44940
2304A2209122j617679k0383j038652M84355j86542J45119m59470L50151o92418
2295I173603K76914j187668q6913o55507m94973k42919k12836J00302p64154J08759
2285F014608j9171R3407l5989j33430j296662K35465j029461j1270M04769k33445
$$ plain form
2343 43337369 47559921 52244827 61426832 72954493 88544782 110690845 155512751 245558500
2335 245558500 392980433 516675706 520645420 467723205 360513761 258113633 189228960
2328 189228960 141512077 108292544 82528042 64610920 51736537 43555752 38895025
2321 38895025 37100137 37737147 38676392 36403971 33948370 29146334 25892731 22493017
2313 22493017 20475911 18076470 17265580 16196632 15494761 14943057 13632377 13154062 12209122
2304 12209122 10591443 10571060 9532408 10016763 9830221 9975340 9515870 9866021 9173603
2295 9173603 9450517 8262849 8175936 7520429 7025456 6782537 6569701 6670003 5905849 6014608
2285 6014608 5995437 6088844 6052855 5919425 4622763 4858228 3828767 3817497 4222266 3988821
2275C988821O36959q37904K16842n02559L94546l73069j27359k44381j34579k03644
2265B813673K04289m68703J42004M96292l47653O57844m27785K69223K10634j47062
2255C402756n66268P9681n94831l72617O57328q61943K85974m49704Q95821n56455
2245A919742R05897p95165M40592k98543j73825J12785o49408O57882k4022l83505
2235A712430j4821L6209j99393J024658k38616K06758n9221o39547L4941o53580
2225A209818l32026j2840m2325J55148n0305k47363M26608m18752O48854J03212
2215A440029o98713O38863n17735M02550j51930j61588p9595j72351L17044l0973
2205I85601k66737J10019r4655R24279p04335j15405N70234j18606M77717p67884
$$ plain form
2275 3988821 4625780 3787876 4004718 3502159 3896705 3523636 3396277 3151896 3017317 2813673
2265 2813673 3017962 2549259 2691263 3187555 2839902 3497746 3069961 3339184 3549818 3402756
2255 3402756 2836488 2916169 2321338 1948721 2606049 1744106 2030080 1580376 2476197 1919742
2245 1919742 2825639 2030474 2471066 2172523 1998698 2111483 1462075 2119957 2095935 1712430
2235 1712430 1697609 1733818 1534425 2559083 2320467 2527225 2468004 1828457 1863398 1209818
2225 1209818 877792 864952 822627 977775 927470 680107 1106715 687963 1336817 1440029
2215 1440029 741316 1380179 862444 1264994 1113064 951476 871881 699530 1016574 985601
2205 985601 718864 828883 734228 1658507 954172 838767 1409001 1290395 1768112 1000228
2195A000228k40037l32474M54346r81670p6950J77711p0370J083290n24150J16313
2185F06237J19720l5785L52361l19136o39709N38127j34896L63673n43560K77505
2175E84537J02526R76810m32478J53212o24072m77505M00424r56269j14423n55528
2165i42766O17655K06349J83788O9980o37322N00236L5188j45968P66495r1209
2155E62426q0607K08720m57138r4959N21691k96031O54396k14539l72149j9464
2145D12346j00847o9138K44322J4231j20099K08052M5955m62949J38527m98753
2135a88353P0272N79289p71951L76652o50701O40736p21611L93610n32820J50522
2125f54355M48561m0713m1087J12115P2363N28983o1764q6876J84435j59494K40672
$$ plain form
2195 1000228 760191 427717 882063 -99607 -176557 1154 -69216 1014074 489924 606237
2185 606237 725957 690172 1042533 723397 83688 621815 486919 850592 307032 584537
2175 584537 687063 1663873 1231395 1384607 760535 283030 683454 -272815 -387238 -942766
2165 -942766 -325111 -118762 65026 135006 -502316 -2080 33108 -112860 653635 562426
2155 562426 481819 690539 233401 138442 660133 364102 1018498 803959 431810 412346
2145 412346 311499 242361 486683 500914 380815 588867 634822 171873 310400 -188353
2135 -188353 -118081 461208 -310743 65909 -584792 55944 -665667 -272057 -804877 -654355
2125 -654355 -205794 -246507 -287594 -175479 -103116 425867 364103 277227 461662 302168 542840
2114E42840l50484m90819k57801L24062l45206N74498j85165M07454L82953p6555
2104E25777l16522n68956K23859L27744n67306M64535l74588j86211M01025j20135
2094a90778J74547J078274l83947R50630l81442p19117l13160j23650J03084m63755
2084b69314N46601l69426Q22351J52220n84558m60576K77379m07011M21831n10570
2074c81073M52023l62666m1829R22345l60282R83792m96210J142552P16079J49575
2064B724306m31619M83566j030736k72533J73228p13625O79905l6333m74841q29329
2054B71989K05170r31992Q51685l25487k15540K71970j35598k2044k65532L82125
2044H6746k48562Q99415m10872L9877m79448k21070N87159P6072K85983Q1992
$$ plain form
2114 542840 192356 -298463 -556264 -232202 -577408 -2910 -188075 219379 602332 525777
2104 525777 209255 -359701 -135842 191902 -375404 89131 -285457 -471668 -70643 -190778
2094 -190778 -16231 1062043 678096 1628726 1247284 528167 215007 91357 194441 -269314
2084 -269314 277287 -92139 730212 882432 297874 -162702 114677 -292334 129497 -381073
2074 -381073 70950 -291716 -333545 588800 228518 1212310 716100 1858652 2574731 2724306
2064 2724306 2292687 2776253 1745517 1472984 1646212 932587 1612492 1576159 1101318 271989
2054 271989 477159 -454833 396852 71365 -144175 127795 -7803 -29847 -295379 86746
2044 86746 -161816 737599 326727 366604 -112844 -333914 253245 329317 615300 697292
2034F97292J7153p6632l8094m80195p897l79850L42118M37269n77303Q9799j41404
2023a17744P7596L62329p52070K96428j39912K600N28595j134611M38129M38852
2013A92N8308O78324o8860k1543Q57645r09562J1936m6839o21398J47358p4131
2002A1430o84441k08925P40293j85950P78206k65797j35317P01658n26630M91260
1992G15787l73794n8027L8586J53679K84510o37089r9818K47596j2394j29216
1982A29820L46110p18888Q1901l96183m62388L71445L2302Q40941O24587j97797
1972F51850p6006n04984J50524m38658K74099n4532l85848Q40221J7447m6659
1962D27454O40439r09888K37670K17570j044986O15531q19938n73429R22980j059147
$$ plain form
2034 697292 714445 637813 599719 119524 111627 -268223 73895 511164 -66139 23660 -117744
2023 -117744 -40148 322181 -429889 -133461 -273373 -270773 257822 -876789 -438660 192
2013 192 58500 736824 667964 646421 1504066 594504 606440 559601 -61797 85561 11430
2002 11430 -673011 -881936 -141643 -327593 450613 184816 49499 751157 224527 715787
1992 715787 341993 283966 322552 476231 760741 123652 23834 271430 259036 129820
1982 129820 475930 -242958 -161057 -557240 -1019628 -648183 -615881 225060 849647 651850
1972 651850 575844 70860 221384 -217274 56825 2293 -383555 456666 474113 427454
1962 427454 1067893 158005 395675 613245 -431741 183790 -636148 -1209577 -286597 -1345744
1952a345744Q05186M76478j83952J523173o36676R7510k67148k18360K76363k46003
1942B80827j04093L46645k49769l62689n7587j90064j21051q1707l58868j56234
1932a054590M32160j02793L93383L26175l56899Q65030m17358N45408p4690l18908
1922B36918N81271l42752m99944j07345Q777m61408Q65352L6949L64041m23329
1912B58530J34399l81269k51812o8829n26061Q84984l13902J63326J90183J08947
1902A98496N53445N5973J98253o6184j82265j4029o99315n16924l39074k59790
1892a071414R03473K72608J89177O9955r52863K3751J55996l98284L70837j1192
1882d47956Q8997J98837M90336k56163K72706L00294l3858N01057j11531n11024
$$ plain form
1952 -1345744 -540558 -64080 -248032 1275141 638465 735975 468827 250467 526830 280827
1942 280827 176734 523379 273610 -89079 -146666 -336730 -457781 -539488 -898356 -1054590
1932 -1054590 -622430 -725223 -331840 -5665 -362564 502466 85108 630516 555826 236918
1922 236918 818189 475437 -24507 -131852 -123075 -584483 280869 317818 681859 258530
1912 258530 392929 11660 -240152 -308981 -835042 49942 -263960 -100634 89549 198496
1902 198496 751941 807914 1006167 939983 757718 743689 44374 -472550 -811624 -1071414
1892 -1071414 -167941 104667 293844 363799 -589064 -565313 -409317 -807601 -436764 -447956
1882 -447956 -358959 -160122 330214 74051 346757 647051 613193 1114250 1002719 491695
1872D91695L72504r11954J806j28771j97126O69008q63089L36448k90669Q6239
1862d33909Q2149N26P7873O27512l61009L31701k34035m95917N18262j68501P85959
1851G30611l21541l8542M7107K57768l45674J80666n42468J49107M43888l24800
1841B36122j42209K54475j56191m38642L85043o81966j59233L03960j64398J79149
1831c83890J24770K1217P11146M14247j57312Q11028p08017O3342K08039j649245
1821e44675O37032r95107P9967J78460k76984R92222J82367J66605J51330K5359
1811E96576j44122K02187p681l20121J11079q93526R7825p7034k77861O82120
1801c0558L34591Q5662j39055K74843j37556Q4390n28905k96069K54722k31202
$$ plain form
1872 491695 864199 -47755 -45949 -174720 -371846 297162 -565927 -229479 -520148 -433909
1862 -433909 -351760 -351234 -273361 354151 -6858 324843 90808 -405109 113153 -55348 730611
1851 730611 409070 370528 417635 675403 329729 510395 -32073 117034 560922 236122
1841 236122 93913 348388 192197 -246445 138598 -543368 -702601 -398641 -563039 -383890
1831 -383890 -259120 -237903 473243 887490 730178 1541206 833189 896531 1104570 -544675
1821 -544675 92357 -902750 -822783 -644323 -921307 70915 253282 419887 571217 596576
1811 596576 452454 654641 646960 326839 437918 -455608 -357783 -434817 -712678 -30558
1801 -30558 304033 389695 250640 525483 387927 472317 -56588 -352657 -97935 -329137
1791c29137L80409q07845K74151M1966j37449N90672L568K91270N23011j62040
1781F68576l33018k84673m170m60924L64875j4095q4077j33303j86236j36969
1771f04014O6501k31200M01876J72972Q4514L59731j9735L55451l3166q4094j3545
1760D55291j02012k83779M61448k30976k19522J22518j28259J38352J32150n1703
1750B93508L06472m93517k21197K65901l96726l430L15753n03370P03378n53489
1740b86717L22904l56331J41154J30731l90627N10516k5364K10772N82927M41658
1730A281623n05469j05997l3062k00184K47180m91669l73273J74168p22117O70659
1720e8141m19164K72952M55051l8825M7840K1333k01135k66878M02419l48659
$$ plain form
1791 -329137 51272 -756573 -482422 -440456 -577905 12767 16335 307605 830616 668576
1781 668576 335558 50885 46715 -414209 -49334 -63429 -147506 -280809 -467045 -604014
1771 -604014 -537513 -768713 -366837 -193865 -109351 250380 230645 586096 552930 468836 455291
1760 455291 353279 69500 530948 299972 80450 202968 74709 213061 345211 293508
1750 293508 599980 106463 -114734 151167 -245559 -248989 66764 -436606 266772 -286717
1740 -286717 36187 -320144 -178990 -48259 -438886 71630 46266 257038 839965 1281623
1730 1281623 776154 670157 637095 436911 684091 192422 -180851 -6683 -728800 -58141
1720 -58141 -477305 -204353 250698 211873 259713 281046 79911 -186967 215452 -133207
1710a33207Q88303p34439M88413p4282j11106j05870k21637M60475k63437J01057
1700B94270J69813n0990J48477m45832j70113P5714l20065L40654J33431P3554
1690B48913M2909K11345j32057O03510j88211M24516J23168q70960J5853j046254
1680e67268l59978M507J53637N91673J89849O43560l6389M10224m21334K87983
1670H96464o25057K28597m48068p53001P12573m65805O64652l29437P01861m15162
1660A67617R11976j15894K3021q1265n66513m45917m71787J59907k49863m9216
1650g17934M0478N95608k0949O87716j18718L65979m87432K00673o52270O24815
1640E17966R221l74746K97067r70479J51626n01450j41586M77244o9780K37232
$$ plain form
1710 -133207 755096 20657 509070 434788 323682 217812 -3825 456650 193213 294270
1700 294270 464083 413093 561570 115738 -54375 21339 -298726 41928 175359 248913
1690 248913 291822 503167 371110 974620 786409 1210925 1334093 463133 478986 -567268
1680 -567268 -927246 -922739 -769102 -177429 12420 655980 619591 1029815 608481 896464
1670 896464 271407 500004 51936 -701065 11508 -454297 210355 -119082 582779 167617
1660 167617 1079593 963699 986720 905455 338942 -106975 -578762 -418855 -668718 -717934
1650 -717934 -677456 -81848 -102797 584919 466201 832180 344748 545421 -106849 517966
1640 517966 527187 152441 449508 -520971 -369345 -870795 -1012381 -535137 -604917 -367685
1630c67685J02049O45361k84648L62398n6107M6166N92655r83490L16455l35357
1620C7797k53593m1944J65712K43288k75611P34817j32779l18788k73956n95878
1610g10935L70657k85865l0069l96524k98088M25284M74151M73236L20907L98191
1600G40945j6199K43621m90936J99063m42576j73644K58704j8288K81944o91311
1590a08677J55260M0302n24403P4323n65184j47758K06725k28363P73065J99904
1580a24806M00998M61191Q6138Q7508Q7448K12505q52446l91082k39026m42725
1570g14297L30698M69939m40708N54602R3915j90610M72436k13457K12168k89532
1560B85154j99828k02158m46513M51909j4877k95474O33920o50874Q15625Q0567
$$ plain form
1630 -367685 -265636 379725 95077 457475 401368 447534 1040189 56699 373154 37797
1620 37797 -215796 -257740 -92028 151260 -124351 610466 477687 158899 -115057 -710935
1610 -710935 -340278 -626143 -656212 -1052736 -1350824 -925540 -451389 21847 342754 740945
1600 740945 724746 968367 477431 676494 233918 60274 318978 300690 582634 -108677
1590 -108677 46583 86885 -437518 -363195 -928379 -1076137 -869412 -1097775 -324710 -124806
1580 -124806 276192 737383 823521 911029 998477 1210982 358536 -32546 -271572 -714297
1570 -714297 -383599 86340 -354368 200234 294149 103539 575975 362518 574686 285154
1560 285154 85326 -116832 -563345 -111436 -126313 -421787 212133 -438741 376884 457451
1550D57451M40478J36690m82586k06570J21967m99727m63913P85133n77915N93499
1540C04507K46249p65976r4681O5676j16866J033158q46303O36172K17240n61504
1530A17672J48993j6497k34811M47720L19888j55051k26376n18981m3742m28125
1520e89310K27411m62107J172448j86967M03814o01864m9512P2758j01057K16636
1510A02250j96666N32825m84431O87528m41912L54774J62700j88232Q28954l69863
1500I87927k99058j38481q01889q2309J65294r0522K80818P3028k2308k94010
1490b21510o7065m68563N49576j78091l2607N67718q4690K42136K70367j48628
1480D28643l01434N7175K0938M18207k00914K10665l2028p2574m55403m26957
$$ plain form
1550 457451 897929 1034619 552033 345463 467430 -32297 -496210 288923 -288992 304507
1540 304507 550756 -215220 -309901 -244225 -361091 672067 -174236 461936 679176 117672
1530 117672 266665 250168 15357 463077 782965 627914 401538 -117443 -161185 -589310
1520 -589310 -361899 -824006 348442 161475 565289 -36575 -86087 -13329 -114386 102250
1510 102250 -94416 438409 -46022 641506 199594 554368 717068 528836 1357790 987927
1500 987927 688869 550388 -251501 -333810 -168516 -259038 21780 94808 72500 -221510
1490 -221510 -288575 -757138 -207562 -385653 -418260 149458 64768 306904 577271 428643
1480 428643 127209 184384 205322 623529 422615 633280 601252 528678 73275 -353682
1470c53682n19828k79633l37962M07376K02971J41226M38074K3721L59101Q6166
1460A67530m1920O06534l58902K33724j282933L59369j682R5796L11979m91204
1450d01709O12741o46O25095j081971M77438k02771K70589m9507L8468k30015
1440E7712j79811l69561N9801j06828J8143k53945N68917k02281L96493J23857
1430A12497Q4202M92962m98456N03209r42842N66531k35695m7862l42289J28581
1420a79162j99081O05550K88358j29054L72970r0289N97960l71949Q1331p74661
1410B01973q0465m47106r72963N15483m34753N02329K33566L87795l87760P32626
1400B50725q3474M18956L40615q68764Q87103l60910l17109j29474J00397K61585
$$ plain form
1470 -353682 -873510 -1153143 -1491105 -1083729 -880758 -739532 -301458 -277737 81364 167530
1460 167530 125610 732144 373242 606966 -675967 -316598 -318280 -222484 89495 -401709
1450 -401709 211032 210386 835481 -246490 230948 28177 298766 249259 287727 57712
1440 57712 -122099 -491660 -431859 -538687 -520544 -774489 -205572 -407853 -11360 112497
1430 112497 196699 689661 191205 694414 -248428 318103 82408 34546 -307743 -179162
1420 -179162 -378243 227307 515665 386611 759581 669292 1267252 895303 976634 201973
1410 201973 121508 -325598 -1298561 -783078 -1217831 -715502 -481936 -94141 -481901 250725
1400 250725 167251 586207 926822 58058 945161 584251 267142 137668 238065 499650
1390D99650Q42152m43210K05876r98752M6948j50819l81181k15762M37045Q206
1380a49847O84463K9722p68487P78046l10678L4085N8981o55816l90155M74334
1370b15352l35310P71991m13219J023794J13129M17867j25115m4182p04059k46128
1360B43416r2302j29670q0348o4459K17490k58919m67540J55850O165N57696N23275
1349F10654m58090J160528r40170P00127r78723K94774o18642L44548J98345o18571
1339c05220R7986k08267N19756J72608p1597j34498j8463n933K58592l15314K12104
1328B01754o72184Q51071n72343j0605j24375n0600J75277M11370l74715K4751
1318a40599N73941K5707L39628m41054P4567o13163m20680M61284r69931O11732
$$ plain form
1390 499650 1341802 898592 1104468 105716 152664 1845 -379336 -595098 -158053 -149847
1380 -149847 534616 564338 -204149 573897 263219 297304 356285 -299531 -689686 -215352
1370 -215352 -550662 221329 -191890 831904 945033 1362900 1237785 1193603 489544 243416
1360 243416 151114 21444 -58904 -123363 94127 -164792 -632332 -476482 -470317 87379 610654
1349 610654 152564 1313092 372922 1073049 94326 389100 -229542 115006 313351 -305220
1339 -305220 -207234 -415501 104255 276863 205266 70768 52305 46372 304964 -10350 201754
1328 201754 -470430 380641 -191702 -202307 -326682 -377282 -202005 209365 -165350 -140599
1318 -140599 433342 459049 798677 357623 432190 -180973 -601653 -140369 -1110300 -498568
1308d98568m93799K34614P44012j271003J470076l11429K21269O65868o96518
1299F4522j66404J98909l97967J57865l27608r754M31714J72455n2158n8817k38140
1288b25383p8049J55630k59895M04296j01980p8254Q0074r36965P7188M4574O30400
1277b88364J38396L11226m93446J33182J16806n85708O12782o50661O25307L97400
1267C16920l29829K61654m16059M27824j44390r2746m78746M13771L14942o44478
1257c71137L24880q80718J027860k52085P43512k82429K09967j78943m81491O9502
1247g1082r62975J092711o84400J006736Q893q0326k18672O1217j83936J21509
1237H9675K11550q20488P03927q06567P89962l44416r9277K08476K13541N39850
$$ plain form
1308 -498568 -992367 -757753 -13741 -1284744 185332 -126097 95172 761040 64522
1299 64522 -101882 97027 -300940 -143075 -470683 -480437 -48723 123732 71574 12757 -225383
1288 -225383 -303432 -147802 -407697 -3401 -105381 -183635 -103561 -1040526 -963338 -918764 -288364
1277 -288364 -149968 161258 -332188 -199006 -82200 -667908 -55126 -705787 -80480 316920
1267 316920 -12909 248745 -167314 260510 116120 23374 -455372 -41601 273341 -371137
1257 -371137 -46257 -926975 100885 -151200 592312 309883 519850 340907 -140584 -71082
1247 -71082 -1034057 58654 -625746 380990 389883 309557 90885 152102 -31834 89675
1237 89675 301225 -519263 184664 -621903 168059 -176357 -275634 -67158 146383 686233
1227F86233j58750q5706k39932j23216q4191O39635p87680N64728m32139K05569
1217A84551j91522J48055m9462N50986M95433m98722J96358q72302P43556k69920
1207D37011m82506k15925L75116k13027N736p6876K68154J31440J54449J71979
1197E55551n1512j85520O47908l90883M41132j71694J1572j39679n39685L94954
1187E72144q40385K0181m6445O84652o66111N97101j96189j54903P22500q21180
1177a28635L90693j06392j33926J74834K44474m30054O0844N40193q68636J029987
1167G73382m48950l1453N36054n17653L8553k75970L1771m83249L40872p77391
1157h14034J36336J81692j58310O45974r58830M55813J18796N2823M40039k49606
$$ plain form
1227 686233 527483 441777 201845 78629 -5562 634073 -153607 411121 -21018 184551
1217 184551 -6971 141084 91622 642608 1138041 639319 835677 -36625 706931 437011
1207 437011 -45495 -261420 113696 -99331 -93595 -170471 97683 229123 383572 555551
1197 555551 504039 318519 966427 575544 1016676 844982 856554 716875 177190 572144
1187 572144 -268241 -248060 -294505 390147 -275964 321137 124948 -29955 692545 -128635
1177 -128635 262058 155666 21740 196574 441048 10994 71838 612031 -256605 773382
1167 773382 324432 292979 829033 311380 349933 73963 105734 -377515 -36643 -814034
1157 -814034 -677698 -496006 -654316 -8342 -967172 -511359 -392563 -339740 100299 -149307
1147a49307Q07299o68556L13173L97817n97502j18637M67409r5717L89137k7530
1137G17586j08242n36323N8965m01183N6423K87700k30812L39090o57731j66764
1127f41291p35110P89441p80772J250246q16583N05698N95775l95713Q67727m58081
1117A81337Q56747n73154K09589n81087l22558m4054m07386M86109K10960N0787
1107F7290L33849N9603l08563o75907o38539K48985p6874K85685K76384j8666
1097d46753M15138K24991K15359K67598l03945P51337l80736o48447M8467j287190
1087a144181O47784N6447K35075M4011K97767K09263J13678j60562k29492P6907
1077A46697J66415K32081l58747J08449l11780M87612j8350m0885J07815K95633
$$ plain form
1147 -149307 657992 -10564 302609 700426 102924 -15713 451696 355979 745116 717586
1137 717586 609344 73021 131986 -269197 -212774 74926 -155886 183204 -474527 -641291
1127 -641291 -1376401 -586960 -1367732 -117486 -934069 -428371 167404 -228309 639418 181337
1117 181337 1038084 464930 674519 93432 -229126 -273180 -680566 -194457 16503 67290
1107 67290 401139 460742 152179 -523728 -1162267 -913282 -990156 -704471 -428087 -446753
1097 -446753 -31615 193376 408735 676333 372388 1123725 742989 94542 143009 -1144181
1087 -1144181 -496397 -439950 -204875 -160864 136903 346166 459844 299282 69790 146697
1077 146697 313112 545193 186446 294895 -16885 470727 452377 411492 519307 814940
1067H14940p96973P97532j072429P6621J42778m14888K22708p6028L62589k37693
1057a80843L99123n74246r8319m4779p593M1424L68442k74881J130041M8146M57428
1046A263943n5700j41582K31273p663o59646k40673o42250m23982M42294m95476
1036g29462R24060p23924J149622k07297k4178K38435j592673L63399N455m0593
1026f37156Q41517n57255O37536M24051m2794j76884l16652P00981l27117Q58465
1016A404692n55012j97141J1873m32634J02890l44069k60350J92077J81144l85930
1006b82460k83235Q78k03622M64440m076O92057j00100L44839j05403J35913M07124
995A066355q26842P89650M23951r32587n20723l66643l66691J71598k56982J75300
$$ plain form
1067 814940 17967 815499 -256930 -180309 -37531 -452419 -229711 -305739 56850 -180843
1057 -180843 218280 -355966 -454285 -499064 -506657 -465233 -96791 -371672 758369 806515 1263943
1046 1263943 1208243 1066661 1297934 1290271 630625 389952 -252298 -676280 -233986 -729462
1036 -729462 194598 -529326 620296 412999 388821 627256 -965417 -602018 -596563 -637156
1026 -637156 204361 -352894 284642 708693 665899 489015 172363 873344 546227 1404692
1016 1404692 849680 652539 664412 231778 334668 -9401 -269751 -77674 103470 -282460
1006 -282460 -565695 -564817 -768439 -303999 -308075 383982 283882 628721 523318 659231 1066355
995 1066355 239513 1029163 1453114 520527 -196 -366839 -733530 -561932 -818914 -643614
985f43614P06290L14337k5220J44144m54233l11938L54813o73573J09016o29621
975a109599M40430N84025j7743O44453n59983J001296p83621P45106r94251L32507
965B82620k8125m23338k56720n09490j32864N32708K891o840L87510m94556J003382
954C57178m62306Q29397k20511N06803k99691m8075p30914m17061K8533j13006
944e69653N53153m9000j31878K24466j60002k36810J32348q19455K96217Q169
934g52445M24141P57564m41882J49298K26290l65867J48561j76774K05832L33131
924E07849l94329j69010r9851J84911N81398l43124L05592o61462J97853m80488
914c70661q68103N78910L2320O68338q1244O86141m39991J52597R5393m62385
$$ plain form
985 -643614 62676 377013 351793 495937 41704 -270234 84579 -588994 -479978 -1109599
975 -1109599 -669169 -85144 -102887 541566 -18417 982879 199258 944364 -49887 282620
965 282620 254495 -168843 -425563 -935053 -1067917 -535209 -532318 -539158 -151648 -646204 357178
954 357178 -105128 724269 503758 1010561 710870 662795 -68119 -485180 -456647 -569653
944 -569653 -16500 -65500 -197378 27088 -132914 -369724 -237376 -1056831 -760614 -752445
934 -752445 -328304 429260 -12622 136676 362966 -2901 145660 -31114 174718 507849
924 507849 113520 -55490 -155341 29570 610968 267844 573436 -88026 109827 -370661
914 -370661 -1238764 -659854 -627534 40804 -40440 645701 205710 358307 453700 -8685
904h685K13240K07850k3650M19610O5297k48842l85494k69211j17734K36687J85872
893B74940R1211o0415l5491j90074J52258K15315L6033P9563k53367l05432o38915
882f34374N62956k8676L27886k41784L24560l35625J11554q79m36593N28866K25537
871D03428K17941k1579n20834j34249Q2454K91555l55640J09546M42987k35033
861B80576M91641m42755N94732n97394M89037q35480k17108J24017j167025R66972
851c12787j75418m1998P49118M48502l9518L17979q18493l34395K2763j98962
841c83209L99966j13627j83617M06084M71996m00512j32640L07802n70760J09132
831h9385j56508k29307J37537J10514L41022K52987k8773M9194j08572j79118
$$ plain form
904 -8685 204555 412405 388755 808365 873662 624820 239326 -29885 -147619 89068 274940
893 274940 366151 305736 270245 80171 232429 447744 483777 563340 309973 4541 -634374
882 -634374 -71418 -100094 227792 -13992 310568 -25057 86497 85618 -350975 177891 403428
871 403428 621369 599790 78956 -55293 27161 318716 -36924 72622 515609 280576
861 280576 772217 329462 924194 326800 815837 -19643 -236751 -112734 -1279759 -312787
851 -312787 -488205 -530203 218915 667417 627899 945878 127385 -207010 -184247 -383209
841 -383209 16757 -96870 -280487 125597 597593 197081 64441 372243 -198517 -89385
831 -89385 -245893 -475200 -337663 -227149 113873 366860 338087 387281 278709 99591
821I9591J04622o58938N4242J78034k26704N19728n57851N32125K75281j63063
811A57067m92133Q7346k12314L59769l1252j62910K46409l57851L66547R2812
801E3490J02959P1875k59730M36153R4131k82205k17421m57080J01860l62596
791g18564M9106l65239N21011Q0116J98708j83139M72510r0969P76983q73971
781a33448j58388k15860o18787O69141m23654M26822n65781J099817o73294M14530
771a78902m6834M56694K07739L5106K58615p97804N90482r24511M13079r54261
761i40597K70968r5888N78331M75154n08063N96071o04165Q67723j6828l22994
751B99712K36169n63972l6914j51384l78325M3478P25816j21915Q06844n01835
$$ plain form
821 99591 204213 -454725 -400483 -222449 -449153 70575 -487276 44849 320130 157067
811 157067 -335066 -247720 -460034 -100265 -131517 -294427 -48018 -405869 -39322 53490
801 53490 156449 228324 -31406 404747 498878 216673 -748 -457828 -355968 -718564
791 -718564 -669458 -1034697 -513686 -433570 -234862 -418001 54509 -36460 740523 -133448
781 -133448 -291836 -507696 -1126483 -457342 -880996 -454174 -1019955 79862 -593432 -178902
771 -178902 -225736 230958 438697 473803 732418 -65386 525096 -399415 13664 -940597
761 -940597 -669629 -765517 -187186 287968 -220095 375976 -228189 639534 622706 299712
751 299712 535881 -28091 -65005 -216389 -594714 -551236 174580 52665 859509 357674
741C57674j33203q0309j24820K37589j70448O78363l84660Q84066n21094l89275
731C53883m58547l3215K48621j5201p116m58668N18687n4813j27307K98233J65271
720D29828r9458J32924k47101p56419j37172K39025L35462L42476L82928M90990
710A113483M65187l01715o02681o8818r62006J56545N1746j88059R6496k9511
700b69333K31556l62421L59483l17395O85294O59184j92444n6024o09263R8809
690B27446k12197K47797m29760L6691P4218N63634l2592j68652k9654m46739K71644
679A01836k51538N04186j70201K35372j08300o93282J05325j17290l7077O50449
669B19480m33497p3793k8577K90013K28058q4357M4034K75557L5344k53045p78327
$$ plain form
741 357674 224471 144162 19342 256931 86483 764846 380186 1264252 743158 353883
731 353883 -104664 -137879 110742 95541 88425 -370243 148444 93631 -33676 264557 429828
720 429828 330370 463294 216193 -540226 -677398 -438373 -102911 239565 622493 1113483
710 1113483 1578670 1276955 674274 605456 -356550 -200005 -148259 -336318 -239822 -269333
700 -269333 -37777 -400198 -40715 -358110 327184 986368 793924 737900 128637 227446
690 227446 15249 263046 -166714 -130023 -55805 507829 475237 306585 276931 -169808 101836
679 101836 -149702 354484 184283 419655 311355 -381927 -276602 -393892 -430969 219480
669 219480 -214017 -287810 -316387 -26374 201684 117327 161361 436918 472262 219217 -559110
658e59110J28403q72154O91805K9423K05939K27422M26160J32410N79753j70503
648H19548n31243N63877k79010m1113m20663K15692r63968P85535q41694K96962
638c96077Q7904m31103M8376l1792o0345L68068O07823P39762K11628p2552k25076
627H46616p03007R6732r71618K8746L06308L05469M97606j27992P7238K1481J47714
616E25293k20192L27539n79209j72763n81986n0946n45735J29118P10758k02973
606f61096J322200k19473j34108l49833q3288j53026P80734m22034N70486L0998
596F81560o24334k34326m12711o9177M6131M15492l69716P43277k36375J22353
586F2174n27787K18374J46886O25430O00929q46999L2430k81261l82808N56830
$$ plain form
658 -559110 -430707 -1302861 -611056 -581633 -375694 -148272 277888 410298 990051 819548
648 819548 288305 852182 573172 532059 111396 327088 -636880 148655 -693039 -396077
638 -396077 -308173 -739276 -690900 -722692 -783037 -414969 192854 932616 1144244 1071692 846616
627 846616 143609 240341 -731277 -702531 -396223 -90754 406852 278860 356098 377579 525293
616 525293 305101 632640 53431 -119332 -701318 -752264 -1297999 -1168881 -458123 -661096
606 -661096 661104 441631 307523 -42310 -125598 -278624 502110 80076 650562 681560
596 681560 57226 -177100 -589811 -658988 -612857 -197365 -567081 176196 -60179 62174
586 62174 -465613 -247239 -100353 525077 1126006 279007 311437 30176 -352632 204198
576B04198m07385O26144l56728K8583J28343j847k06346J30636J050480r60975
566B35103N30362o15141m40140o48861j5114l91082M61439N07463L74259P71428
556G69716r7114J55107J62665j32750l37626k06204n6207j87656j67435L21709
546B24205K17235l4891l03670j09838q0144J00775m72783J04674L23945J15213
536H4721Q3268J72135j41245J20330l10578J7164J70363r1517j41551M19896r21803
525e38817J049880l59675N17951K39180m56483R9175q34132p9373L77088K87072
515C01866m49447R39419j237807N08006l77286k66684L86690P5023M00022r6370
505A83432l0529L96880m96425O52822q43396Q2142O0433j45854j49891Q891J69637
$$ plain form
576 204198 -203187 422957 66229 94812 223155 221308 14962 145598 1196078 235103
566 235103 765465 150324 -289816 -938677 -953791 -1344873 -883434 -375971 -1712 769716
556 769716 672602 827709 990374 857624 519998 313794 257587 69931 -97504 224205
546 224205 441440 406549 102879 -6959 -87103 13672 -459111 -354437 -30492 84721
536 84721 167989 340124 198879 319209 8631 25795 196158 104641 -36910 382986 -538817
525 -538817 511063 151388 669339 908519 452036 551211 -282921 -362294 14794 301866
515 301866 -147581 791838 -445969 62037 -315249 -581933 -195243 -120220 279802 183432
505 183432 152903 549783 53358 706180 -137216 -55074 5359 -140495 -290386 -281495 -111858
494a11858Q4319K19484j15328j91865m63763O28021n60644L98273k43114P08864
484C52389r7055K04570l97260M14236m60354K08521k12401m84934L14495L4937
474a22856O03496k98412K16686p09409J58477k39240l04446q6282L44536J93530
464b43920O99565N76666k27837j5072J72537o00215l17054j05915j56756K7602
454a90399J05754p9196M56110j73710r0365O58304p22060M03990o56050j0185
444b97807K4464m35973j27389N88537L29369L47542q4182o05357j34760l4786
434d30342O66979J74671L01215L0145J17274j13424l76327m30776l4n20241L49171
423b31689l71034K17401k49048K77913j96723j79666R85041L1355J88539k28456
$$ plain form
494 -111858 -27539 191945 76617 -115248 -579011 49010 -511634 -113361 -356475 352389
484 352389 255334 459904 62644 476880 16526 225047 12646 -472288 -157793 -122856
474 -122856 480640 182228 398914 -310495 -152018 -391258 -695704 -781986 -437450 -243920
464 -243920 455645 1032311 804474 789402 961939 361724 44670 -61245 -218001 -190399
454 -190399 -84645 -163841 292269 118559 28194 686498 -35562 368428 -287622 -297807
444 -297807 -273343 -709316 -836705 -248168 81201 428743 344561 -260796 -395556 -430342
434 -430342 236637 411308 712523 742668 859942 746518 370191 -60585 -60619 -580860 -231689
423 -231689 -602723 -385322 -634370 -356457 -553180 -732846 252195 283550 472089 243633
413B43633o57177k16192J27048j61994N28135K41521J38528J15645O1900j98358
403B22689j98008K57023M37053R09030j51290l15154n33973q18213k04715k50557
393f46115K17978M4013N86554L20105m62199J40439K1085j95593R71986n29669
383D68584N14572m58591K04334l90045o3775m10199M37883j92377o7764J29330
373A71952o10767O54566l95608K52949j93036L35732M83000j07j10105l46707
363B41869q87177j73852k04856M75963l97714P85209K89288N96564j01805n5128
353E68361k22038P5177q6561L9697m25658J9794l96779k71192K38947k40376J056013
342C55385R8316R16543n19121l42742m48597o9510l28285j97182l40561K18693
$$ plain form
413 243633 -413544 -629736 -502688 -664682 -136547 104974 243502 359147 421047 222689
403 222689 24681 281704 718757 1627787 1476497 1161343 627370 -190843 -395558 -646115
393 -646115 -428137 -384124 202430 522535 60336 200775 221860 26267 998253 468584
383 468584 983156 524565 728899 338854 275079 -135120 302763 110386 42622 171952
373 171952 -438815 215751 -179857 73092 -119944 215788 698788 698681 588576 241869
363 241869 -645308 -819160 -1024016 -548053 -945767 -160558 128730 725294 623489 568361
353 568361 346323 421500 334939 374636 -51022 -31228 -428007 -699199 -460252 -700628 355385
342 355385 453701 1370244 851123 508381 59784 -9726 -338011 -535193 -875754 -657061
332f57061L08843j51736K97648k05932O82167M58480M4283j59904K50479k50611
322F16656n25148n76478O17511o07905L22992P39955p8142j4280o24712L69796
312B40245n00092L6824m03577O63955K21902p4829j84651m0362J21861K42865
302C24141J56256k79094o654j4146m71990L24005m83363p5352P88082l96654Q05834
291F71065m74838K31615l28072M48462r21328m35789J64090k88581Q46802L69041
281B82467L13634K50760j08965k67139q5613k90831n51698L06724k32016j43896
271e26573o7874k54085P42386k19601J035400j97972M78434j43793j88121p85662
261a27461n94060j49583J22381L11802K46070j84996K12675K77369m3162J2753
$$ plain form
332 -657061 -348218 -499954 -202306 -408238 273929 732409 776692 616788 867267 616656
322 616656 91508 -484970 132541 -475364 -152372 587583 509441 495161 -129551 240245
312 240245 -259847 -223023 -626600 37355 259257 184428 -223 -40585 81276 324141
302 324141 480397 201303 194649 180503 -291487 32518 -450845 -526197 261885 -134769 671065
291 671065 196227 427842 99770 548232 -373096 -808885 -644795 -933376 -86574 282467
281 282467 596101 846861 737896 470757 385144 94313 -457385 -150661 -382677 -526573
271 -526573 -594447 -848532 -106146 -325747 709653 511681 990115 846322 658201 -127461
261 -127461 -721521 -871104 -748723 -436921 -190851 -375847 -163172 114197 71035 83788
251H3788j11062N16520O23153r722m94269o09998o02390o7135J4763N48414k6066
240a34004K11571j08135k50125k44099N29581p6989Q67626J58426k59385m18449
230B76018p64291M80247n96713O19539k27668N05702L95268n00970k0900n34376
220c68144K46173K61766K93541j44802M34127k44764m85869j0663q40148M13101
210d45682j0775O31214o70017M04085o5215K69220M42233k94632R17944m73906
200G04469J134907j521093M15769j514202P5507J3950k54782Q53436l15169Q94092
190D86884n97543L92312p60795p052L55420K16811Q64367j69137n3831j11716
180F15720L24030q84350P645j8784M37065L33632J08997n60073J95283l83639
$$ plain form
251 83788 -27274 489246 1112399 1102677 608408 -1590 -603980 -671115 -656352 -107938 -134004
240 -134004 77567 -30568 -280693 -524792 4789 -72200 795426 953852 694467 276018
230 276018 -488273 -8026 -604739 14800 -212868 292834 688102 187132 166232 -368144
220 -368144 -121971 139795 433336 288534 722661 477897 -7972 -18635 -858783 -445682
210 -445682 -456457 174757 -495260 -91175 -156390 112830 555063 260431 1178375 704469
200 704469 1839376 318283 734052 -780150 -704643 -690693 -945475 -92039 -407208 486884
190 486884 -110659 281653 -479142 -486194 -130774 86037 950404 781267 727436 615720
180 615720 939750 55400 63045 44261 481326 814958 923955 363882 559165 175526
170A75526j01202K44512o16798p244j04761P3140q08069O93509n29893R03659
160g7621O16619L31431j44373j4532l78209j94536j02801k67585K37147L93271
150C98811q9766J40125r16726J42959Q0494o7109K33203j34291J019326p74460
140C2566J60037j232681K59981k93574Q12556J28463L33179L05720l34842L27785
130D99190o96273L57708m01249L75230l18106N14852r94737J15211J95388L25785
120b7001M38293R5350O7569l1171o0003o98827l05689J2994K50652L29641m1881
109B9927J38049Q8082r2616k68028q6961n62089P3283L86996j62320J34104k08416
98e29989P22029L70765k03250k03604R3413l29709P47719o07962k96499Q5543
$$ plain form
170 175526 74324 318836 -297962 -305206 -409967 -336827 -1144896 -451387 -981280 -77621
160 -77621 538998 870429 726056 711524 333315 138779 35978 -231607 5540 398811
150 398811 309045 449170 -467556 -324597 -244103 -311212 -78009 -212300 807026 32566
140 32566 192603 -1040078 -780097 -1073671 -261115 -132652 200527 506247 171405 499190
130 499190 -197083 160625 -240624 134606 -183500 331352 -663385 -548174 -352786 -27001
120 -27001 411292 506642 574211 543040 483037 -215790 -521479 -508485 -257833 71808 29927
109 29927 167976 256058 163442 -104586 -191547 -753636 -680353 -293357 -455677 -321573 -529989
98 -529989 192040 562805 359555 155951 249364 -80345 667374 59412 -237087 -151544
88a51544k06619J36615p3621K53871P4470N41907J13643k75674n85913k69749
78d42614j60080M06012l25810j45832N49608j04001L72622q9373J21379N1142
68B33053O44000j59771m91917J53925m19341j77837m62892Q1735M35257r7100
58b60888P31407k54777j080J42690k94016J56719k41897P5606l6685j14793P9642
47a8072m83244m73610K65590J31548M60017q4461K96132J139K14799R4832P4193
36D78863q6038J19224r0622l8057m53062o46444N43605n21057O27381J60927p8504
25A6216L81474k08196m34672J5317n39465M29742K23319j54308L13780L68470
15D11677k63346J1368j74264l88481N33834j89198N64613m70995J2711k02338
$$ plain form
88 -151544 -358163 -221548 -295169 -41298 33172 575079 688722 413048 -172865 -442614
78 -442614 -602694 -196682 -522492 -668324 -118716 -222717 149905 60532 181911 233053
68 233053 877053 717282 225365 379290 -40051 -217888 -680780 -599045 -163788 -260888
58 -260888 470519 215742 214662 357352 63336 220055 -21842 53764 17079 -97714 -18072
47 -18072 -501316 -974926 -709336 -577788 -117771 -202232 93900 95039 309838 404670 478863
36 478863 392825 512049 421427 383370 -69692 -716136 -172531 -693588 -66207 94720 16216
25 16216 397690 189494 -245178 -229861 -769326 -339584 -116265 -270573 43207 411677
15 411677 148331 159699 -14565 -403046 130788 -58410 506203 35208 47919 -154419
5a54419J26310j78838k1206k45836J01601
0c72388
$$ plain form
5 -154419 -28109 -206947 -228153 -473989 -372388
0 -372388
$$ Imaginary data points
##PAGE= N=2
##DATA TABLE= (X++(I..I)), XYDATA
16383f71486Q2822O2622O2689K88045p5375l05066k19886o1480k25289j75746
16373a238150N72078o25059R09208j57020j98379J56753l97506M66241K5145K89672
16363a97017l84171O04896k82227M17310l46002j99012q4128L53594k0522j24835
16353b62114J05563j47483o3049j32156J61511k43935N83241o82015N41961l91888
16343e30364m20079J28987n0312L01444O89872k66193J40609K17359m41909K56359
16333B5773k67430j2408j14069L91517k71270L99192n72765J15691J37764L1522
16323a36483J13331L64732l1199j3077L5428n55377O22575n28739L16263o3808
16313A23646L13155J19087n94884M92214o08483J48494r9289L36091p3683K33163
$$ plain form
16383 -671486 -588664 -526042 -463353 -175308 -250683 -555749 -775635 -837115 -1062404 -1238150
16373 -1238150 -666072 -1291131 -381923 -538943 -737322 -580569 -978075 -511834 -486689 -197017
16363 -197017 -581188 23708 -258519 158791 -187211 -386223 -470351 -116757 -137279 -262114
16353 -262114 -156551 -304034 -367083 -499239 -337728 -581663 1578 -680437 -138476 -530364
16343 -530364 -950443 -821456 -871768 -570324 119548 -146645 -6036 211323 -230586 25773
16333 25773 -241657 -254065 -368134 23383 -247887 151305 -421460 -305769 -168005 -136483
16323 -136483 -23152 341580 310381 297304 332732 -222645 399930 -128809 187454 123646
16313 123646 436801 555888 -38996 453218 -155265 -6771 -106060 230031 156348 389511
16303C89511j82627j3997q2688o48926M80078j06986Q7835L40715K24673o48057
16293a60469Q79648m48019P76430l1699R5524k37186j97240O4749p9956o1587
16283F00195n17767M09087m14059K00056j24402M02003P8359L53598l81220L41302
16273I47152o02046N00906J02704l21179k05336m53091J72411j91303M76253r186
16263D17285R74758M22799J22665k78709j56816p18745K77332p99962j85955L92825
16253D67477m45904N09747l82489M54454p1370O53667J49410K09323l72654r8676
16243A072985k82366n7711m1389l19541M80729k14171N42030n2996m25029N24370
16233A226911R8751n16346P25683k66487J71060L9611p63577J54619l21057k11688
$$ plain form
16303 389511 206884 192887 110199 -538727 -58649 -165635 -77800 262915 487588 -160469
16293 -160469 719179 271160 1047590 1015891 1111415 874229 676989 741738 661782 600195
16283 600195 82428 491515 77456 277512 153110 555113 633472 987070 605850 947152
16273 947152 345106 846012 948716 627537 422201 -30890 141521 -49782 426471 417285
16263 417285 1392043 1814842 1937507 1658798 1501982 783237 1060569 260607 74652 467477
16253 467477 21573 531320 148831 603285 531915 1185582 1334992 1544315 1171661 1072985
16243 1072985 790619 732908 691519 371978 852707 638536 1180566 1127570 702541 1226911
16233 1226911 1325662 809316 1534999 1268512 1439572 1479183 715606 870225 549168 337480
16223C37480K39562J96573N1663J89176l1089L17654k2027j65366M02059k28045
16213A287640J35885l35499k24831L88938k54204L62666J20155n5035K3354l60095
16203A088974O4550k14963k99653j0464J87700o6795N18184k59981N48708k53887
16193A302373J01084N9035m44585M14148j6673M6659m00574j84192l41890N72665
16183A108050m7057J06731l70921L65519M1665J43798K1525j92850K58138J64834
16173A599432K20977q29878K17251k26227K89466J70822m12911J99992K36059
16164A464983K30614o1654m22576n44535K7451L08616J3842j99546O79785o50143
16154H46837P98589k39028p00599K74834l62714N21674J35604K80628m58842J44460
$$ plain form
16223 337480 577042 773615 825278 1014454 983365 1301019 1278992 1113626 1515685 1287640
16213 1287640 1423525 1088026 863195 1252133 997929 1360595 1480750 1425715 1449069 1088974
16203 1088974 1153524 938561 638908 628444 816144 749349 1267533 1007552 1556260 1302373
16193 1302373 1403457 1462492 1017907 1432055 1415382 1462041 1061467 877275 535385 1108050
16183 1108050 1060993 1167724 796803 1162322 1203987 1347785 1369310 1176460 1434598 1599432
16173 1599432 1820409 990531 1207782 981555 1271021 1441843 1028932 1228924 1464983
16164 1464983 1695597 1633943 1211367 666832 694283 1002899 1016741 817195 1496980 846837
16154 846837 1645426 1406398 705799 980633 617919 1139593 1275197 1555825 1096983 1241443
16144A241443j32527l18194M19843R6973P3762M78642n72846k37125J03459N84504
16134A737934K6660K14629j66652J28566p29253o9488l78303k79879R7876M32391
16124A014481L8809O3690L7634J53908K35249l28525M99480o31439P84719p72617
16114A095389M28984k97623m41510L68428J53520K30786J70132j30899k5519L78400
16104A930088j177081M55439L29100j7901J32407j79231k68656l2693M80017l02295
16094A349194N74238p54361L94311L23703j68786j97273N04696m55577L7059k99149
16084A308055n01324Q7416r7089O81184p33652M57555l02372O16942j57644K57227
16074A616298Q9218L72596m439J44109k10954m31185K52265n58450N04002k25934
$$ plain form
16144 1241443 1108916 790722 1210565 1307538 1381300 1859942 1287096 1049971 1153430 1737934
16134 1737934 1764594 1979223 1812571 1941137 1211884 1142396 764093 484214 582090 1014481
16124 1014481 1053290 1116980 1154614 1308522 1543771 1215246 1714726 1083287 1868006 1095389
16114 1095389 1524373 1226750 785240 1153668 1307188 1537974 1708106 1577207 1551688 1930088
16104 1930088 753007 1208446 1537546 1519645 1652052 1472821 1204165 1171472 1651489 1349194
16094 1349194 1923432 1169071 1563382 1887085 1718299 1521026 2025722 1570145 1607204 1308055
16084 1308055 806731 894147 797058 1478242 744590 1202145 899773 1516715 1359071 1616298
16074 1616298 1705516 2078112 2073673 2217782 2006828 1575643 1827908 1269458 1773460 1547526
16064A547526J32944K98039l04953j27234k69408k92592m5921Q87836K79719j66156
16054A939800P69451m50495o517m88956m68143l69354j32359j08575O1668N2522
16044G99042k68399Q73460J75509K98514J18231K06896j14828n10052N5989p05952
16034I28410J1831K52807k15396P42533j1993Q1978M81300m18490O35461o70689
16024A817752n80511N82229o21883j20696n8380j86930J86769l56350L22972k14349
16014G70623o415J064558k06166L90240k37663j6134o5623m08287K24003J88418
16004A697554j06718o2034J90432q17507J81160l66761R34820p06011O78435P8106
15994A701476m14868L57559o77993N65582n28726L90520J35862k15787k2755k61868
$$ plain form
16064 1547526 1680470 1978509 1673556 1546322 1276914 984322 938401 1826237 2105956 1939800
16054 1939800 2709251 2258756 2252239 1763283 1295140 925786 793427 684852 746520 799042
16044 799042 530643 1404103 1579612 1878126 1996357 2203253 2088425 1578373 1634362 928410
16034 928410 940241 1193048 977652 1720185 1708192 1790170 2271470 1852980 2488441 1817752
16024 1817752 1237241 1819470 1197587 1076891 1018511 831581 1018350 662000 984972 770623
16014 770623 764208 1828766 1622600 2012840 1775177 1759043 1693420 1285133 1509136 1697554
16004 1697554 1590836 1528802 1719234 901727 1082887 716126 1650946 944935 1623370 1701476
15994 1701476 1286608 1644167 966174 1531756 1003030 1393550 1529412 1313625 1290870 1029002
15984A029002J84799M84436r0240Q49158o56078j29980k51639o54041l0819K47241
15974I81839J75076R68628l65456K22641l6648n98476R1407o02386N44342j93080
15964A187887j19484L25971l74750J37618j9028K34839J46063N15907r72648J036460
15954B098835n30830o43797M39284l95254N47463J72199O82450q64181Q73081
15945B379250j362810Q15549q35497J18572M6489J62979O93958l37742L42685
15936B023433l48513p1470L47170K32301j133631P02515j139239J88396j83885
15927F17077q8737M15489O74308N49082N15788k09496m04556J87788o54928Q1587
15917A683402n06652J94248J02205P7474r197l88383L86875K96345M75542K23425
$$ plain form
15984 1029002 1213801 1698237 1607997 2457155 1801077 1671097 1419458 765417 734598 981839
15974 981839 1156915 2125543 1760087 1982728 1946080 1347604 1439011 836625 1380967 1187887
15964 1187887 1068403 1394374 1019624 1157242 1138214 1373053 1519116 2035023 1062375 2098835
15954 2098835 1568005 924208 1363492 968238 1515701 1687900 2370350 1506169 2379250
15945 2379250 1016440 1831989 996492 1115064 1161553 1324532 2018490 1680748 2023433
15936 2023433 1674920 1603450 1950620 2182921 1049290 1751805 612566 800962 617077
15927 617077 528340 943829 1618137 2167219 2683007 2473511 2068955 2256743 1601815 1683402
15917 1683402 1176750 1370998 1473203 1550677 1541480 1153097 1539972 1836317 2311859 2535284
15907B535284l72423l73634j38310r09233k4770n21800m32594J176421J09446
15898A048387J67098M69211J29684M11545J95285l05112M6247N8958P64685l11476
15888B674512l65974n44024l72783N24008k8243l0181o5084J9411o89170L18706
15878A441178j073213M32417P86243L7992L55223l50587j26794o1513K37483p79936
15868H98493N12483J58848O26378L5099j58967l26501p8252J47633K7683l3089
15858A809808j28823K09385n12956k68489l20858j33434M54240M42118J24988
15849A675979k499N8340k22815L65582j089535K18306K31391j75881O96886n36701
15839A219053K8273j80780L78408L15602N7992k57836n61435K64863J36038l26667
$$ plain form
15907 2535284 2162861 1789227 1650917 741684 716914 195114 -237480 938941 1048387
15898 1048387 1215485 1684696 1814380 2225925 2421210 2116098 2162345 2221303 2985988 2674512
15888 2674512 2308538 1764514 1391731 1915739 1887496 1857315 1792231 1811642 1122472 1441178
15878 1441178 367965 800382 1586625 1624617 1979840 1629253 1502459 1440946 1678429 898493
15868 898493 1410976 1569824 2196202 2231301 2072334 1745833 1667581 1815214 1842897 1809808
15858 1809808 1680985 1890370 1377414 1108925 788067 654633 1108873 1550991 1675979
15849 1675979 1673480 1731820 1509005 1874587 785052 1003358 1234749 1058868 1755754 1219053
15839 1219053 1247326 1066546 1444954 1760556 1818548 1560712 999277 1264140 1400178 1073511
15829A073511R0253K39570M7589N95311J71379k12163q5175J97197q03993K73942
15819A587421q65373O19261k266j59980M61866l5000K02938l17507j0504j039260
15809D41596M47562m61140O79038K90204k52020N11936M65401J50911j01921r46044
15799A225523K04067m21105K94719m88132j43369L15255R3393R71827R5272k56787
15789A890663K41568p0749j39484j083974p63058O25177l40671R29252o22394
15780F66330R39643Q7635P00640O3334m85168n316l11737p3060m64916M34566
15770A551951m69181R70105m11267M96311q43094J66922J15242O3176r4316k21068
$$ plain form
15829 1073511 1163764 1403334 1450923 2046234 2217613 2005450 1920275 2117472 1313479 1587421
15819 1587421 722048 1341309 1339043 1179063 1640929 1605929 1808867 1491360 1480856 441596
15809 441596 889158 428018 1107056 1397260 1145240 1657176 2122577 2273488 2171567 1225523
15799 1225523 1429590 1008485 1303204 815072 671703 986958 1080351 2052178 2147450 1890663
15789 1890663 2132231 2061482 1921998 838024 74966 700143 359472 1288724 666330
15780 666330 1605973 1693608 2394248 2457582 1972414 1967098 1655361 1582301 1117385 1551951
15770 1551951 1082770 2052875 1641608 2137919 1294825 1461747 1576989 1640165 1545849 1324781
$$ [...]
##END NTUPLES=NMR SPECTRUM
##END=
