##TITLE=1H_DE-80H_X3
 200.13MHz, d2o
 8 sc
 
 19ns.26.2.2025
##JCAMPDX= 6.0         $$ Bruker NMR JCAMP-DX V2.0
##DATA TYPE= NMR SPECTRUM
##DATA CLASS= NTUPLES
##ORIGIN= UXNMR, Bruker Analytische Messtechnik GmbH
##OWNER= pz
$$ XWIN-NMR		Version 3.5
$$ Mon Dec 15 11:52:57 2025 Russian Standard Time (UT+4h)  Yarkov@DPX200
##.OBSERVE FREQUENCY= 200.1313
##.OBSERVE NUCLEUS= ^1H
##.ACQUISITION MODE= SIMULTANEOUS
##.ACQUISITION SCHEME= undefined
##.AVERAGES= 8
##.DIGITISER RES= 18
##SPECTROMETER/DATA SYSTEM= spect
##.PULSE SEQUENCE= zg30
##.SOLVENT NAME= CDCl3
##.SHIFT REFERENCE= (INTERNAL, CDCl3, 0, 15.4791)
##AUDIT TRAIL= $$ (NUMBER, WHEN, WHO, WHERE, WHAT)
$$ ##TITLE= Audit trail, XWIN-NMR		Version 3.5
$$ ##JCAMPDX= 5.01
$$ ##ORIGIN= Bruker BioSpin GmbH
$$ ##OWNER= Yarkov
$$ C:/Bruker/XWIN-NMR/data/yarkov2/nmr/H-C/1/pdata/1/auditp.txt
$$ ##AUDIT TRAIL=  $$ (NUMBER, WHEN, WHO, WHERE, WHAT)
(   1,<2025-12-15 11:52:16.54 +0400>,<Yarkov>,<DPX200>,
      <created by zg, POWCHK disabled, PULCHK disabled
       configuration hash MD5:
       00 E9 B6 7A A2 85 ED C7 34 08 36 98 17 FE 4E 26
       data hash MD5: 16K
       37 6D 0F F9 A9 46 CA 4A 63 08 87 16 ED 88 2D 49>)
(   2,<2025-12-15 11:52:22.14 +0400>,<Yarkov>,<DPX200>,
      <Start of raw data processing
       efp BC_mod = 2 LB = 0.25 FT_mod = 6 PKNL = 1 PHC0 = -5310.083 PHC1 = 17.82193 SI = 16K 
       data hash MD5: 16K
       B8 4B B1 41 BC BC CD 24 AF 7C DC 36 1F B5 68 F1>)
$$ ##END=
$$ 
$$ hash MD5
$$ 39 92 07 70 37 07 B1 B3 FB 3D 26 98 29 E6 7D 04
##$RELAX= 
##$RELAX= 
##$RELAX= 
##$RELAX= 
##$RELAX= 
##$RELAX= 
$$ Bruker specific parameters
$$ --------------------------
##$DU= <C:/Bruker/XWIN-NMR>
##$EXPNO= 1
##$NAME= <H-C>
##$PROCNO= 1
##$TYPE= <nmr>
##$USER= <yarkov2>
##$AMP= (0..31)
100 100 100 100 100 100 100 100 100 100 100 100 100 100 100 100 100 100 
100 100 100 100 100 100 100 100 100 100 100 100 100 100 
##$AQSEQ= 0
##$AQ_mod= 1
##$AUNM= <au_zg>
##$AUTOPOS= <>
##$BF1= 200.13
##$BF2= 200.13
##$BF3= 200.13
##$BF4= 200.13
##$BF5= 200.13
##$BF6= 200.13
##$BF7= 200.13
##$BF8= 200.13
##$BYTORDA= 1
##$CFDGTYP= 0
##$CFRGTYP= 5
##$CHEMSTR= <none>
##$CNST= (0..31)
1 1 145 1 1 1 1 1 1 1 1 1 1 1 1 1 1 1 1 1 1 1 1 1 1 1 1 1 1 1 1 1 
##$CPDPRG= <>
##$CPDPRG1= <>
##$CPDPRG2= <>
##$CPDPRG3= <>
##$CPDPRG4= <mlev>
##$CPDPRG5= <mlev>
##$CPDPRG6= <mlev>
##$CPDPRG7= <mlev>
##$CPDPRG8= <mlev>
##$CPDPRGB= <>
##$CPDPRGT= <>
##$D= (0..31)
0 0.7 0 0 0 0 0 0 0 0 0 0.03 0 0 0 0 0 0 0 0 0 0 0 0 0 0 0 0 0 0 0 0 
##$DATE= 1765785135
##$DBL= (0..7)
120 120 120 120 120 120 120 120 
##$DBP= (0..7)
150 150 150 150 150 150 150 150 
##$DBP07= 0
##$DBPNAM0= <>
##$DBPNAM1= <>
##$DBPNAM2= <>
##$DBPNAM3= <>
##$DBPNAM4= <>
##$DBPNAM5= <>
##$DBPNAM6= <>
##$DBPNAM7= <>
##$DBPOAL= (0..7)
0.5 0.5 0.5 0.5 0.5 0.5 0.5 0.5 
##$DBPOFFS= (0..7)
0 0 0 0 0 0 0 0 
##$DE= 6
##$DECBNUC= <off>
##$DECIM= 32
##$DECNUC= <off>
##$DECSTAT= 4
##$DIGMOD= 1
##$DIGTYP= 9
##$DL= (0..7)
0 120 120 120 120 120 120 120 
##$DP= (0..7)
$$ [...]
##$SUBNAM2= <"">
##$SUBNAM3= <"">
##$SUBNAM4= <"">
##$SUBNAM5= <"">
##$SUBNAM6= <"">
##$SUBNAM7= <"">
##$SUBNAM8= <"">
##$SUBNAM9= <"">
##$SW= 18.0517328524113
##$SWIBOX= (0..15)
0 0 2 0 0 0 0 0 0 0 0 0 0 0 0 0 
##$SW_h= 3612.71676300578
##$TD= 16384
##$TD0= 1
##$TE= 0
##$TE2= 300
##$TE3= 300
##$TEG= 300
##$TL= (0..7)
0 120 120 120 120 120 120 120 
##$TP= (0..7)
150 150 150 150 150 150 150 150 
##$TP07= 0
##$TPNAME0= <>
##$TPNAME1= <>
##$TPNAME2= <>
##$TPNAME3= <>
##$TPNAME4= <>
##$TPNAME5= <>
##$TPNAME6= <>
##$TPNAME7= <>
##$TPOAL= (0..7)
0.5 0.5 0.5 0.5 0.5 0.5 0.5 0.5 
##$TPOFFS= (0..7)
0 0 0 0 0 0 0 0 
##$TUNHIN= 0
##$TUNHOUT= 0
##$TUNXOUT= 0
##$USERA1= <user>
##$USERA2= <user>
##$USERA3= <user>
##$USERA4= <user>
##$USERA5= <user>
##$V9= 5
##$VALIST= <valist>
##$VCLIST= <CCCCCCCCCCCCCCC>
##$VD= 0
##$VDLIST= <DDDDDDDDDDDDDDD>
##$VPLIST= <PPPPPPPPPPPPPPP>
##$VTLIST= <TTTTTTTTTTTTTTT>
##$WBST= 1024
##$WBSW= 4
##$XGAIN= (0..3)
0 0 0 0 
##$XL= 0
##$YL= 0
##$YMAX_a= 51348
##$YMIN_a= -43067
##$ZGOPTNS= <>
##$ZL1= 120
##$ZL2= 120
##$ZL3= 120
##$ZL4= 120
##$ABSF1= 0
##$ABSF2= 0
##$ABSG= 0
##$ABSL= 0
##$ALPHA= 0
##$AQORDER= 0
##$ASSFAC= 0
##$ASSFACI= 0
##$ASSFACX= 0
##$ASSWID= 0
##$AUNMP= <proc_1d>
##$AZFE= 0.1
##$AZFW= 0.1
##$BCFW= 0
##$BC_mod= 2
##$BYTORDP= 0
##$COROFFS= 0
##$CY= -3
##$DATMOD= 1
##$DC= 0
##$DFILT= <>
##$DTYPP= 0
##$F1P= 0
##$F2P= 0
##$FCOR= 1
##$FTSIZE= 16384
##$FT_mod= 6
##$GAMMA= 0
##$GB= 0
##$INTBC= 1
##$INTSCL= 3.241238e-09
##$ISEN= 128
##$LB= 0.25
##$LEV0= 0
##$LPBIN= 0
##$MAXI= 10000
##$MC2= 0
##$MEAN= 0
##$ME_mod= 0
##$MI= 1.114404
##$NCOEF= 0
##$NC_proc= -9
##$NLEV= 6
##$NOISF1= 3.799351
##$NOISF2= 2.8
##$NSP= 0
##$NTH_PI= 0
##$NZP= 0
##$OFFSET= 15.47915
##$PC= 1
##$PHC0= -5310.083
##$PHC1= 17.82193
##$PH_mod= 1
##$PKNL= yes
##$PPARMOD= 0
##$PSCAL= 0
##$PSIGN= 0
##$REVERSE= no
##$SF= 200.130008515311
##$SI= 16384
##$SIGF1= 3
##$SIGF2= 2
##$SINO= 0.751879
##$SIOLD= 32768
##$SREGLST= <19F.Aceton>
##$SSB= 0
##$STSI= 16384
##$STSR= 0
##$SW_p= 3612.71676300578
##$SYMM= 0
##$S_DEV= 0
##$TDeff= 16384
##$TDoff= 0
##$TI= <>
##$TILT= no
##$TM1= 0
##$TM2= 0
##$TOPLEV= 0
##$USERP1= <user>
##$USERP2= <user>
##$USERP3= <user>
##$USERP4= <user>
##$USERP5= <user>
##$WDW= 1
##$XDIM= 16384
##$YMAX_p= 524969449
##$YMIN_p= -1526720
$$ End of Bruker specific parameters
$$ ---------------------------------
##NTUPLES= NMR SPECTRUM
##VAR_NAME=  FREQUENCY,     SPECTRUM/REAL,   SPECTRUM/IMAG
##SYMBOL=    X,             R,               I
##VAR_TYPE=  INDEPENDENT,   DEPENDENT,       DEPENDENT
##VAR_FORM=  AFFN,          ASDF,            ASDF
##VAR_DIM=   16384,         16384,           16384
##UNITS=     HZ,            ARBITRARY UNITS, ARBITRARY UNITS
##FACTOR=    0.220516191357247, 1,           1
##FIRST=     3097.84238497025, 0,            0
##LAST=      -514.874378035529, 0,           0
##MIN=       -514.874378035529, -1526720,    0
##MAX=       3097.84238497025, 524969449,    0
$$ Real data points
##PAGE= N=1
##DATA TABLE= (X++(R..R)), XYDATA
$$ [...]
7285 195956 -326248 46316 367555 186261 364052 482799 559969 883780 584353 726768
7275 726768 388286 712107 336296 631589 1300477 914604 984649 1221363 1061982 1435365
7265 1435365 1306080 1039922 409419 192034 562432 449718 453434 -10202 581411 299814
7255 299814 706008 1304530 1002251 616936 799219 541991 573802 807742 903009 704609
7245 704609 664947 961467 929272 969258 1141082 1060765 250411 257066 236589 806954 499921
7234 499921 367973 85494 721430 801290 814574 573966 1450106 859455 419640 880421
7224 880421 963027 1091203 1489291 1331570 556309 875102 1023194 1017774 210776 842706
7214 842706 372185 865266 346010 655080 667224 449250 694065 906155 405677 478416
7204 478416 520687 611540 573168 767969 850155 1332221 951648 452396 1208982 1031824
7194 1031824 827546 361401 501866 607249 1116705 1038325 386664 62098 531926 726010
7184 726010 400345 568456 394157 355623 147765 517803 755207 584153 270805 659985
7174 659985 427220 735001 971612 878915 278589 640671 690561 800402 1151494 1142537
7164 1142537 977412 1664049 1067547 1334855 957034 808822 823996 723879 288474 622438
7154 622438 1381972 1050329 1254518 696428 1653324 1493219 2021048 2325080 2697029 1898763
7144 1898763 2190334 1745710 1491704 804281 602724 587247 769684 716064 649459 519942
7134 519942 504978 989796 840449 1152405 811082 1189444 684020 382779 449291 1098242
7124 1098242 690382 572496 391836 621354 801627 906001 1484952 1400655 788543 404306
7114 404306 466585 242727 275570 680762 1199174 901867 1189866 670196 700494 620201
7104 620201 885188 897885 1005948 452703 1460412 924881 641255 325807 817524 452533
7094 452533 440251 614876 1013734 334854 904748 1785344 1371444 1295701 337184 1141320
7084 1141320 842607 1060860 892113 1420994 1054123 1020064 1078053 1125221 1264162 1953995
7074 1953995 1209761 729631 845033 437203 289072 422068 1043012 1153421 546554 276060
7064 276060 789647 691854 626842 667615 1004699 836849 1101614 1225025 1510776 1127409
7054 1127409 886092 636411 568795 164075 468755 858705 1288196 1389715 1451971 1462569
7044 1462569 1011932 846083 1167827 2003054 1467971 1593531 821569 453872 524717 1244894
7034 1244894 874777 946501 875943 759965 622705 1259906 1118934 918234 839320 1071115
7024 1071115 739817 907575 625844 974727 1330433 1059885 1021393 1156329 1548407 1109355
7014 1109355 1190509 469798 672064 588847 825394 836995 1161835 808554 763956 686348
7004 686348 684024 1073675 1184944 1136149 1137401 1077040 738397 1037852 1474633 1513171 1079889
6993 1079889 1321297 1467532 1116715 656910 861021 561125 510959 396148 1264409 1244852
6983 1244852 698639 595565 854753 1283136 1435285 1908007 1617176 1276857 1242630 1432025
6973 1432025 1171800 1270751 1112808 853851 985877 1748862 1380112 1170757 1047355 1049319
6963 1049319 955295 1071605 822202 1105288 998284 1005277 1466693 588938 612012 1307624
6953 1307624 889101 1028403 1470593 840627 1038458 1421798 1137797 994447 689117 306482
6943 306482 617079 736743 991870 1055125 854387 959550 1085861 1041078 1112995 1037043
6933 1037043 728700 815917 1022244 822067 1613683 1436983 880587 1321961 1332667 1263369
6923 1263369 1437058 1249545 877881 790892 893563 797507 617304 622453 752125 1048530
6913 1048530 958793 1015773 1072802 1392936 1693681 1684031 1319540 1615290 1486667 1291083
6903 1291083 1003205 699334 956148 1311785 1016571 876297 809155 765371 1408633 1012400
6893 1012400 1015300 1016555 1675568 1518161 756741 347169 701787 719874 1184830 845393
6883 845393 544870 306733 966590 787175 476215 693272 1056181 855827 618244 927497
6873 927497 919166 1180783 676557 982220 1245642 1295964 980329 407591 191467 1140716
6863 1140716 1149631 1181835 725770 1104726 1207008 1314258 1633294 1415083 1194607 1315874
6853 1315874 960426 1094812 1302615 936858 928500 1022476 1305378 1454208 940208 548259
6843 548259 1051443 187773 545668 842732 884598 1339259 1467479 1725073 1476330 875254
6833 875254 703486 1531113 1271320 717795 806430 919916 1069222 1273249 793847 424586
6823 424586 1019086 1728022 755582 1012263 495175 984578 1204443 1124133 688846 512373
6813 512373 755002 667842 266235 277049 451504 1216607 1611285 1247495 1278101 1545908
6803 1545908 1193598 850354 1253882 1093217 1373982 1390488 1890035 1668281 1517895 988137
6793 988137 1143130 1039541 969288 954953 1390979 1650956 1726106 1306365 1590917 1673564
6783 1673564 1621498 1511282 1637160 1158897 917499 1164206 1252861 1457370 1335782 1346957
6773 1346957 924803 666844 942683 1668959 1586042 1103944 1272530 1148846 1355268 1587530
6763 1587530 1662884 1225865 1014592 845712 568600 900103 1186884 1033421 652772 580527
6753 580527 925872 1597075 1891161 1390076 1593312 1401550 1457855 1404444 1752593 1347257
6743 1347257 855616 1447644 1349929 1843113 1850388 1655602 1538652 2040805 1644310 1613717
6733 1613717 1770772 1369315 1479668 1643150 1524083 1412463 858542 1242917 1047314 989320
6723 989320 893141 1025745 595037 654234 1075016 1013975 1329325 1404790 1613320 1861771
6713 1861771 1417662 1161394 1975103 1618086 1863356 1321882 1066666 662502 1050619 1716858
6703 1716858 1602472 1445204 1366728 1221165 1151683 883554 1176909 1607556 1283977 858982
6693 858982 940087 1359884 1590088 1074926 1093019 1361677 942365 838083 686716 967765
6683 967765 1095981 1348064 1272413 1755633 1858982 1545414 1464936 977923 1067284 1374013
6673 1374013 2021303 1752230 811402 642190 809158 1031464 1411469 1231684 1494433 1235423
6663 1235423 954777 658531 942116 1297421 1706291 1555368 1161296 1286611 1466777 1684210
6653 1684210 1328952 1260689 1674785 1818054 2186536 2038596 1462763 1381666 1373839 2636280
6643 2636280 2326661 1415293 1069667 1200882 1764752 2459702 1847685 1474928 1532020 2010655
6633 2010655 1235758 1561377 1922778 1668467 1873871 1726345 1778356 2031501 1589885 1735976
6623 1735976 1677916 1761812 1786619 1558174 1463683 1780943 1475700 1553366 1739147 1119635
6613 1119635 847645 1051013 1472032 1444164 1707858 1335061 1532817 1757150 2079208 1917450
6603 1917450 1770105 1892377 1432297 1348098 1214518 1522995 1322757 819049 1135287 1350695
6593 1350695 1540320 1839484 1536092 1782519 1715926 1676600 2063789 1825694 1664131 2071482
6583 2071482 2003724 1453193 1225309 1474566 1621078 1815347 1524823 1351352 1731414 1750878
6573 1750878 1852090 1346285 1375090 1672486 2278573 2005070 1817697 1636705 1557862 1557469
6563 1557469 1491369 1951190 1473966 969525 1485667 1591951 1581143 1463548 1982969 1916329
6553 1916329 1565054 889396 1078787 1464756 1765229 1592517 1917812 1922769 1997009 1498814
6543 1498814 1683539 1912195 1925594 1818872 1611929 1753511 1337659 1631756 1683657 1636301
6533 1636301 1661263 1599074 1973963 2388778 2006093 1477173 1365106 1839879 2193274 2300313
6523 2300313 1998374 2267062 1703835 1500677 1584071 1954672 1787022 1356925 1636090 1947829
6513 1947829 2333170 2386948 1970302 1378614 1796163 1925868 1923029 1694303 2053079 1907547
6503 1907547 1867785 1230173 1556681 1958466 2279753 2311607 2257411 2449338 2806893 2876960
6493 2876960 2199733 1724266 1422724 1705408 1829162 1747810 1356790 1875422 1360036 1641410
6483 1641410 1393514 1661488 1414467 1800021 1551145 1991930 1757475 1664472 1930809 2099873
6473 2099873 1979827 1710823 1795662 1802582 2152091 2156953 1939537 1963836 2536772 1991289 2062523
6462 2062523 2101466 2691328 2271800 2237000 2095578 2470249 2317794 2090509 2019365 2433038
6452 2433038 2421860 2034476 2139667 2310729 2882281 2881889 2619416 1784252 2087609 1991447
6442 1991447 2073941 1717100 1921895 1993753 2165928 1811426 1780376 1786745 2302007 2280082 2343409
6431 2343409 2261527 1746095 1815528 2069599 2021470 1803572 1841011 1766346 2143930 1695474
6421 1695474 2462350 2400903 2000374 1810083 2509645 2107325 2382119 2437136 1981060 1781517
6411 1781517 2243054 2681903 2708844 2652095 2738930 2514456 2878632 3170209 2784568 2995582
6401 2995582 3513695 3371124 2863373 3111858 2596767 2653130 2467780 2383264 2411920 2668351
6391 2668351 2229799 3049926 3276679 3120643 2974959 3244390 3013054 2622670 2879430 3306251
6381 3306251 3184812 2909316 3351022 2669280 2975827 2833460 2732637 3217700 3352201 3470148
6371 3470148 3530701 2853083 3058583 2683195 2986412 2952461 3325505 3466427 3410084 3372175
6361 3372175 3276609 3772109 3668593 4445214 4807289 4396642 3685964 3647788 3674372 3641611
6351 3641611 3551254 3675068 4226471 4383777 3784331 3804025 3239005 3594295 3791150 3929552
6341 3929552 3976277 3966026 3684132 3398214 3659572 3423532 3337045 3277792 3645585 3958696
6331 3958696 4216731 3911156 4034434 4096934 4458165 4244850 4106784 4589484 4191487 4227926
6321 4227926 4522271 4794337 5574732 5449609 5116116 5041650 5337794 6008341 5947722 5605348
6311 5605348 5403114 5610126 5551457 4875519 5314140 5546061 5319723 6241804 6230285 6189336
6301 6189336 5728416 5589032 5828293 6187480 6061908 5966810 5857675 5331733 5216323 5164021
6291 5164021 5137565 5224489 6006891 5984071 6299108 6269723 6459790 6574676 6528748 6181429
6281 6181429 5556852 5990136 6722419 6456384 6074510 6154961 6116650 6099482 5910746 5726152
6271 5726152 5330833 5827485 5597279 5800051 5284111 5382505 6167807 6141864 6061513 6338468
6261 6338468 6257528 5816426 6321181 6546597 6733537 6362100 6460989 6556726 5951387 5713506
6251 5713506 5755466 6420408 6308848 6096342 6243436 5713403 5957453 6355953 6959670 7343945
6241 7343945 6829427 6657601 6577268 6128026 6353906 6193259 6177682 6407113 6596826 6586639
6231 6586639 6358524 6383573 6039534 6552799 6516709 6499989 5948194 5659394 6054159 6112972
6221 6112972 6917471 6782433 6352627 6088684 6288213 6610798 6647333 6729717 6807172 6547991
6211 6547991 6992311 6966757 7870608 7597949 7769769 7506713 7122667 6932140 7031482 7244056
6201 7244056 7443927 7599187 7786977 8226108 8466837 8854367 8844936 8972718 9407238 9190707
6191 9190707 8900957 9453945 9721578 9917154 9909460 9899542 10182948 10555469 10183305 10701016
6181 10701016 10971994 11209170 11824968 12425399 11979720 11651648 11585180 12122339 11747787 12070728
6171 12070728 12726407 12624585 12817509 13578243 14463628 14802013 15659209 15990931 15528447
6162 15528447 14975321 14524755 13606904 13214863 13197974 13308855 13631730 14297278 14903540 15423955
6152 15423955 15653348 15510627 14886397 13496613 13143985 12302112 11990483 11311537 10901800
6143 10901800 10788057 10974966 10727175 9831910 9728542 9874305 9736846 9506307 9356796
6134 9356796 9291389 9563501 9682252 9130291 9358373 9790887 9531131 10067854 10071856 9517182
6124 9517182 9683660 9705549 9953970 9668898 9359908 10667957 11076486 10956609 11320644 11353974
6114 11353974 11666927 11896697 12087728 12409734 12387121 12437072 12411378 12299691 11835392 11439945
6104 11439945 11692202 11594971 11750652 12104266 12825581 13969238 14781796 15589592 16551137
6095 16551137 17818164 18754597 18864012 18878076 18113386 16936987 16098695 15408503 15033604
6086 15033604 15721735 16545075 17060894 18059948 18588258 18237433 17042541 16352858 14748877
6077 14748877 13129227 12291262 11685190 11182355 10830182 10771810 10767434 10754899 10422953 10339114
6067 10339114 9707298 9549089 10102851 9327381 8485913 8658989 9218926 8971537 8864368
6058 8864368 8832477 8801948 9049166 8802763 9284277 9840859 10267465 10829407 10680160 10457803
6048 10457803 10176911 10776281 11104400 10979493 10514537 10243674 10932497 10736679 10923747
6039 10923747 11598493 11881620 12433051 13509387 14776060 14693087 14833217 15127412 15280332
6030 15280332 14520236 14128260 13965925 13825922 13820506 14166001 14604828 15149072 15912084 16749288
6020 16749288 17466470 17338802 17285545 17146938 15936624 15022910 14383427 14607259 14134722
6011 14134722 13859401 14824104 15306196 15411000 15165264 14747783 14639045 14902433 14220667
6002 14220667 14088283 13477852 12771375 12600777 12424170 13131271 13704645 14314833 14918015
5993 14918015 15469834 16454524 16931337 17046985 17021207 17555114 18168813 18698670 18618306 18523878
5983 18523878 18039371 17290155 16138253 15413280 15209204 15625214 16298497 16611684 17333022
5974 17333022 18094369 18708894 19639996 19770584 19788557 19418857 18391444 18105118 18084840 17708159
5964 17708159 17353699 17183490 17217863 18273339 18907221 19755238 20523530 20964790 20663670
5955 20663670 19865713 19513317 18584442 18453429 18223743 17989041 18174167 18636679 19075913
5946 19075913 19451826 19755508 20500249 20510186 20418710 20897230 21262482 21259009 21487901 21869457
5936 21869457 22115956 21785999 20511469 19841648 18403278 17908049 17682682 16686042 16380938
5927 16380938 16030733 15547545 15374570 16021159 16064562 16404236 16727438 16438068 16909729 16977941
5917 16977941 17961822 18802032 19072513 19920321 20901811 21964474 23489578 25720462 26676414
5908 26676414 26464839 25777371 24749819 23501962 22361662 20951686 19669428 18993325 18552436
5899 18552436 18391367 17956285 17680946 18022540 17817954 17281207 17196028 16765150 16452747 16725803
5889 16725803 17112050 17603110 17534830 17879860 18112829 18511268 19063145 19031387 19168997 19119863
5879 19119863 19206594 19083917 19267021 19412838 19288580 19239633 19129463 18958341 19073858 18746419
5869 18746419 19115739 18914805 19844935 20614437 21194529 20954399 20640298 21655164 21797297
5860 21797297 22085097 22101523 22256692 21361837 22058698 21943288 21902662 22530362 23428309 24140194
5850 24140194 24321603 24987245 25950972 26169993 26515517 26349489 26387397 26774118 26804196 27128683
5840 27128683 27247311 26675019 26060967 25946088 25235919 24443748 23821908 23525540 23695677
5831 23695677 23676905 22619810 22118585 21737205 21709380 21163123 21390223 21145552 21033371 21046470
5821 21046470 20808676 21022219 21734548 21498296 21072382 20982507 20605155 20159985 20042387 19707894
5811 19707894 19188272 18655763 18245780 18738422 18594364 18376425 17674381 17167714 17404414
5802 17404414 17361022 17431938 17713248 17445975 17520866 17858371 18799335 19570009 19416529 19637386
5792 19637386 20033845 20597082 20943227 20522925 21040706 21550348 21229874 21479744 22339263
5783 22339263 24063368 24860971 25759914 25787693 25172769 24523126 23689655 22947106 22356426
5774 22356426 21001517 20502028 19746786 18895188 18608967 18320612 18463066 18589975 18585803 18584592
5764 18584592 18829313 19102166 19867770 20994270 22658678 23344848 23694040 24039688 22626120
5755 22626120 20947890 19127231 17971947 17181989 16175934 15227697 14263400 13792010 13189494
5746 13189494 13078758 12549042 12772982 12230955 12611470 12743246 12584586 12512481 12678918 12321736
5736 12321736 12321829 11328525 10751733 11756652 11776140 11347406 11081254 11531289 11374553 12162020
5726 12162020 12572966 12702976 12535681 12834914 12327039 12651954 12805326 13260513 13868473
5717 13868473 14520544 15034765 16257495 18382751 20390369 23282756 24491117 25099104 23937236
5708 23937236 22281627 20263880 18685353 17456086 16464117 15729539 15789781 15753948 15797713
5699 15797713 15813833 15922696 16284423 17550922 18115976 19166583 21026526 22699461 24892598
5690 24892598 26448422 26591230 25516523 24491533 22615851 20897581 18600706 16877635
5682 16877635 15949897 15058689 14137856 14070563 13400355 13058430 13461690 13173222 12400513 12267756
5672 12267756 12629720 12692092 12318154 12170404 12769126 13321866 13374177 12687936 13215619 13646475
5662 13646475 13734751 13498762 13658922 13210709 13046881 13045132 13451514 12998956 12687635 12429044
5652 12429044 12458564 12004838 11954588 11836292 12352446 12319203 11901310 12304554 12288600 12339429
5642 12339429 11452424 11257413 11382278 11193394 11303455 11840174 12089054 12170546 12203274 12493082
5632 12493082 12248304 12184366 11556554 11724277 10942684 11268627 11206199 10495206 10852103 10594209
5622 10594209 10376928 10603024 10675655 10392836 10202560 10396158 10686764 10029707 10135575 10518293
5612 10518293 10214719 10212472 10341320 9903552 9676650 9870419 10136419 10191811 10201803 10181518
5602 10181518 10564855 11200014 10736424 10424844 10277216 10630376 10233520 9728173 9367765
5593 9367765 9522606 8940127 9191388 8824260 8805980 8851277 9086325 8854845 8791995 9152443
5583 9152443 9072315 9401796 8947853 8754366 8628064 8808040 8526692 8797811 9502211 9087066
5573 9087066 9182223 9294218 8986872 8929107 8515012 8957837 8627053 8360797 8239871 9077239
5563 9077239 8822795 8786089 8705389 8708971 8784284 8296707 8101854 8424770 8653418 8847719
5553 8847719 9186356 9052256 9156221 9003806 9189506 8630427 8969839 8873929 9251348 9485763
5543 9485763 9447377 9400555 9994732 9857591 9623065 9027672 8890144 8449921 8606856 8127489
5533 8127489 8409017 8773415 8854729 9259835 9402070 9747408 8870085 9404501 9459329 9511213
5523 9511213 8770550 8734566 8253042 8354106 8444137 8295781 8176456 8531599 8324774 7724999
5513 7724999 7461403 7968228 8093648 7892137 8271243 9087747 9176979 8593530 8780515 8706069
5503 8706069 8600774 8121271 8184171 7353684 7665894 7588437 7374498 7056605 7156554 7310809
5493 7310809 7348904 7683800 7329720 7706981 7941841 8171188 8100428 8110814 7786996 7690447
5483 7690447 7346444 7638307 7365438 7754863 7627015 7945359 7613128 7645831 7648683 7808943
5473 7808943 7168736 7558234 7800635 7986247 8128955 8412561 8449397 8759489 9093618 9538458
5463 9538458 9216622 9474006 9976123 9466724 10117820 10422186 10523467 10335493 10853155 11191422
5453 11191422 10950399 10571526 10435508 10407208 11017798 10650927 10758102 10268488 10338375 10584540
5443 10584540 11092292 11426573 11857073 12223212 12691524 13349876 14419717 15535727 17453270
5434 17453270 20039949 24589093 30813347 36063443 39292378 39047113 36362275 32197123
5426 32197123 28102417 24007264 20753588 18044480 16686581 15394035 14450902 13757032
5418 13757032 13925875 14458387 14862411 15811639 16224585 18206041 20974899 24726400 28663618
5409 28663618 31824265 33030472 32610891 29241040 26136555 22746286 19618615 16931209
5401 16931209 15346459 13796378 12961780 12767706 12127634 11411387 12017916 12841912 12707444
5392 12707444 12531339 11875229 12171814 12446743 12538143 12518395 12218866 12494272 12535727 12723934
5382 12723934 13177063 12854499 12332607 12998876 13292844 13294135 13434880 12856742 12560504 12142035
5372 12142035 12247049 12184177 12220036 12018620 12497655 12337307 12787351 12854528 12630251 11721249
5362 11721249 11339943 11595386 11577994 11701893 11820310 11266925 10286119 10715825 10388993 10309501
5352 10309501 10793863 10817511 10396956 10505373 9789497 10158298 9535883 9475160 9408964 9178451
5342 9178451 9008496 8651806 9487596 10104579 10747882 10582940 10413085 10601702 11184983 10934219
5332 10934219 10773428 9981546 9929864 10102727 9957811 8972187 8017473 7797598 8216327 8090948
5322 8090948 8553906 8952042 9255086 9823378 9973185 9613080 9258830 9239795 9356885 9667502
5312 9667502 9670949 9022343 8743590 9509872 10253249 11472458 11489536 12157962 12540413 12287371
5302 12287371 12493767 12911833 12578803 12888562 13210547 12906530 13062543 13731137 14478595
5293 14478595 14836331 15407250 15764063 15840141 15970193 16223594 15782818 16303398 16447511 16530197
5283 16530197 16193086 16801822 16330921 15812536 14993725 14522634 14717390 15271817 15665722
5274 15665722 15656509 16092312 15720464 15241811 14806198 14384117 14194802 14642922 14443585 15227854
5264 15227854 15079775 15159800 15102445 15009060 14130130 13555069 13385480 13098015 13167622 13332816
5254 13332816 13635840 13713374 13918766 13559977 12708438 12012562 11260506 10391020 9964923 10458498
5244 10458498 10192401 9447198 9443363 9286124 9370986 9550835 9879499 9716344 10077735 9813409
5234 9813409 10339173 9745683 9571163 9004717 8458975 8300128 8388190 8439331 8204184 7817803
5224 7817803 7491646 7451571 7230794 7942308 7767377 7468789 7031811 7370890 7225561 7428670
5214 7428670 7673978 7828321 7611021 6958070 6298286 6418807 6137355 6379357 6091805 6252819
5204 6252819 6244504 6107616 5721247 4855556 5523098 5457950 5431378 5159307 5351767 5153179
5194 5153179 5550073 5425951 5519214 5984874 5871326 5719527 6274323 5369581 5366922 5961130
5184 5961130 5726835 5751964 5608447 4971671 4557535 4867428 4840151 4797265 4569306 4940492
5174 4940492 4580740 4592681 3836798 4623761 4931724 4525326 4065991 4164903 4041047 4231825
5164 4231825 4293472 4814773 4284506 4424357 5024728 4798705 3936713 4160218 4312113 3972747
5154 3972747 4310306 4458816 4267023 4046478 4455469 4572565 5098390 4679316 5265072 5758099
5144 5758099 6114889 5855868 6077439 5791775 5320442 4976271 5177690 5151663 5008374 4049832
5134 4049832 3556777 3671361 3848122 3813181 3708412 4376022 4158101 4344762 4625220 4605684
5124 4605684 4787478 5217141 4921841 4836603 5259265 6046832 5927307 5587574 5489577 5701592
5114 5701592 5669888 4952350 4771538 4989739 4640053 5052353 4937600 4355231 4299888 4838320
5104 4838320 5322125 5202052 4886413 4223098 4070877 3535517 3687058 3945708 4748680 4455962
5094 4455962 5049005 5076641 4571008 4213709 4742791 4843588 4943059 5111114 5244758 4924899
5084 4924899 4268553 4571068 4690035 4307716 4250339 4712847 4310665 5013697 5096791 4839058
5074 4839058 5080557 4867195 4652421 5145149 5323023 5145229 5497815 5466876 5372098 5573950
5064 5573950 5822523 5680525 5205645 5186611 5132171 4706114 4769152 5140764 5093741 5172134
5054 5172134 5436198 5825862 6023886 5850946 5488264 5820308 6301144 6368993 6216839 6175359
5044 6175359 6967077 6648355 6426866 6867837 7166775 6415321 6732181 6888931 7169882 8681034
5034 8681034 10570692 11757777 12564988 12553422 11798061 10996349 9702983 9494075 8783779
5025 8783779 8856883 8100577 7776187 7755215 8358216 8405647 8783878 8818212 9864032 10747252
5015 10747252 12523423 14346094 15762500 16996912 18028858 18405832 17056659 14746925
5007 14746925 12996883 12046890 10789959 8753369 7218273 7168126 6815628 6267080 6711796
4998 6711796 7226362 7048998 8181360 8930560 10001290 11605307 13377630 13285067 12734239
4989 12734239 11860204 10345405 8712369 7856462 6666644 6651603 6382661 6002466 5854726
4980 5854726 5620746 5574827 5601825 6145736 5552546 5292488 5221522 5377841 4962494 5632812
4970 5632812 5547675 5479786 5467536 6013397 5633562 5543084 5838436 5387807 5692812 5826967
4960 5826967 5777882 5581024 5618444 6099350 6381801 6288528 6335928 6158867 6665892 6244854
4950 6244854 6562409 5782490 6088014 5622508 5754729 5745561 5999258 6150872 5890973 6283273
4940 6283273 6800205 7134367 7172808 7550764 8345065 10054161 10988588 11786555 11437948 10615784
4930 10615784 9589385 8459986 7617788 7054963 6439137 6369543 5883846 5736373 5517709
4921 5517709 5756368 5720866 5794382 5315207 5353202 5452361 5615962 5450577 4972612 5257981
4911 5257981 5294219 5606944 5083636 5842353 5938828 6004079 5009457 5463119 5294686 5653602
4901 5653602 5509434 5751298 5950491 5566255 5159107 5360880 5189962 4795059 4769986 4539037
4891 4539037 5261154 5087874 5545725 4757845 5322202 5695661 5582298 4783683 5557735 5441949
4881 5441949 5528582 4826070 5312809 5524369 5211702 4931936 5370866 5553384 5805060 6014773
4871 6014773 6133810 6116282 5978920 5818139 5882313 6755747 6325325 6118181 5859748 6569347
4861 6569347 6061697 6251475 5954543 6373704 6036737 6830032 7045050 8168705 9253347
4852 9253347 9743344 11467941 13387054 14913369 15191153 14507937 13195897 12630625 11380229
4843 11380229 11121441 10566473 10957357 10994091 12669176 13833027 15386340 15847577 15788254
4834 15788254 14470149 13187905 12191038 12043755 12140327 13300716 14850070 14806059 14489586
4825 14489586 12866991 12261875 11184351 10288146 9965857 9853028 9430915 10274198 11020390
4816 11020390 12753064 13379916 13616981 12314366 11632514 10082146 8957532 7886389 7884670
4807 7884670 7743341 7181520 6922614 6386178 6984970 6433170 6727382 7260963 7165411 6798466
4797 6798466 7313443 7348594 8466532 9131249 9953322 9606203 9318318 8810025 8838849 8078904
4787 8078904 8477432 8241219 7691107 7816864 7723139 7454117 7564017 8696995 8698755 9053778
4777 9053778 9552870 10945398 10706874 11155497 11391163 11997544 11780930 12107284 11493999
4768 11493999 11211158 10612074 10153217 9307257 9182502 8632355 8665575 8429886 8385964 8135944
4758 8135944 8426360 9399352 9606588 9992849 10102089 11154824 10931722 10818287 9578101
4749 9578101 9724554 9138603 9118450 8686876 8870521 8410025 7823736 7338475 7797526 7471131
4739 7471131 7214217 7816988 7742456 7711499 7664109 8427026 8387367 9195114 9492859 9422886
4729 9422886 9136651 9344842 9659810 9522587 9241096 9084310 8524312 8859887 8068820 7976277
4719 7976277 7158503 7436890 7603789 7344026 7275867 7220645 7534188 7724439 8015135 7618077
4709 7618077 8097465 8327913 8622626 8378402 7901436 7479659 7893865 7461974 7529690 7292987
4699 7292987 7152371 6795478 7917782 7918846 7931868 7533173 7379840 6582056 6589364 7005946
4689 7005946 6339794 6340657 6494381 7223770 7115545 6728880 6985937 6769629 6746819 7335883
4679 7335883 6966936 7142314 6550426 6322384 6192419 6514267 6756256 6873360 6857416 6489927
4669 6489927 6373922 6807392 7182604 6619168 6656938 6911387 7533175 7380322 6951253 6855184
4659 6855184 6659140 6872671 7133551 6772656 6882963 7048650 6498179 6499671 6491654 6410718
4649 6410718 6770654 7042088 7253745 7126878 6862621 7258175 6796560 6637052 7187025 7125218
4639 7125218 6359817 6633390 7046246 7018910 7114616 6833281 6337409 6265157 6378616 6470527
4629 6470527 6335493 6575959 6154833 6315850 5928664 6721981 6806368 6768987 7105759 6387145
4619 6387145 6166880 6196417 6626583 6962718 6685474 6281309 6132362 6363302 6644492 6008615
4609 6008615 6268027 6733820 6378840 6635460 7415201 7502916 7611294 7505519 7831323 7361913
4599 7361913 7712576 7532360 7388438 7218178 7814169 8093590 7934780 7996768 7743325 7321370
4589 7321370 7097283 7436878 7551275 7590967 7333633 6947240 6823042 7243327 6600512 7025228
4579 7025228 7348493 7575501 7650088 7608541 6819655 6710220 6960394 7357631 7413804 6951362
4569 6951362 6723180 6926306 6841768 7064170 7657752 6903438 6958823 7303029 7943283 7143696
4559 7143696 7188202 7520021 7512512 7335162 7279566 7031718 7253403 7255492 7214778 7698401 7751731
4548 7751731 7656880 8463759 8090210 7538740 7847408 7980518 7584347 7286547 7302119 7754233
4538 7754233 7723058 7243748 7615150 7596124 7588164 7382915 7392104 6946554 7552206 8100088 8249041
4527 8249041 8237340 8138868 7256357 7936504 8476686 8354329 8300378 8028791 9004614 10047826
4517 10047826 10488971 10778692 11605641 11939701 11921160 11667471 11137365 10891705 10892667 10880247
4507 10880247 11203021 11305959 11314827 11788733 12554720 12747906 12905139 12665761 12155800 11820764
4497 11820764 11494398 11835324 12216199 12647911 13164769 12948447 12179562 11488896 11055625
4488 11055625 11060211 10578893 10512512 10315629 10881093 10673554 11201325 11588439 11309799 10516460
4478 10516460 10365636 9895484 9644007 9729893 9258685 9079146 8882505 9075725 8839556 9272254
4468 9272254 9186355 9196248 8851206 8497241 8148538 7870229 8032965 7923248 7851590 8063520
4458 8063520 8376817 8079273 8143970 8429680 8182248 8501204 8907982 8551347 8946615 9445475
4448 9445475 9792917 10038793 9879268 9530964 9297919 9431844 9375507 9381541 9552856 9526302
4438 9526302 9199376 9007596 8937828 9206314 9206943 9185115 9883634 9846139 9094284 9559304 9824147
4427 9824147 10315047 10832155 11295796 10859546 10329738 10066780 9789448 9565687 9611435 8948469
4417 8948469 9004104 9209624 9353314 9429314 9646513 9775290 9905682 9213446 8841336 9499062
4407 9499062 9418908 9122223 8971799 8736160 8686517 8720183 8786899 8765988 8154132 8395508
4397 8395508 8380806 7958103 7942279 8291009 8496340 8813034 8941573 9007597 9041900 8991808
4387 8991808 9290845 8569618 8550360 8053396 8008080 8484591 8664055 8490686 8023875 7977210
4377 7977210 7629747 7397693 7778865 8292106 7946369 7902454 7579315 7977607 7998420 7949161
4367 7949161 7926296 8660028 8751057 8782049 8624170 8620966 8844721 8593761 8489531 8260633
4357 8260633 8318316 8680095 8850785 9139155 9013257 9213389 9243583 9137597 9186794 9349019
4347 9349019 9812251 9869428 9739668 9683555 10013424 9810333 9957535 9377779 10003878 9966234
4337 9966234 9596533 8756841 8645900 9204206 8489776 9005885 9593279 9716373 9709754 9860700
4327 9860700 9861391 9462142 8763419 9064167 8528887 8690145 8873459 8230164 8863942 9885916
4317 9885916 10296228 10412340 10296123 10204330 11070412 11698422 12266736 11646355 11234867 10370083
4307 10370083 10366980 9926489 9900001 10054542 9421931 9181177 9463491 9580330 9833732 9422992
4297 9422992 9237328 10017162 9683325 9560275 9701110 10044357 9960047 10199564 9986756 10059478
4287 10059478 9929287 10392988 10198776 10774942 11392381 11497537 10914278 11473135 11661275
4278 11661275 11682782 11170295 11572369 11609330 12117737 11858654 11373601 11744872 12069244 11573549
4268 11573549 11208827 11420951 10572387 10520350 10541841 10913823 10774509 10582602 10608913 11427611
4258 11427611 11192553 12388721 13040939 12823366 12733881 13149949 13036570 12719397 12077263
4249 12077263 11426915 11436170 11426210 10968031 10474491 10490966 10722146 11741186 11559545 11800156
4239 11800156 11906998 11901085 11622310 11985971 11679613 11444616 11141738 11030068 10831642 10891486
4229 10891486 10879420 10784892 11176402 11140840 11388714 11167321 11854638 11003554 10802896 10717325
4219 10717325 11699955 11032289 11311391 11438446 11640178 11394869 11572338 11802939 12151704
4210 12151704 11969436 12079476 12340974 12344954 12220642 12212351 13177974 13776227 14356686 14059586
4200 14059586 14440279 14490741 14400857 14183226 14682788 14490020 14128974 14091345 14743106 13724476
4190 13724476 13941086 13677904 13848723 14216581 14170839 14480475 14680488 15155560 14884511 14991014
4180 14991014 15233208 15046756 14981241 15505582 15470068 15468662 14972956 15064730 14844793 15227177
4170 15227177 15082020 14925736 15053977 14422010 14560788 15272680 15040100 14497997 14190485
4161 14190485 13837192 13587357 12873689 13264019 13312212 13226455 13056629 13190535 12952706 12399884
4151 12399884 12250777 12558835 11953433 11743630 11302319 11863528 11724327 11859390 11894275 11528420
4141 11528420 11169138 10959259 11461427 11480924 11453229 11003285 11417275 11135633 11904279 11863660
4131 11863660 12443875 11768456 11588939 11235440 11230555 10662592 10969770 10771171 10964112 10871930
4121 10871930 11143242 11623358 11188609 10912699 10757736 11288684 11235626 11307769 11270089 11461379
4111 11461379 10784245 11101630 11345716 12038295 11255450 11237566 11365810 11682480 11476053 11835798
4101 11835798 11460846 12040161 11664720 11706068 12531256 12634970 11805610 11272807 12107893 11939341
4091 11939341 11859024 11947657 12059101 11588628 12127801 12529472 12864583 12190166 12013192 12288522
4081 12288522 12914008 12131349 11660282 12100060 12626709 12779866 12571204 12599269 12842058 13150383
4071 13150383 13277164 13326568 13432373 14067362 13500910 13651197 13732148 14518529 14244758 14024047
4061 14024047 14232660 14717631 14539059 15094547 15479965 16094286 16052837 15922379 16056168 16440981
4051 16440981 16732760 16808824 16663160 16303710 16933115 16989808 17594620 17420730 18005026 17403548
4041 17403548 17669314 17507270 17745450 17148109 17489592 17754267 18299149 18332715 18205272 18484290
4031 18484290 18398940 18500471 18232527 18147716 18065948 18094545 18106776 18050129 17948966 18346742
4021 18346742 17849363 18207168 18005943 17534745 17100307 17718623 17471419 17369555 16529800
4012 16529800 16197767 15997667 16066865 15840959 15994408 15787720 15631208 15836079 15535165 14940389
4002 14940389 14755637 14967445 15008326 14645985 13942417 14050915 13902083 14524940 13871159 13435425
3992 13435425 13239656 13587272 13270612 13266201 12902088 13185805 13039738 12813210 12874533 12281477
3982 12281477 11770707 11874310 11631939 11514193 11612990 11775273 12114781 11887756 11757071 12058558
3972 12058558 12121335 11854110 11945031 11696466 12065936 12213277 12620523 12804534 12491673 12513899
3962 12513899 12901734 13032595 12266553 12500104 12442410 12791821 12879600 12411649 12453564 13063174
3952 13063174 12946118 13429384 13012180 12931697 13353781 13462753 13420192 12678068 12891079 12657419
3942 12657419 13106452 12857168 12594726 12860437 12891941 12912047 13747643 14171310 13983238 13896179
3932 13896179 13696022 13760707 14312629 14543781 14352339 14579887 15112132 14665189 14767333 15007031
3922 15007031 15566745 15269861 15627001 15270226 15710501 16182909 16148365 16015262 15956816 16273451
3912 16273451 16067473 16333667 16173240 16108075 16322677 16927726 16817403 17571637 18091592 18538533
3902 18538533 18681041 19899724 20337607 20658572 21498057 22487865 23550033 24280883 24738296
3893 24738296 25618047 25726523 25914689 25445977 24789096 25011044 24585894 24324211 24075287
3884 24075287 24983656 25504647 25480718 25329045 26255204 26462664 26340548 26181171 25504276 24885810
3874 24885810 24976640 23847063 23746953 23638959 23415902 23486889 23466377 24034680 23553651 23697588
3864 23697588 23946608 24370913 24217338 24124397 23699647 24157887 23500483 23444584 23748275 24043831
3854 24043831 24084868 23713065 23762616 23568582 24324774 24831636 24341432 24755844 24736141 24958791
3844 24958791 25327605 24761370 25059239 24723422 25297317 25289601 25911400 25747178 25969546 26118148
3834 26118148 26365230 26424267 26762877 26498764 26331130 26432647 27002715 27406001 27267402 27423241
3824 27423241 27331041 28128133 28987340 28975985 29432191 30013235 29988382 30330562 30932033 31240657
3814 31240657 30817328 31863972 32218112 32894927 33132664 33623796 34425756 35076786 35642135
3805 35642135 36344264 36635995 36715604 36803265 36958722 37599215 37716951 38139283 38367783 38976484
3795 38976484 39644837 39236158 39314173 39833769 39870815 40020567 39865225 40159319 40569438 40204548
3785 40204548 39819921 40016634 39965341 40306844 40227429 40459105 40572497 40376922 40150840 40047775
3775 40047775 40492216 40875824 41484572 41673304 42428530 42260823 42566912 42448260 42700515
3766 42700515 42965520 43491834 44320094 44643689 44139890 43703099 43567227 44149543 44202461 43297428
3756 43297428 42953673 43095700 43007786 42802571 43102702 43400585 43321814 42579113 42396133 41413870
3746 41413870 40912632 40620616 39788047 39024508 38632311 38826662 38412967 38027379 38462220
3737 38462220 38354856 38555145 38494162 38953392 39020259 39146375 39206075 39002206 39022571 39133279
3727 39133279 38891464 38879873 39001602 38723830 39510664 39081924 38642409 38245899 37829401 37918908
3717 37918908 38557349 38603506 38347174 37372331 37419674 36801992 36275046 36101641 35453659 34450342
3707 34450342 34706249 34244696 33672205 33578567 33024252 33192133 32492284 32016137 30920922
3698 30920922 30849065 30749546 30974359 30430323 29934864 29688515 30417245 30051909 30380606 30553735
3688 30553735 30347544 30308773 30435185 30247181 30466842 30627992 30526594 30575528 31082215 31697623
3678 31697623 31274266 31718705 30978358 31325955 31639367 32064684 32000920 32296053 32595057 32784893
3668 32784893 32615143 32736903 32707754 32931813 32515279 31917756 32192857 32667890 32525667 31852787
3658 31852787 31837440 31446105 30921156 29992062 30263527 29203358 28843151 28144540 27894064
3649 27894064 28046655 27804218 27294985 26739328 26240010 25843753 25462844 25094139 24974370
3640 24974370 24629993 24367033 24147486 23747927 23558764 23842307 23976226 24287684 24081952
3631 24081952 24796653 23928455 23844510 23713318 23719749 23584748 23874146 24312663 24462865 24794104
3621 24794104 25040816 25086782 24646619 24599744 25026619 24805074 24752069 24786559 24506377 24787139
3611 24787139 24633622 25049079 24909337 25793675 25830096 25516885 25111987 25314481 25415479 25403341
3601 25403341 25213047 25183412 25057686 25427003 25707397 26117164 25816143 24897684 25443364 25782951
3591 25782951 25939835 25594075 25689086 25892822 25733245 25756676 26578424 26766731 27611547 27595223
3581 27595223 27719313 27730219 28110424 28678284 29459874 30411334 31260072 32056332 32321036 32824933
3571 32824933 33151706 34459491 35741199 37511915 38219894 39420617 40757173 42067159
3563 42067159 41997650 42479803 43303688 44088973 44487222 45060400 45429227 45618911 46059523 45110773
3553 45110773 45305028 45576097 45326855 45132807 44861589 44250368 44236401 43332085 42570417 41667252
3543 41667252 40377133 39523019 39156863 38339374 37682241 37201722 36806487 36045671 35652101
3534 35652101 35186454 35171627 34891731 34703292 33676468 33954082 34656282 34280892 34567959
3525 34567959 34646110 34966096 34979243 35089845 34847481 35903512 35827654 36122753 36137396 36306588
3515 36306588 36939447 37386778 37214129 36865601 37025908 37865003 37848988 38191133 39106910 39231652
3505 39231652 39460943 40500316 41081807 41026515 42042529 42523498 43079295 43415284 44381821
3496 44381821 45134606 46056409 46298068 47591671 48602812 50252318 51719522 53060100 55347797
3487 55347797 58022625 60712973 62817026 64820251 67604125 70243990 73319284 76561841
3479 76561841 79873073 83940505 88186578 92437535 95553785 98082217 98853914 99123345
3471 99123345 97556667 94404016 89852555 84518570 79143919 73712912 69382768 65540973
3463 65540973 61463675 58379495 55552553 52882132 51047197 49538123 48017314 46988009
3455 46988009 46494263 45947700 45930474 46436352 47156821 50867398 56375564 57494875 55801191
3446 55801191 53256296 48033011 43351148 40282739 38273698 37039751 36082962 35347482
3438 35347482 34327784 34196458 33650641 32997932 32512154 31776362 30824556 29950835 30113720
3429 30113720 30240749 30377860 30036526 29798919 29902140 31062213 33791772 38235445 43505238
3420 43505238 44257014 42456053 40172542 35775953 31768364 28450974 27101904 26229690
3412 26229690 25448495 24899616 23868102 23905236 23504706 22698550 22249636 22233933 21645032 21489352
3402 21489352 21116649 20681265 20189224 19961195 19801663 19985007 19694547 19852478 19535724
3393 19535724 19129117 19521870 19904205 19637174 18704911 18126500 17409729 18522646 18867167
3384 18867167 18992946 18334013 18092758 17954772 18047785 17854088 17474870 17441279 17374337 16950094
3374 16950094 16977923 16601845 16644847 16293317 16238584 16293654 16001351 15798395 15927660 15337643
3364 15337643 14772117 14786555 15028096 14985715 14624804 15314760 15722724 15660056 15484108 16163541
3354 16163541 15944516 15856030 15264262 15416890 14589107 14340791 13442988 13524859 13755190 14188843
3344 14188843 13705857 13492093 13475292 13262508 13111016 13169866 13359024 13249291 13188346 12896483
3334 12896483 13365641 13213622 13677783 13636458 13746902 13950254 14174754 13730150 14036656 13921536
3324 13921536 12830134 12641024 12590611 12640396 12384041 11708775 11957575 12052443 12142489 12013804
3314 12013804 12365009 12248164 12183036 12207836 12261732 13152948 13026545 12167655 12163556 12307446
3304 12307446 12129942 12171349 12532988 12711128 12246683 12659042 12924537 12552428 12742560 12835327
3294 12835327 12615092 13000103 12931932 13382933 12898367 11856041 11987488 11830786 11710360
3285 11710360 11154594 11317004 11240583 11670623 10710373 10369379 10694451 10997734 10777036 10709056
3275 10709056 11021579 11180072 10925397 10769610 11485300 11303653 11271938 11490371 11673602 11980384
3265 11980384 12479100 12722758 12532149 12051186 11619455 11116089 11371632 11140819 11029214
3256 11029214 10851066 10586578 10227328 10171849 9677255 10156078 10788004 10538793 10442533 10495154
3246 10495154 10614895 10897351 11183121 11478272 11593360 11481162 12080721 12222587 12300738 11814192
3236 11814192 11750689 11553692 12128965 12511914 11832152 11791776 11350286 11821741 12034110 11777092
3226 11777092 11502968 11787311 12377531 12465185 12104798 12137039 12182484 12974158 12915989 13155353
3216 13155353 13168739 13441045 13425952 13915771 13984490 14377095 14586452 14798086 14972090 14638739
3206 14638739 15349574 15515949 15259105 15167801 15442426 15468039 15422426 15189553 15623339 15382187
3196 15382187 15497109 15455976 15508267 15885476 15682262 15152809 15833949 15992140 16319350 16336094
3186 16336094 16742967 17240130 16736146 17089984 17403556 17561385 18064980 18876390 19260875
3177 19260875 19916680 20097295 19927092 20728034 21057185 21406883 21566089 21425088 22766966
3168 22766966 23174106 23398677 23861909 24663537 24905836 25218445 26049036 26546819 26339037
3159 26339037 26423004 27227189 26888385 27152706 27187249 26883390 26863362 27715433 27842761 27908274
3149 27908274 27634744 28192823 28813246 29665298 30348234 30699896 31392095 32785573 33307963
3140 33307963 34722966 36780098 39275670 42419647 44393644 46445597 47966961 48299221
3132 48299221 47623288 46236225 44297717 42679058 40280489 38550040 36925148 35181056
3124 35181056 34835782 34746361 34318951 33929949 33519813 33849844 34386168 34686667 35543977 36658465
3114 36658465 37469191 38396561 39231387 40165194 40878251 41319662 42647339 42938881 43511573
3105 43511573 43501453 43441392 42508668 41393857 40112917 38729847 37159184 35693151 33687355
3096 33687355 31288773 30797561 29778121 28346012 27890378 27619319 27405506 27930432 27403415
3087 27403415 27784122 28041916 28259349 27998892 28017631 27470701 27101657 26425172 25801321 24622544
3077 24622544 23552646 22489800 22587762 21523370 20458194 19419902 18720122 17984204 17194859
3068 17194859 17063577 16238702 16326093 15218640 15380628 15051188 14758870 14111507 13622876
3059 13622876 13377664 13951746 13847420 13328163 13255202 13298410 13002320 12588173 12572753 11927955
3049 11927955 11698016 12097867 11444414 10258042 10233708 10374416 10177105 9548633 9335273
3040 9335273 9317923 9346012 8700772 8997569 9084084 8863895 8705573 8084511 7943617 7967269
3030 7967269 8108430 7606109 7421436 7762815 8108653 7642871 6949528 6578560 6407155 6227851
3020 6227851 6075292 5840390 6131852 6449384 6376579 6078170 6281332 5971338 5558101 5465488
3010 5465488 5282998 5346826 5359009 5672996 5223816 5203698 5278788 5235145 4972440 4251991
3000 4251991 4376951 4379802 4122912 4015005 3817519 4014663 3960699 3945584 3392575 3538477
2990 3538477 3532890 3663237 3754334 3354101 3121947 3370721 3238403 3095329 3130706 3181280
2980 3181280 3392629 3341845 3570060 3257236 2666356 2826990 2714575 2816765 2941869 2367573
2970 2367573 2410988 2135644 1962028 1826585 2033811 2079448 2139898 2115011 2126209 2250645
2960 2250645 1315340 1440110 1909095 2088956 2295136 1754947 1325651 1591406 1052725 1409235
2950 1409235 1233701 1155732 1630141 1946650 1966079 1598872 1082063 1400275 1877006 1626663
2940 1626663 1635179 1543406 1601417 1122169 1124352 1022229 1266063 940095 786911 882230 1191519
2929 1191519 1028216 951218 689189 1557889 1685231 1914819 1560847 1215757 1496746 1502270
2919 1502270 1470079 1121742 547283 557031 1169645 1489812 732599 235543 285332 443925
2909 443925 586228 825652 662141 740214 1273143 654644 829569 797182 608129 405680
2899 405680 637561 926562 527522 368615 1026871 843013 247113 746644 1072333 810226
2889 810226 808003 514324 318884 451110 375008 13609 -148315 73096 333603 665874
2879 665874 773628 583226 13171 198837 579821 613865 703722 157704 174715 194843
2869 194843 1020661 437030 -141799 -133841 321283 831336 748244 867849 531942 243726
2859 243726 702392 794632 808775 601510 -259538 -249704 14485 206055 -51631 -192658
2849 -192658 -154133 648066 1076849 449872 -33267 485009 558174 615742 731023 164952
2839 164952 -91557 -47858 -247722 -31528 -49790 -233965 -571578 15801 316716 209339
2829 209339 -39046 -146011 -192548 -133274 500189 266457 536610 864753 295878 -121716
2819 -121716 449306 251224 238447 57622 257493 234664 -69826 -374161 20953 -59568
2809 -59568 -39779 290225 -232747 -70837 -396030 -213764 -72425 -113013 -85482 196253
2799 196253 749381 549820 481408 297298 592304 318546 562515 274150 -400590 -184598
2789 -184598 -400182 -585674 -311782 -191933 -43931 472616 -124489 -52984 -641816 -48196
2779 -48196 383156 378886 826349 116757 70133 220684 34190 88960 -137623 13253 -109740
2768 -109740 89587 14650 -171956 304259 -290836 -207521 -386972 -131204 341233 1070360
2758 1070360 308473 -655478 -548451 -257278 -154977 413867 272021 217242 219475 -142168
2748 -142168 -281973 -557228 -503536 -53606 613827 729440 -92745 -738101 -10692 199290
2738 199290 -342774 -497119 -368705 -271991 -237423 -35578 160568 -423972 -330622 -231282
2728 -231282 -597479 109891 724220 234719 -54791 -495717 -655741 -861453 -435019 -118826
2718 -118826 -443291 321420 454183 -232245 -249923 -262961 39678 -174223 87094 52630
2708 52630 2975 161395 -158577 231105 -224661 216107 24991 -334207 -669245 -512740
2698 -512740 769629 603618 -13562 69863 710025 118067 45845 109495 544532 -11344
2688 -11344 -93113 415029 257488 -183546 -458174 -312221 -541866 -501352 -516010 45692
2678 45692 333504 -111275 -422878 -447128 -332995 179720 666092 130564 -229973 107869
2668 107869 -321970 -284069 -201128 -450834 57393 648666 640089 42890 85897 138190 188112
2657 188112 -115530 -204364 317914 463963 610126 188439 270331 -5245 -33993 -10222
2647 -10222 -490188 -82513 441832 136991 -373976 -439937 -430468 -149818 -272228 -13140
2637 -13140 170825 668845 517716 575302 381780 268027 206455 -81083 39835 97869
2627 97869 457491 464044 416785 829550 747171 736854 752593 750764 1250660 919463 878805
2616 878805 703128 794841 520993 89802 387186 409322 310315 1012103 1261470 1434748
2606 1434748 825653 898919 1631210 1922966 2931228 2918763 2372269 2081198 2065700 1473451
2596 1473451 1022155 920662 -271598 112167 -161831 162411 617161 -192358 299914
2587 299914 561361 289437 391451 659426 536583 403142 797409 602234 183368 299128
2577 299128 106527 -254663 316676 599550 811074 551484 472694 344688 548191 908136
2567 908136 763889 794036 929716 699840 414828 817321 843554 753846 206228 657601
2557 657601 916190 607197 518786 675539 697828 1071843 1219721 655972 450088 706915
2547 706915 988858 1072888 499057 861131 606316 516444 595256 747000 786541 896794
2537 896794 1001046 1116234 1134573 690557 417262 280082 362559 759346 528335 689346
2527 689346 1513116 997137 1273123 1459264 1138348 774088 693173 921684 1494198 778801
2517 778801 646888 622912 361920 806732 1151230 872082 1168883 1256173 1247557 1012617
2507 1012617 834726 754348 577370 577671 877946 1351631 1256091 1467108 729752 1436245
2497 1436245 1464092 1715357 1146395 900403 1295461 1416057 1502645 1692007 1400691 863309
2487 863309 1415588 1040338 1534328 1754030 1279714 1462849 1879299 1247689 921738 1345396
2477 1345396 1668784 1291161 1979787 1754800 1893798 1702162 1898884 2001114 1778872 1601355
2467 1601355 1664690 1900246 1740655 1758142 1967164 2082408 1401925 1970778 2126891 1875052
2457 1875052 1912618 1899635 1785771 1992743 1825659 1669921 2450099 2577184 2438662 2655455
2447 2655455 2908662 2613890 2991538 3016303 3191655 3589755 3595112 3194732 2963860 2775049
2437 2775049 2662013 2787338 3085593 3134436 3417900 3228660 2968842 2696657 3101056 3584698
2427 3584698 3934858 4387618 4271998 4075134 4366699 3987126 4136457 4236567 4070327 4277527
2417 4277527 4309367 4652853 3722125 4163779 3942839 4732333 5279467 5050412 4845687 5417267
2407 5417267 4937075 4768743 5031579 5033164 4300493 4816303 4703284 4838292 5239328 5679603
2397 5679603 5535230 5812890 5735172 5692215 6033627 6320373 6364654 6624070 6655217 6571886
2387 6571886 7029675 7763850 7679656 7844289 7425692 7215597 7744820 7956840 8517892 8595822
2377 8595822 8211319 8979786 9667382 9831410 8907525 9890317 10535968 11074388 11073039 11451537
2367 11451537 12189076 13020583 13791497 14347399 15334461 15884711 16094453 17189497 18179450
2358 18179450 19171874 19491213 21081249 23412191 26263531 28586600 33064850 38035249
2350 38035249 43178726 45049243 46299786 46988984 47872767 50200709 53575019 59231134
2342 59231134 67705238 80279051 96662028 121585831 168636724 262668195 411262780
2335 411262780 524969449 501601093 449221080 365523906 261115682 187135157 134271352
2328 134271352 98952151 71965568 52757445 39477848 33158638 29137496 28487811 28273038
2320 28273038 29321711 26899735 24351257 20762670 17946914 15656255 14967644 13005942
2312 13005942 12053167 10928343 10313253 9149802 8640553 7925119 8008965 7653737 7575611
2303 7575611 7445624 6835838 6714690 6286935 6852134 6085501 5418678 5167528 4822889 4953824
2293 4953824 4733949 4681625 3856864 3521324 3650892 4039045 4051083 3302360 3094682 3158951
2283 3158951 3363111 3368780 2788466 2780783 2474233 2820835 2860120 2535779 2319072 2764693
2273 2764693 2178026 1638979 1437818 1914663 1416070 1561599 1357464 1532747 1081146 1274691
2263 1274691 1451780 1322613 1179087 981611 658710 702742 964404 852676 909230 671424
2253 671424 269977 988476 862550 370862 22800 -131116 160157 428652 -136167 -153072
2243 -153072 -149975 92148 151015 238363 317298 402526 21674 5435 -320104 -316173 192976
2232 192976 796859 370401 252907 -61673 -357049 -524020 -215386 204304 -45391 178418
2222 178418 469777 63448 -99920 -441871 -54095 -73885 -531175 -1057833 -782670 -204711
2212 -204711 -325593 -358845 29276 436027 -372488 -499608 -459158 -181311 -648769 -714232
2202 -714232 -1012968 -445248 -419468 -302998 -722700 -309907 -16607 218425 -374926 -264584
2192 -264584 -461906 -544111 -723282 -757660 -81129 652127 397233 -366242 -1015980 -1032090
2182 -1032090 -710779 -746694 -747662 -653656 -106767 -767772 -916592 -1124930 -696219 -149442
2172 -149442 -749848 -1316950 -1176855 -799540 -741155 -20656 -481011 -693701 -623240 -371477
2162 -371477 -362517 -346550 -725872 -597320 -940784 -1167791 -1023021 -796579 -700030 -619675 -412432
2151 -412432 -387349 -504252 -323836 -254372 -657542 -761813 -711517 -347809 -134901 -240654
2141 -240654 -435520 -334797 -576999 -897526 -827651 -386137 24777 -371922 -100353 -13363
2131 -13363 -618440 -848067 -715211 -860217 -863521 -280751 -435318 -175347 -171325 -460220 -931982
2120 -931982 -658919 -888646 -865565 -1103578 -1197563 -1154154 -1248367 -379572 -601327 -671196 -780647
2109 -780647 -702522 -1190226 -948231 -308745 69252 -71821 -370329 -697687 -1191761 -1526720
2099 -1526720 -1239161 -1124133 -590646 -556363 -763001 -752523 -759854 -405161 -441762 -651849
2089 -651849 -716335 -264664 -159951 389110 -246999 -448053 -84225 129333 -44428 6111
2079 6111 114746 -375794 -504651 -201485 -772429 -812369 -575388 -804336 -537104 60523
2069 60523 162480 690682 1405899 1564800 2295423 1445332 1423268 1216551 1285065 744100
2059 744100 -361060 -645824 -544434 -259128 139431 -433888 -390109 -657629 -640175 59643
2049 59643 78788 -559332 -184904 3220 -179592 -58756 -744007 -256240 -969205 -834302
2039 -834302 -819203 -822603 -1115126 -774891 -767220 -157640 -249525 -277926 -326101 -226900 -815390
2028 -815390 -688064 -1050667 -1381903 -774454 4039 -314498 -474948 -730456 -486530 -117271
2018 -117271 -926644 -472359 -383307 -368692 -42729 -164370 -933082 -1333367 -1056095 -484475
2008 -484475 -406729 -401518 -235607 -118596 531940 84029 -187066 -791295 -996873 -865432
1998 -865432 -633301 -419855 -276144 -988292 -1052268 -902291 -756603 -559576 -637620 -1147611
1988 -1147611 -1043593 -435419 -203294 168078 -381503 -361483 -575146 -455969 -731257 -484191
1978 -484191 -456130 -290581 -431262 -555961 -842783 -1163110 -848671 -578465 -1075617 -1250493
1968 -1250493 -1233335 -1225514 -881995 -538090 -717420 -664015 -919514 -1009044 -653289 -630766 -974611
1957 -974611 -676199 -776469 -857490 -525869 -9175 -159001 -409517 -162540 -597333 -609047
1947 -609047 -535651 -718384 -964517 -683063 -155348 -463535 -627732 -924845 -1163204 -923955
1937 -923955 -855615 -791606 -242031 -316138 -537773 -948520 -461973 -982636 -973477 -1097900 -884793
1926 -884793 -626125 -256560 -257220 -93930 -486076 -1020969 -978537 -461488 -656997 -462696
1916 -462696 -647508 -688964 -732197 -1129011 -659153 -743887 -475748 -1093707 -866339 -356778
1906 -356778 -224148 -668406 -827300 -648357 -425061 -768427 -880521 -511344 -323306 -916005
1896 -916005 -686631 -482793 -238725 -193134 -680039 -891200 -561321 -515618 -870994 -584342
1886 -584342 -400215 -354044 -384452 -674550 -836099 -1047332 -460578 -372264 -575034 -890502
1876 -890502 -840608 -332738 -477369 -635123 -1049610 -739843 -517806 -175638 46522 -613106
1866 -613106 -648748 -586746 -273016 -699717 -261107 -196587 -360769 -443613 -135382 54178
1856 54178 -173518 -693398 -507242 -445502 179940 -96347 -74396 -239459 -976842 -858850
1846 -858850 -454272 -378594 -607810 -1085926 -1166948 -1043048 -511169 -280626 -886174 -386855
1836 -386855 -493407 -444765 -540523 162557 -13081 -36455 -543812 -717826 -782729 -666132
1826 -666132 -376098 -430817 -504923 -526189 -419508 -129019 -121867 -264645 60599 -148776 -220569
1815 -220569 -433331 -284185 189543 -219060 53534 503187 66202 272354 -241461 -523262
1805 -523262 -352362 -161006 -284231 96999 454528 -120398 91557 -426006 232011 -258736
1795 -258736 -192193 -177957 128511 -184361 -338782 -504305 -420972 -411618 -179697 -367514 -861432
1784 -861432 -749111 -566259 -602643 -418117 -71991 18943 79798 15300 -300512 -717208
1774 -717208 -459193 -1106436 -545800 -271512 433068 -110093 110504 -151694 -528545 -508496
1764 -508496 -437909 -535005 -622728 -724443 -395963 -933908 -851832 -302287 -96410 -332685
1754 -332685 -577517 -374309 -559728 -584142 -602043 -674131 -589311 -431967 -496756 -453108 -762888
1743 -762888 -669106 -90429 -330900 -597403 -300761 -423104 -313862 -170915 -492839 -520965
1733 -520965 -432770 -357387 -870646 -859045 -857369 -377501 -993480 -746001 -631681 -63944 -369576
1722 -369576 -362650 -31307 49592 290868 163867 -215309 201828 455206 -110894 -474064
1712 -474064 -493474 43446 -757935 -320450 -336512 -542947 -795989 163964 -378412 -363072
1702 -363072 -1005689 -778757 -821653 -165815 -355449 160040 133203 113371 162038 295952
1692 295952 45322 -557440 -541917 -383291 -389632 -611646 70445 -368178 -15510 -289697
1682 -289697 156893 -109152 352369 -99505 -73903 -360080 -518821 -495805 -364006 -90984
1672 -90984 -110107 -205054 -162697 -334470 -229266 24867 -289478 -302223 -191965 -235131 -460563
1661 -460563 -208518 -1185054 -851280 -1102528 -418320 -1270376 -457971 -972985 -860097 -712659
1651 -712659 -412616 -794004 -951346 -252617 -430700 -501377 -482836 -553938 -1324728 -493193
1641 -493193 -581814 -350844 -614293 8976 -235494 -94180 -705509 -668357 -845794 -14150
1631 -14150 -217699 -97779 -414308 -249115 88208 -57666 -442138 -812290 -552043 -469137
1621 -469137 -379597 -775607 -240216 -571877 -241207 -201284 325896 -133702 58234 -795080
1611 -795080 -1250709 -1204839 -406660 -830854 -848275 -694643 -424049 -416866 -524623 -729374
1601 -729374 -907312 208746 -418193 -377636 -422646 -97181 -385484 -273928 -693055 -723079
1591 -723079 -593509 -53353 -172882 229837 -87642 -88561 -374114 -333929 -878298 -491368
1581 -491368 -459354 -691304 -723872 -116960 317788 52298 -174802 -519737 -412795 -845205
1571 -845205 -456167 -975710 -697520 -711170 -146612 -494862 118355 -487576 -403708 -875050
1561 -875050 -912142 -369004 -237281 -269494 13607 137727 -91445 381660 -589695 -471373
1551 -471373 -323884 59370 110286 253340 -639409 -458096 -522815 367788 -292852 -215358
1541 -215358 557289 323641 -287399 -725966 -504365 31332 -193908 -590168 -448314 -570295
1531 -570295 -678134 -263158 -24271 -321057 -60235 -504555 -957344 -1196598 -412021 -37179
1521 -37179 269949 226666 353890 -212995 541131 -112611 -101669 -524493 -391000 -311604
1511 -311604 -486292 -360690 -469414 -431126 -1096225 -1063658 -346768 498208 -578539 -148343
1501 -148343 -552495 102806 -369533 -404629 -513014 -531002 -796256 -1201192 -749962 -264666
1491 -264666 -447231 -191726 130423 472937 411177 -359722 54388 -59345 -215402 -366778
1481 -366778 275584 -504115 -471012 -1090866 -1072956 -1284549 -511262 -453510 -67553 -302708
1471 -302708 -330106 -1024047 -655242 -212935 -181256 418658 -156114 -665545 -527167 -333718
1461 -333718 -892944 -171225 -516928 -467122 -500426 -613325 -405665 147892 46540 131937
1451 131937 155016 163169 -1134 -162886 -509305 -219925 -61292 -385478 53980 -485098
1441 -485098 -268317 598161 423875 -482611 -973416 -802578 -185663 130732 333796 211007
1431 211007 271463 68944 39668 -420094 122379 236964 463046 184673 82759 336514
1421 336514 -137969 86499 -373064 -180199 1634 314251 129200 -34318 -530340 -410272
1411 -410272 -427291 -87492 -209262 -124805 -26411 -193865 -432332 -89085 -483785 -539441
1401 -539441 -835218 -845365 -764665 -763885 -57836 -45160 -353275 -472865 -403694 -639749 -810333
1390 -810333 -540708 -419835 -551861 -573636 -835348 -83442 -172995 435047 -207661 -495976
1380 -495976 -200158 -362724 -671393 -642725 96462 401198 342705 43218 -148349 -484328
1370 -484328 133995 -176997 -710076 -529990 104624 23967 26526 -68854 -328882 -750376
1360 -750376 -125719 -63991 -179255 -421959 -414020 -56306 -496200 50620 200221 278140
1350 278140 -631114 -853481 -657834 -28109 -155487 -666800 -110381 12318 -161029 -295888
1340 -295888 -867307 -478281 21424 308767 -189370 -257842 -180094 -456392 -342466 31576
1330 31576 910998 288961 -319324 -379193 145945 499093 241618 -31585 216351 -16885
1320 -16885 -224188 115986 303078 -143388 -222092 -403694 -93164 211013 116125 407003
1310 407003 344960 104578 194482 31993 -669133 -611841 -562725 -498167 -313494 40784 46995
1299 46995 181405 153222 281532 228492 356968 -393823 -101980 -396530 -454382 143915
1289 143915 -235561 -913042 -1128900 -697100 -203912 -480823 -513126 -413238 -304159 -223559
1279 -223559 -621841 -771465 -1058057 -657173 -919488 -214411 -442320 -597436 -461454 75192
1269 75192 -438273 -341078 -43847 -390942 -936784 -226686 -225342 -459523 -712583 -650729 -57608
1258 -57608 -132169 29084 48143 317557 395513 165564 -145949 -626147 -578305 -427316 -984548
1247 -984548 -722464 -368361 -334688 -390920 -10328 -282414 219505 -46676 -117931 8559
1237 8559 -557481 12661 -102514 -69573 -153304 -719463 -392934 -26678 33369 -254320 -728607
1226 -728607 -343165 -236875 -635864 -441431 -143052 -754810 -1027345 -148926 463290 164254
1216 164254 -243826 -789375 -461314 -123819 -328733 -490775 -601618 -523991 -428172 -536725
1206 -536725 -425702 -95347 -613763 -468372 -307777 -210571 -731851 -398738 -232871 160538
1196 160538 160235 -84108 -378838 -870453 -841114 -476081 -533527 -791822 -933565 -737878 -586804
1185 -586804 -543960 -576917 -140027 143143 -225253 -22423 -155157 -551208 -598605 -329969
1175 -329969 -15429 493601 468247 351972 407622 136236 -171710 -421602 -544803 -568206
1165 -568206 -477792 -209187 -376615 -146278 60644 351949 384618 307942 356502 90789
1155 90789 -146489 25924 196068 -538831 -661337 -655030 -293250 -322935 -162843 -38598
1145 -38598 -327003 -892796 -312766 -70822 146556 481127 394712 772320 469047 570754
1135 570754 858474 581452 53283 202644 -4559 145841 363370 359947 40211 112200
1125 112200 333305 -95821 -431539 -329836 23355 268300 621319 958441 744091 -64832
1115 -64832 -395577 156498 391605 -124437 -70299 -773706 -653671 -208005 -318414 148402
1105 148402 431111 196261 136789 317333 -14817 1143928 1069686 532119 464740 -238838
1095 -238838 -461273 -169296 -468589 -157460 -398156 -287677 -444856 -637884 -220450 301942
1085 301942 494819 -6534 -355188 -597056 -925860 -830606 -420747 -85999 -766625 -789973
1075 -789973 -74887 -532444 -67261 -374656 60466 24930 -133568 -188800 -563197 -746767
1065 -746767 -470561 105504 -307547 -138010 -226664 -157620 42340 231777 -351579 229065
1055 229065 468015 323484 -142221 442270 396938 -37714 24269 -386025 -287267 -136261
1045 -136261 454441 -17394 -416441 -461284 -209715 -18235 -219903 -1094857 -737559 178430
1035 178430 98269 30303 343065 115131 -283484 -489554 -325727 -111625 -213973 -97274
1025 -97274 -162882 -518155 -433705 -338685 -808460 -418632 -28616 -77649 -709706 -824668 -909118
1014 -909118 -143372 141386 282591 -536468 -553576 -277251 25641 -19320 179973 284194
1004 284194 -215792 -209590 -380249 -232829 -263173 474304 -102554 -81798 489968 223911
994 223911 36945 268033 -376208 -756246 -1060015 -284541 -533009 -101328 -216542 289474
984 289474 377165 468464 142197 -304955 -10897 -59813 -18749 -326435 -266652 -138681 680601
973 680601 144003 -237232 -304072 -151463 -254395 -77635 -531452 -630294 -878479 -653335
963 -653335 -525818 -268671 -365954 -251063 613872 -150996 51906 -359314 -157268 -679128
953 -679128 -229703 -239302 175543 -223841 -340784 -635807 -358611 -139423 375860 225942
943 225942 253597 -3027 -127249 -572234 -716775 -377062 477979 227508 -343816 -391014
933 -391014 -304564 596303 559430 767270 237748 585656 -171791 99231 -383685 32955
923 32955 -285374 124566 -661274 -511464 -1025370 -840566 -372663 -283743 -247102 -71894
913 -71894 -10575 246692 257053 37900 190354 -694954 -717693 -925134 -29866 -337979 -95057
902 -95057 -393619 -251503 -57771 551073 345004 -109421 113419 441348 355511 574339
892 574339 211580 -30023 -70539 -147374 248211 76923 -194394 -394048 408100 -303435
882 -303435 96942 -639241 -60092 -396634 -476455 -433559 119243 -70281 93538 -18186
872 -18186 351734 -307831 -949523 -45710 190209 368772 -415887 -250507 -811402 -830776
862 -830776 -1083968 -158685 -288843 -326299 -783220 -385367 -272147 193769 60057 114066
852 114066 -353172 -412828 -292828 -411754 -215913 53420 23418 -79875 4583 -227417
842 -227417 -112378 -499747 141319 -457503 -46907 -536440 -363091 -132314 1083325 505766
832 505766 464826 363399 -66816 -542378 -116589 -260187 323734 983775 316187 250955
822 250955 -33163 -73154 174095 415787 198813 427854 222065 387988 132850 353249
812 353249 163373 430688 -306434 320784 -562995 -451720 89235 307623 -198435 -436705
802 -436705 -180562 -247026 -206862 -161625 -294322 -648300 197493 -20161 112510 -237330
792 -237330 212467 -415260 -144093 -534934 -721303 -523216 -2430 -18059 -120363 54576
782 54576 49850 355970 -192258 -889095 -910031 -289967 -782466 -298951 33986 561643 -377829
771 -377829 -55035 -198971 256494 247781 695855 43238 194783 -352620 -613872 -526463
761 -526463 -252432 -373348 -311280 34016 -120977 275946 -368304 -747603 -671917 -124145
751 -124145 -500002 -203902 -480418 -250123 -364967 108876 92720 644481 146421 135371
741 135371 136006 241 -102750 -330005 -385657 -663827 -451750 -490610 -390374 -294472 -212788
730 -212788 -615327 -339526 -15626 206467 122197 212084 -186237 -363589 -794692 -623849
720 -623849 -573462 -266547 -221943 -195980 -195749 116409 -294855 -394816 -134316 -568199 -313075
709 -313075 -194372 150674 -61550 414217 -261432 -218228 -304739 416225 -182143 -415932
699 -415932 -211443 -605126 -121913 -234195 -177576 -67009 -156303 -445472 -358159 -396236 -196557
688 -196557 -793160 -420193 -28192 -126593 -228753 573799 9144 -226752 -547746 -213938
678 -213938 -103586 -722050 -831632 -446673 117307 -376325 28242 446256 293892 -298590
668 -298590 -205725 -498113 -45288 -29284 226998 -173403 156017 139945 94978 176608 -317493
657 -317493 -13794 234540 611613 489190 98940 728318 205736 157056 74348 -318977
647 -318977 -345737 -823774 -911903 -438686 -310010 -472342 -144714 -376444 -778218 -753064
637 -753064 -300724 115745 41782 87090 291409 308654 594552 853218 831548 352353 -257793
626 -257793 -630022 -849926 -291662 180346 323678 -395568 -550571 -256899 -249422 -232943
616 -232943 16896 3501 -151841 -706125 -522700 -561796 -188646 297853 316192 750821
606 750821 31018 -703635 -278438 314401 386688 875747 103882 -11242 151493 380135
596 380135 -37830 -104484 -482455 -448972 -439742 -234970 83433 296680 14620 -59061 238330
585 238330 216007 673686 -99111 -345819 100699 -283463 -234546 214329 -551724 195858
575 195858 254426 -195854 481858 325528 389556 368803 529362 -311643 -294362 -258507 -765350
564 -765350 -601869 -574252 -366820 -317892 -909034 -763050 -568574 78987 234803 -370706
554 -370706 97080 130092 -213774 -123406 -363149 -334875 -144735 -414169 -81131 -153502 -403490
543 -403490 -615185 -275951 -249325 -784579 -1095209 -846090 -383352 617891 688170 263195
533 263195 250065 327562 151616 47669 231301 552759 343520 245383 -289396 -461934
523 -461934 -480674 -450208 113653 -146655 -952374 -928049 -614785 -273519 173630 77613 -253167
512 -253167 -475966 -306214 -575941 -363359 -372240 -209927 -97807 -122706 -66685 -335539 -643659
501 -643659 -214503 -165207 -361689 -272814 -431181 -642649 -530539 -61044 -298266 -426638
491 -426638 32639 -135379 -146115 -10732 261841 -246525 92453 -209048 -194991 354185
481 354185 686724 361942 119406 5034 -200829 -57110 -30755 -454496 -663276 -243275
471 -243275 450740 -39017 -679019 -793169 -218020 -342947 -247961 114145 -233732 200734
461 200734 612351 -33585 -23284 -29438 -626628 -443457 184178 424469 147164 196310 -96955
450 -96955 -432092 -879863 -706800 -409884 -237678 18219 -242908 -36936 350482 540399
440 540399 -111160 -592968 -352612 -334158 -1531 -42298 301407 52424 -390555 142167
430 142167 700030 -46098 -511364 -680899 -234851 -266908 -272911 -297915 -22977 -629181 -167867
419 -167867 -216917 -581519 -580887 -338280 -238802 -127710 -346221 -493169 -279187 -2972 46558
408 46558 -360085 -400723 -225865 456172 510984 68532 -63371 -205084 -140252 -30778 289493
397 289493 527136 189291 -159031 416519 52559 160755 -265281 -384023 -64654 218398
387 218398 -314660 75605 206378 208874 96563 -124698 -401826 -40540 115449 -17906
377 -17906 -1136 -123420 -73588 -335585 -177432 -911140 -919833 -935433 -556116 -323250 16498
366 16498 110828 64867 -114805 69624 -745007 -252740 -189631 -381645 96033 6896 178024
355 178024 533761 141127 247831 81097 -213285 -69262 -90332 -24787 145968 225309
345 225309 -47155 -200346 -637530 -428895 74245 332543 190874 434224 63788 -220917
335 -220917 314003 603981 446936 193698 47990 -629832 -33361 97255 -44650 -219643
325 -219643 254083 -45846 206312 -634771 -818764 -1417011 -862068 -517577 130513 -91729
315 -91729 307309 -236129 -671818 -398705 -314864 118107 70359 421428 -9116 345644
305 345644 113977 148063 312606 61242 -440119 -223030 -170984 413687 265682 312244
295 312244 -300835 34620 -688066 -219632 -23088 -106177 136356 -184225 -64685 83734
285 83734 -422561 -282287 543627 32117 13014 -415799 -438520 -842950 -520961 -791002
275 -791002 -129336 -185725 178935 -454606 -603916 -48001 -152476 -265625 -577726 -116503
265 -116503 311886 -156870 -239782 35144 44018 260877 778104 481549 -319427 128250
255 128250 -534619 -177563 -417860 87028 -80078 341422 -126981 -54575 518176 709963
245 709963 47131 137215 -287717 -288699 -3543 -16179 141308 -98174 -370177 -16380 37656
234 37656 -366996 541401 637964 692032 289439 -29650 -115906 180385 127755 -92034 -233627
223 -233627 -103004 300181 711243 300799 -255847 5893 -60746 -220864 -714693 -419741
213 -419741 -862196 -431690 -313570 233626 299028 276279 533648 433231 -130628 62451
203 62451 159899 79311 -94347 -213184 222101 854559 1009439 153761 518719 -92777
193 -92777 -58116 -354718 44075 164636 200677 -180950 -157611 -171303 -438570 -153288 14246
182 14246 66924 667044 -12135 -49441 -9146 214219 533316 195964 -12806 264182 -121045
171 -121045 -258006 -255763 -143127 -134743 -218314 247414 -122319 263158 -71300 819947 413321
160 413321 12293 558024 326954 -108354 -17314 -339684 -288408 -84975 90956 540149
150 540149 250012 -72925 -212460 -338930 -494508 75831 1221 253243 -408003 -65828
140 -65828 164720 384431 -90681 -213913 -33551 30836 39822 -238574 342501 619771 900077
129 900077 387366 431097 90273 40585 99809 -54268 -151118 -38398 -48981 6145 149818
118 149818 -29 -7262 -30590 -296978 -158738 116731 316012 508865 155872 31365
108 31365 -488365 35255 -287962 -134701 610733 38694 -293024 -586793 -43709 232169
98 232169 48449 -489644 -575090 -244226 -166579 -406252 -463404 -93959 -72793 341305 348048
87 348048 111768 -209094 -569501 -449892 -77468 -257862 -217202 126906 -74648 191264
77 191264 -43351 -293935 -225854 -348162 -46858 179302 342371 264926 -501456 -407720 -130689
66 -130689 -234410 -573335 -130890 -28799 -172404 -307712 -349226 -318428 -247613 -211612 179452
55 179452 262575 -30080 -220099 -54813 32939 67910 -272376 -140036 -156626 -392724 -670925
44 -670925 -516030 -24315 -219545 -52612 -232367 -61610 -220786 111001 -42213 -152093
34 -152093 -119173 1040 -13136 38797 -303056 -599922 -488951 -82144 136341 -44962 -312281
23 -312281 -57284 -32239 -356890 -199253 38053 -119531 -101479 209263 8200 -196155
13 -196155 -445545 -492853 -418129 -183163 -398141 -349329 -626760 -105920 -98691 -376749 -809063
2 -809063 -654575 -162820
0 -162820
$$ Imaginary data points
##PAGE= N=2
##DATA TABLE= (X++(I..I)), XYDATA
16383 -1167617 -1228475 -985602 -1238351 -1509680 -1967347 -1317724 -1452711 -1640212 -1699001 -1198332
16373 -1198332 -1106288 -1146547 -1056303 -997926 -1166303 -1443752 -1330890 -1407345 -1158994 -992744
16363 -992744 -801767 -736509 -815659 -1395189 -1097949 -849662 -729178 -1076527 -795034 -895753
16353 -895753 -659256 -1112516 -996648 -1142988 -292960 -574918 -1006668 -731612 -979498 -1036409
16343 -1036409 -729624 -626703 -329536 -502852 -649148 -424218 -724912 17118 -238888
16334 -238888 -98108 -304702 -189243 -481339 -545753 -422980 -141516 31783 -349056 -319433
16324 -319433 -53381 151290 27399 267625 335893 -51902 268148 66004 -212312 -11708
16314 -11708 -90695 78858 -161184 121031 306287 116302 -180211 549495 450529 718501
16304 718501 766494 992113 485248 643342 1246610 956093 1105099 1147426 805039 532040
16294 532040 844542 695932 513403 849362 1017912 798702 1366527 1295374 1481332 914191
16284 914191 921573 1040505 1051827 1233568 903229 518421 462544 309989 956495 1185335
16274 1185335 1403077 918714 1026440 978463 1021295 1234685 1053229 1105575 526515 756651
16264 756651 1115637 1477092 1305551 1347151 1060178 1083404 1250730 1313442 825061 1235655
16254 1235655 1359010 1233473 1268289 1304832 1704772 1373563 1380660 1070146 1513216 1305352
16244 1305352 988534 1552087 1727777 1580337 1663264 1214823 1615350 1780740 1732803 1626784
16234 1626784 1777443 1855947 1945505 1708764 1965409 2112399 1874355 1687349 2197725 2175407
16224 2175407 1750144 1946540 1442099 1530348 1812475 1664083 1085025 1196491 1624589 2066294
16214 2066294 1722824 2115360 2392137 2434948 1993501 1933938 2609400 2770169 2228298 2220102
16204 2220102 1660209 1338872 1973924 1356537 1866955 2261419 2051940 2272117 2257819 1999970
16194 1999970 2356387 2322493 2536542 2493275 2808947 2964948 2931767 2433190 2419647 2381259
16184 2381259 2374738 2347790 2170731 2332968 1866586 1890938 2408347 2279482 1780458 2418947
16174 2418947 2847567 3129844 2787625 3039955 2730819 2601371 2308799 2810429 2451924
16165 2451924 1821048 1583742 1929342 2252398 2767369 2998361 2808170 2791422 2813741 3214475
16155 3214475 2287320 1454549 2190806 2447078 1919637 2405181 2886075 2346900 2659351
16146 2659351 2979647 2789894 2568214 2011614 2401182 2726311 2378903 1798917 2269150
16137 2269150 2569176 2637828 1932014 2610924 2883405 2155938 2206864 1836200 1899595 1563828
16127 1563828 2152312 2255182 2238096 2261264 2763484 1989206 1917185 2837578 2915931 2310685
16117 2310685 2586136 2870765 2374495 2222935 2777463 2650983 2206783 1986566 2341428
16108 2341428 2648117 2384190 2672437 2993830 3428530 3167765 3041849 2593929 2452185
16099 2452185 2511970 2718684 2312975 3068558 3073132 2918053 2464629 1924137 2414506 2805607
16089 2805607 2484090 2676062 2523757 2564836 2060269 1965554 2739121 2911786 3237988 2895813
16079 2895813 2913383 3464264 3452834 2925559 3082073 2576748 2508475 2372197 2444624 2665904
16069 2665904 2966701 3056080 2993215 2814985 2615489 2462776 2295128 2445586 2143349 2397255
16059 2397255 2358213 2753342 2855198 2405272 2232448 3034216 2820581 3041547 2823684 2464620
16049 2464620 1874977 2197759 2838015 2616332 2325593 2638841 2769479 2372526 2575560
16040 2575560 3116002 3112924 2297927 2313622 2648878 2714235 2792409 3307899 2870727 2542425
16030 2542425 2034241 2693352 2743634 3087133 2697659 2734428 2631489 2809438 3022537 2986017
16020 2986017 2986270 2808684 2982837 2290930 2485731 2503043 2185898 1729133 2586261 2926716
16010 2926716 3237257 3460631 3398555 2996901 3012272 3204088 2984727 3419927 3525184 3277941
16000 3277941 2899729 2810935 3167763 2769529 2820959 2943206 2578332 2683234 2506911 2655284
15990 2655284 2195364 2216156 2962503 2973319 2769420 2423984 2398031 2571028 2466366 2496842
15980 2496842 2766262 3029275 2510990 2649249 2398929 2480172 2713610 2748866 3163776 3060431
15970 3060431 2984938 2616731 2720941 2762335 3368488 3494105 3427735 3067748 3130922 3069792
15960 3069792 2402208 2147455 2779825 2924611 2683884 2574569 2360060 2510937 2389881
15951 2389881 2421115 2454982 2455116 2396337 2514345 2684374 3211980 2664466 2631600 3275037 3392020
15940 3392020 2892341 2372960 2477859 2647409 3226833 3195249 2887158 2921303 2923810 3059489
15930 3059489 2976528 2829605 2675770 2450409 2736903 2775158 2987317 2290776 2232606 2800896
15920 2800896 3131340 3563159 3234575 2940903 2514641 2555084 2791362 2715591 2627053 2862682
15910 2862682 2769096 2766887 2822856 2745480 2658961 2952256 3001330 3069836 2912850 3350085 2837873
15899 2837873 2431162 2240284 2477129 3111351 3284645 2896006 2974123 2572388 2621487 3297678
15889 3297678 3327374 3139365 3157932 2474248 2134210 2441637 2302723 2722383 2492675 2677318
15879 2677318 2850142 3183589 3417413 3114336 3031684 3534281 3110388 3240741 2907105 2613771
15869 2613771 2533507 2553291 2806472 2984350 2761740 2490606 2621881 2243583 2534722 2373735
15859 2373735 2860499 2731813 2694785 2784483 3052508 3099151 2785968 2306417 2652505 2406908
15849 2406908 2624400 2837617 2745784 2679458 2827432 2703372 2353054 2549190 2894633 3145355
15839 3145355 2592498 2518276 2217780 2530644 2329217 2801440 2840274 2973181 2138540 2858896
15829 2858896 3054766 3203520 3103684 2955719 3341778 3017950 2897288 3142548 3119597 3949098
15819 3949098 3831396 3099257 2828940 2206685 2906428 2606518 2800437 2599451 2800665
15810 2800665 3213291 3208395 3247346 2802695 2462784 2345547 2235859 2615666 2477993 2425036
15800 2425036 2769039 2704480 2943725 3123017 2897646 2802912 2899879 3111403 2903262 2447062
15790 2447062 2928841 2410793 2351131 2494965 2685058 2638058 3060516 2893313 3051948 3004775
15780 3004775 2637328 2371677 2198414 2440756 3012636 2880414 2903488 3468753 3292371 3083367
15770 3083367 2807432 3264679 3169504 3380759 3474568 3350935 2888805 2633393 2234340 2313991
15760 2313991 2147900 2152983 2337532 3435371 3362302 2289896 2246511 2460192 3302530 3104694
15750 3104694 3226547 3199913 2921858 3042206 2916719 2567238 2874056 3127560 3125213 2443367
15740 2443367 2315458 2650465 2870165 2880640 2588719 2616785 2461258 2844727 3129236 2547324
15730 2547324 2534774 2880822 2993409 3294428 2658365 2565856 2348833 2487340 2646149 2944513
15720 2944513 3311452 2822176 2252747 3136907 3368260 3225673 2871587 2477987 2534951 2857278
15710 2857278 3158440 3178549 3169830 3137075 2919529 3140932 3053206 2446026 2769838 2977511
15700 2977511 2395336 2895318 3194077 3313241 3541566 3133355 3265465 2662696 2861542
15691 2861542 3030040 3156414 3335374 3416084 2868924 2501498 2743664 2758640 2826200 2965471
15681 2965471 2877290 3107785 3410970 2596398 2873284 3362430 3727914 3618654 3158575 2790213
15671 2790213 3010787 2660575 2695325 2404603 2295156 1883998 2153594 2655526 2753393 3027932
15661 3027932 2564269 2176904 2077777 2511901 2799917 2803483 2787335 2960424 2628899 3278319
15651 3278319 3185552 2705831 2399827 2598213 3003618 3076520 2743799 3072740 3075599 2927880
15641 2927880 3051685 3300800 2633142 2817699 2635377 2590961 2768426 2960400 3055238 2933268
15631 2933268 3174289 3337855 3424821 3173715 3441245 3626504 3478180 3251111 3835283 3283346
15621 3283346 2994817 2862298 2725419 2617135 3047489 3040746 3145917 3064900 3097350 2757239
15611 2757239 2784641 2878736 2767417 3122154 2863085 2886931 2398067 2737199 2543784 2842246
15601 2842246 2613285 2277475 2301576 2829106 2691217 2475168 2329600 2660768 3526274 3614796
15591 3614796 3123274 2669794 2440742 2435232 2553376 2463831 3362266 3132031 2849069 2425660
15581 2425660 2585003 2451810 2636532 2642594 2591812 2817177 3092233 3235518 3220495 2968167
15571 2968167 2742313 2779400 3113049 3524483 3723370 3648762 3060558 2995240 3058261 2754881
15561 2754881 2204451 2721322 2376630 2956370 3270465 3309515 2960508 2457578 2786099 3107803
15551 3107803 2531972 2955286 2904243 2756943 2370443 2267236 2273089 2259107 3011127 2903824
15541 2903824 3043510 3247739 3000444 2816859 2903669 2732734 2992582 2675330 2742888 2901842
15531 2901842 3472817 3333899 3244074 3231507 3614337 3039703 3203799 3377061 3031915 2841203
15521 2841203 2563104 2205753 2410021 2494116 2600522 2735499 2493944 3266030 3155871 3252269
15511 3252269 2712387 2713262 3108970 3269122 3175385 3470949 3064342 2718885 2669631 2445414
15501 2445414 2521577 2497126 2431619 2861777 2908420 3275446 3290942 3013807 2710950 2488715
15491 2488715 2758461 2868559 3036509 2443418 2822042 3445739 3725812 3369693 3215815
15482 3215815 2644859 2921661 2678448 2729690 2760311 2488259 2018371 1893884 2605535 3109989
15472 3109989 3130409 3448141 3301528 2662761 3110927 2768544 2693528 3017977 3172467 3271368
15462 3271368 3407370 3231940 3148134 2435669 2929028 3041915 3126524 2689061 3414230 3664858
15452 3664858 3924428 3510547 2981094 3387638 2689956 2591103 2313456 2405625 2426216 2964900
15442 2964900 2650463 2827136 2956112 3149018 3071694 3197726 3285120 2793633 2816155 2644679
15432 2644679 2127445 3155094 3348461 3928318 3474943 2727357 2444705 2335766 2455442
15423 2455442 3238185 3467564 2874415 3400620 3017680 2453562 2409642 2758893 2948372 3054557
15413 3054557 2692637 2873769 2614951 2759264 3184364 3105983 3107584 3052535 2740763 2606115
15403 2606115 2818365 3348289 2994885 2617609 2636101 2600200 3069153 2378089 1969637 2551008
15393 2551008 2934151 2875874 3112813 2275180 2889587 3211880 3123173 2881869 3050574 3564604
15383 3564604 3743759 3687573 3619235 3750376 3023152 2825498 2647509 2737987 2347698 2389721
15373 2389721 2272852 2274399 2939295 3076541 2506927 3199984 2840231 2851528 2548123 2797911
15363 2797911 3099226 3036683 2626171 3162042 2965603 3270766 3139416 2720411 2944658 2392207
15353 2392207 2477179 2429123 2795633 2596741 2716943 2428329 2117958 2507246 2938268 2966591
15343 2966591 2986340 3068899 3095000 2561529 2521013 2763596 3151052 3487363 3765771 3455876
15333 3455876 3467640 3417391 2812651 2899967 3328909 3337688 3021272 3056243 3026586 3279549 3657803
15322 3657803 3674619 2853684 2558886 3136253 3175889 2922457 3077710 3165556 2607177 2461686
15312 2461686 2940586 3007037 2952479 2720283 3211874 3120396 2991972 3085981 3448166 3290850
15302 3290850 2438096 2977720 2770889 2157912 2119978 2283996 3079777 3133354 3145313 2959753
15292 2959753 2812507 2896027 2482393 2775329 2919273 3087059 2735690 2518011 2415021 2848425
15282 2848425 3047500 3018439 2899698 2700150 3239586 2990618 3175793 3429017 3539796 3515238
15272 3515238 3295851 3176498 3209141 3352908 3316903 2963937 2819620 2909813 3318626 3347926
15262 3347926 3525948 3612244 3546085 3470507 3568504 3471419 3120666 2938318 3098547 3274174
15252 3274174 3107064 3549986 3513377 2991913 3021724 3612499 3492242 2952464 2841489 2937698
15242 2937698 2432478 2745103 3198802 3366272 2928231 3429666 3134510 2836248 2750220 2583774
15232 2583774 2296297 2692314 3183305 3307694 3282658 3056035 2701866 2570391 3363629 3083931
15222 3083931 3126249 3277000 3383689 2988385 2982872 3590064 3437320 3450328 2812651 2886803
15212 2886803 2673355 2282737 2301623 2419822 2462590 3104463 3642154 3290615 2856048 2987655
15202 2987655 2703794 2516093 2594292 2733242 2656479 3248475 3491173 3229815 3597647 3318407
15192 3318407 2763348 3056634 2887156 2755241 2956483 3067493 3128766 3216058 3821155 3634178
15182 3634178 3189830 3017925 2983777 2807142 2895869 3021345 3191650 2820732 2848487 2456565
15172 2456565 2536081 2543869 3025616 3107410 3190440 3398878 3787140 3662032 3232143 3629827
15162 3629827 4172814 3911963 3758238 3041101 2667121 2986981 2510072 2944007 2969334 3468968
15152 3468968 3526850 3285863 3056633 3183481 2907290 2730903 3011174 3097761 3168255 2724352
15142 2724352 2627126 2548416 3253878 3053093 3363160 3092939 3176857 3173179 2921703 2137532
15132 2137532 2255452 2912021 3568031 3317696 2971069 2909719 3321092 3627257 3291402 3022448
15122 3022448 3300172 3152702 3105658 3197325 2771152 3151945 3067676 2818757 2698025 2951405
15112 2951405 3210502 3373646 3074346 3307870 2873336 2575351 3188253 3401733 3116456
15103 3116456 2922708 2713780 3291143 3601834 3621086 3158066 3254994 3398009 3216913 3208742
15093 3208742 3267616 3406900 2867463 2590014 2822985 3034269 2887391 3352763 3385938 3168474
15083 3168474 3131223 3513155 3376437 3124693 3147037 2799811 2801917 3339748 3002572 2914033
15073 2914033 3236416 3284069 3194960 3093513 3153269 3083572 3570206 3324212 3114714 2755857
15063 2755857 2817346 2768955 3348716 3104606 2615002 2323521 2575382 3180477 3639377 2805599
15053 2805599 3171819 3613180 3262758 2773291 3323717 3748044 3338027 3247726 3458657 3567712
15043 3567712 3275602 3279655 3027119 3421734 3548601 3846226 3762861 2928817 2430598 2515541
15033 2515541 3330948 3058914 3226740 3543208 3232865 3068828 2677801 2607119 2480269 2631685
15023 2631685 3063348 3531540 3518511 3351170 3324994 3418223 3167936 2983810 2998216 3434600
15013 3434600 3248065 3057826 3254628 3191730 2920181 3021468 3220003 3177127 2873242 2870346
15003 2870346 2743671 2746418 3271260 3817371 3997832 3827334 3632352 3288346 2628642 3003300
14993 3003300 2981989 3484206 3262770 2938354 2733474 2878621 3539962 3851397 3265049 3344428
14983 3344428 3203581 2726226 3049407 3222665 3372482 3111169 3463238 3319134 3708471
14974 3708471 3016984 2822179 3189895 4014372 3714136 3342164 3096393 2657843 3364080
14965 3364080 3168630 3197314 3743926 3381960 3462918 3438724 3224611 3465949 3382640 3489192
14955 3489192 3642735 3456297 3396608 3168311 3383867 3491159 3151392 3504990 3860012 3476075
14945 3476075 3085986 3003593 2994952 3292406 3377254 3626073 3408113 3439998 3439219 3522198 3366754
14934 3366754 3302927 3418695 3703326 3784273 3585499 3598269 3256342 3416760 3276399 3180679
14924 3180679 3245107 3179283 3636211 3564499 3347007 3486854 3232348 2971042 2403016 2633047
14914 2633047 2865768 3107827 3314170 2774690 2554341 2602600 2593210 2938180 3019966 2534148
14904 2534148 2603836 3251195 3343405 3107797 3190886 3224481 3572794 2982193 2962404 3387910
14894 3387910 3501281 3553945 3389535 3382665 3634789 3533506 3092664 2984411 3043056 3341202
14884 3341202 3725510 3937500 4035529 3944492 4105220 3797333 3403536 3623442 3341176 2924856
14874 2924856 3548466 3827269 3942246 4031260 3512545 2972700 3116687 3306035 3296726 2852035
14864 2852035 2905812 3335027 3346395 3398519 3383216 3257292 3893060 4158336 3921134 3440351
14854 3440351 3597779 3621277 3649733 3655837 3961974 4093719 4215865 3761908 3073487 3301441
14844 3301441 3421875 2956521 2928757 3685720 3101469 3042931 2636026 2476421 2308559 3169135
14834 3169135 3248521 3465088 2908051 2770973 3095957 3176213 3244935 3401473 3415519 3086001
14824 3086001 3607795 4251202 4010076 3564232 3459838 3231841 2986791 2886222 3168500
14815 3168500 3208546 3385388 3031230 2825353 3296136 3225841 2942023 2724599 3058522 3794667
14805 3794667 3229368 2788712 2722844 3062649 2884768 3395936 3375255 3233460 3717299 3764036
14795 3764036 3599508 2779242 3191027 3302814 3460096 3524536 3523261 2862644 2677652 2932909
14785 2932909 2576786 2537257 2946978 2881560 2901938 2689633 2810929 2770897 2865264 3466746
14775 3466746 3796314 3741326 3418049 3270271 3525294 3646897 2193388 2451409 3071785
14766 3071785 3228558 3019356 3057559 3413566 3263459 2618853 2783366 2817585 2476241 2816693
14756 2816693 2810793 3138908 2769301 2411378 3023433 3322049 3684591 3906250 3745508 3509826
14746 3509826 3103331 3463204 3292915 3029089 3173432 2774900 2914314 3038747 3306938
14737 3306938 3082214 2917479 3027070 2938368 2800209 3201518 3286416 3309304 2957930 3439122
14727 3439122 3291559 3140806 3352676 3079827 2794097 2904923 3313828 3403072 3889864 4432619
14717 4432619 3866627 3530478 3513189 3240683 3480926 3100504 3106368 3015028 3087699 3007543
14707 3007543 3091407 2914121 2673383 3370432 3868529 3254650 3296047 3390666 3509990 3492921
14697 3492921 3297981 2804316 2781118 2682350 2783202 3270617 3522989 3100103 3044976 2877398
14687 2877398 2701391 3000961 2922724 3077653 3071879 2758052 2913670 2879001 2854489 3623583
14677 3623583 3820067 3598246 3359126 3585105 3191827 2878265 3104027 3062969 3300116 2834029
14667 2834029 2662605 2596593 2691208 2992498 3299725 3070507 2523173 2819457 2904753 3048491
14657 3048491 3492835 2989236 2747661 2680519 2459123 3019424 3215314 3310251 3060126 3707787
14647 3707787 3178490 3045803 3215356 3377604 2950644 2954931 3137546 3484603 3118753 3492355
14637 3492355 4047514 3998665 3390127 3284357 3441231 3433163 3254355 2477806 2913627 3299025
14627 3299025 3828065 3512438 3518231 3120800 2405578 3133733 3075086 2902877 3444061 3073269
14617 3073269 3520595 3111362 3200627 3219826 3058101 2724762 2846342 3558691 3285344 2972881
14607 2972881 3148658 2931788 3293510 3282944 3506592 3569350 3308839 2953505 3353737 3629807
14597 3629807 3639274 3249574 2554857 3024091 3122859 3212473 2749906 2645518 2875589 2923157
14587 2923157 3162540 3638373 3783984 3932615 3395082 3216239 2661051 2961521 3337589
14578 3337589 2899398 3095329 3245954 3556718 3225807 2960091 2955229 3473521 3056305 2480050
14568 2480050 2499719 2835464 2689368 2898606 3393519 3568417 3633939 3104620 2954834 3255186
14558 3255186 3650835 3460307 3537891 3248022 3452460 3290939 3002046 3177194 3245790 3643183
14548 3643183 3785236 3818464 3694914 3197029 3210796 2855901 3132689 2969402 2967096 3760336
14538 3760336 3949610 3777604 3421814 2934793 2979295 3021057 3047834 3527233 3474732 3734740
14528 3734740 3863113 4340344 3791420 3059546 3478443 3714847 3578213 3470538 3981332
14519 3981332 3129277 2692978 3314585 3482702 3584444 3344633 2963105 3278472 3435859
14510 3435859 3144515 3165212 3388536 3488752 3296448 3654609 3368948 3214441 3395099 3915341
14500 3915341 3709948 3440896 3248904 3644033 3822390 3525954 3591933 3260799 3149996 3100323
14490 3100323 3135190 3633851 3087832 2534210 3030381 3578154 3555551 3035396 3184647 3399073
14480 3399073 4049360 4451817 4115743 3625610 3143425 3441272 3626660 3868065 3347652
14471 3347652 2883427 3047939 2800106 2899845 3197164 3291486 3274752 3520657 3934605 3866877
14461 3866877 3622473 3539859 3374372 3300756 3398379 3521648 3378203 3387106 3873079 3831499
14451 3831499 3460425 3397440 3473465 3264354 3354977 3174815 3135815 3215368 3354706 3353491 3206106
14440 3206106 3574739 3179361 3141916 3246292 3471007 3524463 3378374 3562261 3874363 3867586
14430 3867586 3989457 4048085 3635416 3013842 3012465 2793779 2750026 3058442 3101028 3539418
14420 3539418 3534859 3125800 2861742 3227950 3510026 3532393 3777061 3521173 3635606 3840870
14410 3840870 4443749 4335424 3336037 3661430 4013064 3976388 3744310 3646564 3052798 3023590
14400 3023590 2778203 2890513 3186213 3283746 3902833 3703972 3845812 3490090 3090749 3042122
14390 3042122 3217629 3400567 3443155 3138044 3201767 3591237 3714288 3331733 3642094 3278675
14380 3278675 3167727 2705483 2804974 2885195 3066039 3431856 3595665 3192624 3328511 3064854
14370 3064854 3118924 3329872 3748604 4104641 3378848 3329626 3653083 3586394 3720687 3754480
14360 3754480 3624219 4041728 3987836 3817303 3342399 3609319 3612592 3454444 3364932 3202051
14350 3202051 2892922 3225150 3413958 3202692 2829516 3113572 3296136 3229972 3077746 3666162
14340 3666162 3617826 3093659 2921572 3495943 3556550 3625906 3876533 3745350 3150071 3133408
14330 3133408 3506035 3866850 3587542 3400642 3344468 3753923 3474751 3665701 3860572 3606633
14320 3606633 3396174 3301649 3135554 3290883 3492632 3678088 3995016 3800721 3609682 3617680
14310 3617680 3538720 4007629 4351228 3411724 3321311 3348759 3001260 3000571 3383122 3723636
14300 3723636 3827610 3239384 3897930 3880761 4092111 3643116 3376696 3703093 3780707 3741215
14290 3741215 3429339 3618195 3668118 3428430 3124874 3499677 4222011 4317384 4076132 3694717
14280 3694717 3413252 3026689 2895960 3114385 3030336 3429584 3407894 3382845 3598487 3402371
14270 3402371 3226961 3369233 3062066 3164975 3084960 3295983 3464200 3272130 3404045 3495339
14260 3495339 3736935 3483513 3392896 3324865 3641153 3548916 3883545 3667855 3668178 3529680
14250 3529680 3326677 3314428 3144864 3590718 3382446 3601362 3550565 3233965 3020097 2868708
14240 2868708 2920070 3351532 3215989 3497618 3723338 3447714 3314554 3074371 2813311 3154748
14230 3154748 3424997 3531994 3668581 3530326 3700223 3311023 3239747 3534223 3586011 3358304
14220 3358304 3101030 2873551 3424084 3998845 3903183 3640888 3631760 3534983 3298188 2899284
14210 2899284 3495258 3617364 3658777 3579377 3941133 4138381 3598946 3575621 2962639 3005618
14200 3005618 2795041 2650375 3250216 3306408 3250041 3125267 3131204 3439007 3125706 2943443
14190 2943443 3311469 3438641 3235043 3207100 3881227 3773724 3389768 3161698 3197978 3358748
14180 3358748 3066466 3602640 3181024 3083757 2963273 3066085 3280285 3504182 3803217 4105709
14170 4105709 4114263 3656555 3065693 3427289 3378753 3612882 3926761 3878792 3316816 2994334
14160 2994334 3171503 3200543 3184232 2891562 2693791 2528663 3343380 3657275 4242648 3713689
14150 3713689 3844837 3890884 4046992 3712922 3871508 3409982 3564065 3239935 2869798 3321405
14140 3321405 3742674 3521521 3469798 3563594 2993784 3207425 2953824 2939030 2800122 3100279
14130 3100279 2867862 3060068 3352273 3509786 3310824 3027243 2686183 2861571 2824657 2751927
14120 2751927 3155310 3452670 3523192 4045395 3976287 3622791 3421931 2945467 3338369 3628708
14110 3628708 3016113 2993231 3270205 3391588 3630540 3304544 3764398 4140013 4206831 4034812
14100 4034812 3565532 3008914 2872877 3189152 3362586 3406704 3892064 3887625 4051393 4248453
14090 4248453 4087582 3850430 3265271 4008987 3608252 2627325 2420102 3027987 3202519
14081 3202519 3027872 3413653 3219908 2906253 3420860 3388226 3487858 3589281 3748954 3560488
14071 3560488 3080784 3549917 4034348 3920675 3759267 4189293 4260010 3814381 3590962 3568544
14061 3568544 3589531 3275473 3390125 3716522 3238237 3069956 2952895 3840621 3383682 2925419
14051 2925419 3429149 3661999 3219875 2878824 3338644 3455074 2945043 2673969 3136597
14042 3136597 3623635 3771740 2676037 2900561 2810177 3380802 3311206 3274284 2509535 3017622
14032 3017622 3705287 3706105 3572279 3795250 3554559 3496493 3721984 3286582 3645532 3511272
14022 3511272 3572595 3730107 3927468 3292420 2967607 3173046 3686596 3304531 3057118 3112721
14012 3112721 3423888 3456716 3171595 3244443 2930727 3228597 3533958 3182561 3103554 3388435
14002 3388435 3711515 3483875 3778030 3045818 2948481 3408848 3382116 3453369 3183487 3437979
13992 3437979 4076650 3873897 3550306 3926003 3784078 3444984 3749148 3620544 3202869
13983 3202869 3117361 3455285 3399498 4248130 4156117 3896039 3498779 3798648 3269734 3053740
13973 3053740 2969172 3414217 3504053 3391098 3902540 3856289 3598548 3602521 3813859 3451159
13963 3451159 3270004 3001191 2862664 2898078 3723597 3740717 3812666 3587387 3459249 3646409
13953 3646409 2960070 2730476 3215976 3557912 4245640 4189910 3953477 4140763 3751631 3697831
13943 3697831 3857747 3754173 4027361 3668673 3763830 3730353 2988838 3325891 4051315 3912049
13933 3912049 3412650 3486572 3724178 3747249 3116102 3568643 3716090 3372346 3577606 3609772
13923 3609772 3434922 3239111 3059627 3485349 3337002 3353106 3566771 3301874 3759807 3364197
13913 3364197 3287476 3513235 3795744 3648101 4163770 3614642 3620231 3775165 3169351 3357990
13903 3357990 3561126 3296960 3456227 3735324 3243531 3336584 3752036 3508463 3043900 3232517
13893 3232517 3511497 3528723 3464765 3563235 3630076 3265114 3018222 3529629 3901658 3246182
13883 3246182 3422146 3289116 3250817 3348168 2993394 2936684 2974422 3375237 3597210 3776838
13873 3776838 4456008 3933965 4060834 3767853 3350196 3483248 3992809 4408717 3887207
13864 3887207 3887887 3619185 2622540 2479722 3458003 3985104 3936215 3653349 3740869 3589066
13854 3589066 3324940 2974593 3163974 3206680 3160678 3815643 4112407 4127819 4084732 4200281
13844 4200281 3642044 3912967 4139053 4058902 3708761 3444293 2999431 3287887 3419787 3429264
13834 3429264 3206142 3369342 3499607 3708039 3956840 4085384 3624065 3311960 3745732
13825 3745732 3747598 3483864 3094299 3663281 3601793 4353887 3808872 3798167 3408172 3646627
13815 3646627 3696415 4056690 3622861 3974281 3628897 3293471 3461805 3655710 3668817 3593453
13805 3593453 3599928 3685656 3793545 3503182 3662056 3595398 3757434 3865086 4018775 3707296
13795 3707296 4174102 3871688 3574709 3366282 3678533 3388520 3135607 3042251 3436719 3614696
13785 3614696 3492669 3482204 3139154 3086156 3407764 3423946 3370669 4196502 3820863 3734806
13775 3734806 3507379 3279421 2867519 3321303 3533221 4138034 3659272 3588881 3771863 3743115
13765 3743115 3898662 3903788 3609183 3444165 3637153 3852417 3527014 3752833 4113752 3405589
13755 3405589 3664971 4034782 4011383 3911839 3961083 4352523 4311325 3864505 3849700 3235320
13745 3235320 4037618 4264565 4226430 3764693 3757983 3633700 3589948 3448980 3926921 3933697
13735 3933697 3750256 4133816 3643308 3862907 3737100 4067020 3674176 3734786 3466912 3166076
13725 3166076 3589000 3806870 3980378 3784583 3492285 3333017 3402829 3020827 3825388 4283931
13715 4283931 4392535 3709358 3612385 2973028 3495199 3330383 3565187 3854143 4278863 3842847
13705 3842847 4040221 4069509 3574659 3390790 3270369 3613537 3743832 3882330 3719339 3614470
13695 3614470 3731113 4132361 3770166 3531647 3759994 3989751 3752498 4025309 3994628 4065584
13685 4065584 3521308 3671691 3336864 3570823 3292246 3300117 3708188 3748883 3805266 4116633
13675 4116633 3384295 3044202 3616224 3416861 3734039 3762443 3530089 3427027 3403037 3095818
$$ [...]
##END NTUPLES=NMR SPECTRUM
##END=
