##TITLE=1H_DE-80H_X3
 200.13MHz, d2o
 8 sc
 
 19ns.26.2.2025
##JCAMPDX= 6.0         $$ Bruker NMR JCAMP-DX V2.0
##DATA TYPE= NMR SPECTRUM
##DATA CLASS= NTUPLES
##ORIGIN= UXNMR, Bruker Analytische Messtechnik GmbH
##OWNER= pz
$$ XWIN-NMR		Version 3.5
$$ Fri Dec 19 11:08:50 2025 Russian Standard Time (UT+4h)  Yarkov@DPX200
##.OBSERVE FREQUENCY= 200.1313
##.OBSERVE NUCLEUS= ^1H
##.ACQUISITION MODE= SIMULTANEOUS
##.ACQUISITION SCHEME= undefined
##.AVERAGES= 8
##.DIGITISER RES= 18
##SPECTROMETER/DATA SYSTEM= spect
##.PULSE SEQUENCE= zg30
##.SOLVENT NAME= CDCl3
##.SHIFT REFERENCE= (INTERNAL, CDCl3, 0, 15.4858)
##AUDIT TRAIL= $$ (NUMBER, WHEN, WHO, WHERE, WHAT)
$$ ##TITLE= Audit trail, XWIN-NMR		Version 3.5
$$ ##JCAMPDX= 5.01
$$ ##ORIGIN= Bruker BioSpin GmbH
$$ ##OWNER= Yarkov
$$ C:/Bruker/XWIN-NMR/data/yarkov2/nmr/H-C/1/pdata/1/auditp.txt
$$ ##AUDIT TRAIL=  $$ (NUMBER, WHEN, WHO, WHERE, WHAT)
(   1,<2025-12-19 11:08:04.45 +0400>,<Yarkov>,<DPX200>,
      <created by zg, POWCHK disabled, PULCHK disabled
       configuration hash MD5:
       00 E9 B6 7A A2 85 ED C7 34 08 36 98 17 FE 4E 26
       data hash MD5: 16K
       FD 6B 32 BF 9D 31 F9 14 76 B6 84 CF 64 4D EE 3E>)
(   2,<2025-12-19 11:08:08.20 +0400>,<Yarkov>,<DPX200>,
      <Start of raw data processing
       efp BC_mod = 2 LB = 0.25 FT_mod = 6 PKNL = 1 PHC0 = -5306.755 PHC1 = 10.82193 SI = 16K 
       data hash MD5: 16K
       A2 70 65 8A F6 85 66 41 F0 81 14 BB A5 D1 F1 D9>)
$$ ##END=
$$ 
$$ hash MD5
$$ ED 43 3E 63 33 5A F5 5E 64 E6 AB 1E B2 E7 18 D0
##$RELAX= 
##$RELAX= 
##$RELAX= 
##$RELAX= 
##$RELAX= 
##$RELAX= 
$$ Bruker specific parameters
$$ --------------------------
##$DU= <C:/Bruker/XWIN-NMR>
##$EXPNO= 1
##$NAME= <H-C>
##$PROCNO= 1
##$TYPE= <nmr>
##$USER= <yarkov2>
##$AMP= (0..31)
100 100 100 100 100 100 100 100 100 100 100 100 100 100 100 100 100 100 
100 100 100 100 100 100 100 100 100 100 100 100 100 100 
##$AQSEQ= 0
##$AQ_mod= 1
##$AUNM= <au_zg>
##$AUTOPOS= <>
##$BF1= 200.13
##$BF2= 200.13
##$BF3= 200.13
##$BF4= 200.13
##$BF5= 200.13
##$BF6= 200.13
##$BF7= 200.13
##$BF8= 200.13
##$BYTORDA= 1
##$CFDGTYP= 0
##$CFRGTYP= 5
##$CHEMSTR= <none>
##$CNST= (0..31)
1 1 145 1 1 1 1 1 1 1 1 1 1 1 1 1 1 1 1 1 1 1 1 1 1 1 1 1 1 1 1 1 
##$CPDPRG= <>
##$CPDPRG1= <>
##$CPDPRG2= <>
##$CPDPRG3= <>
##$CPDPRG4= <mlev>
##$CPDPRG5= <mlev>
##$CPDPRG6= <mlev>
##$CPDPRG7= <mlev>
##$CPDPRG8= <mlev>
##$CPDPRGB= <>
##$CPDPRGT= <>
##$D= (0..31)
0 0.7 0 0 0 0 0 0 0 0 0 0.03 0 0 0 0 0 0 0 0 0 0 0 0 0 0 0 0 0 0 0 0 
##$DATE= 1766128083
##$DBL= (0..7)
120 120 120 120 120 120 120 120 
##$DBP= (0..7)
150 150 150 150 150 150 150 150 
##$DBP07= 0
##$DBPNAM0= <>
##$DBPNAM1= <>
##$DBPNAM2= <>
##$DBPNAM3= <>
##$DBPNAM4= <>
##$DBPNAM5= <>
##$DBPNAM6= <>
##$DBPNAM7= <>
##$DBPOAL= (0..7)
0.5 0.5 0.5 0.5 0.5 0.5 0.5 0.5 
##$DBPOFFS= (0..7)
0 0 0 0 0 0 0 0 
##$DE= 6
##$DECBNUC= <off>
##$DECIM= 32
##$DECNUC= <off>
##$DECSTAT= 4
##$DIGMOD= 1
##$DIGTYP= 9
##$DL= (0..7)
0 120 120 120 120 120 120 120 
##$DP= (0..7)
$$ [...]
##$SUBNAM2= <"">
##$SUBNAM3= <"">
##$SUBNAM4= <"">
##$SUBNAM5= <"">
##$SUBNAM6= <"">
##$SUBNAM7= <"">
##$SUBNAM8= <"">
##$SUBNAM9= <"">
##$SW= 18.0517328524113
##$SWIBOX= (0..15)
0 0 2 0 0 0 0 0 0 0 0 0 0 0 0 0 
##$SW_h= 3612.71676300578
##$TD= 16384
##$TD0= 1
##$TE= 0
##$TE2= 300
##$TE3= 300
##$TEG= 300
##$TL= (0..7)
0 120 120 120 120 120 120 120 
##$TP= (0..7)
150 150 150 150 150 150 150 150 
##$TP07= 0
##$TPNAME0= <>
##$TPNAME1= <>
##$TPNAME2= <>
##$TPNAME3= <>
##$TPNAME4= <>
##$TPNAME5= <>
##$TPNAME6= <>
##$TPNAME7= <>
##$TPOAL= (0..7)
0.5 0.5 0.5 0.5 0.5 0.5 0.5 0.5 
##$TPOFFS= (0..7)
0 0 0 0 0 0 0 0 
##$TUNHIN= 0
##$TUNHOUT= 0
##$TUNXOUT= 0
##$USERA1= <user>
##$USERA2= <user>
##$USERA3= <user>
##$USERA4= <user>
##$USERA5= <user>
##$V9= 5
##$VALIST= <valist>
##$VCLIST= <CCCCCCCCCCCCCCC>
##$VD= 0
##$VDLIST= <DDDDDDDDDDDDDDD>
##$VPLIST= <PPPPPPPPPPPPPPP>
##$VTLIST= <TTTTTTTTTTTTTTT>
##$WBST= 1024
##$WBSW= 4
##$XGAIN= (0..3)
0 0 0 0 
##$XL= 0
##$YL= 0
##$YMAX_a= 39143
##$YMIN_a= -36058
##$ZGOPTNS= <>
##$ZL1= 120
##$ZL2= 120
##$ZL3= 120
##$ZL4= 120
##$ABSF1= 0
##$ABSF2= 0
##$ABSG= 0
##$ABSL= 0
##$ALPHA= 0
##$AQORDER= 0
##$ASSFAC= 0
##$ASSFACI= 0
##$ASSFACX= 0
##$ASSWID= 0
##$AUNMP= <proc_1d>
##$AZFE= 0.1
##$AZFW= 0.1
##$BCFW= 0
##$BC_mod= 2
##$BYTORDP= 0
##$COROFFS= 0
##$CY= -3
##$DATMOD= 1
##$DC= 0
##$DFILT= <>
##$DTYPP= 0
##$F1P= 0
##$F2P= 0
##$FCOR= 1
##$FTSIZE= 16384
##$FT_mod= 6
##$GAMMA= 0
##$GB= 0
##$INTBC= 1
##$INTSCL= 3.241238e-09
##$ISEN= 128
##$LB= 0.25
##$LEV0= 0
##$LPBIN= 0
##$MAXI= 10000
##$MC2= 0
##$MEAN= 0
##$ME_mod= 0
##$MI= 1.114404
##$NCOEF= 0
##$NC_proc= -7
##$NLEV= 6
##$NOISF1= 3.799351
##$NOISF2= 2.8
##$NSP= 0
##$NTH_PI= 0
##$NZP= 0
##$OFFSET= 15.48576
##$PC= 1
##$PHC0= -5306.755
##$PHC1= 10.82193
##$PH_mod= 1
##$PKNL= yes
##$PPARMOD= 0
##$PSCAL= 0
##$PSIGN= 0
##$REVERSE= no
##$SF= 200.130007192919
##$SI= 16384
##$SIGF1= 3
##$SIGF2= 2
##$SINO= 0.751879
##$SIOLD= 32768
##$SREGLST= <19F.Aceton>
##$SSB= 0
##$STSI= 16384
##$STSR= 0
##$SW_p= 3612.71676300578
##$SYMM= 0
##$S_DEV= 0
##$TDeff= 16384
##$TDoff= 0
##$TI= <>
##$TILT= no
##$TM1= 0
##$TM2= 0
##$TOPLEV= 0
##$USERP1= <user>
##$USERP2= <user>
##$USERP3= <user>
##$USERP4= <user>
##$USERP5= <user>
##$WDW= 1
##$XDIM= 16384
##$YMAX_p= 274129725
##$YMIN_p= -332242
$$ End of Bruker specific parameters
$$ ---------------------------------
##NTUPLES= NMR SPECTRUM
##VAR_NAME=  FREQUENCY,     SPECTRUM/REAL,   SPECTRUM/IMAG
##SYMBOL=    X,             R,               I
##VAR_TYPE=  INDEPENDENT,   DEPENDENT,       DEPENDENT
##VAR_FORM=  AFFN,          ASDF,            ASDF
##VAR_DIM=   16384,         16384,           16384
##UNITS=     HZ,            ARBITRARY UNITS, ARBITRARY UNITS
##FACTOR=    0.220516191357247, 1,           1
##FIRST=     3099.16520717486, 0,            0
##LAST=      -513.551555830916, 0,           0
##MIN=       -513.551555830916, -332242,     0
##MAX=       3099.16520717486, 274129725,    0
$$ Real data points
##PAGE= N=1
##DATA TABLE= (X++(R..R)), XYDATA
$$ [...]
7487A52802K627n5265J87895j35537O0318M1608m1411j27668Q3004M1304k2131
$$ 152802 155429 100164 288059 152522 212840 254448 213037 85369 168373 209677 187546
7476A87546k0399J46561j1984m9824L2572o6051l3082l7385Q1640m0977J23354
$$ 187546 167147 313708 301724 251900 284472 218421 185339 147954 229594 188617 311971
7465C11971M3271p8882j4719j1173O8249j09039o3346L4797l4159J3639J21096
$$ 311971 355242 276360 261641 250468 318717 209678 146332 181129 146970 160609 281705
7454B81705K0129M7915R6946o0913j22523r5244J08982L2967n1807J20163n048
$$ 281705 301834 349749 446695 385782 263259 168015 276997 309964 258157 378320 373272
7443C73272j27391J00429j06390p5871o6813q0426K45122O3518j39638Q0014r558
$$ 373272 245881 346310 239920 164049 97236 16810 261932 325450 185812 265826 256268
7432B56268p5984j31047N8928R1894M5741J8121K3797m9453m692o7519j03045
$$ 256268 180284 49237 108165 200059 245800 263921 287718 238265 233573 166054 63009
7421F3009K1572j1132L6970J06164L1348O7885K6859K044j41372n1322J6587j77703
$$ 63009 84581 73449 110419 216583 247931 315816 342675 344719 203347 152025 168612 -9091
7409i091K14245J63591J1684j4573n5481l1561l8376On0844J6480n3342r626L7313
$$ -9091 205154 368745 380429 365856 310375 278814 240438 240444 189600 206080 152738 143112 180425
7396A80425j4854O5224O517J8059J00986L1214p8351j0162o4716m1743P9489K8872
$$ 180425 165571 230795 237312 255371 356357 387571 309220 299058 234342 192599 272088 300960
7384C00960R9700m0050o4164J16036k1533j15696o8634q6945O3829J69066M0066
$$ 300960 400660 360610 296446 412482 390949 275253 206619 119674 183503 352569 392635
7373C92635j4448j85177L4114m9953o2311J15051N3725j9014k4476j01909Q0175
$$ 392635 378187 193010 227124 177171 114860 229911 283636 264622 240146 138237 218412
7362B18412K21690p1019j13235r5817r6718R7095J13799K2930k1158L079J6238
$$ 218412 440102 369083 255848 160031 63313 160408 274207 297137 275979 279058 295296
7351B95296p2467p2323j16381J39675J33119j6518j87901R2090N2155N3339p8694
$$ 295296 222829 150506 34125 173800 306919 290401 102500 194590 246745 300084 221390
7340B21390L7108l0598r0783Q3211K4794P8087j38893j63721J00018J02462L1366
$$ 221390 258498 227900 137117 220328 245122 323209 184316 20595 120613 223075 254441
7329B54441j2303j01445r2147R9093J17893n0842j2596Q165K30814j04483j17272
$$ 254441 242138 140693 48546 147639 265532 214690 202094 210259 441073 336590 219318
7318B19318J62978P7055j0375k3875j47288K1678m7322P315o879n0044P0022J2853
$$ 219318 382296 459351 448976 425101 277813 299491 252169 259484 252605 202561 272583 285436
7306B85436K2996J6524j5583Q1411j74416l7514J53957j2717q5818J94619P3917
$$ 285436 308432 324956 309373 390784 216368 178854 332811 320094 234276 428895 502812
7295E02812k29804k7062Q9978p8654k2476J27933j3728K3452n2370m242R3821
$$ 502812 273008 245946 335924 257270 234794 362727 348999 372451 320081 315839 409660
7284D09660l5267j38925L3494k1526M1375L3859O5704o3861k8709J35114M4181
$$ 409660 374393 235468 268962 247436 288811 322670 388374 324513 295804 430918 475099
7273D75099j4688q108K0412m5384p7545Q0580n9029k0417K6193J8144n4831p353
$$ 475099 460411 452303 472715 427331 349786 430366 371337 350920 377113 395257 340426 333073
7261C33073p0363L9457q4430k5743N9921K7981N8820m2594K0281J02965m129p0323
$$ 333073 262710 302167 217737 191994 251915 279896 338716 296122 316403 419368 415239 344916
7249C44916j01058m5449L6629q9079J47233j09234Q9848m0214K8155J1752P7756
$$ 344916 243858 198409 235038 145959 293192 183958 273806 233592 261747 273499 351255
7238C51255l9121j15308J04316J47629j22043K2454M279j54739K1852o2892N6714
$$ 351255 312134 196826 301142 448771 326728 349182 353461 198722 220574 157682 214396
7227B14396l4892j14230K4362R6929L9327Q8547p9560q4184r3625R2132J64452
$$ 214396 179504 65274 89636 186565 225892 314439 234879 150695 57070 149202 313654
7216C13654j2785J42423l5058j02967j11801O6788m6973n986R5983Q9796K4950
$$ 313654 300869 443292 408234 305267 193466 260254 213281 207295 303278 393074 418024
7205D18024j95398L9652k52J72818p6503j27671n4199j8224J26569j0450M2221
$$ 418024 222626 262278 262026 434844 358341 230670 176471 158247 284816 274366 316587
7194C16587K1002k3361j9548k7879q1106K1788P0055j04255r1955J86012j9567
$$ 316587 337589 314228 294680 266801 185695 207483 277538 173283 81328 267340 247773
7183B47773q7865L5548j19732J07429j9961Q2248P5660j16594M5190N5196l9073
$$ 247773 159908 195456 75724 183153 163192 245440 321100 204506 249696 304892 265819
7172B65819N5550P280K3312m3558O600n0398j03828m0304L7306M140Q8870M5758
$$ 265819 321369 328649 351961 308403 315003 264605 160777 120473 157779 161919 250789 296547
7160B96547L123p0571l5238K4206J27471J19419n7088l7456Q7937n0886j55762
$$ 296547 299670 229099 193861 218067 345538 464957 407869 370413 458350 407464 251702
7149B51702R6196m4165J78803Q2448k11134k4070J53836L553k3213n1144L5964
$$ 251702 347898 303733 482536 564984 353850 329780 483616 487169 463956 412812 448776
7138D48776n7083M5214l6027J5580O7026N0826j12836j94875J23228r4337P5052
$$ 448776 391693 436907 400880 416460 483486 534312 421476 226601 349829 255492 330544
7127C30544r5531J4246J07077o9135J15366n5030j28636n3741o0988K6340K26050
$$ 330544 235013 249259 356336 287201 402567 347537 218901 165160 104172 130512 356562
7116C56562O1276m0564K0361q4455o2501l2914p1269R6531L5295J10881j08531
$$ 356562 417838 377274 397635 313180 250679 217765 146496 243027 278322 389203 280672
7105B80672O0949Q9971m9273L4545k0311j2452J2917l646K6030N7936j02109k0936
$$ 280672 341621 431592 382319 416864 396553 384101 397018 393372 419402 477338 375229 354293
7093C54293j63610n1757Q2401j3527k3217P2623N1805O7252L6830k191r425j79240
$$ 354293 190683 138926 221327 207800 184583 257206 309011 376263 413093 410902 401477 222237
7081B22237Q196k0608P229L0632N1191m5523L2600J0150j0614p647R3962m6246
$$ 222237 230433 209825 217054 247686 298877 253354 285954 296104 285490 277843 371805 325559
7069C25559j25405J52690o3975l3895J02333k4555n2850R6047p3163m670m3888
$$ 325559 200154 352844 288869 254974 357307 332752 279902 375949 302786 298116 254228
7058B54228M7271Q8658J7108j24048J75425l294K226j02693k0905m5033O2748
$$ 254228 301499 390157 407265 283217 458642 455348 457574 354881 333976 288943 351691
7047C51691p0232o7252K3451j1259P4058j24455L8775L5716K2968K9635j46365
$$ 351691 281459 214207 237658 226399 300457 176002 214777 250493 273461 303096 156731
7036A56731k4907K04403m9834N0010P2706k3034j55425l2756m775J13433M0489
$$ 156731 131824 336227 286393 336403 409109 386075 230650 197894 193119 306552 347041
7025C47041J8172J10344q2768k6128J8001n7428j4396J2321M3845n6905q661O7875
$$ 347041 365213 475557 392789 366661 384662 327234 312838 325159 369004 312099 303438 371313
7013C71313J51039j78291j46815j37530J20578J67512q1900J32825l0058l7606
$$ 371313 522352 344061 197246 59716 180294 347806 265906 398731 368673 331067
7003C31067j2047Q9602n896j29838r5203o2065J12596Q0567o8571K145N5089J4936
$$ 331067 319020 408622 402726 272888 177685 115620 228216 308783 240212 242357 297446 312382
6991C12382l1874J06238J20779q2674n1893k0017k0448j0356K9054o948K9642
$$ 312382 280508 386746 507525 424851 372958 352941 332493 322137 351191 344243 373885
6980C73885L7349n7491M471J11215j8817p0362J4055j85725P4590K30209n2706
$$ 373885 411234 353743 358214 469429 450612 380250 394305 208580 283170 513379 460673
6969D60673n3346l5555L9788L400J10484m6839o9545K8986j04475p3673o1282
$$ 460673 407327 371772 411560 414960 525444 478605 409060 438046 333571 259898 198616
6958A98616R3951Q5488j5590k1007j198J75382j7525m5047K611j6627q4237n9795
$$ 198616 292567 378055 362465 341458 340260 515642 498117 453070 455681 439054 354817 295022
6946B95022n5989J57117J00029j6894N4872n6076n1583p2725J4514Q0291K3084
$$ 295022 239033 396150 496179 479285 534157 478081 426498 353773 368287 448578 471662
6935D71662o5129n0711m7165o3938k7322P0728m5278J28768L0531P430r8300k006
$$ 471662 406533 355822 308657 244719 217397 288125 242847 371615 402146 409576 311276 309270
6923C09270n0384J25642m2427k0039P3330j5136L74J3012K3089L1673R603m4442
$$ 309270 258886 384528 342101 322062 395392 380256 380630 393642 416731 448404 458007 413565
6911D13565o5368K9932R1407l4924N934o2876M8507r2200P070J05902k4464j71878
$$ 413565 348197 378129 469536 434612 440546 377670 426177 333977 341047 446949 422485 250607
6899B50607M805Q1608m8321M2405n3303O0037R1095l8298p3235j3773O1695O510
$$ 250607 255412 337020 288699 331104 277801 337838 428933 390635 317400 303627 365322 371832
6887C71832p0890O2339J48742j820Q0862j23026j59392k8584R3411L9900O1340
$$ 371832 300942 363281 512023 510203 591065 468039 308647 280063 373474 413374 474714
6876D74714m8202j3452O3125K7512r5271o5909R9169J05268n3864k5275k2886
$$ 474714 426512 413060 476185 503697 408426 342517 441686 546954 493090 467815 444929
6865D44929O8016J36272o4777j09096M76j02226J2232J17888L189M1797l2501
$$ 444929 512945 649217 584440 475344 475820 373594 385826 503714 506903 548700 516199
6854E16199L1958j04100L7447j16378k8630N5827M149j5462o3937Q7993J36770
$$ 516199 548157 444057 481504 365126 336496 392323 396472 381010 317073 405066 541836
6843E41836l3999j32599Q2221p3687m6190K2152N5534Q4037k5831l2612J44590
$$ 541836 507837 375238 457459 383772 337582 359734 415268 499305 473474 440862 585452
6832E85452n4237n7715R2041l4704n3890j41286K8489m2137J2078J98041j522
$$ 585452 531215 473500 565541 530837 476947 335661 364150 322013 334091 532132 530610
6821E30610l109q1705Q2802J37568k32085j77223P3918P0804l0866J28789j64285
$$ 530610 527501 445796 528598 666166 434081 256858 330776 401580 370714 499503 335218
6810C35218J615J36447l5832k7322O6668J6523j08725j1906n5301L0004m6851
$$ 335218 336833 473280 437448 410126 476794 493317 384592 372686 317385 347389 300538
6799C00538m1130J25139J64607n3593j25368j1042R9119L1779j23687l829L3649
$$ 300538 259408 384547 549154 495561 370193 359151 458270 490049 366362 362533 396182
6788C96182J57010J511p8260p6346j5726J49368J39601j21822j29741J8563J23753
$$ 396182 553192 554703 476443 400097 384371 533739 673340 551518 421777 440340 564093
6777E64093j155j89927J31533K8023m3434k0998J04893j6381j72902O2874K3390
$$ 564093 562938 373011 504544 532567 489133 468135 573028 556647 383745 446619 470009
6766D70009N0553k86K2433m6449q4987J28252P9706q0294p5426M5680l7776p8768
$$ 470009 520562 520276 542709 496260 411273 539525 619231 538937 463511 509191 471415 392647
6754C92647R4708R0075l7296q2848O437K429N8520j34788J4261J05726j27734
$$ 392647 487355 577430 540134 457286 463723 466152 524672 389884 404145 509871 382137
6743C82137P387R9758J34096r4011k33285n2134J03293n0470J33370L2175L8623
$$ 382137 389524 489282 623378 529367 296082 243948 347241 296771 430141 462316 500939
6732E00939M1360M0605j4290n2749K0056M8771l5970n4955n4418o3854Q0653j8957
$$ 500939 542299 582904 568614 515865 535921 584692 548722 493767 439349 375495 456148 437191
6720D37191J42814q278O3877J01197p4697q9557j04131o7206k4318O957M6629
$$ 437191 580005 571727 635604 736801 662104 572547 468416 401210 376892 383849 430478
6709D30478M9007p1032N2402N5544o2822J11634k5071n805n4708n6050J45962
$$ 430478 479485 408453 460855 516399 453577 565211 540140 534335 479627 423577 569539
6698E69539m6468O9778l7626N72K5318K2559J4409N3057J3837L2266Q819j56942
$$ 569539 523071 592849 555223 555795 581113 603672 618081 671138 684975 717241 726060 569118
6686E69118j7275Q5088m8725q5539m167M7312M8840M8506o0200m2342j2521j3379
$$ 569118 551843 636931 588206 502667 498500 545812 594652 643158 582958 540616 528095 514716
6674E14716J8927N3679o4196M9422K9596K7952O0988O03n1204r0190J20396q3760
$$ 514716 533643 587322 523126 572548 602144 630096 691084 691687 640483 550293 670689 586929
6662E86929K0773j8490M8508k3392J74379j34006j83927K18097J27698j34499
$$ 586929 607702 589212 637720 614328 788707 654701 470774 688871 816569 682070
6652F82070j67000J32170J4275K1664J0141j33418P6416N8632q5056Q7179l0321
$$ 682070 515070 647240 661515 683179 693320 559902 636318 694950 609894 697073 666752
6641F66752l769J67333l7666j15307q0169P8780M1089J50395j8844K5L6747j89456
$$ 666752 662983 830316 792650 677343 597174 675954 717043 867438 848594 848619 885366 695910
6629F95910l616J1687r5436M101P2560K26642n01j46177J2672r0141M9835n9825
$$ 695910 692294 703981 608545 612646 685206 911848 911347 765170 777842 687701 737536 677711
6617F77711m2901J72779O2065j41535j4204N7205m3734j9348j24189K0089J30232
$$ 677711 634810 807589 869654 728119 713915 771120 727386 708038 583849 603938 734170
6606G34170j324o5018k5256M7168Q4461l4650j77889J49744L4094j06463l8698
$$ 734170 732846 667828 642572 689740 774201 739551 561662 711406 745500 639037 600339
6595F00339J06941K5633O9936l6108P5236P3154P4756j4090j36222J25603L5519
$$ 600339 707280 732913 802849 766741 841977 915131 989887 975797 839575 965178 1000697
6584A000697R868P9761k18459K6569M7608p7552j00673J147Q5030p4833k6099
$$ 1000697 1010565 1090326 871867 898436 946044 868492 767819 768966 853996 779163 753064
6573G53064J676J0745k7827j7282k1401J32252o9208j5758J19486o6087R120J42147
$$ 753064 754740 765485 737658 720376 698975 831227 762019 746261 865747 799660 808780 950927
6561I50927n8406l9936l6358N282j28705k7381R494o8747L3591Q1989J44797k3802
$$ 950927 892521 852585 816227 821509 692804 665423 674917 606170 639761 721750 866547 842745
6549H42745J0216J2080q3677k4060R3958L2320j27398J40464M0462k4089k9461
$$ 842745 852961 865041 781364 757304 851262 883582 756184 896648 937110 913021 883560
6538H83560j12878r7629J02999K492p7587N6840N0802K3979n3346L8099J67794
$$ 883560 770682 673053 776052 778544 700957 757797 808599 832578 779232 817331 985125
6527I85125P0009j76651j55687P2566l03r0734o4109Q0940O9758k7357O3101l7073
$$ 985125 1055134 878483 722796 795362 795059 704325 640216 721156 790914 763557 826658 789585
6515G89585J25643j6516j40142m1420j0589J82902Q5588q840j9509j07215K3961
$$ 789585 915228 898712 758570 717150 706561 889463 975051 966211 946702 839487 863448
6504H63448J53016M2486n6471j32691j8493L2295J79887M2134j49900P4101k2955
$$ 863448 1016464 1058950 1002479 869788 851295 883590 1063477 1105611 955711 1029812 1006857
6493A006857O5307n7957q7219J2488N5679K0995Q645J41847j55483L4300o6134
$$ 1006857 1072164 1014207 926988 939476 995155 1016150 1024795 1166642 1011159 1045459 979325
6482I79325o6144P5324k2994N2465k984K5008j56252k525R4786L1022L5357j27492
$$ 979325 913181 988505 965511 1017976 1014992 1040000 883748 881223 976009 1007031 1042388 914896
6470I14896N2008J68879L9315O7021m7739M204m2575N697n2585q3001Q5913J21067
$$ 914896 966904 1135783 1175098 1242119 1194380 1198584 1156009 1161706 1109121 1026120 1112033 1233100
6458A233100L0523j0633o5110j11075k5291m766P7750K9155M2902O2483k0618
$$ 1233100 1263623 1252990 1187880 1076805 1051514 1046748 1124498 1153653 1196555 1259038 1238420
6447A238420j26137Q1583j8375n3760O427L5431O1894r897R5666r777o5281L9978
$$ 1238420 1112283 1193866 1175491 1121731 1128158 1163589 1225483 1215586 1311252 1301475 1236194 1276172
6435A276172L7138o8362Q6765O7750n2565r8371q5328Q248P0705J9885R7909N3295
$$ 1276172 1313310 1244948 1331713 1399463 1346898 1248527 1163199 1171447 1242152 1262037 1359946 1413241
6423A413241p0703q2530J3401m9627J44458P8502k8203o8042Q3876Q675O788p3736
$$ 1413241 1342538 1260008 1273409 1223782 1368240 1446742 1418539 1350497 1434373 1443048 1449836 1376100
6411A376100l782R3331k3087K5754J01923j95929M0528P5386j19251j5611J46424
$$ 1376100 1372318 1465649 1442562 1468316 1570239 1374310 1414838 1490224 1370973 1355362 1501786
6400A501786L831p153L4750J50631k9385o9066N7381o6918R5416j9652J67098
$$ 1501786 1505617 1498464 1533214 1683845 1654460 1585394 1642775 1575857 1671273 1651621 1818719
6389A818719R5693J02599q6339r2373K5746K3982M5722j20473M8882J58830j3913
$$ 1818719 1914412 2017011 1930672 1838299 1864045 1888027 1933749 1813276 1862158 2020988 2007075
6378B007075l7763j8354J05762k7692L4528j26607J1666J84910k4636n7344J86486
$$ 2007075 1969312 1950958 2056720 2029028 2063556 1936949 1948615 2133525 2108889 2051545 2238031
6367B238031p1325J50537l2872l4961l1742o1958J1658P4262j11530J04419M8416
$$ 2238031 2166706 2317243 2284371 2249410 2217668 2155710 2167368 2241630 2130100 2234519 2282935
6356B282935K1767J18522j78615J668J48582j6394K28o3587Q8198J33845K2953
$$ 2282935 2304702 2423224 2244609 2246277 2394859 2378465 2378693 2315106 2403304 2537149 2560102
6345B560102J7558J8275R0132r8138l1195Q7150J79413n3676l9906J9506p5309
$$ 2560102 2577660 2595935 2686067 2587929 2556734 2643884 2823297 2769621 2729715 2749221 2673912
6334B673912p6093m568k9797o2369J01817Q8603J3436J1210M0712l9557j9386
$$ 2673912 2597819 2593251 2563454 2501085 2602902 2691505 2704941 2716151 2756863 2717306 2697920
6323B697920L8151j1860O5171K7934m2647R7392k7696m1574Q483j38042J4109
$$ 2697920 2736071 2724211 2789382 2817316 2774669 2872061 2844365 2802791 2811274 2673232 2687341
6312B687341N4755m3301J076k2574j4629P2592k3395P525p9583O2094j09871l2599
$$ 2687341 2742096 2698795 2699871 2677297 2662668 2735260 2711865 2719390 2639807 2701901 2592030 2559431
6300B559431j60403M1659J24127Q1545n4678O9629J58261P9960j03176k33666
$$ 2559431 2399028 2440687 2564814 2646359 2591681 2661310 2819571 2899531 2796355 2562689
6290B562689M2408j5886o5154k1586o9447L4206p6271o4682K76264Q8523J05159
$$ 2562689 2605097 2589211 2524057 2502471 2433024 2467230 2390959 2326277 2602541 2691064 2796223
6279B796223j09389m1083K5435R5939J9034q6047k8604p0036K7838M6076n3215
$$ 2796223 2686834 2645751 2671186 2767125 2786159 2700112 2671508 2601472 2629310 2675386 2622171
6268B622171J5872J9068m8887j18300M7897J82781M5607j44947J39150L9778p8769
$$ 2622171 2638043 2657111 2608224 2489924 2537821 2720602 2766209 2621262 2760412 2800190 2721421
6257B721421m3514j14604Q7126q5668R5599K27652M7758q1482J23846j25063p941
$$ 2721421 2677907 2563303 2650429 2564761 2660360 2888012 2935770 2854288 2978134 2853071 2845130
6246B845130L205L5432N3864o344J0579J26622N8623M6880l3197n376N399J52303
$$ 2845130 2848335 2883767 2937631 2931287 2941866 3068488 3127111 3173991 3140794 3135418 3140817 3293120
6234C293120N0909l3704O685k4129J15440j04927K7444J28926N7267L7864o2406
$$ 3293120 3344029 3310325 3317010 3292881 3408321 3303394 3330838 3459764 3517031 3554895 3492489
6223C492489N851O3077J67701P894L142R454M5045J85025L0968j51079j2496N0402
$$ 3492489 3498340 3561417 3729118 3737012 3740154 3749608 3794653 3979678 4010646 3859567 3847071 3897473
6211C897473J33851j3523j9149L5367m4172N864J08342Q0092O031L2774j5182
$$ 3897473 4031324 4017801 3998652 4034019 3989847 3995711 4104053 4184145 4190176 4222950 4207768
6200D207768K9574n596M7251o489J04579o0347R2423R9003J3475j58613R1688
$$ 4207768 4237342 4231746 4278997 4272508 4377087 4316740 4409163 4508166 4521641 4363028 4454716
6189D454716K24375K1736q7890J14926J95237J21287O1451J18779m0909j2780
$$ 4454716 4679091 4700827 4612937 4727863 4923100 5044387 5105838 5224617 5183708 5170928
6179E170928P259J23509J14730J4522N2139p5940J41432O8793K413K15439M3114
$$ 5170928 5178187 5301696 5416426 5430948 5483087 5407147 5548579 5617372 5619785 5835224 5878338
6168E878338k8301K0557J04427P4259L3762M3713P7007P1161J21120l8748K5893
$$ 5878338 5850037 5870594 5975021 6049280 6083042 6126755 6203762 6274923 6396043 6357295 6383188
6157F383188O0017K1130O6696p7307j37733L2245n5772M1156J06692l8282J4100
$$ 6383188 6443205 6464335 6531031 6453724 6315991 6348236 6292464 6333620 6440312 6402030 6416130
6146F416130j53883n3270n3475m9793p3590j6126k1125J0586J8739q7652j078
$$ 6416130 6262247 6208977 6155502 6105709 6032119 6015993 5994868 6005454 6024193 5936541 5935463
6135E935463r74p2358M9358l0429j90702M8903l4197n1323J8264O1016o7069j83411
$$ 5935463 5934489 5862131 5911489 5881060 5690358 5739261 5705064 5653741 5672005 5733021 5665952 5482541
6123E482541n0696K7460k118m3114j0011o5429L009J8555J06637j45664j09829
$$ 5482541 5431845 5459305 5457187 5414073 5404062 5338633 5341642 5360197 5466834 5321170 5211341
6112E211341R2320K8046j16820l0899J18348O8838j709k7217R5382p8129J5394
$$ 5211341 5303661 5331707 5214887 5183988 5302336 5371174 5369465 5342248 5437630 5359501 5374895
6101E374895m0979p5550N021m545n6985l9548l6294j021J18495j1540j64658p739
$$ 5374895 5333916 5258366 5263387 5258842 5201857 5162309 5126015 5124994 5243489 5231949 5067291 5059552
6089E059552N5269n9550k2835Q012j28005p5472J84502o7073q7208j13547p9775
$$ 5059552 5114821 5055271 5032436 5040448 4912443 4836971 5021473 4954400 4867192 4753645 4673870
6078D673870j19101j6480O0067m7313M5219j04114j26222N8324k07361J25257
$$ 4673870 4554769 4538289 4598356 4551043 4596262 4492148 4365926 4424250 4216889 4342146
6068D342146J47344p5805P850O1643m7515M8932Q9124r0684j61108Q7146L8537
$$ 4342146 4489490 4413685 4421535 4483178 4435663 4484595 4573719 4483035 4321927 4409073 4447610
6057D447610l9881J65455L676p5658m7166m7202k8075O9634p6987j0954J57987
$$ 4447610 4407729 4573184 4576860 4501202 4454036 4406834 4378759 4448393 4371406 4360452 4518439
6046D518439k825j18122p019J06266J05903m4890j27796J74754Q9406J29196o8575
$$ 4518439 4515614 4397492 4390473 4496739 4602642 4557752 4429956 4604710 4694116 4823312 4754737
6035D754737j15381J41524P3275M0566K8226J00381j00474J12913J8845O6526
$$ 4754737 4639356 4780880 4854155 4894721 4922947 5023328 4922854 5035767 5054612 5121138
6025E121138J17359K87137J25431O312Q3868k63067J1788n1989L9799P4512j35125
$$ 5121138 5238497 5525634 5651065 5657377 5741245 5478178 5489966 5437977 5477776 5552288 5417163
6014E417163j17325r0885p0933k0291M8792n935j03977p1326J22356O9474N140
$$ 5417163 5299838 5208953 5138020 5117729 5166521 5160586 5056609 4985283 5107639 5177113 5182253
6003E182253N9479L7791R3302m0826P9269r4335j61973k53632k17520m4878l5509
$$ 5182253 5241732 5279523 5372825 5331999 5411268 5316933 5154960 4901328 4683808 4638930 4603421
5992D603421N5571J4650p3247j09453k2122j0796m5211j07035O3315R1566j46918
$$ 4603421 4658992 4673642 4600395 4490942 4468820 4458024 4412813 4305778 4369093 4460659 4313741
5981D313741k5563J1435k6163N8366Q3886J07537J9426N8394p9971M7294J21620
$$ 4313741 4288178 4299613 4273450 4331816 4415702 4523239 4542665 4601059 4521088 4568382 4690002
5970D690002Q7907j32046M5736Q2771J81984K12311J01627j6287J46358J79472
$$ 4690002 4777909 4645863 4691599 4774370 4956354 5168665 5270292 5254005 5400363 5579835
5960E579835Q6450n3856q0990p3804L0169L2516o9994j65404j33836j0970j3540
$$ 5579835 5666285 5612429 5531439 5457635 5487804 5520320 5450326 5284922 5151086 5140116 5126576
5949E126576J5901j939j0688l446J39367r3247J73296J40623K8142K8928j40874
$$ 5126576 5142477 5140538 5129850 5126404 5265771 5172524 5345820 5486443 5514585 5543513 5402639
5938E402639m7272j24501o7434j39642j9160j58668p410k3332j91309j27441j79074
$$ 5402639 5355367 5230866 5163432 5023790 5004630 4845962 4838552 4815220 4623911 4496470 4317396
5927D317396j66225j21626J42581m0159o5847j27270Q881L1722o5888k03795r7231
$$ 4317396 4151171 4029545 4172126 4131967 4066120 3938850 3947731 3979453 3913565 3709770 3612539
5916C612539J9445J59924M7743k8948K7340P0238k0087j48992m099J7025m5450
$$ 3612539 3631984 3791908 3839651 3810703 3838043 3908281 3888194 3739202 3735103 3752128 3706678
5905C706678o0487q115j23474p8829k1043Q5189n4959L6072N9417q7651M1528
$$ 3706678 3646191 3638076 3514602 3435773 3414730 3499919 3444960 3481032 3540449 3452798 3494326
5894C494326O6654J3193J1497q9835J68620K8413k21355O8001j17650j9223J85770
$$ 3494326 3560980 3574173 3585670 3495835 3664455 3692868 3471513 3539514 3421864 3402641 3588411
5883C588411K5693r8294m2474p0871J5240r6806L5711N0189j46332Q2907j14270
$$ 3588411 3614104 3515810 3473336 3402465 3417705 3320899 3356610 3406799 3260467 3343374 3229104
5872C229104q5936J191j07094N2054J48641j95954N0310o6601j93998P7078J39231
$$ 3229104 3143168 3144359 3037265 3089319 3237960 3042006 3092316 3025715 2831717 2908795 3048026
5861C048026j8010n6027P6852K5300k2601P518m771L9651q0064j56088J20163
$$ 3048026 3030016 2973989 3050841 3076141 3053540 3061058 3056287 3095938 3015874 2859786 2979949
5850B979949n7163n6642M9655P0302j9615m0325p5966r5157j25703j31260L5035
$$ 2979949 2922786 2866144 2915799 2986101 2966486 2926161 2850195 2755038 2629335 2498075 2533110
5839B533110L632j16184N4796L8440n7728J2387k4001M6762R9110k05430J47253
$$ 2533110 2536742 2420558 2475354 2513794 2456066 2468453 2444452 2491214 2590324 2384894 2532147
5828B532147j3894j92090p5832P9178N1548n305k2829j777N4644r3820o9137p2899
$$ 2532147 2518253 2326163 2250331 2329509 2381057 2375752 2352923 2351146 2405790 2311970 2242833 2169934
5816B169934L3954j1271J73414j9674n92l5613j31536N0452J0283k221J7969j8338
$$ 2169934 2203888 2192617 2366031 2346357 2345765 2310152 2178616 2229068 2239351 2237130 2255099 2236761
5804B236761O0787q8766m5128J55786O3983K73506K32137J47354R2441R459j99135
$$ 2236761 2297548 2208782 2163654 2319440 2383423 2656929 2889066 3036420 3128861 3138320 2939185
5793B939185j26777l86819k24422j66160p4713j26785j86098R2417M2898L9967
$$ 2939185 2812408 2425589 2201167 2035007 1960294 1833509 1647411 1739828 1782726 1822693
5783A822693j60959j6789P2508q4284m3977P5596j82760n5969M4694m8084Q7453
$$ 1822693 1661734 1644945 1717453 1633169 1589192 1664788 1482028 1426059 1470753 1422669 1510122
5772A510122o3058N960p7513j039J47305N469k3870j56960J21483J3347Q3248
$$ 1510122 1447064 1453024 1375511 1374472 1521777 1527246 1503376 1346416 1467899 1481246 1564494
5761A564494j25677k0772j65562N1028Q8487l1874M4037O6292L444j86008P5813
$$ 1564494 1438817 1418045 1252483 1303511 1391998 1360124 1404161 1470453 1473897 1287889 1363702
5750A363702Q7963K2702r7056O5019K9835n2105n8250N4531j8992q5430l0810
$$ 1363702 1451665 1474367 1377311 1442330 1472165 1420060 1361810 1416341 1397349 1311919 1281109
5739A281109J0652J0103Q4620L4555j26489L2294n1672q4302l0615n4421o5595
$$ 1281109 1291761 1301864 1386484 1421039 1294550 1326844 1275172 1190870 1160255 1105834 1040239
5728A040239R1987J68495O4897L3067j6805K896k8358n1485o6558K1591L1838
$$ 1040239 1132226 1300721 1365618 1398685 1381880 1384776 1356418 1304933 1238375 1259966 1291804
5717A291804R7980L0083j48942j17998N7598O8231j24688K4920k0645N9573K7424
$$ 1291804 1389784 1419867 1270925 1152927 1210525 1278756 1154068 1178988 1158343 1217916 1245340
5706A245340Q587l5048j37238N5299J02491j3344k1931K75383n4119m1347K8108
$$ 1245340 1253927 1218879 1081641 1136940 1239431 1226087 1204156 1479539 1425420 1384073 1412181
5695A412181l942J33095Q580R2777q2466j79482o1254M9546p6642j7816J9352
$$ 1412181 1408239 1541334 1549914 1642691 1560225 1380743 1319489 1369035 1292393 1274577 1293929
5684A293929j128P9386j28806R377N0810j2968k1778q4360Q5960n2063k6033j5063
$$ 1293929 1292801 1372187 1243381 1252758 1303568 1290600 1268822 1184462 1270422 1218359 1192326 1177263
5672A177263P6497O4234r1848k491R5439O7529q2028m1756l6405k8960J3338J80406
$$ 1177263 1253760 1317994 1226146 1223655 1319094 1386623 1304595 1262839 1226434 1197474 1210812 1391218
5660A391218p2801j04082K3678M5903r8937N3197P4817P3336Q7702N8985j30929
$$ 1391218 1318417 1214335 1238013 1283916 1184979 1238176 1312993 1386329 1474031 1533016 1402087
5649A402087j50107P922j22130p7378j2194J18728O8431L3171j16789j00995J51156
$$ 1402087 1251980 1259902 1137772 1060394 1048200 1166928 1235359 1268530 1151741 1050746 1201902
5638A201902O8683L5643O0999q890j16562k3043O0051k7485n121J9092q3120j4684
$$ 1201902 1270585 1306228 1367227 1358337 1241775 1218732 1278783 1251298 1246177 1265269 1182149 1167465
5626A167465O2151J2914m0114l0022m6909L8847r0557J9595J0355n8747J10212
$$ 1167465 1229616 1242530 1202416 1172394 1125485 1164332 1073775 1093370 1103725 1044978 1155190
5615A155190j6044j14357J7589O9177j58325L2918K3192O2700j11407J10108j3424
$$ 1155190 1139146 1024789 1042378 1111555 953230 986148 1009340 1072040 960633 1070741 1057317
5604A057317l4058r713J49716o0403q3144q0157p7686K01958o738j10329J69456
$$ 1057317 1023259 1013546 1163262 1102859 1019715 939558 861872 1063830 1057092 946763 1116219
5593A116219L3319q9122p0268R940L3146r5086n3002N759J01823k9571k2786M2805
$$ 1116219 1149538 1060416 990148 1000088 1033234 938148 885146 890905 992728 963157 940371 983176
5581I83176Q9705n225Q6016m1574K2058p0249j32198J47540R8218K9008j19439
$$ 983176 1072881 1067656 1153672 1112098 1134156 1063907 931709 1079249 1177467 1206475 1087036
5570A087036j98484j34475M6095K9511N6639K18919r2446p0998n2109q179O7437
$$ 1087036 888552 754077 800172 829683 886322 1105241 1012795 941797 889688 881509 948946
5559I48946N8356P3582n1158N6060J45493j65350n358l2784m2854K8816Q0577
$$ 948946 1007302 1080884 1029726 1085786 1231279 1065929 1060571 1027787 984933 1013749 1094326
5548A094326M595n7250m8174L4968m3667n0476J15260n3540p8318M417J13785
$$ 1094326 1098921 1041671 993497 1028465 984798 934322 1049582 996042 917724 922141 1035926
5537A035926N4833j54732O2716P6565n749O8726j0435j51899n6666o8979K527
$$ 1035926 1090759 936027 998743 1075308 1069559 1138285 1127850 975951 919285 850306 852833
5526H52833J52884J18542n5288N5765k9673r6158J12449l235J3389j04400j9265
$$ 852833 1005717 1124259 1068971 1124736 1095063 998905 1111354 1108119 1121508 1017108 997843
5515I97843K4362o8725J36991r6023M9053l7234r4704M4400J10544j14630M8970
$$ 997843 1022205 953480 1090471 994448 1043501 1006267 911563 955963 1066507 951877 1000847
5504A000847n3729n8585J36602K3991N3222M0967j72952r0252J36243Q9595R2199
$$ 1000847 947118 888533 1025135 1049126 1102348 1143315 970363 880111 1016354 1105949 1198148
5493A198148L5886J01442j8383J45405j69278K835K1085o6824J11418J09836K0182
$$ 1198148 1234034 1335476 1317093 1462498 1293220 1296055 1317140 1250316 1361734 1471570 1491752
5482A491752n09Q494J45615j3873K3652M0610m5005J37656j2271j28747P9913
$$ 1491752 1491243 1499737 1645352 1631479 1655131 1695741 1650736 1788392 1776121 1647374 1727287
5471A727287Q2274J54750j5443q17P5279q2538n5303j35454o4121Q4041l7695
$$ 1727287 1809561 1964311 1948868 1948051 2023330 1940792 1885489 1750035 1685914 1769955 1732260
5460A732260k9405n6111K2193q8611N5973j59116M6234m4352j33128P7467j15812
$$ 1732260 1702855 1646744 1668937 1580326 1636299 1477183 1523417 1479065 1345937 1423404 1307592
5449A307592J4677J01290j2691q4021p289J08433j7953P0117p6382N0073n5167
$$ 1307592 1322269 1423559 1410868 1326847 1319558 1427991 1410038 1480155 1403773 1453846 1398679
5438A398679M7081J10037K0689N654o7980J0812J85446L5713j19076J82583L7497
$$ 1398679 1445760 1555797 1576486 1582140 1514160 1524972 1710418 1746131 1627055 1809638 1847135
5427A847135L4618o178J23450n5495p537q722L6914L4301r7713r1543m9967R2932
$$ 1847135 1881753 1875575 1999025 1943530 1935993 1927271 1964185 1998486 1900773 1809230 1759263 1852195
5415A852195r4150L16R7109r7411K07105l2856P2082p0649r1871M5889j3009n2673
$$ 1852195 1758045 1758361 1855470 1758059 1965164 1932308 2004390 1933741 1841870 1887759 1874750 1822077
5403A822077l0502J47322m3091M962l8257j94986n098p2779K7712j7532L7330
$$ 1822077 1791575 1938897 1895806 1900768 1862511 1667525 1662427 1589648 1617360 1599828 1637158
5392A637158J31991j2285p2323K931L6517j54056q172J28936j13162l9143M8766
$$ 1637158 1769149 1756864 1684541 1687472 1723989 1569933 1561761 1690697 1577535 1538392 1587158
5381A587158K9603O8054R3405n7666k6136J70479P6511j05082l9664P0766k3275
$$ 1587158 1616761 1684815 1778220 1720554 1694418 1864897 1941408 1836326 1796662 1867428 1844153
5370A844153P9189P6114R110P5935L8228K4188Q8562O9762N188P4136J8092l0474
$$ 1844153 1923342 1999456 2008566 2084501 2122729 2146917 2235479 2305241 2310429 2384565 2402657 2372183
5358B372183l8224j28758p3258q5142k056K7576J0069l3176Q5627K9618k01124
$$ 2372183 2333959 2205201 2131943 2046801 2044745 2072321 2082390 2049214 2134841 2164459 1963335
5347A963335p7256q614N682j91629P5820R8788j0308q4818p0288j7508J256j6263
$$ 1963335 1886079 1877465 1883147 1691518 1767338 1866126 1855818 1771000 1700712 1683204 1684460 1668197
5335A668197m1478J46088j33201n9629N9489M3778L2634q2903j8710m9721J28910
$$ 1668197 1626719 1772807 1639606 1579977 1639466 1683244 1715878 1632975 1614265 1564544 1693454
5324A693454k0500j03934J43657N6076q0148P4089r3634q7926J23416K4637L2002
$$ 1693454 1672954 1569020 1712677 1768753 1688605 1762694 1669060 1581134 1704550 1729187 1761189
5313A761189R877P6722N459n0707N7929J10139J32258r1659r7391Q2456m0741
$$ 1761189 1771066 1847788 1853247 1802540 1860469 1970608 2102866 2011207 1913816 1996272 1955531
5302A955531O4121q8449R4979q0028L5466J67289j1997j21362q4025J2823J4614
$$ 1955531 2019652 1931203 2026182 1946154 1981620 2148909 2136912 2015550 1931525 1944348 1958962
5291A958962J26888l1354q3358n3294m9285M0016n4773r9348N1604L3034l3830
$$ 1958962 2085850 2054496 1971138 1917844 1868559 1908575 1853802 1754454 1806058 1839092 1805262
5280A805262L8189r1963L5360L1902j01305J22652R5044J0449N995q671j856Q5572
$$ 1805262 1843451 1751488 1786848 1818750 1717445 1840097 1935141 1945590 1951585 1942914 1941058 2026630
5268B026630O3521O2148N6148o5539k5189K08462j39921m9455J27237n132k8153
$$ 2026630 2090151 2152299 2208447 2142908 2117719 2326181 2186260 2136805 2264042 2258910 2230757
5257B230757j44721O441J8164j9530k25618m9370l5764M16m4247m9749R8273n6983
$$ 2230757 2086036 2092477 2110641 2091111 1865493 1816123 1780359 1780775 1736528 1686779 1785052 1728069
5245A728069N7212r2382o213n1251k5489M8177o2403J0031n9521L7201J07865
$$ 1728069 1785281 1692899 1686686 1635435 1609946 1658123 1595720 1605751 1546230 1583431 1691296
5234A691296J214r1510j80756K236J29210j0219j761m3167n6946O4441m5455Q5048
$$ 1691296 1692510 1601000 1420244 1422480 1551690 1541471 1539710 1496543 1439597 1504038 1458583 1543631
5222A543631O3875n1964J20166j4523K7344o0420J12056J8638K0027J70355o5589
$$ 1543631 1607506 1555542 1675708 1661185 1688529 1628109 1740165 1758803 1778830 1949185 1883596
5211A883596L535K9232L5375J25420M6410L1575P0999K2301J31828M9055R917
$$ 1883596 1887131 1916363 1951738 2077158 2123568 2155143 2226142 2248443 2380271 2429326 2439243
5200B439243R4725P3355k959j01089M0488l8277l1709k6931n5008O1734j06677
$$ 2439243 2533968 2607323 2604364 2503275 2543763 2505486 2473777 2446846 2391838 2453572 2346895
5189B346895j96339j6967K1863J24090R9010p0831j35009l3075q779l3974j25579
$$ 2346895 2150556 2133589 2155452 2279542 2378552 2307721 2172712 2139637 2130858 2096884 1971305
5178A971305j07052P0705m0291q3623M0669l370p4026j81871M4049J67769r9214
$$ 1971305 1864253 1934958 1894667 1811044 1851713 1848343 1774317 1592446 1636495 1804264 1705050
5167A705050j18822p7838r5075o423R37M1435Q3831j62454l2958K2936o9880n0553
$$ 1705050 1586228 1508390 1413315 1406892 1407829 1449264 1533095 1370641 1337683 1360619 1290739 1240186
5155A240186L1270J1599K5868k6005L0554L5649n3683P6196L5106o2262R1538
$$ 1240186 1271456 1283055 1308923 1282918 1313472 1349121 1295438 1371634 1406740 1344478 1436016
5144A436016M8118R711Q4225j11689N1589R5367j64298k1229L4621J14637m5896
$$ 1436016 1484134 1493845 1578070 1466381 1517970 1613337 1449039 1427810 1462431 1577068 1531172
5133A531172M4075q7006j16217O9347J75880q2211J0996M2312j09223M6152R1311
$$ 1531172 1575247 1488241 1372024 1441371 1617251 1535040 1546036 1588348 1479125 1525277 1616588
5122A616588m8980j99454j38817J32740j4385l9154j3352Q606j64811j65687J49621
$$ 1616588 1567608 1368154 1229337 1362077 1347692 1308538 1295186 1303792 1138981 973294 1122915
5111A122915J33477k374j31688j52737M1695N3867J8780q0974m5513P2497j13891
$$ 1122915 1256392 1254018 1122330 969593 1011288 1065155 1083935 1002961 957448 1029945 916054
5100I16054j9655n3948n8543j44067K7541N1035j5993r7612N1737O8892k385J12569
$$ 916054 896399 842451 783908 639841 667382 718417 702424 604812 656549 725441 723056 835625
5088H35625k9694q4713J25773j12414L3161M7287j03784J2025l4377n7216N7602
$$ 835625 805931 721218 846991 734577 767738 815025 711241 723266 688889 631673 689275
5077F89275P2681J7860J414j44401O2176L4106j00450j0903L839Q8843N041J4685
$$ 689275 761956 779816 781230 636829 699005 733111 632661 621758 625597 714440 719481 734166
5065G34166o5258K9251J670K7936k9406q398o0809O0030O049N0095L7759l6434
$$ 734166 668908 698159 699829 727765 698359 689961 629152 689182 695231 745326 783085 746651
5053G46651k4458l1889j02590Q112J74454l0326P2619j1716n8384m1522R3561
$$ 746651 722193 690304 587714 595826 770280 739954 812573 800857 742473 700951 794512
5042G94512K3333K4199k07783O080O0223r6337R7496Q5114o5330J09838k7959
$$ 794512 817845 842044 634261 640341 700564 604227 701723 786837 721507 831345 803386
5031H03386R8194J392K3410J63507J12024K43975J07428J46002K5697k0116j47111
$$ 803386 901580 902972 926382 1089889 1201913 1445888 1553316 1699318 1725015 1704899 1557788
5020A557788r7783j84308p3911n6760k36324o9521L9976p8698q4650n7092J96199
$$ 1557788 1460005 1275697 1201786 1145026 908702 839181 879157 800459 715809 658717 854916
5009H54916N2372j12106j22766P3645j0403P7195k3397r1226J1004O4177N0568
$$ 854916 907288 795182 672416 746061 735658 812853 789456 698230 709234 773411 823979
4998H23979M5732J22784K8019j74268j26992n919q0699J67391K5436L8964k684
$$ 823979 869711 992495 1020514 846246 719254 713335 632636 800027 825463 864427 861743
4987H61743m2062n1774J0545J00584J18520j59007j90929J11936n4583M8085K7303
$$ 861743 819681 767907 778452 879036 997556 838549 647620 759556 704973 753058 780361
4976G80361O4302K3236N6451J23447j1399j04945J6752J66500m8133o4762n6653
$$ 780361 844663 867899 924350 1047797 1036398 931453 948205 1114705 1066572 1001810 945157
4965I45157K2315l3554M1133K8287O6880Q4066P1571l7114L5111o3261J24169
$$ 945157 967472 933918 975051 1003338 1070218 1154284 1225855 1188741 1223852 1160591 1284760
4954A284760J0624l6550K6013K7196Q0859p5751L7435M157J25560L14834R1692
$$ 1284760 1295384 1258834 1284847 1312043 1392902 1317151 1354586 1358743 1484303 1799137 1890829
4943A890829J82998J86745K23454p080j45520j70928j79653n8536n7251k5574
$$ 1890829 2073827 2260572 2484026 2476946 2331426 2160498 1980845 1922309 1865058 1839484
4933A839484m7989j51814m8893M7010M0110J1517k9859O4503m211o5214j95221
$$ 1839484 1791495 1639681 1590788 1637798 1677908 1689425 1659566 1724069 1719858 1654644 1459423
4922A459423m3910P2594J15660p0672o5271O2067n2901P6310J03534q156j6036
$$ 1459423 1415513 1488107 1603767 1533095 1467824 1529891 1476990 1553300 1656834 1648678 1632642
4911A632642j5119k512Q8152N607K6639J11336j21021n2472l6474q595J90721
$$ 1632642 1617523 1615011 1703163 1708770 1735409 1846745 1725724 1673252 1636778 1628183 1818904
4900A818904j0385n0846K15276p9807O7590L644N1010J18613j247k6517M7958
$$ 1818904 1808519 1757673 1972949 1893142 1960732 1964376 2015386 2133999 2132752 2106235 2154193
4889B154193K8690K5124m392J21367j26735l5829J9811l6531P5889J36044M2896
$$ 2154193 2182883 2208007 2203615 2324982 2198247 2162418 2182229 2145698 2221587 2357631 2400527
4878B400527q5376q675m5825L0636p8091o4133M1520L4263q2300K9472k7094M3525
$$ 2400527 2315151 2306476 2260651 2291287 2213196 2149063 2190583 2224846 2142546 2172018 2144924 2188449
4866B188449m6810q4627r7741J7434P744N8745N837L3772r5092j53259R113m8994
$$ 2188449 2141639 2057012 1959271 1976705 1984449 2043194 2049031 2082803 1987711 1834452 1843565 1794571
4854A794571K45150R8481j29038n0248m6268O85k5053R0322o154J4964J08815
$$ 1794571 2039721 2138202 2009164 1958916 1912648 1913333 1888280 1978602 1972448 1987412 2096227
4843B096227J45555k8962P7678l2496j72671Q0817O5472r6937j05886L9611P0117
$$ 2096227 2241782 2212820 2290498 2258002 2085331 2166148 2231620 2134683 2028797 2068408 2138525
4832B138525P438m4316k6043j988Q5866p5785L2542j7195j77537o9654K3242K8469
$$ 2138525 2145963 2101647 2075604 2073616 2159482 2083697 2116239 2099044 1921507 1851853 1875095 1903564
4820A903564o7435o245J41785J3261o6752j70594J6339M1575R06J6912n0489j00174
$$ 1903564 1836129 1829884 1971669 1984930 1918178 1747584 1763923 1805498 1806404 1823316 1772827 1672653
4808A672653o4519j5367o6730l181P7597M0340j53239j05437L4523k1352J12803
$$ 1672653 1608134 1592767 1526037 1522856 1600453 1640793 1487554 1382117 1416640 1395288 1508091
4797A508091J0958j57745m8315L0387J21660J4664o9512m2147n2507J35939J10163
$$ 1508091 1519049 1361304 1312989 1343376 1465036 1479700 1410188 1368041 1315534 1451473 1561636
4786A561636j63467q5813j12616J28254J74401o3395j05281m1192q0354l985o9952
$$ 1561636 1398169 1312356 1199740 1327994 1502395 1439000 1333719 1292527 1212173 1208188 1138236
4775A138236J7582R162m2065M4110J24527j3405j59047n825m7919K2270N7958
$$ 1138236 1155818 1164980 1122915 1167025 1291552 1278147 1119100 1113275 1065356 1087626 1145584
4764A145584J7702p12O8524J7570j68127m8491O62j4362K6391l6306K5419r4935
$$ 1145584 1163286 1162574 1231098 1248668 1080541 1032050 1032712 1018350 1044741 1008435 1033854 938919
4752I38919K8457p6694L9461J16481O4406j4821O916K0090n9950K2134n7719N7096
$$ 938919 967376 890682 930143 1046624 1111030 1096209 1103125 1123215 1063265 1085399 1027680 1084776
4740A084776m3268o4067P7073J13363J9822N6786m5233p023J68009K21535K00267
$$ 1084776 1041508 977441 1054514 1167877 1187699 1244485 1199252 1192229 1360238 1581773 1782040
4729A782040L39632K06914J36272n0678k55949j14811p1157n2090m390k36621
$$ 1782040 2121672 2328586 2464858 2414180 2158231 2043420 1972263 1920173 1915783 1679162
4719A679162q3317J8441P5052k6893n0003q5297j21252j02950j76970j16163j9259
$$ 1679162 1595845 1614286 1689338 1662445 1612442 1527145 1405893 1302943 1125973 1009810 990551
4708I90551J7098K0323P6343m1767M5393k12802O0111P1969K9974l7711R5197
$$ 990551 1007649 1027972 1104315 1062548 1107941 895139 955250 1027219 1057193 1019482 1114679
4697A114679N050j1482P3210p1086o94r4962P9196Q2929P3660L727J5176J5708
$$ 1114679 1119729 1108247 1181457 1110371 1109677 1014715 1093911 1176840 1250500 1254227 1269403 1285111
4685A285111n3537m4449J3593L2837j5623J12543N6443k593j59790K4370J4593
$$ 1285111 1231574 1187125 1200718 1233555 1217932 1330475 1386918 1384325 1224535 1248905 1263498
4674A263498J5380R9841J4741l9008Q268M808N3448o532j1104P4492j14451K2056
$$ 1263498 1278878 1378719 1393460 1354452 1362720 1367528 1420976 1414444 1403340 1477832 1363381 1385437
4662A385437K20167j54678k3647J17564N2138j3676P7156j74299K724J34282J45157
$$ 1385437 1605604 1450926 1427279 1544843 1596981 1583305 1660461 1486162 1488886 1623168 1768325
4651A768325k6469j14589n697K9777L9151q6226j499J03134r9435l9166J5852
$$ 1768325 1741856 1627267 1621570 1651347 1690498 1604272 1602773 1705907 1606472 1567306 1583158
4640A583158J9504j2832P428Q376j64826m6456K18800L8514q0133M462j3500m093
$$ 1583158 1602662 1589830 1597258 1605634 1440808 1394352 1613152 1651666 1571533 1575995 1562495 1558402
4628A558402N425R7104N7111P292j01591N6850o4135M2278J043N617L7583J42889
$$ 1558402 1563827 1660931 1718042 1725334 1623743 1680593 1616458 1658736 1659779 1665396 1702979 1845868
4616A845868j07525L2976q1610q014j14761Q9801N3043n8379Q2040J56553L9054
$$ 1845868 1738343 1771319 1689709 1681695 1566934 1656735 1709778 1651399 1733439 1889992 1929046
4605A929046R0772j00220j01427l7509J14917M1129N2355J85940J70791J81764
$$ 1929046 2019818 1919598 1818171 1780662 1895579 1936708 1989063 2175003 2345794 2527558
4595B527558q9666J45872J70937j47206j06791j61366k26315p049q3094k21908
$$ 2527558 2437892 2583764 2754701 2607495 2500704 2339338 2113023 2105974 2022880 1800972
4585A800972j05902l7084O4403J5151n3294j36637J7639J47820l9598o1192k7381
$$ 1800972 1695070 1657986 1722389 1737540 1684246 1547609 1565248 1713068 1673470 1612278 1584897
4574A584897j53589P1419M9337Q8550j13885j3063p1189K4108K9345K8142L0059
$$ 1584897 1431308 1502727 1552064 1640614 1526729 1513666 1442477 1466585 1495930 1524072 1554131
4563A554131k255J43731n8326m5961L2869n3529o9984R4066k9695P2020n0094
$$ 1554131 1551876 1695607 1637281 1591320 1624189 1570660 1500676 1594742 1565047 1637067 1586973
4552A586973J361k0237n6891J5897k33843O5898J15116l5553K4552Q6116R4783
$$ 1586973 1588334 1568097 1511206 1527103 1293260 1359158 1474274 1438721 1463273 1549389 1644172
4541A644172q3824l1619M6528N1007n2916K8078P4750K21093J93815K18667K85335
$$ 1644172 1560348 1528729 1575257 1626264 1573348 1601426 1676176 1897269 2091084 2309751 2595086
4530B595086M72423J30035m1534j10314j61564k96537l30245l12313j47041j77987
$$ 2595086 3067509 3197544 3156010 3045696 2884132 2587595 2257350 1945037 1797996 1620009
4520A620009m2579m410J7854q0799j3709o880q932n0387n2362O4146N2808j28974
$$ 1620009 1577430 1573020 1590874 1510075 1496366 1489486 1480554 1430167 1377805 1441951 1494759 1365785
4508A365785j61287r570J24625L2075Q546j5719J80922k4956k734n2767J20284
$$ 1365785 1204498 1194928 1319553 1351628 1360174 1344455 1525377 1500421 1497687 1444920 1565204
4497A565204O0835j1713k8756n9456j28439J14598J8634j23553L3435O9390Q0594
$$ 1565204 1626039 1614326 1585570 1526114 1397675 1512273 1530907 1407354 1440789 1510179 1590773
4486A590773p5710r1932M944J17421J8461k4045K31299k7147q6865j27059J17739
$$ 1590773 1515063 1423131 1428075 1545496 1563957 1539912 1771211 1744064 1657199 1530140 1647879
4475A647879Q5725J42611J55845p6380N1481n3571q263L2336q5047Q7307k6872
$$ 1647879 1733604 1876215 2032060 1955680 2007161 1953590 1945327 1977663 1892616 1979923 1953051
4464A953051p5176Q0082j25005j0568l0305m0334J5429L2055m3303j8204k1749
$$ 1953051 1877875 1957957 1832952 1822384 1792079 1751745 1767174 1799229 1755926 1737722 1715973
4453A715973J48744l2508j4846M6960R5231k2758J4327j11224O2340m0741L5886
$$ 1715973 1864717 1832209 1817363 1864323 1959554 1936796 1951123 1839899 1902239 1861498 1897384
4442A897384J64653k2457N1486N8901R5966O0264M0921N9151P3606J27625j9145
$$ 1897384 2062037 2039580 2091066 2149967 2245933 2306197 2347118 2406269 2479875 2607500 2588355
4431B588355j38645l7953Q4963N9213J8270k8478M7601n735J40747q6993j4934
$$ 2588355 2449710 2411757 2496720 2555933 2574203 2545725 2593326 2587591 2728338 2641345 2626411
4420B626411m5039L3754K2431k5159p45j10982J7830K3170J07832N4083K077O9595
$$ 2626411 2581372 2615126 2637557 2612398 2611653 2500671 2518501 2541671 2649503 2703586 2705663 2775258
4408B775258J8467L2708q1605N7445P4482M8491M173J46542J06091R976J05465
$$ 2775258 2793725 2826433 2744828 2802273 2876755 2925246 2929419 3075961 3182052 3192028 3297493
4397C297493J42805M4178n7385K7177J06617P3226K65340R0528K58968M37732
$$ 3297493 3440298 3484476 3427091 3454268 3560885 3634111 3899451 3989979 4248947 4686679
4387D686679N35909K43983J55804j35438l39899l02086r6146o5576j84623k39398
$$ 4686679 5222588 5466571 5622375 5486937 5147038 4844952 4748806 4683230 4498607 4259209
4377D259209j34102P3425J48471l9755J93894n2358p668m1493J31209N3657J10171
$$ 4259209 4125107 4198532 4347003 4307248 4501142 4448784 4441116 4399623 4530832 4584489 4694660
4366D694660Q4216K21342J52540J09734k3159q002J86986K53711J83658J08690
$$ 4694660 4778876 5000218 5152758 5262492 5239333 5231331 5418317 5672028 5855686 5964376
4356E964376P9749Q4419K2017K14821J95569K24926R4538L05102J96629J03002
$$ 5964376 6044125 6128544 6150561 6365382 6560951 6785877 6880415 7185517 7382146 7485148
4346G485148M1642J11870Q5249L7074Q4934K61010K49139J41980K33658J75333
$$ 7485148 7526790 7638660 7723909 7760983 7845917 8106927 8356066 8498046 8731704 8907037
4336H907037K91180L79125N19696L98325N18398P46052N39166N44042N47738O40770
$$ 8907037 9198217 9577342 10097038 10495363 11013761 11759813 12298979 12843021 13390759 14031529
4326A4031529Q02965R52344Q93440J169771J428486J584722J716381J558111K167016
$$ 14031529 14834494 15786838 16680278 17850049 19278535 20863257 22579638 24137749 26304765
4317B6304765K403572L504260M139777N276047P189653J1371508K0101979M3532035
$$ 26304765 28708337 32212597 36352374 41628421 48818074 60189582 80291561 123823596
4309A23823596P2509411P0744447P052271k4916703l6283679n0891235m0719080
$$ 123823596 196333007 267077454 274129725 249213022 212929343 162038108 121319028
4302A21319028l0761644k1969143j5860708j1229606q023014m280891l088906
$$ 121319028 90557384 68588241 52727533 41497927 33474913 29194022 26105116
4295B6105116j509691j063514j023420j298372q35208r62608o12611p03536j24336
$$ 26105116 24595425 23531911 22508491 21210119 20374911 19412303 18799692 18096156 17971820
4286A7971820n74188n8394o3947o5645k67347N8276p5603J0135j74788q4240j91912
$$ 17971820 17397632 17339238 17275291 17209646 16942299 17000575 16924972 16935107 16760319 16676079 16484167
4275A6484167n5614k15547j57662l87130k30238k18768l37682m85452k50696n29408
$$ 16484167 16428553 16213006 16055344 15668214 15437976 15219208 14881526 14396074 14145378 13615970
4265A3615970q3612k05779k60238l12957k52424k95880m36924m20354k93651l49311
$$ 13615970 13532358 13326579 13066341 12753384 12500960 12205080 11768156 11347802 11054151 10704840
4255A0704840k85331l46774l09172l13037k71886k73236l39388l94736l18138
$$ 10704840 10419509 10072735 9763563 9450526 9178640 8905404 8566016 8171280 7853142
4246G853142l22649k67684l00696l55387k57159k03191j72669j10451m09510j54069
$$ 7853142 7530493 7262809 6962113 6606726 6349567 6146376 5973707 5863256 5453746 5299677
4236E299677j27430k60450j83712j21235k94690l4371o2736j18645k08239j58272
$$ 5299677 5172247 4911797 4728085 4606850 4312160 4277789 4215053 4096408 3888169 3729897
4226C729897j07655j69817p4710o6488j86359M3808P9176p0399p6579j15455k09342
$$ 3729897 3622242 3452425 3377715 3311227 3124868 3168676 3247852 3177453 3100874 2985419 2776077
4215B776077n2219M6898J03066r296m7875p6157k4961N6739p8648n4224p8537
$$ 2776077 2723858 2770756 2873822 2864526 2816651 2740494 2715533 2772272 2693624 2639400 2560863
4204B560863K5253K4430j12913k4670k624Q4828N9789L0084L7470J5461k3841
$$ 2560863 2586116 2610546 2497633 2472963 2470339 2555167 2614956 2645040 2682510 2697971 2674130
4193B674130M8125P2221J3431j54170j39648J28200q0945j22045o9026j1206p2316
$$ 2674130 2722255 2794476 2807907 2653737 2514089 2642289 2561344 2439299 2370273 2359067 2286751
4182B286751L557K7810o7796r5102J28802n0315j00254J5947K41420r0548j29990
$$ 2286751 2290308 2318118 2250322 2155220 2284022 2233707 2133453 2149400 2390820 2300272 2170282
4171B170282Q0825J08876m7525r6206N5321K23592j68468N3766J9099q254j00347
$$ 2170282 2251107 2359983 2312458 2216252 2271573 2495165 2326697 2380463 2399562 2391308 2290961
4160B290961L1702R6597J04066L0004L5607p4350K7609K5024K5096O8432K16422
$$ 2290961 2322663 2419260 2523326 2553330 2588937 2514587 2542196 2567220 2592316 2660748 2877170
4149B877170k0504j20920n7338q3445O5662K49742j18282J01738J45727J08882
$$ 2877170 2856666 2735746 2678408 2594963 2660625 2910367 2792085 2893823 3039550 3148432
4139C148432Q0474n7583M9145J70561O1030J12645J26522N3575j16417J17013
$$ 3148432 3228906 3171323 3220468 3391029 3452059 3564704 3691226 3744801 3628384 3745397
4129C745397R5621J6301J58879p0959J31641K90516N7603m2179Q384J32527J67141
$$ 3745397 3841018 3857319 4016198 3945239 4076880 4367396 4424999 4382820 4391204 4523731 4690872
4118D690872P3406J70750R5113Q1268R2837m2121O7442l1109P6529K07295m1867
$$ 4690872 4764278 4935028 5030141 5111409 5204246 5162125 5229567 5198458 5274987 5482282 5440415
4107E440415R2252j18730m5790L0199n5681J08704J25025k3037j32249p0668K9709
$$ 5440415 5532667 5413937 5368147 5398346 5342665 5451369 5576394 5553357 5421108 5350440 5380149
4096E380149O8015n0463O7707j4001j07965j39998l2120n7011K6002R297l8783
$$ 5380149 5448164 5397701 5465408 5451407 5343442 5203444 5171324 5114313 5140315 5149612 5110829
4085E110829k27350j21021M9656l7886L7565K0180K0210p1879L1117l654Q752
$$ 5110829 4883479 4762458 4812114 4774228 4811793 4831973 4852183 4780304 4811421 4807767 4816519
4074D816519J7737K1746P2799K1276K5543Q0860k4422m2298K0514J27883j4881
$$ 4816519 4834256 4856002 4928801 4950077 4975620 5056480 5032058 4989760 5010274 5138157 5123276
4063E123276J58355J45353N8397Q5028r9863P2091K01283M5717O8090P0039N9581
$$ 5123276 5281631 5426984 5485381 5570409 5470546 5542637 5743920 5789637 5857727 5927766 5987347
4052E987347O5876O7643J27468J77681q3911l2171Q5616J83113m9516R4683R5670
$$ 5987347 6053223 6120866 6248334 6426015 6342104 6309933 6395549 6578662 6529146 6623829 6719499
4041F719499J03747K24656J94049J48148J06379j06367J47072K53842J46421J25907
$$ 6719499 6823246 7047902 7241951 7390099 7496478 7390111 7537183 7791025 7937446 8063353
4031H063353J06977J90038L42723J98714K63795L59846K06901J57729K98618L00270
$$ 8063353 8170330 8360368 8703091 8901805 9165600 9525446 9732347 9890076 10188694 10488964
4021A0488964M87630N85660L83860L59631K89482n1608L32672J7323J11227J16740
$$ 10488964 10976594 11562254 11946114 12305745 12595227 12543619 12876291 12893614 13004841 13121581
4011A3121581M3815j699P2486K20388J72715K10360Q7000N9980P2748J06162m1287
$$ 13121581 13165396 13163697 13236183 13456571 13629286 13839646 13926646 13986626 14059374 14165536 14124249
4000A4124249J31665K11307O6424O1731N2020j08449P7964J32102J8525j75925
$$ 14124249 14255914 14467221 14533645 14595376 14647396 14538947 14616911 14749013 14767538 14591613
3990A4591613r5993O0576j42960q2406m7957k11768j42960j0980p9590j74164
$$ 14591613 14495620 14556196 14413236 14330830 14282873 14071105 13928145 13917165 13837575 13663411
3980A3663411j61387Q6594j02293j74294k57018k19492j25319k08125r9409j34410
$$ 13663411 13502024 13588618 13486325 13312031 13055013 12835521 12710202 12502077 12402668 12268258
3970A2268258j96495k18663j66043k79229q5401j70684q1746k41362j51342j23477
$$ 12268258 12071763 11853100 11687057 11407828 11322427 11151743 11069997 10828635 10677293 10553816
3960A0553816k49180k79649k10815j85887k22525p7632k16395j86873j32546p3347
$$ 10553816 10304636 10024987 9814172 9628285 9405760 9328128 9111733 8924860 8792314 8718967
3950H718967j81842j83771k39053r8268p4254k76339j07173j78016j44222p8218
$$ 8718967 8537125 8353354 8114301 8016033 7941779 7665440 7558267 7380251 7236029 7157811
3940G157811M1224j25842P4763j36398j28769q1487r683R2928K253K2239J18254
$$ 7157811 7199035 7073193 7147956 7011558 6882789 6801302 6791619 6884547 6886800 6909039 7027293
3929G027293R8646J23351M9234J38887J09413J52646k8928J03147L05117k5379
$$ 7027293 7125939 7249290 7298524 7437411 7546824 7699470 7670542 7773689 8078806 8053427
3919H053427J10080L3791K15726J76203L4779J30350N064p564j8830J43210J36814
$$ 8053427 8163507 8197298 8413024 8589227 8624006 8754356 8759420 8751856 8733026 8876236 9013050
3908I013050J83160j73301o1243n5277j01514j21154L8259l9609r9229j33105
$$ 9013050 9196210 9022909 8961666 8906389 8804875 8683721 8721980 8682371 8583142 8450037
3898H450037m1653j78088m3646n5808q2991j39672K0142k00342k02778P229j06085
$$ 8450037 8408384 8230296 8186650 8130842 8047851 7908179 7928321 7727979 7525201 7532430 7426345
3887G426345p1335L6488Q2218O9572O1244J42448Q1928K8977L49808J29855K22371
$$ 7426345 7355010 7391498 7473716 7543288 7604532 7746980 7828908 7857885 8207693 8337548 8559919
3876H559919J56277K80442K66402K69876L50234K88811L82104M57670M69334N06451
$$ 8559919 8716196 8996638 9263040 9532916 9883150 10171961 10554065 11011735 11481069 11987520
3866A1987520M13488M24821L79030N25445M74977N39929L99389M53263L31893
$$ 11987520 12401008 12825829 13204859 13730304 14205281 14745210 15144599 15597862 15929755
3857A5929755M83353K76362J73469L61543K29086P5950J47745K38138J24595J98021
$$ 15929755 16413108 16689470 16862939 17224482 17453568 17529518 17677263 17915401 18039996 18238017
3847A8238017K80490n6030j36570j72810o2027o0229k3495j16790k65054j69116
$$ 18238017 18518507 18462477 18325907 18153097 18091070 18030841 18007346 17890556 17625502 17456386
3837A7456386n7393j15726m2882j45009j38079j04298j76095k53785k6674K30183
$$ 17456386 17398993 17283267 17240385 17095376 16957297 16852999 16676904 16423119 16396445 16626628
3827A6626628q4041j49599n512j34900j57324r9551R5483l9444q5448o0152j7017
$$ 16626628 16542587 16392988 16387476 16252576 16095252 15995701 16091184 16051740 15966292 15906140 15889123
3816A5889123J01225k75810j54610J4205l30476k92074k03525k64301l69669k72235
$$ 15889123 15990348 15714538 15559928 15574133 15243657 14951583 14748058 14483757 14114088 13841853
3806A3841853l05101l58171k89917k35653k81004l86556k70104m43180l92262
$$ 13841853 13536752 13178581 12888664 12653011 12372007 11985451 11715347 11272167 10879905
3797A0879905m39695l67350m57568k87910k29913l42765k97340k86167k23334
$$ 10879905 10440210 10072860 9615292 9327382 9097469 8754704 8457364 8171197 7947863
3788G947863l85744j04711k31857j94625J2708k29097n4884m2489L0423K2266
$$ 7947863 7562119 7457408 7225551 7030926 7043634 6814537 6759653 6717164 6747587 6769853
3778F769853n1197k6700R969N4123O9283j3148k6685J34268O0463j416J58283
$$ 6769853 6718656 6691956 6701925 6756048 6825331 6812183 6785498 6919766 6980229 6978813 7137096
3767G137096J34733R9257L9676J65931J29004J8J93288K07359q0314R2918K58263
$$ 7137096 7271829 7371086 7410762 7576693 7705697 7705715 7899003 8106362 8026048 8118966 8377229
3756H377229J01651K41553o582R0583J6027l9228J06879l4919o1692J3735J45281
$$ 8377229 8478880 8720433 8713851 8804434 8820461 8781233 8888112 8853193 8791501 8805236 8950517
3745H950517j02940M237J2361j88593m7603j32765j49956j94916r1984j37740
$$ 8950517 8847577 8851814 8864175 8675582 8627979 8495214 8345258 8150342 8058358 7920618
3735G920618j67529j41914k56389j64759n3960k76817k58869p712k10762l01850
$$ 7920618 7753089 7611175 7354786 7190027 7136067 6859250 6600381 6592669 6381907 6080057
3725F080057j43732j84059r9751L5271j94932k84812j38926j77053j26199j8254
$$ 6080057 5936325 5752266 5652515 5687786 5492854 5208042 5069116 4892063 4765864 4747610
3715D747610q6999n0423k57319l1983o0525r6662k7347p0180j09835J0048j9271
$$ 4747610 4660611 4610188 4352869 4320886 4260361 4163699 4136352 4066172 3956337 3966385 3947114
3704C947114p6431R181Q9986M3027Q0412J80305Q307o0069J41724K5638q8938
$$ 3947114 3870683 3879864 3969850 4012877 4093289 4273594 4281901 4221832 4363556 4389194 4300256
3693D300256j6969J45094J51435J01841j48686J39619J51731L9438R3847k2708
$$ 4300256 4283287 4428381 4579816 4681657 4532971 4672590 4824321 4863759 4957606 4934898
3683D934898O0770L2114q7884N4403J77508j9663r0357N263J24230q0791J40479
$$ 4934898 4995668 5027782 4939898 4994301 5171809 5152146 5061789 5067052 5191282 5110491 5250970
3672E250970l0503n3391k2898j24751o7980m929n0604k36573r9725r2040m8707
$$ 5250970 5220467 5167076 5144178 5019427 4951447 4946518 4895914 4659341 4559616 4467576 4418869
3661D418869p4509k40201k400j44543l26893O6483N3631j51306j10662j57629
$$ 4418869 4344360 4104159 4101759 3957216 3630323 3696806 3750437 3599131 3488469 3330840
3651C330840j69517j34796n5246o8139M1101m9425j19777j7566o3880q7748j2692
$$ 3330840 3161323 3026527 2971281 2903142 2944243 2894818 2775041 2757475 2693595 2605847 2593155
3640B593155m8694l7598p9880N1558j1691r7812n8799j2189R1882l8606J74668
$$ 2593155 2544461 2506863 2426983 2478541 2466850 2369038 2310239 2298050 2389932 2351326 2525994
3629B525994n3363o8701l1495Q3208J43489o8196J265k1238J18152L1212n7583
$$ 2525994 2472631 2403930 2372435 2455643 2599132 2530936 2532201 2510963 2629115 2660327 2602744
3618B602744J8352O746R3817n6666L6362J72380l9866K759O5107r945q6962m7718
$$ 2602744 2621096 2627842 2721659 2664993 2701355 2873735 2833869 2836628 2901735 2891790 2804828 2757110
3606B757110J744K0304q2058J8729M8654M1248J41389p6684L5349j480j18190
$$ 2757110 2758854 2779158 2697100 2715829 2764483 2805731 2947120 2870436 2905785 2904305 2786115
3595B786115n3912k6686Q1580l5822p1907o0055p8431j62296j3405l5714P744
$$ 2786115 2732203 2705517 2787097 2751275 2679368 2619313 2540882 2378586 2365181 2329467 2337211
3584B337211m0683j52751n0346p1447j86926j6283J23438p4950p606j66952J1447
$$ 2337211 2296528 2143777 2093431 2021984 1835058 1818775 1942213 1867263 1859657 1692705 1704152
3573A704152j27966j73359r8443q2355q5586j3046J23598m6879k18188J3044N1353
$$ 1704152 1576186 1402827 1304384 1222029 1136443 1123397 1246995 1200116 981928 994972 1046325
3562A046325p1683Q5603P0734p1531j8l4332j84912k5826J19923j0566m5873J26525
$$ 1046325 974642 1060245 1130979 1059448 1059430 1025098 840186 814360 934283 923717 877844 1004369
3550A004369j63318o4025Q7624r6574j9556P6785q4357l2299M8881J76805N9825
$$ 1004369 841051 777026 864650 768076 748520 825305 740948 708649 757530 934335 994160
3539I94160j26033q8327k9378m112J36570N6238R3965n6418p418p8620J5118n2013
$$ 994160 868127 779800 750422 746310 882880 939118 1033083 976665 969247 890627 905745 853732
3527H53732o2995P0073J9184n9030Q5438j6809O7226J2836k5363k532J27102K2778
$$ 853732 790737 860810 879994 820964 906402 889593 956819 969655 944292 941760 1068862 1091640
3515A091640j3802r5128k6714J56693o7329j6085M3449J59209n941j9025Q0738
$$ 1091640 1077838 982710 955996 1112689 1045360 1029275 1072724 1231933 1225992 1206967 1287705
3504A287705n5340k2138Q4200J6989J33168j10562J26744J28574N8285J33004
$$ 1287705 1232365 1210227 1294427 1311416 1444584 1334022 1460766 1589340 1647625 1780629
3494A780629o0912P0644p341N7880J40256k8734P9424J25276J24354O2492Q0855
$$ 1780629 1719717 1790361 1783020 1840900 1981156 1952422 2031846 2157122 2281476 2343968 2424823
3483B424823K9452J36175Q1683P0826K11344L67562M10119M21449N45234Q67913
$$ 2424823 2454275 2590450 2672133 2742959 2954303 3321865 3731984 4153433 4698667 5566580
3473E566580J240057J418835J490845Q54540p7899m93244q42141j053253r77321
$$ 5566580 6806637 8225472 9716317 10570857 10492958 9999714 9157573 8104320 7126999
3464G126999p69839q05596o13745n80849m88430m13966l49660l23508j63531k58373
$$ 7126999 6357160 5551564 4937819 4356970 3868540 3454574 3104914 2781406 2617875 2359502
3454B359502k32935j76319j22410j04187j20881j30212p7598J0614j00150j42774
$$ 2359502 2126567 1950248 1827838 1723651 1602770 1472558 1394960 1405574 1305424 1162650
3444A162650M7860L6535O3643J4025q1693j59327j14805R9560m2656j33555r9810
$$ 1162650 1210510 1247045 1310688 1324713 1243020 1083693 968888 1068448 1025792 892237 792427
3433G92427k9246K1060P0294o6935l7968R8260j020l8338j20261j6856P1754j06195
$$ 792427 763181 784241 854535 787600 749632 847892 846872 808534 688273 671417 743171 636976
3421F36976j65100J18927O4054j10716J17158J8480O3393q037K8637q6993j29767
$$ 636976 471876 590803 654857 544141 661299 679779 743172 735135 763772 676779 547012
3410E47012j6100j13322r216j03262n0169L5001M0818O9998o2278o1727J4564
$$ 547012 530912 417590 408374 305112 254943 289944 330762 400760 338482 276755 291319
3399B91319O162j5033k1766n8738J30715m230p3959P4924p9944j6899R784n0173
$$ 291319 297481 282448 260682 201944 332659 328429 254470 329394 249450 232551 242335 192162
3387A92162J06003k070n8515r006J19372m2140j46291J1558O1919m0054M5322
$$ 192162 298165 296095 237580 228574 347946 305806 159515 171073 232992 192938 238260
3376B38260P0269j13860j08466J6528N3m8598m5962L3641K6839p3586m4962O3128
$$ 238260 308529 194669 86203 102731 102784 54186 8224 41865 68704 -4882 -49844 13284
3364A3284L8741O7820J0038m6226N8221O9090J2243k05189l762J16667j9613n5193
$$ 13284 52025 119845 129883 83657 141878 210968 223211 18022 14260 130927 111314 56121
3352E6121l5134j8449k7481O9785O7375o9425K2707R7110l6490N6739o9160J41550
$$ 56121 20987 2538 -24943 44842 112217 42792 65499 162609 126119 182858 113698 255248
3340B55248p7194j6869m1365m0380k54j40163m9031N0792J73026m2103J9271k3824
$$ 255248 178054 161185 119820 79440 79186 -60977 -110008 -59216 113810 71707 90978 67154
3328F7154M3956m4231J9661K9235n6682J91727R5166j38075m3180J8456K2444
$$ 67154 111110 66879 86540 115775 59093 250820 345986 207911 164731 183187 205631
3317B05631K6496j36445j49172M9844L9214k3819q3887N1911K7720n919J7258
$$ 205631 232127 95682 -53490 -3646 35568 11749 -72138 -20227 7493 1574 18832
3306A8832O87k1775q2614J16097j8017L2094L1289n6279P4351j27182j9977N1856
$$ 18832 19519 -2256 -84870 31227 13210 45304 76593 20314 94665 -32517 -52494 -638
3294f38P7718m2693m788J6490q998L8867n8662J01570J010m5573p3515J23739
$$ -638 77080 34387 29599 46089 37091 75958 17296 118866 119876 74303 788 124527
3282A24527N5782n8511p6028q6052J4348L0700k7294L0929m0758l4037J36811
$$ 124527 180309 121798 45770 -40282 -25934 4766 -22528 8401 -32357 -66394 70417
3271G0417J8688l3937P6652j27429P2624n3992r9336j3446o6507j9586R3704M7840
$$ 70417 89105 55168 131820 4391 77015 23023 -76313 -89759 -156266 -175852 -82148 -34308
3259c4308O962J9898j12539J0955J6046N7814m1158K4091l2173L3537O5198k8903
$$ -34308 -27346 -7448 -119987 -109032 -92986 -35172 -76330 -52239 -84412 -50875 14323 -14580
3247a4580M8114j0495r7249R2337K5632j99480M3614j4475l9966K09323J09537
$$ -14580 33534 23039 -74210 18127 43759 -155721 -112107 -126582 -166548 42775 152312
3236A52312q2634p1534L331r5183l7861J88231r4837n2053k6909K09653J50039
$$ 152312 69678 -1856 1475 -93708 -131569 56662 -38175 -90228 -117137 92516 242555
3225B42555j11309M5056o1231J8467l6283j27270n9522J32265j25262m0379j7343
$$ 242555 131246 176302 115071 133538 97255 -30015 -89537 42728 -82534 -122913 -140256
3214a40256K32902O8839k9132j6481q0094k9530M0452n5689n6626P6828M7340
$$ -140256 92646 161485 132353 115872 35778 6248 46700 -8989 -65615 11213 58553
3203E8553j2117J05910r2247m6180J29059L0574j21972L2461K8204j8572m9221
$$ 58553 46436 152346 60099 13919 142978 173552 51580 84041 112245 93673 44452
3192D4452J175l9591P5469o935K0911R6264l5449r4571J06862o3187j13054O6755
$$ 44452 45627 6036 81505 74570 95481 191745 156296 61725 168587 105400 -7654 59101
3180E9101R7568K6091m6525o231P0566K9523j12445M1420j5187l4796L5198J16156
$$ 59101 156669 182760 136235 130004 200570 230093 117648 159068 143881 109085 144283 260439
3168B60439N9775M2386q0534n8685M829O0373j09220N1586J0372J63420m031J6138
$$ 260439 320214 362600 282066 223381 228210 288583 179363 230949 241321 404741 400710 416848
3156D16848M4815R8534p692K852k6933q9706n0646j819R6951N3343N1645j19903
$$ 416848 461663 560197 552505 555357 528424 438718 388072 386253 483204 536547 588192 468289
3144D68289K8342L6083k8832N3503k2737j10423o3608J2619M2646n1464J65066
$$ 468289 496631 532714 503882 557385 534648 424225 360617 373236 415882 364418 529484
3133E29484M9304q6088J28553L5498J54644N3567q2391j08453o1589j07933j13248
$$ 529484 578788 492700 621253 656751 811395 864962 782571 674118 612529 504596 391348
3122C91348L0888K2636O4739k506j03172l0111r1017J49821J17460m5410l708
$$ 391348 422236 444872 509611 507105 403933 373822 282805 432626 550086 504676 500968
3111E00968O8498p1944k9929r6447j37074J82264K04856o0530M7842Q6753l0110
$$ 500968 569466 497522 467593 371146 234072 416336 621192 560662 608504 695257 665147
3100F65147n8976L7895O4167N0704m5955j43003j565j25192j3584m4583m6644
$$ 665147 606171 644066 708233 758937 712982 569979 568414 443222 429638 385055 338411
3089C38411P818L7196M4433q1232M0370m4540k9372O6437p627J1008P7668l7415
$$ 338411 346229 383425 427858 346626 386996 342456 313084 379521 371894 382902 460570 423155
3077D23155p4143l6759P5615N229j93322j1124k1250Q3808J04333P661j07910
$$ 423155 349012 312253 387868 393097 199775 188651 167401 251209 355542 363203 255293
3066B55293j19361l541J52560K3554j05417J9934j23526N6993J15079j21039n9141
$$ 255293 135932 132391 284951 308505 203088 223022 99496 156489 271568 150529 91388
3055I1388R8431Q068m3432j30695L6643L7884J49606j34147n3902p449n0843J7232
$$ 91388 189819 197887 154455 23760 60403 98287 247893 113746 59844 52395 1552 18784
3043A8784P4299Q2307p4421j502p9402M3882p1696K6521L6452p4233j70164O1652
$$ 18784 93083 175390 100969 99467 20065 63947 -7749 18772 55224 -19009 -189173 -127521
3031a27521Q4173N7786k0765j58768Q144Q0096j71233J17885Q4324M4467M1301
$$ -127521 -43348 14438 -6327 -165095 -156951 -76855 -248088 -130203 -45879 -1412 39889
3020C9889j8125L9184M0251r6335L1835J25457r9395L7188m2040j08399J8592
$$ 39889 21764 60948 101199 4864 36699 162156 62761 99949 57909 -50490 -31898
3009c1898L0343j4607K6997o2826l600J29355Q793Q965m1127m6857p0701J14244
$$ -31898 -1555 -16162 10835 -51991 -55591 73764 82557 91522 50395 3538 -67163 47081
2997D7081J25286k1157p0499j64341J14008k3906j74386K5738M5581O8849j48496
$$ 47081 172367 151210 80711 -83630 30378 6472 -167914 -142176 -96595 -27746 -176242
2986a76242N1377J98437o9686K4972m2781l4333J9921o0381J4939j3292J2118
$$ -176242 -124865 73572 3886 28858 -13923 -48256 -28335 -88716 -73777 -87069 -74951
2975g4951M0990J50375k2980Q980j0865j24112N0707J375m9289O3105p3364l8049
$$ -74951 -33961 116414 93434 102414 91549 -32563 18144 19519 -29770 33335 -40029 -78078
2963g8078l0644J02995L6104j49024m9071J71233L2970J5352o7634o0721j12009
$$ -78078 -108722 -5727 30377 -118647 -167718 3515 36485 51837 -15797 -76518 -188527
2952a88527J13036J63884j38088J6195P2488n1385j502k2323M7023l5566n617
$$ -188527 -75491 88393 -49695 -33500 38988 -12397 -13899 -36222 10801 -24765 -30382
2941c0382J33330m2263j12209q681p4949o7512J08114J25784M0157k0533K6359
$$ -30382 102948 60685 -51524 -60205 -135154 -202666 -94552 31232 71389 50856 77215
2930G7215j4729j01821l7665r2570m9591R739k8390Q3259O3949m9938n5990J89317
$$ 77215 62486 -39335 -77000 -169570 -219161 -209422 -237812 -154553 -90604 -140542 -196532 -7215
2918g215l9522m4527K6930J39320j22219L1710m6823J22260j25800N4064J07708
$$ -7215 -46737 -91264 -64334 74986 -47233 -15523 -62346 59914 -65886 -11822 95886
2907I5886k5195n3545n6383L4605j15196P9817J05698l1006j5239O858Q1576p8969
$$ 95886 70691 17146 -39237 -4632 -119828 -40011 65687 34681 19442 26300 107876 28907
2895B8907o1759l8087j13847R2181J77740l4266k4098P608r6060J1600M6666k2349
$$ 28907 -32852 -70939 -184786 -92605 85135 50869 26771 34379 -61681 -50081 -3415 -25764
2883b5764O6779j9839k267R0623r8951q2518K3725J6357J4083r9339J16540O5146
$$ -25764 41015 21176 18909 109532 10581 -71937 -48212 -31855 -17772 -117111 -571 64575
2871F4575j6289j16740J3464J3994k5961O3490M0546L7569J12379q4431j98184
$$ 64575 48286 -68454 -54990 -40996 -66957 -3467 37079 74648 187027 102596 -95588
2860i5588K4108p0540J04564J8997P6324j507O7354K9455j32648j66181O3579
$$ -95588 -71480 -142020 -37456 -18459 57865 56358 123712 153167 20519 -145662 -82083
2849h2083J43920j7530K252r6391p406N9087j24918L2631R0615l0909L1587P095
$$ -82083 61837 44307 46559 -49832 -57238 1849 -123069 -90438 177 -30732 855 7950
2837G950j13953K3299L9610J23307J8004j91039J23281M0948j42554j0497j2497
$$ 7950 -106003 -82704 -43094 80213 98217 -92822 30459 71407 -71147 -81644 -94141
2826i4141J7270J5359P1250j05365n1159J51982q3800n8269J25527L3790j28823
$$ -94141 -76871 -61512 9738 -95627 -146786 5196 -78604 -136873 -11346 22444 -106379
2815a06379q082M1563m3367J04367m1536O9953k9917K77K2434L108m4932q7312
$$ -106379 -114461 -72898 -116265 -11898 -53434 16519 -13398 -13121 9313 12421 -32511 -119823
2803a19823M0000P7372M6384j22735M9875J84357Q598k22260j4944l3139j13195
$$ -119823 -79823 -2451 43933 -78802 -28927 155430 164028 -58232 -73176 -106315 -219510
2792b19510O8085M1101J09595k5591o7107l6521Q0632l3475N8199N0457j43681
$$ -219510 -151425 -110324 -729 -26320 -93427 -129948 -49316 -82791 -24592 25865 -117816
2781a17816k10q8805J16659Q0344Q0307j1212n0032n5447M3194L6716k1403n193
$$ -117816 -118026 -206831 -90172 -9828 70479 59267 9235 -46212 -3018 33698 12295 7102
2769G102J8198n7009J7325Q1776j45078n386n6370N2426J46392N2028j40654P0627
$$ 7102 25300 -31709 -14384 67392 -77686 -83072 -139442 -87016 59376 111404 -29250 41377
2757D1377k2495p5026L4826P9731o1212K3394q2703N5160j49522L8053N0035n6750
$$ 41377 18882 -56144 -21318 58413 -2799 20595 -62108 -6948 -156470 -118417 -68382 -125132
2745a25132L5056K3228j02431J69792O865j11358J46777l1784O1627N3168j09573
$$ -125132 -90076 -66848 -169279 513 7378 -103980 42797 11013 72640 125808 16235
2734A6235j4291j30701R9080J91878p4980n020n7551j0283p1553J33121L8067
$$ 16235 1944 -128757 -29677 162201 87221 82201 24650 14367 -57186 75935 114002
2723A14002N0030o3369m2169m2459k1628n3320K02463M9829j7634j02122r4944
$$ 114002 164032 100663 58494 16035 -5593 -58913 143550 193379 175745 73623 -21321
2712b1321O054n301K1081K9717J01300j40001q9380N6276O8655N6130N7622j13129
$$ -21321 -15267 -20568 513 30230 131530 -8471 -97851 -41575 27080 83210 140832 27703
2700B7703r8342J14557M843l5172m997O9856q8284Q9717p8480J4757K668K7730
$$ 27703 -70639 43918 48761 13589 8592 78448 -9836 79881 1401 16158 18826 46556
2688D6556J671m5768Q6570j0800j87026m1478J10924J22635m4793J5479j7352
$$ 46556 48227 2459 89029 78229 -108797 -150275 -39351 83284 38491 53970 36618
2677C6618n9196n5820K5731P2785J22931q5253k0730M4567n9866J09739j244o281
$$ 36618 -22578 -78398 -52667 20118 143049 57796 37066 81633 21767 131506 130262 123981
2665A23981j02428K3983Q8579j9265l7007p4223k3673J1512Q8217Q4079k9025
$$ 123981 21553 45536 134115 114850 77843 3620 -20053 -8541 79676 163755 134730
2654A34730j05968Q2420r304j19289L7218p2178P0027N3244p7329j19O2250L7456
$$ 134730 28762 111182 101878 -17411 19807 -52371 17656 70900 -6429 -6548 55702 93158
2642I3158l692k3300L0607k6887J51458m0334J2724m1651p1191j5471n4176Q7827
$$ 93158 89466 66166 96773 69886 221344 181010 193734 152083 80892 65421 11245 99072
2630I9072Q4810j26208p7285M2142Q2945M3100L574O0934J3971l5917l9704J1579
$$ 99072 183882 57674 -19611 22531 105476 148576 152150 213084 227055 191138 151434 163013
2618A63013M3916k1331L4867L0629j75143Q184Q6883L3411j49456M8967J6561
$$ 163013 206929 185598 220465 251094 75951 84135 171018 204429 54973 103940 120501
2607A20501P408l9859j01266K9223R2795L1472Q18R417k269J57296J59056J33887
$$ 120501 127909 88050 -13216 16007 108802 140274 141092 150509 148240 305536 464592 598479
2595E98479j632M0114J35918j73150l01823r4521l7637M6166j93699m6189L193
$$ 598479 596847 636961 772879 599729 297906 203385 165748 211914 18215 -27974 -24781
2584b4781O5127J80481J02858k5121L6431j77273j09215P8150R6323j78391m1045
$$ -24781 40346 220827 323685 298564 334995 157722 48507 126657 222980 44589 3544
2573C544J37295q947J9722p8060P7864Q0005N2807j40002j78905P5218k4846J17356
$$ 3544 140839 131892 151614 73554 151418 231423 284230 144228 -34677 40541 15695 133051
2561A33051K9088o9056J2048j4575K0525p5444p8897J08794K12499l1157o9615
$$ 133051 162139 93083 105131 90556 111081 35637 -43260 65534 278033 246876 177261
2550A77261j37556O3974R7846M207r5333O4481n3734O5342J49344K102j8534j13062
$$ 177261 39705 103679 201525 205732 110399 174880 121146 186488 335832 337934 319400 206338
2538B06338J2641p3438J5469N9335r2645L6004O3436k0260O5985k31470R2514
$$ 206338 218979 145541 161010 220345 127700 163704 227140 206880 272865 41395 133909
2527A33909J91809p3373k1917n378K9224r3738m5592O5615J5554R6968j63863
$$ 133909 325718 252345 230428 225050 254274 160536 114944 180559 196113 293081 129218
2516A29218l9797K0452L5043n0508Q2137J02211j19058K5762J7507P969J70416
$$ 129218 89421 109873 144916 94408 176545 278756 159698 185460 202967 210936 381352
2505C81352r3631p7367Q0508Q2233J1870r6934O8502L1194m0037L8338j6424n1465
$$ 381352 287721 210354 290862 373095 384965 288031 356533 387727 347690 386028 369604 318139
2493C18139L3896p0042k3684P2854m2648l4088j4770K2621k0173J37689j7962
$$ 318139 352035 281993 258309 331163 288515 254427 239657 262278 242105 379794 361832
2482C61832j90060n2824P2223J07875O783n0744J5106J49709j00972L4346R2679
$$ 361832 171772 118948 191171 299046 305829 255085 270191 419900 318928 353274 445953
2471D45953o0223k0419q2251J6894O2688n8487J55858k3361j55589p2846J71530
$$ 445953 385730 365311 283060 299954 362642 304155 460013 436652 281063 208217 379747
2460C79747K8404Q8005P0645k3802l8687m019j35948n9950P6051O4806J55294
$$ 379747 408151 496156 566801 542999 504312 500293 364345 304395 380446 445252 600546
2449F00546m8496r2664J2294J25693j13886l569J53895n8360p2148o744M9851
$$ 600546 552050 459386 471680 597373 483487 479918 633813 575453 503305 496561 546412
2438E46412l8391J47798q3561m660M1504J35917K0682l221o9512K2634j02299
$$ 546412 508021 655819 572258 567598 609102 745019 765701 762480 692968 715602 613303
2427F13303p4887J30942k5974N7424J40452k4293j1956k2008M5111m3476p2537
$$ 613303 538416 669358 643384 700808 841260 816967 805011 783003 828114 784638 712101
2416G12101J17587l840J3201K14347q1666M2790R8176j7036l7531o5289l4911
$$ 712101 829688 825848 839049 1053396 971730 1014520 1112696 1095660 1058129 992840 957929
2405I57929R3265J4777j7907J02815K6817M8235r7069m7362J39169l0998O6600
$$ 957929 1051194 1065971 1048064 1150879 1177696 1225931 1128862 1081500 1220669 1189671 1256271
2394A256271N2938M0010k3036m3318N6849J06880L3384k7087n4881J0322O1823
$$ 1256271 1309209 1349219 1326183 1282865 1339714 1446594 1479978 1452891 1398010 1408332 1470155
2383A470155J35952M4092o3417J0483L7065Q8445K05812K52368K9384j43239l5493
$$ 1470155 1606107 1650199 1586782 1597265 1634330 1722775 1928587 2180955 2210339 2067100 2031607
2372B031607J27397p4435O9118J22684J43699R2924L7230m1952l967L0127L8717
$$ 2031607 2159004 2084569 2153687 2276371 2420070 2512994 2550224 2508272 2504305 2534432 2573149
2361B573149J96981J04432r4958K42643J63480J93831P5412L07041K70385L24416
$$ 2573149 2770130 2874562 2779604 3022247 3185727 3379558 3454970 3762011 4032396 4356812
2351D356812Q5864L60818L66913M80357N73000J093443R99087O78050K63813L33791
$$ 4356812 4442676 4803494 5170407 5650764 6223764 7317207 8316294 8994344 9258157 9591948
2341I591948J82288N03287N03409J212072J290067K239228K570416M287323O680368
$$ 9591948 9774236 10277523 10780932 11993004 13283071 15522299 18092715 22380038 29060406
2332B9060406J4945911K6983182L3102809J2242685q899161j2931100k0439194
$$ 29060406 44006317 70989499 104092308 116334993 107435832 94504732 74065538
2325G4065538j8643167j4268182j0738058p874058n399012m200603k597092j740449
$$ 74065538 55422371 41154189 30416131 22542073 17143061 12942458 10345366 8604917
2317H604917q85865j91687K37435k64336o43293q79453q12355p18193m80185l82660
$$ 8604917 7719052 7527365 7764800 7500464 6857171 5977718 5165363 4447170 3966985 3584325
2307C584325l69853l67137k16013k08327m4867p3577l6482j36427K4753j58346
$$ 3584325 3214472 2847335 2631322 2422995 2378128 2304551 2268069 2131642 2156395 1998049
2297A998049q2713N9720j71058j93480j96349j15003j21299P757n8875p7894J31649
$$ 1998049 1915336 1975056 1803998 1610518 1414169 1299166 1177867 1185624 1126749 1048855 1180504
2286A180504n2121j05133J14591j36495j66836j5006j43893k2126l6855P7630
$$ 1180504 1128383 1023250 1137841 1001346 834510 819504 675611 653485 616630 694260
2276F94260K39048j72344j24204P8329m9284J3361r5385L3272K1884q6119o3161
$$ 694260 933308 760964 636760 715089 665805 679166 583781 617053 638937 552818 489657
2265D89657K1845j6937j07243K2920J0557j05978J5264J41956n8779o8443l4747
$$ 489657 511502 494565 387322 410242 420799 314821 330085 472041 413262 344819 310072
2254C10072N5462j00926M8007P9569m5730j48204J28224j9010j21167J5731R457
$$ 310072 365534 264608 312615 392184 346454 198250 326474 307464 186297 202028 211485
2243B11485R2910j971p9828k2781m2831r0698j48463j34311K88098L5263k2751
$$ 211485 304395 302424 222596 199815 156984 66286 -82177 -216488 71610 106873 84122
2232H4122m8828r725O7919J06317m6770L1502N5773j10623l164l7053o1106N2492
$$ 84122 35294 25569 93488 199805 153035 184537 240310 129687 126523 89470 28364 80856
2220H0856n0279K5818m9778j49615K2458n7858J9649P7487M5310l8516m9916N4433
$$ 80856 30577 56395 6617 -142998 -120540 -178398 -158749 -81262 -35952 -74468 -124384 -69951
2208f9951o9378O4483J34450j03323L5341L8035q6825j04610J50532j11697j8880
$$ -69951 -139329 -74846 59604 -43719 -8378 29657 -57168 -161778 -11246 -122943 -141823
2197a41823J99153L6943p5774r7080M9151L4712j00479J26018q0238Q9372J0784
$$ -141823 57330 94273 18499 -78581 -29430 5282 -95197 30821 -49417 39955 50739
2186E0739o5991j72406m608K6572L0793q0133R7914O6368j06042P7288L5482l6797
$$ 50739 -15252 -187658 -192266 -165694 -134901 -215034 -117120 -50752 -156794 -79506 -44024 -80821
2174h0821O638j3792m8496M6173J02212K2613o6836l1289J34076l5055q6365M4878
$$ -80821 -74183 -87975 -136471 -90298 11914 34527 -32309 -63598 70478 35423 -50942 -6064
2162f064p6322m7397j0955j787K8375Q1539Q3930j39690k5266M4109o643P1657
$$ -6064 -82386 -129783 -140738 -142525 -114150 -32611 51319 -88371 -113637 -69528 -76171 -4514
2150d514R5716j35044j54234R0165O066N0779l1401l9238J24873J14974j9204
$$ -4514 91202 -43842 -198076 -107911 -101845 -51066 -82467 -121705 3168 118142 98938
2139I8938q3389k6477j18238p2172J77112k9699r6508Q20L9358r6018l9942O8098
$$ 98938 15549 -10928 -129166 -201338 -24226 -53925 -150433 -149613 -110255 -206273 -246215 -178117
2127a78117J03664n142k00812K6115N1793j16236N531J933L5512l833R2648J07778
$$ -178117 -74453 -79595 -280407 -254292 -202499 -318735 -313204 -311271 -275759 -279592 -186944 -79166
2115g9166j9219o065M2292o7661q4663J45625Q6699r8185k8009N9644j20211l535
$$ -79166 -98385 -104450 -62158 -129819 -214482 -68857 17842 -80343 -108352 -48708 -168919 -172454
2103a72454j6780J32170o5242J9748k3236j16970O090n9666J50185j5982j6321
$$ -172454 -189234 -57064 -122306 -102558 -125794 -242764 -236674 -296340 -146155 -162137 -178458
2092a78458O4692O0016j89664q8828J41538L8778J55153l4498N8127O0725j82723
$$ -178458 -113766 -53750 -243414 -332242 -190704 -151926 3227 -31271 26856 87581 -95142
2081i5142j4140l9870M5609J14361L3409k43927J63446k3615p8874M5212o5700
$$ -95142 -109282 -149152 -103543 10818 44227 -199700 -36254 -59869 -138743 -93531 -159231
2070a59231P4644M5273o6172R150K5610Q0811M4803O2898k5190J58330K42898
$$ -159231 -84587 -39314 -105486 -96336 -70726 10085 54888 117786 92596 250926 493824
2059D93824K7427p8028l6969r4046j50743n2422j6277k29288J37572l2523J051
$$ 493824 521251 443223 406254 312208 161465 109043 92766 -136522 1050 -31473 -30422
2048c0422M1089O6329j29016j9156P5540J3484j13266k7647Q5926j11104j2450
$$ -30422 10667 76996 -52020 -71176 4364 17848 -95418 -123065 -37139 -148243 -160693
2037a60693L4464J0690P2112P0957j27141J0638j3317j42664L7512J94230k0990
$$ -160693 -126229 -115539 -43427 27530 -99611 -88973 -102290 -244954 -207442 -13212 -34202
2026c4202j51943L7290O2333q885Q9252R946Q358l3834o6637J3815m2999K019
$$ -34202 -186145 -148855 -86522 -95407 -6155 3791 12149 -21685 -88322 -74507 -117506 -115487
2014a15487K9131l2326q130M8018M3352j34963k7962l8839J51269p6206O4769
$$ -115487 -86356 -118682 -126812 -78794 -35442 -170405 -198367 -237206 -85937 -162143 -97374
2003i7374j40121Q5146J06986Q5656k7963j5216k2849J4178q9341j7771o5185
$$ -97374 -237495 -152349 -45363 40293 12330 -2886 -25735 -11557 -100898 -118669 -183854
1992a83854P9870q2001j9948J07633N4655J9464n3843n5538L1854J32610o0092
$$ -183854 -103984 -185985 -205933 -98300 -43645 -24181 -78024 -133562 -101708 30902 -29190
1981b9190j40763j6361J27855K09615j00053o1482l8337j24782j18457L8396O695
$$ -29190 -169953 -186314 -58459 151156 51103 -10379 -48716 -173498 -291955 -253559 -246864
1970b46864Q2252J64610r9083j00691O961J41619m8062L047M4653k12L3156m8159
$$ -246864 -164612 -2 -99085 -199776 -192815 -51196 -99258 -96211 -51558 -51770 -18614 -66773
1958f6773p7915l5030o4745j4945J9756J20133M6324j16464r4667J26465Q6975
$$ -66773 -144688 -179718 -244463 -259408 -239652 -119519 -73195 -189659 -284326 -157861 -70886
1947g0886N0987n9721L6690N3143j3697l9286P9333j33583m0246r0244m5239k7854
$$ -70886 -19899 -79620 -42930 10213 -3484 -42770 36563 -97020 -137266 -227510 -272749 -300603
1935c00603J05361R0046J3579O4981k3625q5747L7184M4076N3810J02826k72433
$$ -300603 -195242 -105196 -91617 -26636 -50261 -136008 -98824 -54748 -938 101888 -170545
1924a70545N6509J61977j82338l4225J11032L1556Q0542P8976j83483j9773o2415
$$ -170545 -114036 47941 -134397 -168622 -57590 -26034 54508 133484 -49999 -69772 -132187
1913a32187k3753J3511O3890R4433K1954j26482m1899m3159P2894K1566p5513
$$ -132187 -155940 -142429 -78539 15894 37848 -88634 -130533 -173692 -100798 -79232 -154745
1902a54745L0762k8828J0640N8781l3302j18145L2565J07889J0062J06240l4485
$$ -154745 -123983 -152811 -142171 -83390 -116692 -234837 -202272 -94383 -84321 21919 -12566
1891a2566j20865j27321P3914K23594q4943n2091m7214P3506j44993N5133P1085
$$ -12566 -133431 -260752 -186838 36756 -48187 -100278 -147492 -73986 -218979 -163846 -92761
1880i2761l3883O6787o5299J7101O6753L221m6835Q4034L2004j16364j33688l3035
$$ -92761 -126644 -59857 -125156 -108055 -41302 -38081 -84916 -882 31122 -85242 -218930 -251965
1868b51965P5771P067L8615J2286J11964j3027n6738M1140o3584K018j02614l1849
$$ -251965 -176194 -169127 -130512 -118226 -6262 -19289 -76027 -34887 -98471 -96453 -199067 -230916
1856b30916O7012R2705k2813j52093J33814J07032L9329j42797J2752R5338L3378
$$ -230916 -163904 -71199 -94012 -246105 -112291 -5259 34070 -108727 -95975 -637 32741
1845C2741r1345j47539O4855J7433Q3858J4922O3929q0322o1775j16674P6778
$$ 32741 -58604 -206143 -141288 -123855 -39997 -25075 38854 -41468 -103243 -219917 -143139
1834a43139M8993j75436k3158R8730Q7314Q5763j19627J33521Q8764p8801j44912
$$ -143139 -94146 -269582 -292740 -194010 -106696 -20933 -140560 -7039 81725 2924 -141988
1823a41988j0857K1182M0333r921j27189P1279Q1994O5268j54876J12891L6616
$$ -141988 -152845 -131663 -91330 -101251 -228440 -157161 -75167 -9899 -164775 -51884 -15268
1812a5268J0326j39214M206J52768L949r2795O8136j00837l710j6495o7964P5696
$$ -15268 -4942 -144156 -139950 12818 16767 -76028 -7892 -108729 -112439 -128934 -196898 -121202
1800a21202M2652n0217Q912N1584j5879L8070Q3720l8986Q753k4281J7724r346
$$ -121202 -78550 -128767 -119855 -68271 -84150 -46080 37640 -1346 7407 -16874 850 -8496
1788h496j17395J299j36794k1723P8853m797J06322J66965m1074j18840J34912
$$ -8496 -125891 -124592 -261386 -283109 -204256 -209053 -102731 64234 23160 -95680 39232
1777C9232j1034k0044L8956j5552k9643j57763J9875O1476j2905L1091n4947k3950
$$ 39232 28198 8154 47110 31558 1915 -155848 -135973 -74497 -87402 -56311 -111258 -135208
1765a35208o4571n0332J75185K04878j22636k4442N4900j07492R246L3522J2281
$$ -135208 -199779 -250111 -74926 129952 7316 -17126 37774 -69718 -60472 -26950 -14669
1754a4669k0226l9348q2894Q2116J24137m9066r5478M5271L2302p0436m6403J27482
$$ -14669 -34895 -74243 -157137 -75021 49116 50 -95428 -50157 -17855 -88291 -134694 -7212
1742g212n0460j13435j01824J70560K32231k6319j20590j27206k4916L0621j9267
$$ -7212 -57672 -171107 -272931 -102371 129860 103541 -17049 -144255 -169171 -138550 -157817
1731a57817l2159J42391J04824q7671l9230J51702m6612R66J26983p5478j02402
$$ -157817 -189976 -47585 57239 -30432 -69662 82040 35428 36394 163377 87899 -14503
1720a4503j48964o188j4283J20148k1514k085K8924j0297j81869K3364J66792
$$ -14503 -163467 -169655 -183938 -63790 -85304 -87389 -58465 -68762 -250631 -227267 -60475
1709f0475l6169m8969j3508n3007J2673R8485P580N9188l6627n3243P7151L5981
$$ -60475 -96644 -145613 -159121 -212128 -199455 -100970 -93390 -34202 -70829 -124072 -46921 -10940
1697a0940o6809O6284j08604k9834q8003P6328P0151J5381P9807r2112M5800M2812
$$ -10940 -77749 -11465 -120069 -149903 -237906 -161578 -91427 -76046 3761 -88351 -42551 261
1685B61l7121o1965P393p5592O912O1944l2216K7103J60138j04472q7255R5120
$$ 261 -36860 -98825 -91432 -167024 -160112 -98168 -130384 -103281 56857 -47615 -134870 -39750
1673c9750j11154K8825O5176p4097P1275N9073J3424O9590l2597L6836J28902
$$ -39750 -150904 -122079 -56903 -131000 -59725 -652 12772 82362 49765 86601 215503
1662B15503j67831k31337R479n2649J62405R9875j9029r0180k5067P7153N8701
$$ 215503 47672 -183665 -174186 -226835 -64430 35445 16416 -73764 -98831 -21678 37023
1651C7023L0788j24971q6366J61857O8107n6543j1086J158n1802q0621R7582r676
$$ 37023 67811 -57160 -143526 18331 86438 29895 18809 19967 -31835 -112456 -14874 -24550
1639b4550j26941l0332J59359K6128j2318m0166P6621p2814j4697J13214j84083
$$ -24550 -151491 -181823 -22464 3664 -8654 -48820 27801 -45013 -59710 53504 -130579
1628a30579Q1053O7912K5464m3213j17360m5787p1408P5392r7206K25086O2842
$$ -130579 -49526 18386 43850 637 -116723 -162510 -233918 -158526 -255732 -30646 32196
1617C2196J4611K8886m1185m8663o3022n7456q9076J22622j3097k5359o3952P3496
$$ 32196 46807 75693 34508 -14155 -77177 -134633 -223709 -101087 -114184 -139543 -203495 -129999
1605a29999O6694R4092L9528K0716j20932k1028q2725o7672J25534o2154M7271
$$ -129999 -63305 30787 70315 91031 -29901 -50929 -133654 -201326 -75792 -137946 -90675
1594i0675n1208k5126m4658j6113J6382K8464R6579J9927j3036K9265l7276l6288
$$ -90675 -141883 -167009 -211667 -227780 -211398 -182934 -86355 -66428 -79464 -50199 -87475 -123763
1582a23763J09950k8302L4292n475n9580p0924O8446P092P063n8178K0107R554
$$ -123763 -13813 -42115 -7823 -13298 -72878 -143802 -75356 -68264 -61201 -119379 -99272 -89718
1570h9718J4791K3068N4800l2864L8583j5792j8615K9244m698n891N0091j2052
$$ -89718 -74927 -51859 2941 -29923 8660 -7132 -25747 3497 -1201 -7092 42999 30947
1558C0947n7199P9254N9917M0085K0713n264j72498L7069L9514o8245L1648q9738
$$ 30947 -26252 53002 112919 153004 173717 168453 -4045 33024 72538 4293 35941 -53797
1546e3797l382J33813N7266n2398q9169o2754n0047k0115R1147M0500J8153n4074
$$ -53797 -57179 76634 133900 81502 -7667 -70421 -120468 -140583 -49436 -8936 9217 -44857
1534d4857m8987l8972m2514K38806j5219m5241P3123o8128r0423o3229o0421Q266
$$ -44857 -93844 -132816 -175330 63476 48257 3016 76139 8011 -82412 -145641 -206062 -197796
1522a97796J56294M8514j03759M4071r8783M8652N4787Q8154K5144j27659l5454
$$ -197796 -41502 7012 -96747 -52676 -151459 -102807 -48020 40134 65278 -62381 -97835
1511i7835m9559J6490R2084K1935l127J50190j13633j71132j0444j51604L6972
$$ -97835 -147394 -130904 -38820 -16885 -20012 130178 16545 -154587 -165031 -316635 -279663
1500b79663O0067K07370j5237J29645j17677J5813R2665q000p4160N8961j06615
$$ -279663 -219596 -12226 -27463 102182 -15495 318 92983 84983 10823 69784 -36831
1489c6831j09631N4380o3870J06305j00413K9733m0924P7908k0563Q6483N3078
$$ -36831 -146462 -92082 -155952 -49647 -150060 -120327 -161251 -83343 -103906 -17423 35655
1478C5655r3849m7883P8469j5676r474M0482n7523Q592m6524J9629J48399r0100
$$ 35655 -58194 -106077 -27608 -43284 -52758 -12276 -69799 -61207 -107731 -88102 60297 -29803
1466b9803k1405o2154J02827n7454r325N5951j74909N6925J52456J03059n655
$$ -29803 -51208 -113362 -10535 -67989 -77314 -21363 -196272 -139347 13109 116168 110513
1455A10513K3698k0780j39094K6767o0847j08755O4323R7109J12231j15734m7551
$$ 110513 134211 113431 -25663 1104 -59743 -168498 -104175 -7066 105165 -10569 -58120
1444e8120J10546M490m9940q9363k5036J01044L7499K1035p7907O2992J37706
$$ -58120 52426 56916 6976 -82387 -107423 -6379 31120 52155 -25752 37240 174946
1433A74946j67940j63242P5052N5414l3978j8995m8516Q5446J16952k09997L8991
$$ 174946 7006 -156236 -81184 -25770 -59748 -78743 -127259 -41813 75139 -134858 -95867
1422i5867k0730n9080J10161J72945o349j47363p3115P2353M3651J7649j8849
$$ -95867 -116597 -175677 -65516 107429 101080 -46283 -119398 -47045 -3394 14255 -4594
1411d594l4794k4605m6600K7688j15268R1754k9550n1454M4120K5334k1674J24218
$$ -4594 -39388 -63993 -110593 -82905 -198173 -106419 -135969 -187423 -143303 -117969 -139643 -15425
1399a5425L0246r248q4423k3835R1522j6701n2156Q4895J2006P4018q2820j2415
$$ -15425 14821 5573 -78850 -102685 -11163 -27864 -80020 4875 16881 90899 8079 -4336
1387d336K4593p3849j21191r4067J20954J38539m2692L3175j3357q7551J34546
$$ -4336 20257 -53592 -174783 -268850 -147896 -9357 -52049 -18874 -32231 -119782 14764
1376A4764K670k3331L5503P5963O5978k0306j66568q3514p2745O1306L2207k3881
$$ 14764 17434 -5897 29606 105569 171547 151241 -15327 -98841 -171586 -110280 -78073 -101954
1364a01954J9576L783R1737R918N0498K5758o6720n4664J938J35220J957o8319
$$ -101954 -82378 -78595 13142 23060 73558 99316 32596 -22068 -20130 115090 117047 48728
1352D8728q4948j24037J13914N8413n3337R5496q5228K4555l7934p040q2230K1610
$$ 48728 -36220 -160257 -46343 12070 -41267 54229 -30999 -6444 -44378 -51418 -133648 -112038
1340a12038J56910m5448J14220m0449o7804L9209n4861n3982N1969J3600j31863
$$ -112038 44872 -576 113644 73195 5391 44600 -10261 -64243 -12274 1326 -130537
1329a30537K1946Q1485p905j4904M555o4250M8291L9084j41065Q8603J65410k61142
$$ -130537 -108591 -27106 -35011 -49915 -45360 -109610 -61319 -22235 -163300 -74697 90713 -170429
1317a70429O924n771n7390J27112J03957j560j2290k9300l6873K1942j41243J11778
$$ -170429 -163505 -169276 -226666 -99554 4403 2843 -9447 -38747 -75620 -53678 -194921 -83143
1305h3143k5554N8912K28880p3198j57561m2536P8458L7286N2751L9132L6760
$$ -83143 -108697 -49785 179095 105897 -51664 -94200 -15742 21544 74295 113427 150187
1294A50187P652r3120q6576o5880J7436N3776j09069j3011q473J02884O1880j44245
$$ 150187 157839 64719 -21857 -87737 -70301 -16525 -125594 -138605 -147078 -44194 17686 -126559
1282a26559P0522R1908j09470j4373Q1749m6386n8366P1003O8985n4168k8184
$$ -126559 -56037 35871 -73599 -87972 -6223 -52609 -110975 -39972 29013 -25155 -53339
1271e3339n4651j5239J9265J13737j44907O6693L4954N4995L9767k8826O872J1869
$$ -53339 -107990 -123229 -103964 9773 -135134 -68441 -33487 21508 61275 32449 39321 51190
1259E1190j22771m2790L4470P5130j41445r789J14796K1287J5876P9016Q6328
$$ 51190 -71581 -114371 -79901 -4771 -146216 -156005 -41209 -19922 -4046 74970 161298
1248A61298n6697m5382j80268J18361j16710j57871m6829R6814Q4438K7562N8396
$$ 161298 104601 59219 -121049 -2688 -119398 -277269 -324098 -227284 -142846 -115284 -56888
1237e6888Q67r6840p5283O6849J18867p280O9204M020K6281n0048q7415J68084
$$ -56888 -56021 -152861 -228144 -161295 -42428 -49708 19496 23516 49797 -251 -87666 80418
1225H0418j23876r1518L2152Q2470K7799n1234K6591Q0319j0411R1356M0013j29180
$$ 80418 -43458 -134976 -102824 -20354 7445 -43789 -17198 63121 52710 144066 184079 54899
1213E4899j34161K3345K19255Q1790j84398j05139N8430l7360N741m0027O3897
$$ 54899 -79262 -55917 163338 245128 60730 -44409 14021 -23339 -17598 -57625 6272
1202F272j0518o5264M1408K7222p6943M2422O0718O694m2809M1497m4508j07904
$$ 6272 -4246 -69510 -28102 -880 -77823 -35401 25317 32011 -10798 30699 -13809 -121713
1190a21713l4296p042q7089P4323Q5278J65394q002m5510m9801J20015k4614n8482
$$ -121713 -156009 -163051 -250140 -175817 -90539 74855 66853 21343 -28458 91557 66943 8461
1178H461l8839p3227J51681j07507r1154L7605j029M2765L9550m0049P4536n2946
$$ 8461 -30378 -103605 48076 -59431 -150585 -112980 -114009 -71244 -31694 -71743 2793 -50153
1166e0153m5259o299n1825P1096J40197q4725n369j3953N1982n7490Q4565o3039
$$ -50153 -95412 -101711 -153536 -82440 57757 -26968 -32337 -46290 5692 -51798 32767 -30272
1154c0272R3094Q2101j66734K4593p9769M471J28196j24974o8912J50039N3476
$$ -30272 62822 144923 -21811 2782 -76987 -72516 55680 -69294 -138206 11833 65309
1143F5309J18211j96099n6588J11341Q292j2819j49981N7732o6330j6396O79N8958
$$ 65309 183520 -12579 -69167 42174 50466 37647 -112334 -54602 -120932 -137328 -136649 -77691
$$ [...]
##END NTUPLES=NMR SPECTRUM
##END=
