##TITLE=1H_DE-80H_X3
 200.13MHz, d2o
 8 sc
 
 19ns.26.2.2025
##JCAMPDX= 6.0         $$ Bruker NMR JCAMP-DX V2.0
##DATA TYPE= NMR SPECTRUM
##DATA CLASS= NTUPLES
##ORIGIN= UXNMR, Bruker Analytische Messtechnik GmbH
##OWNER= pz
$$ XWIN-NMR		Version 3.5
$$ Thu Dec 18 10:12:27 2025 Russian Standard Time (UT+4h)  Yarkov@DPX200
##.OBSERVE FREQUENCY= 200.1313
##.OBSERVE NUCLEUS= ^1H
##.ACQUISITION MODE= SIMULTANEOUS
##.ACQUISITION SCHEME= undefined
##.AVERAGES= 8
##.DIGITISER RES= 18
##SPECTROMETER/DATA SYSTEM= spect
##.PULSE SEQUENCE= zg30
##.SOLVENT NAME= CDCl3
##.SHIFT REFERENCE= (INTERNAL, CDCl3, 0, 15.4858)
##AUDIT TRAIL= $$ (NUMBER, WHEN, WHO, WHERE, WHAT)
$$ ##TITLE= Audit trail, XWIN-NMR		Version 3.5
$$ ##JCAMPDX= 5.01
$$ ##ORIGIN= Bruker BioSpin GmbH
$$ ##OWNER= Yarkov
$$ C:/Bruker/XWIN-NMR/data/yarkov2/nmr/H-C/1/pdata/1/auditp.txt
$$ ##AUDIT TRAIL=  $$ (NUMBER, WHEN, WHO, WHERE, WHAT)
(   1,<2025-12-18 10:11:40.82 +0400>,<Yarkov>,<DPX200>,
      <created by zg, POWCHK disabled, PULCHK disabled
       configuration hash MD5:
       00 E9 B6 7A A2 85 ED C7 34 08 36 98 17 FE 4E 26
       data hash MD5: 16K
       1A 4F B4 55 DB CB 03 15 E8 70 70 CE 2B 46 9F 2A>)
(   2,<2025-12-18 10:11:45.73 +0400>,<Yarkov>,<DPX200>,
      <Start of raw data processing
       efp BC_mod = 2 LB = 0.25 FT_mod = 6 PKNL = 1 PHC0 = -5305.955 PHC1 = 10.82193 SI = 16K 
       data hash MD5: 16K
       CB 8D 8E E5 7A 5F DD BA 1D 1D 9E EA 82 30 E5 66>)
$$ ##END=
$$ 
$$ hash MD5
$$ E0 98 01 9F 93 67 BB 10 08 11 6E E8 6F 8A 22 1A
##$RELAX= 
##$RELAX= 
##$RELAX= 
##$RELAX= 
##$RELAX= 
##$RELAX= 
$$ Bruker specific parameters
$$ --------------------------
##$DU= <C:/Bruker/XWIN-NMR>
##$EXPNO= 1
##$NAME= <H-C>
##$PROCNO= 1
##$TYPE= <nmr>
##$USER= <yarkov2>
##$AMP= (0..31)
100 100 100 100 100 100 100 100 100 100 100 100 100 100 100 100 100 100 
100 100 100 100 100 100 100 100 100 100 100 100 100 100 
##$AQSEQ= 0
##$AQ_mod= 1
##$AUNM= <au_zg>
##$AUTOPOS= <>
##$BF1= 200.13
##$BF2= 200.13
##$BF3= 200.13
##$BF4= 200.13
##$BF5= 200.13
##$BF6= 200.13
##$BF7= 200.13
##$BF8= 200.13
##$BYTORDA= 1
##$CFDGTYP= 0
##$CFRGTYP= 5
##$CHEMSTR= <none>
##$CNST= (0..31)
1 1 145 1 1 1 1 1 1 1 1 1 1 1 1 1 1 1 1 1 1 1 1 1 1 1 1 1 1 1 1 1 
##$CPDPRG= <>
##$CPDPRG1= <>
##$CPDPRG2= <>
##$CPDPRG3= <>
##$CPDPRG4= <mlev>
##$CPDPRG5= <mlev>
##$CPDPRG6= <mlev>
##$CPDPRG7= <mlev>
##$CPDPRG8= <mlev>
##$CPDPRGB= <>
##$CPDPRGT= <>
##$D= (0..31)
0 0.7 0 0 0 0 0 0 0 0 0 0.03 0 0 0 0 0 0 0 0 0 0 0 0 0 0 0 0 0 0 0 0 
##$DATE= 1766038300
##$DBL= (0..7)
120 120 120 120 120 120 120 120 
##$DBP= (0..7)
150 150 150 150 150 150 150 150 
##$DBP07= 0
##$DBPNAM0= <>
##$DBPNAM1= <>
##$DBPNAM2= <>
##$DBPNAM3= <>
##$DBPNAM4= <>
##$DBPNAM5= <>
##$DBPNAM6= <>
##$DBPNAM7= <>
##$DBPOAL= (0..7)
0.5 0.5 0.5 0.5 0.5 0.5 0.5 0.5 
##$DBPOFFS= (0..7)
0 0 0 0 0 0 0 0 
##$DE= 6
##$DECBNUC= <off>
##$DECIM= 32
##$DECNUC= <off>
##$DECSTAT= 4
##$DIGMOD= 1
##$DIGTYP= 9
##$DL= (0..7)
0 120 120 120 120 120 120 120 
##$DP= (0..7)
$$ [...]
##$SUBNAM2= <"">
##$SUBNAM3= <"">
##$SUBNAM4= <"">
##$SUBNAM5= <"">
##$SUBNAM6= <"">
##$SUBNAM7= <"">
##$SUBNAM8= <"">
##$SUBNAM9= <"">
##$SW= 18.0517328524113
##$SWIBOX= (0..15)
0 0 2 0 0 0 0 0 0 0 0 0 0 0 0 0 
##$SW_h= 3612.71676300578
##$TD= 16384
##$TD0= 1
##$TE= 0
##$TE2= 300
##$TE3= 300
##$TEG= 300
##$TL= (0..7)
0 120 120 120 120 120 120 120 
##$TP= (0..7)
150 150 150 150 150 150 150 150 
##$TP07= 0
##$TPNAME0= <>
##$TPNAME1= <>
##$TPNAME2= <>
##$TPNAME3= <>
##$TPNAME4= <>
##$TPNAME5= <>
##$TPNAME6= <>
##$TPNAME7= <>
##$TPOAL= (0..7)
0.5 0.5 0.5 0.5 0.5 0.5 0.5 0.5 
##$TPOFFS= (0..7)
0 0 0 0 0 0 0 0 
##$TUNHIN= 0
##$TUNHOUT= 0
##$TUNXOUT= 0
##$USERA1= <user>
##$USERA2= <user>
##$USERA3= <user>
##$USERA4= <user>
##$USERA5= <user>
##$V9= 5
##$VALIST= <valist>
##$VCLIST= <CCCCCCCCCCCCCCC>
##$VD= 0
##$VDLIST= <DDDDDDDDDDDDDDD>
##$VPLIST= <PPPPPPPPPPPPPPP>
##$VTLIST= <TTTTTTTTTTTTTTT>
##$WBST= 1024
##$WBSW= 4
##$XGAIN= (0..3)
0 0 0 0 
##$XL= 0
##$YL= 0
##$YMAX_a= 67627
##$YMIN_a= -77477
##$ZGOPTNS= <>
##$ZL1= 120
##$ZL2= 120
##$ZL3= 120
##$ZL4= 120
##$ABSF1= 0
##$ABSF2= 0
##$ABSG= 0
##$ABSL= 0
##$ALPHA= 0
##$AQORDER= 0
##$ASSFAC= 0
##$ASSFACI= 0
##$ASSFACX= 0
##$ASSWID= 0
##$AUNMP= <proc_1d>
##$AZFE= 0.1
##$AZFW= 0.1
##$BCFW= 0
##$BC_mod= 2
##$BYTORDP= 0
##$COROFFS= 0
##$CY= -3
##$DATMOD= 1
##$DC= 0
##$DFILT= <>
##$DTYPP= 0
##$F1P= 0
##$F2P= 0
##$FCOR= 1
##$FTSIZE= 16384
##$FT_mod= 6
##$GAMMA= 0
##$GB= 0
##$INTBC= 1
##$INTSCL= 3.241238e-09
##$ISEN= 128
##$LB= 0.25
##$LEV0= 0
##$LPBIN= 0
##$MAXI= 10000
##$MC2= 0
##$MEAN= 0
##$ME_mod= 0
##$MI= 1.114404
##$NCOEF= 0
##$NC_proc= -9
##$NLEV= 6
##$NOISF1= 3.799351
##$NOISF2= 2.8
##$NSP= 0
##$NTH_PI= 0
##$NZP= 0
##$OFFSET= 15.48576
##$PC= 1
##$PHC0= -5305.955
##$PHC1= 10.82193
##$PH_mod= 1
##$PKNL= yes
##$PPARMOD= 0
##$PSCAL= 0
##$PSIGN= 0
##$REVERSE= no
##$SF= 200.130007193425
##$SI= 16384
##$SIGF1= 3
##$SIGF2= 2
##$SINO= 0.751879
##$SIOLD= 32768
##$SREGLST= <19F.Aceton>
##$SSB= 0
##$STSI= 16384
##$STSR= 0
##$SW_p= 3612.71676300578
##$SYMM= 0
##$S_DEV= 0
##$TDeff= 16384
##$TDoff= 0
##$TI= <>
##$TILT= no
##$TM1= 0
##$TM2= 0
##$TOPLEV= 0
##$USERP1= <user>
##$USERP2= <user>
##$USERP3= <user>
##$USERP4= <user>
##$USERP5= <user>
##$WDW= 1
##$XDIM= 16384
##$YMAX_p= 499316298
##$YMIN_p= -4475448
$$ End of Bruker specific parameters
$$ ---------------------------------
##NTUPLES= NMR SPECTRUM
##VAR_NAME=  FREQUENCY,     SPECTRUM/REAL,   SPECTRUM/IMAG
##SYMBOL=    X,             R,               I
##VAR_TYPE=  INDEPENDENT,   DEPENDENT,       DEPENDENT
##VAR_FORM=  AFFN,          ASDF,            ASDF
##VAR_DIM=   16384,         16384,           16384
##UNITS=     HZ,            ARBITRARY UNITS, ARBITRARY UNITS
##FACTOR=    0.220516191357247, 1,           1
##FIRST=     3099.1652071827, 0,             0
##LAST=      -513.55155582308, 0,            0
##MIN=       -513.55155582308, -4475448,     0
##MAX=       3099.1652071827, 499316298,     0
$$ Real data points
##PAGE= N=1
##DATA TABLE= (X++(R..R)), XYDATA
$$ [...]
4976A3660069j03089k550126N82279K134113j722548r80821K835842n8409k255318
4967A1541992O59938J464851j660024q6926K149854M77627j173127O49629K65121
4958A4288935j352079p0769J156048j154860n19899J402709N69321j667914J023626
4949A3675118K188340j377629j681904K173239M24164k450377k38073J753187
4941A4466065l60861r96564K248009L89560j202645l5218J536003k205171j127298
4932A2711880J385792K276218k429805m34645J337596j82633j615058Q08658J405766
4923A5263769M32036j039143M59974j07382j305653r28462P84360M42387M41139
4914A4443025j502983M36452J749263o61433r68236N93140M46844p69603q96174
$$ plain form
4976 13660069 13556980 11006854 11589133 13723246 12000698 11019877 13855719 13797310 11541992
4967 11541992 12201930 13666781 12006757 11919831 14069685 14547312 13374185 14023814 14288935
4958 14288935 12936856 12866087 14022135 12867275 12347376 13750085 14319406 12651492 13675118
4949 13675118 15863458 14485829 12803925 14977164 15401328 12950951 12712878 14466065
4941 14466065 14105204 13108640 15356649 15746209 14543564 14508346 16044349 13839178 12711880
4932 12711880 14097672 16373890 13944085 13509440 14847036 14664403 13049345 13858003 15263769
4923 15263769 15695805 14656662 15116636 15009254 13703601 12775139 13559499 14001886 14443025
4914 14443025 12940042 13376494 15125757 14464324 13496088 14089228 14536072 13766469 12870295
4905A2870295N65785M64800j500168m03430K150065r76459j092313J757798Q05740
4896A4642113k001958r94617O75211Q54714j769546n5784J672165J03397j040321
4887A2085374O92321N4480M30695j914785j52609J429934j316842n81890M85738
4878A1212416K11863O67594O66845j012587R01351j929447n88409L20766p09267
4869I741125m92329K654874L51445m14824m82723J370495n26306k027391k91477
4860I882889Q27616n59556J138170J074627j675953j009249R06122j87348L06419
4851A0703737o33343L23982k37842l0415R93710J84942k593316P54110Q69316
4842A0334881n41706j008984N87398J778043q21139k616608J077906K111572j696716
$$ plain form
4905 12870295 13436080 13900880 12400712 11997282 14147347 13170888 12078575 13836373 14642113
4896 14642113 12640155 11645538 12320749 13175463 11405917 11350133 13022298 13125695 12085374
4887 12085374 12777695 12832175 13262870 11348085 11195476 12625410 11308568 10726678 11212416
4878 11212416 11424279 12091873 12758718 11746131 12647482 10718035 10129626 10450392 9741125
4869 9741125 9248796 11903670 12255115 11840291 11357568 12728063 12201757 10174366 9882889
4860 9882889 10710505 10150949 11289119 12363746 10687793 9678544 10584666 10397318 10703737
4851 10703737 10070394 10394376 10156534 10126119 11119829 11304771 8711455 9465565 10334881
4842 10334881 9793175 8784191 9371589 11149632 10328493 7711885 8789791 10901363 9204647
4833I204647j790301J297148P30797j030327K50163K130126r6972k354589R25797
4824I266489N62724j470501n57898Q35737j370306Q01194O97006R4194n67881
4815H290758O58100L70993q79384r47032Q33077Q35508l059813L37951K948871
4806I389029O93191k093202J199134R92938j816239j193159J778995J798324k371438
4797H377573l94092K057336p47486k252637R84261J674675k18309o44615J016456
4788I853162K3820J70591m13323o72312n32249J860836j130288r17493K279197
4779A0521941R58484l210407O30661J674738o39242j392909O51116J172745j242054
4770I125073o52101J617501j91964q35990Q11986J27534o23823q08292j47952
$$ plain form
4833 9204647 7414346 8711494 9442291 8411964 8662127 10792253 10695281 8340692 9266489
4824 9266489 9829213 8358712 7800814 8636551 7266245 8067439 8764445 8858639 8290758
4815 8290758 8948858 9319851 8440467 7493435 8326512 9162020 6102207 6440158 9389029
4806 9389029 10082220 7989018 9188152 10181090 8364851 7171692 8950687 10749011 8377573
4797 8377573 7983481 10040817 9293331 7040694 8024955 9699630 9481321 8836706 9853162
4788 9853162 9876982 10047573 9634250 8961938 8429689 10290525 9160237 8242744 10521941
4779 10521941 11480425 8270018 8900679 10575417 9936175 8543266 9194382 10367127 9125073
4770 9125073 8472972 10090473 9898509 9062519 9874505 10002039 9378216 8569924 8421972
4761H421972k4147l42129O68938O93502q58822M58890Q22669p41519r33036J678852
4751I845170r96428p36243J93130P61831j227699j225579J334347J236648q22077
4742H363100P9720K52256p58093l94124R30573J70111j866650j12703J960704
4733H624894m04132o05169Q15943j53664q69496K16055L3875K04861L47990K97316
4723H508473q93864m08183l0851P06660L03785K60567m23619j225256J522809
4714H320521k00379j450654j060685J210513J178040j247524o33718J466859J26142
4705G709115j134038Q51920O81271j26364j138741q37943J306208M97347j237967
4696F570808q4660Q09704P81885P0586Q4278L62554n03801j905308k10520J282317
$$ plain form
4761 8421972 8397825 8055696 8724634 9418136 8559314 9018204 9840873 9099354 8166318 9845170
4751 9845170 8848742 8112499 8305629 9067460 7839761 6614182 7948529 9185177 8363100
4742 8363100 8442820 8695076 7936983 7542859 8473432 8643543 6776893 6664190 8624894
4733 8624894 8220762 7615593 8431536 8277872 7408376 7624431 7658306 7863167 8211157 8508473
4723 8508473 7614609 7206426 7175575 7882235 8186020 8446587 8022968 6797712 8320521
4714 8320521 8120142 6669488 5608803 6819316 7997356 6749832 6116114 7582973 7709115
4705 7709115 6575077 7426997 8108268 7981904 6843163 6005220 7311428 7808775 6570808
4696 6570808 6486148 7295852 8077737 8148323 8232601 8595155 8091354 6186046 5975526 7257843
4686G257843J84530O05705o41824J22603n34642M62587R98753n02859j716763
4677F235933m3643P70143O98395k3908r9214O09227L84090k24472k08176k91744
4667G806631k582j39765j53878j21371J001168K72438J90021r08466R65631j170753
4657G739074r59061J232269J766225o57240r03600O71888N61873r29432j569729
4648F952267J342177R41458m92521n63311Q30580L47577o27886p11238Q03407
4639H822510L00222M6180q06263L48712M36149J136805j044595M08693J36139
4630I784552p32632n64133J228636m31111r43636J065758P98405o37760o14891
4621H953188J621002l90838j171901n88458J625537o70004o21881M75223N74661
$$ plain form
4686 7257843 7442373 8048078 7406254 7528857 6994215 7456802 8455555 7952696 6235933
4677 6235933 6192290 6962433 7660828 7636920 7537706 8146933 8531023 8306551 8098375 7806631
4667 7806631 7804049 7664284 7510406 7389035 8390203 8662641 8852662 7944196 8909827 7739074
4657 7739074 6780013 8012282 9778507 9121267 8217667 8889555 9451428 8521996 6952267
4648 6952267 8294444 9235902 8743381 8180070 9010650 9358227 8730341 8019103 8822510
4639 8822510 9122732 9168912 8362649 8711361 9147510 10284315 9239720 9648413 9784552
4630 9784552 9051920 8487787 9716423 9285312 8341676 9407434 10205839 9568079 8953188
4621 8953188 10574190 10183352 9011451 8422993 10048530 9378526 8756645 9231868 9806529
4612I806529j475907p7994J665635q29309r37526M28155Q55023o7362k75189J93119
4602I285174J43429l07120N34350l21926o34409O61039l06689m1680J432901o07034
4592I838035J80173r321o51496n40103P30560K34437k48837j280646J251079M58933
4582I962814k328602Q79344K196810l74676k575357J019843J021221m33199j043104
4573H325094P12138J152228j649229K57827J113639O84288j026321o20901L54258
4564I303021R63487k577595J317896J078648j302647O72798K10132r60856q8772
4555H616112J318805P403o43394q46808K287301k61978k376050J225363J662545
4546A0989299k054242m926P23968J134157L29947j055946J050623N88798k387373
$$ plain form
4612 9806529 8330622 8252628 9918263 9088954 8151428 8579583 9434606 9367244 9092055 9285174
4602 9285174 9428603 9121483 9655833 9333907 8699498 9360537 9053848 9012168 10445069 9838035
4592 9838035 10018208 10008887 9357391 8817288 9547848 9782285 9533448 8252802 9503881 9962814
4582 9962814 7634212 8513556 10710366 10335690 7760333 8780176 9801397 9368198 8325094
4573 8325094 9037232 10189460 8540231 8798058 9911697 10595985 9569664 8948763 9303021
4564 9303021 10266508 7688913 9006809 10085457 8782810 9455608 9665740 8704884 8616112
4555 8616112 9934917 9942320 9298926 8452118 10739419 10477441 8101391 9326754 10989299
4546 10989299 8935057 8930131 9654099 10788256 11118203 10062257 11112880 11701678 9314305
4537I314305Q43215M50103j878002m7095J33615J839304p85588M96450J532787
4528A1899094m60022k373920K69397N50145j264859J51928J720222L38651J57903
4519A0988539m59559n49403K19491n1934J554273j015702O6369J016466j223151
4510A0545389j151103J843102q8567q38434j41820J445853J17957k573525m9990
4501I108862K772927N2725j960737J079307J207800K6783l80894o66176j085477
4492A0155120Q75722J484183L75899j023265q4246M62543p22657j920660J030381
4483A0633020K606220N41093k039915o91061J310908k38131m39341J237695P15580
4474A3636068j285907L25385P66218J153502k322593k7617J577243L64871j466337
$$ plain form
4537 9314305 10157520 10607623 8729621 8682526 8816141 10655445 9869857 10366307 11899094
4528 11899094 11439072 9065152 9334549 9884694 8619835 8771763 10491985 10830636 10988539
4519 10988539 10528980 9979577 10199068 10147134 11701407 10685705 10752074 11768540 10545389
4510 10545389 9394286 11237388 11148821 10310387 10168567 11614420 11732377 9158852 9108862
4501 9108862 11881789 11934514 9973777 11053084 12260884 12287667 11906773 11240597 10155120
4492 10155120 11030842 12515025 12890924 11867659 11783413 12245956 11523299 9602639 10633020
4483 10633020 13239240 13780333 11740418 11049357 12360265 12122134 11682793 12920488 13636068
4474 13636068 12350161 12675546 13441764 14595266 12272673 12245056 13822299 14187170 12720833
4465A2720833L28332j195221L35616J304246m91970K29859J513722R36901r21009
4456A4761309j284266k40060J135013j179821M44438J401012k96593P18791l06568
4447A5153255o87889m12254l21098J272483J577090k106217J305374K6211k187432
4438A3619523j026148L207402M19214j430483R62676Q50949k19200k024789J331537
4429A5690681l75587O7333J648420J75955k644153J337976J48513j275932Q17408
4420A5590614J381266l37377J09803J112247q14036k684303J893199K285862j852626
4411A6684649j47893L649857o78896k232467M09834M1307p86264J004927J283555
4402A9228609q51376j523671N9044J850755j24731q23421k45488J427393K89018
$$ plain form
4465 12720833 13049165 11853944 12189560 13493806 13001836 13231695 14745417 15682318 14761309
4456 14761309 13477043 13236983 14371996 13192175 13636613 15037625 14741032 15459823 15153255
4447 15153255 14465366 14053112 13732014 15004497 16581587 14475370 15780744 15806955 13619523
4438 13619523 12593375 15800777 16219991 14789508 15752184 16603133 16383933 14359144 15690681
4429 15690681 15315094 15382427 17030847 17206802 14562649 15900625 16049138 14773206 15590614
4420 15590614 16971880 16634503 16744306 17856553 17042517 14358214 16251413 18537275 16684649
4411 16684649 16536756 20186613 19507717 17275250 17685084 17726391 16940127 17945054 19228609
4402 19228609 18377233 16853562 16912606 18763361 18638630 17815209 17569721 18997114 19286132
4393A9286132j308870j02020K057959J115008n65680J41728R69044L83085j033620
4384B0942766K49213J437985j371346k033686K006522J298638j114067j545560
4376A9870465J073565P95088q19872m21816K748708Q74949k097442l72780J044679
4367B2695544N7913j40064K97059R94467K09975j303022K26834J008892M22440
4358B4470038n96998N68797J162712J183615j051843k12545N28864p12561J976845
4349B7316924J078149j408319j271427J930819M67658m12741j407096K139241
4341B8433208R60422k650104L88618J574307M24934p69761J763303M73009n52100
4332C0045836p01147J718474o73213m12128J119100N02420P65384J049362j35908
$$ plain form
4393 19286132 17977262 17875242 19933201 21048209 20482529 20624257 21593301 21976386 20942766
4384 20942766 21191979 22629964 21258618 19224932 21231454 22530092 21416025 19870465
4376 19870465 20944030 21739118 20919246 20497430 23246138 24121087 22023645 21650865 22695544
4367 22695544 22753457 22613393 22910452 23904919 24114894 22811872 23038706 24047598 24470038
4358 24470038 23873040 24441837 25604549 26788164 25736321 25523776 26052640 25340079 27316924
4349 27316924 28395073 26986754 25715327 27646146 28113804 27701063 26293967 28433208
4341 28433208 29393630 26743526 27132144 28706451 29131385 28361624 30124927 30597936 30045836
4332 30045836 29344689 31063163 30389950 29977822 31096922 31599342 32364726 33414088 33278180
4323C3278180m60555P45792l45307J431547K096981R58904p80418J0948J455903
4314C8391975r51783o43992L688078L389106k34952J324715M409026R70478k138009
4305D8204642j252824L10406r04049r44944R27049j60175P78262J665756R7730
4296D8721853m37481J471349J21454q00309j44574N21984L25471l33537M47269
4287D9893479J594720M81755o34034k84473J629002L85829j272308Q30142J608258
4278E4232370N47925j78763K69549M24884J799870Q43698n12214N70909J322207
4269E9320435J43532k142547K31694J516483j01898k91959K154496J322485r80359
4260F1172362n88135J803279Q82216p17161J804578J855498O0825J033257j59860
$$ plain form
4323 33278180 32817625 33563417 33218110 34649657 36746638 37705542 36925124 36936072 38391975
4314 38391975 37440192 36796200 40484278 43873384 43638432 44963147 49372173 50342651 48204642
4305 48204642 46951818 47262224 46358175 45413231 46340280 46180105 46958367 48624123 48721853
4296 48721853 48284372 49755721 49877175 49076866 48932292 49454276 49779747 49446210 49893479
4287 49893479 51488199 51969954 51335920 51051447 52680449 53066278 51793970 52624112 54232370
4278 54232370 54780295 54601532 54871081 55295965 57095835 57939533 57427319 57998228 59320435
4269 59320435 59463967 57321420 57553114 59069597 58967699 58675740 60830236 62152721 61172362
4260 61172362 60584227 62387506 63269722 62552561 64357139 66212637 66273462 67306719 67146859
4251F7146859N67406K139966J409543m912J568790K167562r1253J02139R41774
4242G5947874J298409M36925L063843K015336R49274o81276J508234O76723J618099
4233H6833441J422060N47890R74340K80224M17013p05109J829540J996172k07371
4224I3388200M32824L178842j120549k369781J08984J009811j608169j497005
4216I1523157J171772K99124j617455j213776K18449o73395j584183j151125m25059
4207H6547509q49718j882966j995482K43389j802783r49669m966q06574r07778
4198G7590962k591125j822259j113448m81056p2645j216215o72993M10624j739506
4189F8292339k798152Q08068K54644k512918j064481Q77796j787320k791537P67144
$$ plain form
4251 67146859 67714265 69854231 71263774 71258862 72827652 74995214 74903961 75006100 75947874
4242 75947874 77246283 77683208 80747051 82762387 83711661 83030385 84538619 85215342 86833441
4233 86833441 88255501 88803391 89777731 90057955 90474968 89769859 91599399 93595571 93388200
4224 93388200 93821024 96999866 95879317 93509536 93618520 94628331 93020162 91523157
4216 91523157 92694929 92994053 91376598 90162822 90381271 89707876 88123693 86972568 86547509
4207 86547509 85697791 83814825 81819343 82062732 80259949 79310280 79305314 78498740 77590962
4198 77590962 74999837 73177578 72064130 71583074 71510429 70294214 69621221 70031845 68292339
4189 68292339 65494187 66302255 66556899 64043981 62979500 63857296 62069976 59278439 60045583
4180F0045583k03358k515843j657972K467462q02511q04055J41627j146524k505625
4171E3018784L60294N46886j092959j323547L29484m93228j30151P902n01924
4162E0721541O9235r996j319481j018137k46924o3922j144816l15170K8663L78044
4152D7079037p52363p09176j97933r41533m93137M32213n40921K68881q81080
4143D3263988j316559J239262L38206m81996L09151P01528r06577r1986M92955
4134D3547972j155690j959183K101651j17599n13976m19847J390246q32921K06217
4125D2246870k33082K37526R25901M05061k034167P37568P7372j853777p71305
4116C9737967L373679R50437k565191L27252K408846j238010j836897j8106R46194
$$ plain form
4180 60045583 59842225 57326382 55668410 58135872 57333361 56529306 56670933 55524409 53018784
4171 53018784 53379078 53925964 52833005 51509458 51838942 51345714 51215563 51223465 50721541
4162 50721541 50790776 50780780 49461299 48443162 48196238 48132316 46987500 46672330 46700993 47079037
4152 47079037 46326674 45617498 45419565 44478032 43984895 44417108 43876187 44145068 43263988
4143 43263988 41947429 43186691 43524897 43042901 43352052 44053580 43147003 43055017 43547972
4134 43547972 42392282 40433099 42534750 42417151 41903175 41483328 42873574 42040653 42246870
4125 42246870 42013788 42251314 43177215 43582276 41548109 42285677 42363049 40509272 39737967
4116 39737967 43111646 44062083 41496892 41824144 44232990 42994980 41158083 41139977 42086171
4107D2086171L77075L97432j046466P30675Q2905K257611j570798Q5082Q09252
4098D4208939R9806n16033O25742L98172j103355J058813Q84791j391477l75954
4089D3889444L048605M73068j417508J146286O54580l66232K95748P60167J88821
4080D8672979r26352O85149J433418P61307j450308K883439K92300j38924r35506
4071E1277502J042758j592534J777305J018662m97955j428681K482637K249022
4063E6328716o78933j005328K034244P36982j273860J04916J027931R1691j40320
4054E7226039r9017K089085Q65888R41284k18256n3328Q59256O39927j124628
4045F1126250P86090O85333L48704m21096Q17060J017793Q84623j320137J063131
$$ plain form
4107 42086171 42463246 42860678 41814212 42544887 42627792 44885403 43314605 43399687 44208939
4098 44208939 44308745 43792712 44418454 44816626 43713271 44772084 45656875 44265398 43889444
4089 43889444 46938049 47411117 45993609 47139895 47794475 47428243 47723991 48484158 48672979
4080 48672979 47746627 48431776 49865194 50626501 49176193 52059632 52351932 52213008 51277502
4071 51277502 52320260 50727726 52505031 53523693 53025738 51597057 54079694 56328716
4063 56328716 55649783 54644455 56678699 57415681 56141821 56246737 57274668 57366359 57226039
4054 57226039 57127022 59216107 60081995 61023279 60805023 60751695 61610951 62250878 61126250
4045 61126250 61912340 62597673 62946377 62525281 63342341 64360134 65244757 63924620 64987751
4036F4987751J581119j765089j224786J229020j1414j600483O14611K982548J330909
4027F8124186k406375J721401J382333j107788j905733J670286M93977o1660p86183
4018F7124444K002586L44560m11776p79287K390924L93904j658800Q16066R63797
4009G1186418j027322j974632J904873R12559l19239R40150J117777n81647j67319
4000G1991618N63234l57008p1482q0563P18868q25019N97940k94026l4489P34366
3990G2943439K154857L32642j344274L1920M87537k055773q92414J221677J458718
3981G4338329O42204m42452J060850L4588o31769l73070k04243Q7808K34095K23091
3971G4969431P3728j327269p3555J305501k41000l61306J422768M44947r43901
$$ plain form
4036 64987751 66568870 64803781 63578995 64808015 64796601 63196118 63810729 66793277 68124186
4027 68124186 65717811 67439212 68821545 67713757 65808024 67478310 67972287 67910627 67124444
4018 67124444 69127030 69471590 69059814 68280527 70671451 71065355 69406555 70222621 71186418
4009 71186418 70159096 68184464 70089337 71001896 70682657 71622807 72740584 72158937 71991618
4000 71991618 72554852 72197844 72126362 72045799 72764667 71939648 72537588 72243562 72209073 72943439
3990 72943439 75098296 75430938 74086664 74118584 74606121 72550348 71657934 72879611 74338329
3981 74338329 74980533 74538081 75598931 75633519 75001750 74628680 74424437 74512245 74746340 74969431
3971 74969431 75043159 73715890 73642335 74947836 74706836 74345530 75768298 76213245 75269344
3962G5269344k80632m01060j313051J30425M3918J355338J002664n62417j74506
3953G5070023L79537k39918j465216N9496N8868k66683j306462K01337L17823
3944G2808805J295591k64975m04252k26632J401700J43280j446821l47045L26511
3935G3286162K47100j209558Q37371K517057m84898j983259R97067J387857n76221
3926G5018678l44675R74071J26591j048685k49386Q76518N0478L21540J345216
3917G7070346O79192j2561J078309K48057J27931q10325L67064O18993J151479
3908H0518485J728499P54998j407270K691922J400626q70093N30282J963861M936
3899H7316246K00781P48366K588611J237694J609203K77767J655698K65061J661346
$$ plain form
3962 75269344 74988712 74587652 73274601 73405026 73448944 74804282 75806946 75244529 75070023
3953 75070023 75449560 75209642 73744426 73803922 73862790 73596107 72289645 72490982 72808805
3944 72808805 74104396 73839421 73435169 73208537 74610237 74753517 73306696 72959651 73286162
3935 73286162 73533262 72323704 73161075 75678132 75193234 73209975 74207042 75594899 75018678
3926 75018678 74674003 75648074 75774665 74725980 74476594 75353112 75403590 75725130 77070346
3917 77070346 77749538 77736977 78815286 79063343 79191274 78380949 78748013 79367006 80518485
3908 80518485 82246984 83001982 81594712 84286634 85687260 84817167 85347449 87311310 87316246
3899 87316246 87517027 88265393 90854004 92091698 93700901 93978668 95634366 95899427 97560773
3890I7560773Q54685J435011K396219p38680J272336L261965J472732n85888J634756
3881A08563909J790258K840394L63317J879582J713507J34090o71548L93265k10051
3872A16796723Q63199L63079p63323m55365N82678j32832j629891j318002Q37207
3863A15143473j110275j187487j276085P73661j161305n68218m20954m14737j553355
3854A08224718N39537l0942k050108L25698J492915p38391p47357J381501N99534
3845A08997105r03317J249707Q32930K36906J80688K105776Q41192J888541J057315
3836A16486843K88906J553932K036665K44971J077212K181252R37802J144086
3828A25951669Q81894K164182O65363L35693K338077J350498j269511Q74885J907338
$$ plain form
3890 97560773 98415458 99850469 102246688 101508008 102780344 106042309 107515041 106929153 108563909
3881 108563909 110354167 113194561 113557878 115437460 117150967 117285057 116613509 117006774 116796723
3872 116796723 117659922 118023001 117259678 116804313 117386991 117254159 115624268 114306266 115143473
3863 115143473 114033198 112845711 111569626 112343287 111181982 110613764 110192810 109778073 108224718
3854 108224718 108764255 108733313 106683205 107008903 108501818 107763427 107016070 108397571 108997105
3845 108997105 108093788 109343495 110176425 110413331 110594019 112699795 113540987 115429528 116486843
3836 116486843 116775749 118329681 120366346 120611317 121688529 123869781 124807583 125951669
3828 125951669 126833563 128997745 129663108 129998801 132336878 133687376 132417865 133292750 135200088
3819A35200088M04852j88449M20303j38737J353486j19198k74082n85605J80687
3810A36253345j784530k77253J04842n21827k763346l33519n73495p70637k590820
3801A26742760j017273j521084r05280l278355k233901r93796j66563k428884
3793A14197624k977226l43797o73212m177667k846307j051356j343075k225164
3785I8559820k390424j522317k607069l680739j328987p21489k004025j916443
3777H2388327j167048j433883l331869k274540j315020o97831k925638j864780
3769F7377718j198867l22438r80981j799913j832534k77380o19966j352204j491452
3760E7501983m6295j209784k173276j410456J298038j071285N57838p4893j446402
$$ plain form
3819 135200088 135604940 135416491 135836794 135698057 137051543 136932345 136658263 136072658 136253345
3810 136253345 134468815 134191562 134296404 133774577 131011231 130677712 130104217 129333580 126742760
3801 126742760 125725487 124204403 123299123 120020768 117786867 116793071 116626508 114197624
3793 114197624 111220398 110876601 110203389 106025722 103179415 102128059 100784984 98559820
3785 98559820 96169396 94647079 92040010 88359271 87030284 86308795 84304770 82388327
3777 82388327 81221279 79787396 76455527 74180987 72865967 72168136 69242498 67377718
3769 67377718 66178851 65856413 64875432 63075519 61242985 60965605 60345639 58993435 57501983
3760 57501983 57455688 56245904 54072628 52662172 53960210 52888925 53446763 53371870 51925468
3751E1925468k087986o10985l51874k91397n86422M9243N03524m80149n31069
3742D7538353j187946L66627j67323n93223r76400J13053j666415j102448P0302
3733D2394580l12456o39036k17715J141174p31704k306959p93058K86850j704855
3724C7116821j015024m43887M56768o92937q34645j07794J70532j832273l37594
3715C2479967l53404q00680m93834l16121p02529j478103m66208M35012P7411
3706B8381511j178286k41659j05694n70554k20187l51126n02918p0503j652825
3697B3487759J20857L33678l56013p97821J482329q9374j500237N19029K70799
3688B3471006j050844j636441Q52468k32217m37131J045858L82549q6597o66445
$$ plain form
3751 51925468 49837482 49226497 48874623 48583226 47996804 48046047 48549571 48069422 47538353
3742 47538353 46350407 46717034 46549711 45956488 44980088 45093141 43426726 42324278 42394580
3733 42394580 42082124 41443088 41225373 42366547 41634843 39327884 38534826 38821676 37116821
3724 37116821 36101797 35657910 36114678 35421741 34587096 34479302 34649834 32817561 32479967
3715 32479967 32126563 31325883 30832049 30515928 29813399 28335296 27869088 28304100 28381511
3706 28381511 27203225 26961566 26855872 26285318 26065131 25714005 25211087 25140584 23487759
3697 23487759 23608616 23942294 23586281 22788460 24270789 24181415 22681178 23200207 23471006
3688 23471006 22420162 20783721 21636189 21403972 20966841 22012699 22395248 22308651 21642206
3679B1642206l13523J43857m06022m79481J004560K60333k8806j77263O05706
3670B2251567m50147n63579j242092O84268N84283K06935j290744K01079L42348
3661B0723918M2325l67593o88853J101204N0832l35613l12484J393207j124597
3652B0482346p64674J5501J41762p14812L1779J213718j71839j414357J086822
3643A9906246K06942n82155J13936n25994p62954Q92655L66310k80830Q91960
3634B0226116o08924q17845K88230P38101q26086l98435J162550O45137j758551
3625A8650293N74228J617949j562735k96235J190008J171920l228326J063259
3617A9180361K010355j6608k325861J587696Q72875q54789p95669N50471N22409
$$ plain form
3679 21642206 21328683 21472540 21066518 20587037 21591597 21851930 21823124 21645861 22251567
3670 22251567 21801420 21237841 19995749 20680017 21264300 21471235 20180491 20381570 20723918
3661 20723918 20766243 20398650 19709797 20811001 20861833 20526220 20213736 21606943 20482346
3652 20482346 19717672 19733173 19874935 19160123 19191902 20405620 20233781 18819424 19906246
3643 19906246 20113188 19531033 19644969 19118975 18356021 19248676 19614986 19334156 20226116
3634 20226116 19617192 18799347 19087577 19825678 18999592 18601157 19763707 20408844 18650293
3625 18650293 19224521 20842470 19279735 18983500 20173508 21345428 18117102 19180361
3617 19180361 21190716 21174108 18848247 20435943 21308818 20454029 19658360 20208831 20731240
3608B0731240q52356Q50967P28632q6791q38315K08428K94460L28989p40706q974
3598B0615574L89160R53399j27536Q9683k78362P29323r9224m33571J96552J744130
3588B3779128K77635n13848j247298J174021J347270j355670j31882J271378J197498
3579B5798232j078892J39662J090722L95819M37805J17218p56529l40214J306630
3570B7110453K12944l47258p90514K531843M61958m08433k03929J750542m26955
3561B9890651K89357N92407J141158j92802K29036J100357O45293M6930p10701
3552C3031686J643080K12411L08298j38005O7995J172277j283053M26123P36402
3543C6177214Q97898J059997P47279j098746L41603J404854L04069R41742N13919
$$ plain form
3608 20731240 19878884 20729851 21458483 21371692 20533377 20741805 21036265 21365254 20624548 20615574
3598 20615574 21004734 21958133 21830597 21920280 21641918 22371241 22272017 21838446 22034998 23779128
3588 23779128 24056763 23542915 22295617 23469638 24816908 23461238 23329356 24600734 25798232
3579 25798232 24719340 24859002 25949724 26345543 26783348 26900566 26144037 25803823 27110453
3570 27110453 27323397 26976139 26185625 28717468 29179426 28770993 28567064 30317606 29890651
3561 29890651 30180008 30772415 31913573 31720771 31949807 33050164 33695457 33742387 33031686
3552 33031686 34674766 34887177 35195475 35057470 35125465 36297742 35014689 35440812 36177214
3543 36177214 37075112 38135109 38882388 37783642 38125245 39530099 39834168 40775910 41289829
3534D1289829P89468J344496Q42902P33461J478812J462164J362429N37554J431016
3525E1272131J873224N9298R18181K117614L08711Q28022J595968K382859O99521
3516F2055529o8105l88533K867121l6561J002728O99220J734398J654693J622926
3507G1143416J794861K564428K477734K497094L054808J841490K008133L165234
3499I0547198L928427K454532K66154L185641M170613L671127L098163L280592
3491A14602447L920147M292316P452037P583270O867061R740449J1401783R910352
3483A75769862Q742937J0879764J0797654Q212245M420943N660523J392776k274476
3475B23602228k307070k130753m139704m392232k736627p23967k814966n570043
$$ plain form
3534 41289829 42079297 43423793 44266695 45000156 46478968 47941132 49303561 49841115 51272131
3525 51272131 53145355 53204653 54122834 56240448 56549159 57377181 58973149 61356008 62055529
3516 62055529 61987424 61598891 64466012 64429451 65432179 66131399 67865797 69520490 71143416
3507 71143416 72938277 75502705 77980439 80477533 83532341 85373831 87381964 90547198
3499 90547198 94475625 96930157 97196311 100381952 104552565 108223692 111321855 114602447
3491 114602447 118522594 122814910 130266947 137850217 144717278 154457727 165859510 175769862
3483 175769862 184512799 195392563 206190217 214402462 218823405 224483928 225876704 223602228
3475 223602228 221295158 219164405 215024701 210632469 207895842 207171875 204356909 198786866
3467A98786866m503383n324635r631271j1221252r823543r228818j0615722q848433
3459A29589809p134008o870339p632618o615649o479393o323760m334019o093577
3451G8106446m160090m127481l131054l581439j456583k789889j649456p75370
3443E6435084j959991k237365p61751j486777j008680j876567k79222r82937n78990
3434D5262804j144134m64607k049382Q93979j516183o94791j135717k13173k130241
3425C6808555p87978L87493q98331l216500m85599Q89025k059639j603976P68799
3416B9801849o4332k831899p12742J239076k72274j765490q6976L60095k083695
3407B3583612L01620J452529n89118j748361l44606J488560k495514j090864O24235
$$ plain form
3467 198786866 194283483 188958848 179327577 168106325 158282782 149053964 138438242 129589809
3459 129589809 122455801 115585462 107952844 101337195 94857802 88534042 84200023 78106446
3451 78106446 73946356 69818875 66687821 63106382 61649799 58859910 57210454 56435084
3443 56435084 54475093 52237728 51475977 49989200 48980520 47103953 46824731 45841794 45262804
3434 45262804 44118670 43654063 41604681 42498660 40982477 40287686 39151969 38938796 36808555
3425 36808555 36020577 36408070 35509739 32293239 31807640 32696665 30637026 29033050 29801849
3416 29801849 29737517 26905618 26192876 27431952 27159678 25394188 25307212 25667307 23583612
3407 23583612 23885232 25337761 24748643 23000282 22655676 24144236 21648722 20557858 21182093
3398B1182093J036062k476390j06528J684999J31468k355219o55786J409713j229325
3389A8621087k252536J647646J514538j579703j786278J271050J97429p22147
3381A6911086j345846J282031j764108M09282K63243L44444j544074N48201l69038
3372A4735221M19247p65658K31867P94196J54504j353558k81272O38437J87016
3363A4760000j161997n41627N0023J125906j865637K74042O59570P93138j191387
3354A2902031M1756K7219l68547k94566j292506J379179J255058L91820o37485
3345A3403959J219655q24159j466063j075432J497870m51937l58177N77160k06771
3336A2316105j110957J918275M11180j252003j009056K297741j366780r85154
$$ plain form
3398 21182093 22218155 19741765 19635237 21320236 21451704 19096485 18440699 19850412 18621087
3389 18621087 16368551 18016197 19530735 17951032 16164754 17435804 17633233 16911086
3381 16911086 15565240 16847271 15083163 15492445 15755688 16100132 14556058 15104259 14735221
3372 14735221 15154468 14388810 14620677 15414873 15569377 14215819 13934547 14572984 14760000
3363 14760000 13598003 13056376 13106399 14232305 12366668 12640710 13300280 14093418 12902031
3354 12902031 12943787 12971006 12602459 12307893 11015387 12394566 13649624 14041444 13403959
3345 13403959 14623614 13799455 12333392 11257960 12755830 12303893 11945716 12522876 12316105
3336 12316105 11205148 13123423 13534603 12282600 11273544 13571285 12204505 11219351
3328A1219351J49240J500167j872231q11352J107659K165189n78958j112139p70109
3319A0996817J104704j3855r91498n05954J162107J22942q5712k038162N59138
3310A0310527K029496N60725k269733j55210K055109o16275l090282J024143K578786
3301A2427286k907282r40746L199813J202197k941511j22511Q84796n9125m06325
3292A0336592l9052R02880k05057q20077j166429P82301K230301j276274j855703
3283H889482J467377J443905j100383j738251K00992k25041L19576O49898J405161
3274A1312716j124921J013806L22955j946838p9672J353104n45552q31196M60529
3265I934931M196j07702R67495J384236j258184R60987P40322p19893j573242
$$ plain form
3328 11219351 11368591 12868758 10996527 10185175 11292834 13458023 12879065 11766926 10996817
3319 10996817 12101521 12087666 11096168 10590214 11752321 11875263 11789551 9751389 10310527
3310 10310527 12340023 12900748 10631015 10475805 12530914 11914639 8824357 9848500 12427286
3301 12427286 9520004 8579258 11779071 12981268 10039757 9917246 10802042 10742917 10336592
3292 10336592 10297540 11200420 10995363 10175286 9008857 9791158 12021459 10745185 8889482
3283 8889482 10356859 11800764 10700381 8962130 9163122 8938081 9257657 9907555 11312716
3274 11312716 10187795 11201601 11524556 9577718 9498046 10851150 10305598 9474402 9934931
3265 9934931 9939127 9831425 10798920 12183156 10924972 11885959 12626281 11906388 10333146
3256A0333146J526274q09284j425308j2002K420937N86636j39437r78259N96492
3247A2099195m09051q58778q86830J442558N91626K61781p72263J018687J11564
3238A2598489n00857K30602J126701L13410j674250L18283M28767j028069m90027
3229A1323049J451500Q38415j43533K77033k6441N35148j60801P79843j090364
3220A3783849K68539O27519R34513r74250j39774R32057Q85486o83058k53908
3211A5380973K483631L51032j297865j17819j9674r79568Q64482J705425o31786
3202A7738831K72059J894478M56354j434731P96894J660229j055172k332026P50052
3193A8746968K110090l23113P31195J776597O14220J7081L931J50558M39627N63883
$$ plain form
3256 10333146 11859420 11050136 9624828 9612826 12033763 12620399 12480962 11502703 12099195
3247 12099195 11690144 10831366 9944536 11387094 11978720 12240501 11468238 12486925 12598489
3238 12598489 12097632 12328234 13454935 13768345 12094095 12412378 12841145 11813076 11323049
3229 11323049 12774549 13612964 13469431 13746464 13720023 14255171 14094370 14874213 13783849
3220 13783849 14052388 14679907 15614420 14640170 14500396 15432453 16317939 15634881 15380973
3211 15380973 17864604 18215636 16917771 16799952 16780278 15800710 16665192 18370617 17738831
3202 17738831 18010890 19905368 20361722 18926991 19723885 21384114 20328942 17996916 18746968
3193 18746968 20857058 20533945 21265140 23041737 23655957 23673038 23676969 23827527 24267154 24831037
3183B4831037Q17000O99582P90212M78637J042800J543647L031099M84641P76220
3174C4494875J62609L352783M90487J098768O82766M604049J883722J811052K257038
3165E0838149N865652L137811K694721L605744N174231K741365L47811J954205
3157G6359689J463583j319886k369119J723051N71395o69385p29337J805406l02481
3148G6532916r11266k75755J572472k9555L09591Q77303J579149Q99470K714350
3139H3268675K640419L419637M185690N559938R176159J2383489J5831584J7092643
3131A53558234J2831508M578620o173869j4746368j4914941j1990403j3013323
3124A10129458j2090114p757871o081146n703087l640512j877036k161943l572949
$$ plain form
3183 24831037 25648037 26347619 27137831 27616468 28659268 30202915 33234014 33718655 34494875
3174 34494875 34657484 38010267 38500754 39599522 40282288 44886337 46770059 48581111 50838149
3165 50838149 56703801 59841612 62536333 66142077 71316308 74057673 74405484 76359689
3157 76359689 77823272 76503386 74134267 75857318 76428713 75759328 75029991 76835397 76532916
3148 76532916 75621650 75345895 76918367 76888812 77198403 78075706 79654855 80554325 83268675
3139 83268675 85909094 89328731 93514421 99074359 108250518 120634007 136465591 153558234
3131 153558234 166389742 170968362 164794493 150048125 135133184 123142781 110129458
3124 110129458 98039344 90281473 84200327 78497240 74856728 72979692 70817749 67244800
3116F7244800p67415L73980j787323j357350K548467J643265P85032N55662J091143
3107G0330261K223986K848813K713837J754529M531833L864178L18259k025072
3099H6560624l76862j867854m847350n625989n211651o043007m062896m181845
3091E4343170m916471l648742j568457j280708k015791q1662j384299l122532
3083C6324508j457826J028439j644184j111989J906408M99566l468557j233358
3075C0843007r5451j745560m60352r05207k024831k697741M73896l31909l210723
3066A9845129q78165J781650j376324j564658j397318l9339j485902J39629j547320
3057A3477382K92204L60835j150016m02209p72644J122498p98481k32416K79265
$$ plain form
3116 67244800 66477385 66851365 65064042 63706692 66255159 67898424 68683456 69239118 70330261
3107 70330261 72554247 75403060 78116897 79871426 84403259 88267437 88585696 86560624
3099 86560624 86183762 84315908 79468558 73842569 68630918 62587911 58525015 54343170
3091 54343170 49426699 45777957 44209500 42928792 40913001 40831339 39447040 36324508
3083 36324508 34866682 35895121 34250937 33138948 35045356 35544922 32076365 30843007
3075 30843007 30747556 29001996 28541644 27636437 25611606 22913865 23387761 23055852 19845129
3066 19845129 18966964 20748614 19372290 17807632 16410314 16370975 14885073 15024702 13477382
3057 13477382 13769586 14130421 12980405 12578196 11805552 12928050 12129569 11897153 12176418
3048A2176418Q66092j499009j647289k2990R50048k664966n98717J290870J494085
3039A0344542q80702k107968N2440Q88934j141085q78101J03719N03922j99927
3030F685774o17849k46398Q16231O07582n83211j406734r6337m34229r82041P43474
3020D486262l59571L15245L78959n6330n74444J138938J242198k200528j022071
3011C348658J375022o0289k050077J67238J742343k39915j707801P49028J736917
3002E061124j58519r17779q8178M22292n28189j670641p66810J312053R42938
2993C608291j431143K33644J624273j144106j577186Q88007R78607j083508o62608
2984A434271J439402r32631o97207N22909N47234o74097J94402J14876Q0354M8678
$$ plain form
3048 12176418 13042510 11543501 9896212 9873222 10823270 8158304 7559587 8850457 10344542
3039 10344542 9463840 7355872 7408312 8297246 7156161 6278060 6381779 6885701 6685774
3030 6685774 6067925 5821527 6637758 7245340 6662129 5255395 5159058 4724829 3742788 4486262
3020 4486262 4126691 4441936 4820895 4764565 4190121 5329059 6571257 4370729 3348658
3011 3348658 4723680 4663391 2613314 2780552 4522895 4282980 2575179 3324207 5061124
3002 5061124 4902605 3984826 3896648 4318940 3790751 2120110 1353300 2665353 3608291
2993 3608291 2177148 2410792 4035065 2890959 1313773 2201780 3180387 2096879 1434271
2984 1434271 2873673 1941042 1243835 1766744 2313978 1639881 1834283 1949159 2029513 2078191
2974B078191N5076j364301q8376M26316m77049p22685L0985J541284o1092n57149
2964H61200k0071J026472k041851j97498K72597R14509k029661K03687J207942
2955A97326J508169m99089j156636k23922J307978j469334j131130Q47247K227438
2946A608047j298712j228619O36493J901112n74093j305217N68163M64322r18822
2937a47326j536462J158941P72708o29530j204534J630263P57096o35100r95012
2928h28956N33487J143438q49138j513349Q81358J213969n91900q43093n06855
2919a361039N31307N94656K1583M60592m65624k08988l93287O40797j956778J6027
2909b120754K84491J622717l57767j224765J090656j44623j152837P35711N47036
$$ plain form
2974 2078191 2133267 768966 680590 1106906 629857 -92828 -61843 1479441 1418349 861200
2964 861200 841129 1867601 -174250 -371748 -99151 815358 -1214303 -1010616 197326
2955 197326 1705495 1206406 49770 -174152 1133826 -335508 -1466638 -619391 1608047
2946 1608047 309335 -919284 -282791 1618321 1044228 -260989 307174 771496 -147326
2937 -147326 -1683788 -524847 247861 -381669 -1586203 44060 801156 166056 -828956
2928 -828956 -295469 847969 -1169 -1514518 -633160 580809 -11091 -854184 -1361039
2919 -1361039 -829732 -235076 -213493 247099 -218525 -427513 -820800 -180003 -2136781 -2120754
2909 -2120754 -1836263 -213546 -571313 -1796078 -705422 -850045 -2002882 -1267171 -720135
2900g20135j255054M57908P18305j430308j87510N34747J534396j782563p71449
2891b901663Q18867J930538k076554r53768J322152J09649n58521P19792K77261
2882a312247r38408J33126m1511l79466P65369N37890L18408P2479J56901p35824
2872a423283n18217n5035o8495n28686M42810L82114j88775J468183n45867o07169
2862a642420l74764J862487q71416j951900M29426J297231j627112J38657J824046
2853i15765M84934j014325J303944q6493p03193k4983Q12319j614098P40355N01572
2843e15733Q42552j249071J198274r60442p42027P18138Q54774n85773k95650
2834g34958N17138J16311n70683o01267R75302k28365J95086K21458P70748p37949
$$ plain form
2900 -720135 -1975189 -1517281 -798976 -2229284 -2416794 -1882047 -347651 -2130214 -2901663
2891 -2901663 -2082796 -152258 -2228812 -3182580 -1860428 -1750779 -2309300 -1589508 -1312247
2882 -1312247 -2250655 -2117529 -2159040 -2538506 -1773137 -1235247 -916839 -844360 -687459 -1423283
2872 -1423283 -1941500 -1996535 -2065030 -2593716 -2150906 -1768792 -1957567 -489384 -1035251 -1642420
2862 -1642420 -2017184 -154697 -1026113 -2978013 -2548587 -1251356 -2878468 -2739811 -915765
2853 -915765 -430831 -1445156 -141212 -227705 -930898 -955881 -143562 -1757660 -1017305 -515733
2843 -515733 326819 -922252 276022 -684420 -1426447 -708309 146465 -439308 -734958
2834 -734958 -217820 -101509 -672192 -1273459 -298157 -526522 -331436 -109978 660770 -77179
2824g7179L36687J35723l23368m38284p25829P62434O50043o18067k83235P85359
2814B04284R53727j459653o28346O08050l83765m73307Q07473j207177l78337
2805a957051K032284P85547j047356j909731J976564P36702k617421j111849K271667
2796h40644O22261j697582O27063J210422o57550p86157J293871l47755o34099
2787a210170j34161j84940r99247R1746J68839J169033P62380l7171j051200O86017
2777g38874L81990L41462k390801N5197k459Q34412O14005Q82551k4209l50373
2767c97099L99313q76370q3080Q5971N79525o76329M42849n52308j280317J519466
2757h38379J555727j141741j051693K458910J14833k062916j575490K508266K14251
$$ plain form
2824 -77179 259508 395231 71863 -366421 -1092250 -329816 320227 -297840 -581075 204284
2814 204284 1158011 -301642 -929988 -321938 -705703 -1179010 -371537 -1578714 -1957051
2805 -1957051 75233 860780 -186576 -2096307 -119743 616959 -2000462 -3112311 -840644
2796 -840644 -218383 -1915965 -1288902 -78480 -736030 -1522187 -228316 -576071 -1210170
2787 -1210170 -1344331 -1529271 -2528518 -2436772 -2267933 -1098900 -336520 -373691 -1424891 -738874
2777 -738874 -356884 -15422 -2406223 -2351026 -2353485 -1519073 -905068 -22517 -46726 -397099
2767 -397099 2214 -874156 -957236 -871265 -291740 -968069 -525220 -1077528 -2357845 -838379
2757 -838379 717348 -424393 -1476086 982824 1097657 -965259 -2540749 -32483 181768
2748A81768k984747L55106J570903j8207r53440M32351P27654J91232j10654k5182
2738f33216o03823r64385M27133o50787J15152J637283j89369l77272Q00838l83478
2728h21924r36372M57278j439702j69858O50879O64992O473l46358J085557k17860
2718a066895j312528Q95112N02369j903075l13146P25218Q68029n09221n36055
2709b650192J053648K78690n15958l69129J222890j836751O04614m18931l49841
2700b980960L42127J182098L34514K09785j098649J34641R32777o67457m3157
2691a654281P46316p12276k3212p65025J453806o80660j99039P32426J450950
2682C49005k134403j8333J016629o90545l20289k95534Q83898n17942l52823K35987
$$ plain form
2748 181768 -2802979 -2447873 -876970 -895177 -1848617 -1416266 -688612 -497380 -608034 -633216
2738 -633216 -1237039 -2201424 -1774291 -2425078 -2309926 -672643 -862012 -1239284 -438446 -821924
2728 -821924 -1758296 -1301018 -2740720 -2910578 -2259699 -1594707 -1588234 -1934592 -849035 -1066895
2718 -1066895 -2379423 -1484311 -981942 -2885017 -3198163 -2472945 -1604916 -2114137 -2650192
2709 -2650192 -1596544 -1317854 -1833812 -2202941 -980051 -2816802 -2212188 -2631119 -2980960
2700 -2980960 -2638833 -1456735 -1122221 -912436 -2011085 -1876444 -943667 -1611124 -1654281
2691 -1654281 -907965 -1620241 -1643453 -2408478 -954672 -1635332 -1834371 -1101945 349005
2682 349005 -1785398 -1803731 -787102 -1477647 -1797936 -2093470 -1209572 -1727514 -2080337 -1844350
2672a844350J292636j075778J604493j061968q67157p02062J574971o47831m54354
2663b181400P71200Q62425l78663j75098O42270N62648r55200o56273o36624n6756
2653b201471n501O46351M38924K85693M3056K10842k30031j040239Q00665j217222
2643b268933j204535N19648R48472M6965J092834Q53391p50885j033388j381273
2634c177704J636655l95837j420847N98143J277805K27439o83873j95272O54698
2625a478793J504912j625170j11543n0143K41188k03752n54688n40702J211908
2616a606783J537162k76171j158076o36467K038799o17380j171830N38801O76647
2607f75298k00935L79006m53329l23541O42701N34340J050253N20275L15481J61159
$$ plain form
2672 -1844350 -551714 -1627492 -22999 -1084967 -1952124 -2654186 -1079215 -1727046 -2181400
2663 -2181400 -1410200 -547775 -926438 -1101536 -459266 103382 -851818 -1508091 -2144715 -2201471
2653 -2201471 -2206972 -1560621 -1121697 -836004 -792948 -582106 -812137 -1852376 -1051711 -2268933
2643 -2268933 -3473468 -2953820 -2005348 -1958383 -865549 -12158 -763043 -1796431 -3177704
2634 -3177704 -1541049 -1936886 -3357733 -2759590 -1481785 -1254346 -1938219 -2133491 -1478793
2625 -1478793 26119 -1599051 -1710594 -1760737 -1519549 -1723301 -2277989 -2818691 -1606783
2616 -1606783 -69621 -345792 -1503868 -2140335 -101536 -718916 -1890746 -1351945 -675298
2607 -675298 -876233 -497227 -950556 -1274097 -631396 -97056 953197 1473472 1788953 1950112
2597A950112m81486m8830p51933o53459M10188Q59336k8892n17543k02856j056050
2587e21413J690746q64601j824102O44475Q87131o7725j253719L14576J569694
2578E75062M68639k94292N15356o52998n80486R0548r95531n1548M30892O23904
2568A29546r21880K183938R98461j658592j260310N33165q2999j453656N64581
2559i67746R85540q66119p01889J584120q86018j10298J523068J720344j485566
2550G95436k358877J001608O45164j331558p47716K803648J01904r83579p60080
2541h34050N32724M47431j510657L701K409731n50499k298541Q69449J378043
2532D47332l37152j351632R17513K080941l06278r37877j075611n84867O8488
$$ plain form
2597 1950112 1468626 1419796 667863 14404 424592 1283928 1255036 737493 534637 -521413
2587 -521413 1169333 304732 -1519370 -874895 12236 -55489 -1309208 -994632 575062
2578 575062 1043701 749409 1264765 611767 31281 121829 -873702 -925250 -494358 129546
2568 129546 -792334 1391604 2390065 731473 -528837 4328 -78671 -1532327 -967746
2559 -967746 17794 -848325 -1550214 33906 -852112 -962410 560658 2281002 795436
2550 795436 -1563441 -561833 83331 -1248227 -1995943 807705 909609 -73970 -834050
2541 -834050 -301326 146105 -1364552 -1360851 1048880 498381 -1800160 -930711 447332
2532 447332 110180 -1241452 -323939 1757002 1450724 512847 -562764 -1147631 -1079143
2523a079143p33533n27685J452557K761793j646729r12681Q60986K045421k686342
2514d65356l03464J854250K58848l069193L06893J976834p46256m33448J613141
2505I92249J297325j208026J16080l62822j748115r18722J764594l04717r85693
2496a357847J712434O05198q83562q16511J103592N85211j306086m5532Q65929
2487D62826m93086j103959J863432l56634m36669O06358j81634j71311m2241k29468
2477h2386j429287j59460J525861J041322j101121k66310P98906k99634J97514
2468B25405o36791J992521L10310p90761k507337N96814M46443j33802k27399
2459g24597J197132J402017j930728O252K308412p85566k763855J868268N30568
$$ plain form
2523 -1079143 -1812676 -2340361 -887804 1873989 227260 -685421 175565 2220986 -465356
2514 -465356 -768820 1085430 1344278 -1724915 -1418022 558812 -187444 -620892 992249
2505 992249 2289574 1081548 1197628 834806 -913309 -1832031 -67437 -372154 -1357847
2496 -1357847 354587 959785 76223 -740288 363304 948515 -357571 -403103 462826
2487 462826 -30260 -1134219 729213 372579 -64090 542268 360634 189323 147082 -82386
2477 -82386 -1511673 -1671133 -145272 896050 -205071 -471381 327525 27891 225405
2468 225405 -411386 1581135 1891445 1100684 -1406653 -809839 -363396 -497198 -724597
2459 -724597 472535 1874552 -56176 -49924 2258488 1472922 -1290933 577335 1107903
2450A107903o04395j86023Q46836m56747m43203J947640N13442j024502r7704
2441A603247O12556j011547p78984K13131n97430J677589J073960q38003k82970
2432A671549M83373p14j760317J08539J230345Q37660j486294P71802J518903
2423C374846j245858m56933J261668J943982k446119j258643N62715J792453j447966
2414B080145p28788R48498J805368r99936K25243p77724k9819Q18417R18088q08146
2404C451346J34878J512519l40904k170328K73254O13182r56448P71534K338285
2395E627318k52120j560879q018j72799J047884q75485M1056M78979J779273j319923
2385D785286m07321n14094K504407m85025j859941J316713J223750o60567q21747
$$ plain form
2450 1107903 503508 317485 1164321 707574 264371 2212011 2725453 1700951 1603247
2441 1603247 2215803 1204256 425272 638403 40973 1718562 2792522 1954519 1671549
2432 1671549 2154922 2154208 393891 502430 1732775 2570435 1084141 1855943 3374846
2423 3374846 2128988 1672055 2933723 4877705 2431586 1172943 1735658 3528111 2080145
2414 2080145 1351357 2299855 4105223 3105287 3330530 2552806 2522987 3341404 4259492 3451346
2404 3451346 3586224 5098743 4757839 2587511 2860765 3473947 2517499 3289033 5627318
2395 5627318 5375198 3814319 3806301 3633502 4681386 3805901 3846957 4325936 6105209 4785286
2385 4785286 4377965 3863871 6368278 5883253 4023312 5340025 6563775 5903208 5081461
2376E081461P13888J358057Q99101J12793M76342L50149r16309K045157n33508
2367I587131K20139J9127N36582J021593O62962k70794J141200N33966R00660
2358A4352566J004379J494479J420091J475174L14906M31495K016187K184748
2350B4694025R80477K219972K980011L749545M872942M131254L235485K403865
2342D9267576K419685J49959K773747N010088P188814Q877197J5381609J9890370
2334A10959045K7877677M5147610P7020498J08101980R5890869L4318619m7097727
2327D52218571r9230039r7166818o8706511m8465142l3413641k3447531j8945396
2320F2843493j4605588p978432l710800n605246j713302J137760r48090m909968
$$ plain form
2376 5081461 5795349 7153406 8052507 8165300 8641642 8991791 8075482 10120639 9587131
2367 9587131 9807270 9826397 10362979 11384572 12047534 11776740 12917940 13451906 14352566
2358 14352566 15356945 16851424 18271515 19746689 20061595 20493090 22509277 24694025
2350 24694025 25674502 27894474 30874485 34624030 39496972 43628226 46863711 49267576
2342 49267576 51687261 51837220 54610967 59621055 66809869 75687066 91068675 110959045
2334 110959045 138836722 183984332 261004830 369106810 464997679 499316298 452218571
2327 452218571 352988532 255821714 187115203 138650061 105236420 81788889 62843493
2320 62843493 48237905 40259473 36548673 30943427 29230125 30367885 29419795 24509827
2312B4509827l648349k086546j852283l364161k010003o14229j463832k201551
2304G268873O61893K82808j021080j264620O83223N1239j531101j043882J315652
2295E403005K89117l43963q99814J171170k46561j956722p94097O05742M6077
2286C273954j125060J121234J83857q73647l13232j01812l60010n62210J49303
2277A392377k97130l71551o21945Q46644K29409r3539k29306J463913n14536k728715
2267i24379m03338J693829o08496j529858J375822K619067j243463j012587M54402
2258D20999J31307l54307l44623R06026k97063j048557o95128J728281l56706
2249I0229r36693P84365R26484k28445m3576r56567O91284r03820j159034K07648
$$ plain form
2312 24509827 20861478 18774932 16922649 13558488 11548485 10934256 9470424 7268873
2304 7268873 7930766 8213574 7192494 5927874 6611097 6662336 5131235 4087353 5403005
2295 5403005 5692122 5348159 4448345 5619515 5372954 3416232 2622135 3227877 3273954
2286 3273954 2148894 3270128 3453985 2580338 2267106 2165294 1805284 1243074 1392377
2277 1392377 1095247 723696 101751 948395 1177804 1084265 854959 2318872 1804336 -924379
2267 -924379 -1327717 366112 -242384 -1772242 -396420 2222647 979184 -33403 420999
2258 420999 552306 197999 -146624 759402 462339 -586218 -1281346 446935 90229
2249 90229 -846464 -62099 864385 635940 592364 -364203 327081 -576739 -1735773 -1528125
2239a528125j171756M42347K263444J016277k362742q15212J145105R16335p25518
2230h19845k10859Q27667j171535j222052n10538J872445Q14413n43229r27619
2221a891152J221743k60219j396877J84749N62722j008281p55348J82111K471915
2212f88637q81366q06907M07266Q40344r07544K08384k43735P4298j403791j0405
2202c412093K020604j45160o48543J10700R34308L61877j082128r13408M62545
2193b311298Q37613k68752n40080M31090J172648n96326j211794j17937J051122
2184a553714L82469j072593M84677P69211p7593j367783J024863Q01226m68158
2175a077395j483326M10145J479194n21028m87756K12197N72372j176201N7921
$$ plain form
2239 -1528125 -2699881 -2257534 5910 1022187 -1340555 -2155767 -1010662 -94327 -819845
2230 -819845 -1030704 -203037 -1374572 -2596624 -3107162 -1234717 -420304 -963533 -1891152
2221 -1891152 -669409 -929628 -2326505 -2141756 -1579034 -2587315 -3342663 -3160552 -688637
2212 -688637 -1570003 -2376910 -1969644 -1129300 -2036844 -1828460 -2072195 -1997897 -3401688 -3412093
2202 -3412093 -1391489 -1536649 -2185192 -2074492 -1140184 -778307 -1860435 -2773843 -2311298
2193 -2311298 -1473685 -1742437 -2282517 -1851427 -678779 -1275105 -2486899 -2604836 -1553714
2184 -1553714 -1171245 -2243838 -1759161 -989950 -1067543 -2435326 -1410463 -609237 -1077395
2175 -1077395 -2560721 -2150576 -671382 -1192410 -1680166 -1467969 -895597 -2071798 -2013877
2166b013877N69106P81045K68830j674794J96617J550350N47693k104337M28178
2157a451189J159837j855045j844336K555809O92041j327638L54158J404449o07897
2148i19811j321192P63937J118293k057326l95774K036183n38631j402921R96292
2139a720950J610933N50895q47048m70342o15189L91662k35302q61058k97393
2130b493792O40909P26485n99495j939613M00259J094246K90425j692463J118262
2121b454777Q78766l30822l13291R01344j557020r15379R25836Q22507m69577
2112b512413J82263J117778q81687p44010m33872L93403N4567J478398m82440
2103a828013r09047j738388Q51870P69925N71939L68452M11308k28426n84448
$$ plain form
2166 -2013877 -1444771 -663726 -394896 -2069690 -1873073 -322723 224970 -1879367 -1451189
2157 -1451189 -291352 -2146397 -3990733 -1434924 -742883 -2070521 -1716363 -311914 -919811
2148 -919811 -2241003 -1477066 -358773 -2416099 -2811873 -775690 -1314321 -2717242 -1720950
2139 -1720950 -110017 440878 -406170 -876512 -1491701 -1100039 -1335341 -2196399 -2493792
2130 -2493792 -1852883 -1126398 -1725893 -3665506 -3265247 -2171001 -1880576 -3573039 -2454777
2121 -2454777 -1576011 -1906833 -2220124 -1318780 -2875800 -3791179 -2865343 -2042836 -2512413
2112 -2512413 -2330150 -1212372 -2094059 -2838069 -3271941 -2878538 -2823971 -1345573 -1828013
2103 -1828013 -2737060 -4475448 -3623578 -2853653 -2281714 -1913262 -1501954 -1730380 -2314828
2094b314828p42613L05941K65669j53493k58474J206828l01158P94406j346175
2085b543897J15714J6550N23794j6825R61084m48608j60404j030422p07241J998507
2075a291748K34739o76159P67546L50590q39921o25379l84059P22446L76997R9507
2065a265441K06036m80638p02180J543585J3486J178571J126045m65978j180662
2056b7176j006984j171875r49218p13883J904001R68356r20929q22074J681858
2047a057924j76515r40412q67047M33142M06079m46019k24172J047917k74634
2038b099585p06554m42959J141146Q98147K81144L23813p53845j611541o31684
2029c601918M34121P17435J046491N02947k91146o16760L86748k18914j123667
$$ plain form
2094 -2314828 -3057441 -2751500 -2485831 -2639324 -2897798 -1690970 -1992128 -1197722 -2543897
2085 -2543897 -2428183 -2411633 -1887839 -1904664 -943580 -1392188 -1552592 -2583014 -3290255 -1291748
2075 -1291748 -1057009 -1733168 -965622 -615032 -1454953 -2080332 -2464391 -1741945 -1364948 -1265441
2065 -1265441 -1059405 -1540043 -2242223 -698638 -685152 493419 1619464 1153486 -27176
2056 -27176 -1034160 -2206035 -3155253 -3869136 -1965135 -996779 -1917708 -2739782 -1057924
2047 -1057924 -1234439 -2174851 -3041898 -2608756 -2202677 -2648696 -2872868 -1824951 -2099585
2038 -2099585 -2806139 -3249098 -2107952 -1209805 -928661 -604848 -1358693 -2970234 -3601918
2029 -3601918 -3167797 -2450362 -1403871 -900924 -1192070 -1808830 -1422082 -1640996 -2764663
2020b764663j6248P51224O22468l13781k70840J19334l78969o7167J479969p01937
2010a540610M44129J128195r56381k513922K249137M81998k164060R5159J869265
2001i07090L45524k53565L42503m32437l45039r81235J389030L86915j359605
1992a814999r30442L10489J05417O1151Q98836K796559j86163k174000q00993
1983a734145J008734r91643r45919J087049J254528j004878K51326J233745p51406
1974e92609j136174J656209P94494j392018j851288J385218k75763q57325k34503
1965b503759J633300L60291m91551J15808O14911j699504r50518J428140n3783
1956a546665j361763J428519K131948j535718j124591M00173J386653q31250o81074
$$ plain form
2020 -2764663 -2780911 -2029687 -1407219 -1721000 -1991840 -1872506 -2251475 -2318642 -838673 -1540610
2010 -1540610 -1096481 31714 -924667 -3438589 -1189452 -707454 -2871514 -2776355 -907090
2001 -907090 -561566 -815131 -472628 -905065 -1250104 -2231339 -842309 -455394 -1814999
1992 -1814999 -2745441 -2434952 -2329535 -2268384 -1369548 1427011 1240848 -933152 -1734145
1983 -1734145 -725411 -1717054 -2662973 -1575924 -321396 -1326274 -1074948 158797 -592609
1974 -592609 -1728783 -72574 721920 -670098 -2521386 -1136168 -1411931 -2269256 -2503759
1965 -2503759 -870459 -510168 -1001719 -885911 -271000 -1970504 -2921022 -1492882 -1546665
1956 -1546665 -2908428 -1479909 652039 -883679 -2008270 -1608097 -221444 -1052694 -1733768
1947a733768R5379O58471q65565k01298k83986J447552N97951j131856L89739
1938a027381o1875j507313M93262J727111k54237j155370m24853J094145j265911
1929b382422o32472J971106J226367j573201J242961l50734j337622K38698m88584
1920b085903q44519J5302Q02398J22536J407297P03099j026678o24300k78145
1911a808913p2420J08036K50450p92095n42127J097104j23273J07629P08692J223589
1901A56672j60256r19265j154359L93262l1714k99854l95776R20351K18682K02666
1891a069591m44093m60597M1647K12528l7862J012116O1476j870984o59463R20374
1881b294449O42997p83635J16087R55246L96157p44866q85016o345k95121P08534
$$ plain form
1947 -1733768 -1638389 -979918 -1845483 -2046781 -2330767 -883215 -285264 -1417120 -1027381
1938 -1027381 -1089256 -2596569 -2103307 -376196 -630433 -1785803 -2210656 -1116511 -2382422
1929 -2382422 -3014894 -1043788 182579 -1390622 -147661 -498395 -1836017 -1597319 -2085903
1920 -2085903 -2930422 -2915120 -2112722 -1990186 -582889 120210 -906468 -1530768 -1808913
1911 -1808913 -1881333 -1773297 -1522847 -2314942 -2857069 -1759965 -1883238 -1775609 -1066917 156672
1901 156672 -3584 -922849 -2077208 -1683946 -1715660 -2015514 -2411290 -1490939 -1272257 -1069591
1891 -1069591 -1513684 -1974281 -1932634 -1720106 -1757968 -745852 -684376 -2555360 -3214823 -2294449
1881 -2294449 -1651452 -2435087 -2319000 -1363754 -967597 -1712463 -2597479 -2603824 -2898945 -2190411
1871b190411P32389j047868M69226J081350L66374l076663N80433K265287J205374
1862C85491j963792l6442n93246n76095n64003L58527M17573K198146M02850j290168
1852a261159J96334n85004p07677M21121K43108j821173J084632J455763p0465
1843a044520j242099J098550K05909r52788o5484J456390r08198j864593O15693
1834b701140J277710l46399L49870J038467k10661j56784p56277m83415n75190
1825b563819L69940J04118Q05778J517871j396294j266991j01915O00635p50144
1816b680821J816350K79187j239333M18180R76386k472421p7979J521032N2028
1807a407391j386819O68372Q47768R1670j688399J53046M33646O53372k40168
$$ plain form
1871 -2190411 -1458022 -2505890 -2036664 -955314 -588940 -3665603 -3085170 -819883 385491
1862 385491 -1578301 -1614743 -2207989 -2784084 -3348087 -2989560 -2571987 -373841 29009 -1261159
1852 -1261159 -1064825 -1649829 -2357506 -1936385 -1693277 -3514450 -2429818 -974055 -1044520
1843 -1044520 -2286619 -1188069 -982160 -1934948 -2000432 -544042 -1452240 -3316833 -2701140
1834 -2701140 -1423430 -1769829 -1419959 -381492 -592153 -748937 -1505214 -1988629 -2563819
1825 -2563819 -2193879 -2089761 -1283983 233888 -1162406 -2429397 -2531312 -1930677 -2680821
1816 -2680821 -864471 -585284 -1824617 -1406437 -430051 -2902472 -2980451 -1459419 -1407391
1807 -1407391 -2794210 -2125838 -1278070 -1186400 -2874799 -2721753 -2288107 -1634735 -1874903
1798a874903o72301j01618J094264r30930p66674J792349J108465j101482l61871
1789a814701J82493K9002j277835L99417J569645K8735r50231J252233L34644
1780b46598r35351m96624O63199L53016n96952m98136J374838Q95345j242467
1771g29730o87204O87141J243838q71942l4548J6579K69334m80673P06846m89095
1761c69454j33443n4913Q87252m51648j79945J6759R65550j766605M06264Q93933
1751B13750K35317q89502J474359p44277j551427q5022J770781J87941j422929
1742h11009P7932J298958j397225j034441J694523Q74526r91198p04722K12821
1733g79835K30143j18963J44010j59663j019179M32218J248711k051275J288146
$$ plain form
1798 -1874903 -2547204 -2648822 -1554558 -2485488 -3252162 -1459813 -351348 -1452830 -1814701
1789 -1814701 -1632208 -1603206 -2881041 -2481624 -911979 -883244 -1833475 -581242 -246598
1780 -246598 -1181949 -1678573 -1015374 -662358 -1259310 -1757446 -382608 512737 -729730
1771 -729730 -1416934 -729793 514045 -357897 -392445 -375866 -106532 -587205 119641 -369454
1761 -369454 -502897 -557810 329442 -122206 -302151 -285392 680158 -1086447 -680183 213750
1751 213750 449067 -440435 1033924 289647 -1261780 -1346802 423979 611920 -811009
1742 -811009 -733077 565881 -831344 -1865785 -171262 703264 -287934 -992656 -779835
1733 -779835 -549692 -668655 -524645 -684308 -1703487 -1271269 -22558 -2073833 -785687
1724g85687P49096J9451j477258N16629n2290k18874q87622L13327l40492j140123
1714c303843J346984Q62313l42358j074486K62470J170795p06664q08242O62774
1705a930257m30521M63086Q01190l86765j171193P18044M28565j37197r42912
1696b587960n36912K25040o9855p91215J172508J900082n1967p51091m4359j85898
1686a721627q31203Q9864J765343j108915j736047O36364K374133k048837J8960
1677b561965J141521J754689k098368k0302J001071j113116j263958J084224N51756
1668a524448j049565J362561O26524k84976r24266l05315O2835J62819O17540
1659a256291m74794m31890k16312J616367q54880j717328J721726J803563n04670
$$ plain form
1724 -785687 -36591 -17140 -1494398 -977769 -1030059 -1248933 -2136555 -1823228 -2163720 -3303843
1714 -3303843 -1956859 -1094546 -1436904 -2511390 -2248920 -1078125 -1784789 -2593031 -1930257
1705 -1930257 -2360778 -1897692 -1096502 -1483267 -2654460 -1936416 -1507851 -1645048 -2587960
1696 -2587960 -3124872 -2899832 -2969687 -3760902 -2588394 -688312 -740279 -1491370 -1535729 -1721627
1686 -1721627 -2552830 -2462966 -697623 -1806538 -3542585 -2906221 -532088 -2580925 -2561965
1677 -2561965 -1420444 334245 -1764123 -1784425 -783354 -1896470 -3160428 -2076204 -1524448
1668 -1524448 -2574013 -1211452 -584928 -869904 -1794170 -2099485 -2036650 -1873831 -1256291
1659 -1256291 -1731085 -2162975 -2379287 -762920 -1617800 -3335128 -1613402 190161 -314509
1650c14509k22966Q73797J2955l327210r0005K121885N24604j631593P24497L27604
1640a000941p35595j52202J085972P3596j152945r71515R93630j46000m40699
1631b446699O42409R36417k10666L84580r8272J46908q2927j197545j1729p61957
1621b699481r0802J511633J904974m55395n73978r88111J693840k133885m4488
1612a875693R60142J43885j016686N71412o1407J80527K91735m7939P53612n63320
1602f63732M75737P71898j642204m83126P56678j103792l96208J887063M43536
1593D5850n26873p0611J117158o85078o45614N03338k31349q33425L63807p9877
1583a042674p69861R16035J710904r88473M01645J312552j237175j320776r2800
$$ plain form
1650 -314509 -537475 336322 349277 -2977933 -3067938 -946053 -421449 -2053042 -1328545 -1000941
1640 -1000941 -1736536 -1888738 -802766 -729170 -1882115 -2853630 -1860000 -2006000 -2446699
1631 -2446699 -1804290 -867873 -1078539 -693959 -792231 -645323 -728250 -1925795 -1937524 -2699481
1621 -2699481 -2790283 -1278650 626324 170929 -403049 -1391160 302680 -1831205 -1875693
1612 -1875693 -915551 -771666 -1788352 -1216940 -1278347 -1097820 -806085 -854024 -100412 -663732
1602 -663732 -187995 583903 -1058301 -1541427 -784749 -1888541 -2284749 -397686 45850
1593 45850 -481023 -551634 565524 -119554 -765168 -261830 -493179 -1326604 -962797 -1042674
1583 -1042674 -1812535 -896500 814404 -174069 227576 1540128 302953 -1017823 -1110623
1574a110623J911731j507754r38563O12261K346057j661480o63368J330459J18329
1565D37049q26396q12316K4229j97450m66535r35461J237948N55865l16517j65596
1555a465180J896049o28913j109384q58563Q86573j094220j022937J413229J108920
1546h74426k80791j451125J075924J131172j413221n05289K072203n04661k120016
1537b870230J670689K37141j328085O98935M22188o58129K5284J566421j196415
1528a432201j517360Q46370P99364q66139M71626K99646q26821K50823J622937
1519c51755m75519L22418j86008m82990l51829J573689R61423k361970o51986
1510b004527J853165q85297j652000K836304R32011j491657n96294L85218l38015
$$ plain form
1574 -1110623 801108 -706646 -1645209 -1032948 1313109 -348371 -1011739 318720 437049
1565 437049 -389347 -1201663 -1177434 -1374884 -1841419 -2776880 -1538932 -983067 -1299584 -1465180
1555 -1465180 430869 -198044 -1307428 -2165991 -1279418 -2373638 -3396575 -1983346 -874426
1546 -874426 -1155217 -2606342 -1530418 -399246 -1812467 -2317756 -245553 -750214 -2870230
1537 -2870230 -1199541 -962400 -2290485 -1591550 -1169362 -1827491 -1802207 -235786 -1432201
1528 -1432201 -2949561 -2103191 -1303827 -2169966 -1698340 -1398694 -2225515 -1974692 -351755
1519 -351755 -827274 -504856 -690864 -1173854 -1525683 48006 1009429 -1352541 -2004527
1510 -2004527 -151362 -1036659 -2688659 147645 1079656 -412001 -1008295 -623077 -961092
1501i61092m97062P63406K54536m90320k9315Q12027J46222j37173o19301j40520
1491h98592j37854l69038M73140J186444k59777P04672M3760j200221L92752j44565
1481b09279m19142j339661N74244J58505Q85214l22019J25785j78724q82543J764534
1471A56914p043j335619o32936N24346K79467P35972L7332l35658j09026j20241
1461h06492n2423l22702j9110M73534K80316o92523J00213K5839Q54559p09340
1451h68129j036999J86404J058555l13707J238895l1033j890168j255055J500368
1442a410869N65266N3436m29786N67680j49662l0488j21558K55827R67256j149874
1432h82772q18402O4464J014792j719353l7866J705804k16922l42904J150264
$$ plain form
1501 -961092 -1458154 -694748 -440212 -930532 -959847 -147820 -1598 -138771 -758072 -898592
1491 -898592 -1036446 -1405484 -932344 254100 -5677 698995 742755 -457466 -64714 -209279
1481 -209279 -628421 -1968082 -1393838 -1235333 -350119 -672138 -546353 -725077 -1607620 156914
1471 156914 149871 -1185748 -1818684 -1294338 -1014871 -278899 -241567 -577225 -686251 -806492
1461 -806492 -858915 -1181617 -1200727 -727193 -446877 -1139400 -1039187 -1013348 -158789 -868129
1451 -868129 -1905128 -1718724 -660169 -973876 265019 233986 -1656182 -2911237 -1410869
1442 -1410869 -845603 -792167 -1221953 -654273 -803935 -834423 -955981 -700154 267102 -882772
1432 -882772 -1701174 -1636710 -621918 -2341271 -2379137 -673333 -890255 -1233159 -82895
1423h2895K42184j203358j128275m12938L83558L04644M59550K15498k36432J709375
1413B50911j107407r65151k05128l65626j246162K122403M68708j253329m18477
1404b719258J440788m14922j246400R00018J70854o91958p23979O05078j496996
1395d176775R24792J789643l97989j159223O86274M41469J18773n9611r77913
1386b810560O15793m30963J34536J41201J150083j359964r62837J610089L32405
1377a580217m52302J025055J110520j570166j461210L93513n3721n41667M64808
1368b665387J573995p6233o77298J321397Q58571r00490j746334J069825J046862
1359a95092j116038j306736R65281J110511o90988P74445Q33282l67641j586952
$$ plain form
1423 -82895 159289 -1044069 -2172344 -2585282 -2201724 -1897080 -1437530 -1222032 -1458464 250911
1413 250911 -856496 -1821647 -2026775 -2392401 -3638563 -1516160 -1047452 -2300781 -2719258
1404 -2719258 -1278470 -1693392 -2939792 -2039774 -1868920 -2560878 -3284857 -2679779 -4176775
1395 -4176775 -3251983 -1462340 -1860329 -3019552 -2333278 -1891809 -1773036 -1832647 -2810560
1386 -2810560 -2194767 -2625730 -2491194 -2349993 -1199910 -2559874 -3522711 -1912622 -1580217
1377 -1580217 -2032519 -1007464 103056 -1467110 -2928320 -2534807 -2588528 -3130195 -2665387
1368 -2665387 -1091392 -1167625 -1844923 -523526 335045 -565445 -2311779 -1241954 -195092
1359 -195092 -1311130 -2617866 -1652585 -542074 -1233062 -458617 374665 7024 -1579928
1350a579928J110639L90618j910425o38480J738615k11121J22522P59630L08779
1341I0849R15910O09639k048408j561311J004104J220019q98288n24136K178612
1332I86990j76975k365744P23492J095873M84951p89890j001843J018548l48500
1323c73098j025219J3220J925557j359979q61602R87481K132760p95194j644787
1314a000861M3701J62995j104120j9404J327107K69327k95255n3199p25148P44015
1304f50842K040462n18812j459333N59796K09978j364461j039821R21089L1659
1295a270285L55404J214501J120346r58874n97282j175339J029472n26811j145472
1286a954340N78327J547443r43204L90225Q52481p68445o1939K98864J71450n98652
$$ plain form
1350 -1579928 -469289 -78671 -1989096 -2627576 -888961 -1100082 -977560 -217930 90849
1341 90849 1006759 1616398 -432010 -1993321 -989217 230802 -667486 -1191622 986990
1332 986990 810015 -1555729 -832237 263636 748587 -41303 -1043146 -24598 -373098
1323 -373098 -1398317 -1385097 540460 -819519 -1681121 -693640 1439120 643926 -1000861
1314 -1000861 -957160 -794165 -1898285 -1917689 -590582 -321255 -616510 -669709 -1394857 -650842
1304 -650842 1389620 870808 -588525 -28729 181249 -1183212 -2223033 -1301944 -1270285
1295 -1270285 -914881 299620 1419966 461092 -136190 -1311529 -282057 -808868 -1954340
1286 -1954340 -1376013 171430 -771774 -381549 470932 -297513 -359452 -60588 110862 -487790
1276d87790R53832q55684p13808p06002K038160j32676l174J079269L07720k781500
1266a301653k62556J934314j248191m71082N74673J034875j839832O47674J967414
1257A035636l16284j696590Q56883k75650K74213J58703j107282j008037M74148
1248a604260K10025K5642N88209R234J010817m84694q82422n41279L21207L70087
1238i77434o19988l32674J374835J87353n55176m11862l85244l23717J304077
1229g39830m13193r19944j209130P73924J164536j557124J531165J375411j170937
1220a165122j354494J180353n57252n91473J250460l64969j435047L38215K639296
1211f0033m55747j256984Q12281R54047j511646J24312J199475M69765j683786
$$ plain form
1276 -487790 466042 -389642 -1103450 -1809452 228708 96032 92858 1172127 1479847 -1301653
1266 -1301653 -1564209 370105 -878086 -1349168 -774495 260380 -1579452 -931778 1035636
1257 1035636 719352 -977238 -120355 -396005 -121792 36911 -1070371 -2078408 -1604260
1248 -1604260 -1394235 -1368593 -780384 -771150 239667 -245027 -1127449 -1668728 -1347521 -977434
1238 -977434 -1597422 -1930096 -555261 -367908 -923084 -1334946 -1720190 -2043907 -739830
1229 -739830 -1153023 -2072967 -3282097 -2508173 -1343637 -2900761 -1369596 5815 -1165122
1220 -1165122 -2519616 -1339263 -1896515 -2487988 -1237528 -1602497 -3037544 -2699329 -60033
1211 -60033 -515780 -1772764 -960483 -6436 -1518082 -1393770 -194295 275470 -1408316
1202a408316p72500J768074J11435j206401J430142M62923o98104j464877P18911
1193a058713P26009p49882n80032P24679L26129j02931P32707j047790k74045
1184a303869J754497l45202k987952R32913J999139m5273j756998N69729J687842
1175E04826p26297j017624K98011J163802o172J024413j540557j09985j79542
1166e89125k19153p16121O18084M2113J74183K98048N44496j152951n70153N0783
1156a519796O19127j49498j219717Q8966P47856J311212j532566L37516L50128
1147i66772K33193j372565J171057o70852n98019j84964j25614M65145K069544
1138B0153j61331n68258j407611r87916J291992N02264p57982O42024k63108O3428
$$ plain form
1202 -1408316 -2180816 -412742 -301307 -1507708 -77566 385357 -312747 -1777624 -1058713
1193 -1058713 -332704 -1082586 -1662618 -937939 -611810 -714741 17966 -1029824 -1303869
1184 -1303869 450628 105426 -2882526 -1949613 49526 4253 -1752745 -1183016 504826
1175 504826 -221471 -1239095 -941084 222718 216546 1240959 -299598 -409583 -589125
1166 -589125 -808278 -1524399 -906315 -864202 -690019 -391971 152525 -1000426 -1570579 -1519796
1156 -1519796 -900669 -1050167 -2269884 -2180918 -1433062 -121850 -1654416 -1316900 -966772
1147 -966772 -733579 -2106144 -935087 -1605939 -2203958 -2388922 -2514536 -2049391 20153
1138 20153 -141178 -709436 -2117047 -3104963 -1812971 -1310707 -2068689 -1426665 -1689773 -1626345
1128a626345L27097o35794J076487k77216j258721Q55102m6489p87319N09286
1119a863912k31415K1164J68377J203495K81633o31401m12960J313053j208641
1110a360607l22914O3545n76366O88593Q31577p47268Q7472k09841M05409l86885
1100a527285N51973Q95504O75060j484159m43478J74792r81884Q17678K70925
1091a050874O17392p57897l71933P93122R49897r10442j2818l41254r80349q8225
1081b153381J116815M38697l64570o5556L11640j142822K20148J767239L37883
1072D66093k150599m2951O86703k15039o35375K277957K71246j943248p18462
1063b003675J978747J41421k541390O62691K511525q69747k623233K259792N13203
$$ plain form
1128 -1626345 -1299248 -1935042 -858555 -1135771 -2394492 -1539390 -1585879 -2373198 -1863912
1119 -1863912 -2095327 -2074163 -1905786 -702291 -420658 -1052059 -1465019 -151966 -1360607
1110 -1360607 -1683521 -1619976 -2196342 -1507749 -676172 -1423440 -1335968 -1545809 -1140400 -1527285
1100 -1527285 -975312 -79808 595252 -888907 -1332385 -1157593 -2139477 -1321799 -1050874
1091 -1050874 -433482 -1191379 -1563312 -770190 179707 -730735 -743553 -1084807 -2065156 -2153381
1081 -2153381 -1036566 -597869 -962439 -1027995 -716355 -1859177 -1639029 128210 466093
1072 466093 -1684506 -1727457 -1040754 -1255793 -1891168 386789 658035 -1285213 -2003675
1063 -2003675 -24928 116493 -2424897 -1762206 749319 -120428 -2743661 -483869 29334
1054B9334k101714J86911K357105q82020k238510J940059J684720k166180j431990
1045b622285K672469p0213j389028l81407L23056J288140j73179q77793K05382
1036a024858N41549L77806n71705l53615R04519q01684r99084J488266J41263
1027b97543o0808J538496m94274j628243m62811M51648K60696p62489J23412Q30919
1017e00997l21357J381867L16491j878021o08687J344021r07388K57901L22539
1008e93631O04399m29836n07204J84060n87725j89390J730890N21348k32048q45724
998c44861L04751k97132j48904o19788k96298J230294l63729j14528n53379R82440
988b21134j98943m5648P05071l86658j159326M25473j38543m80325P04063L03376
$$ plain form
1054 29334 -2072380 -1885469 471636 -410384 -2648894 -708835 975885 -1190295 -2622285
1045 -2622285 50184 -20029 -1409057 -1790464 -1467408 -179268 -352447 -1230240 -1024858
1036 -1024858 -483309 -105503 -677208 -1030823 -126304 -927988 -1927072 -438806 -297543
1027 -297543 -358351 1180145 685871 -942372 -1405183 -953535 -692839 -1455328 -1331916 -500997
1017 -500997 -822354 559513 876004 -1002017 -1610704 -266683 -1174071 -916170 -593631
1008 -593631 10768 -419068 -926272 -742212 -1329937 -1519327 211563 732911 500863 -344861
998 -344861 -40110 -337242 -486146 -1105934 -1402232 -171938 -535667 -650195 -1203574 -221134
988 -221134 -420077 -465725 239346 -147312 -1306638 -881165 -1019708 -1500033 -795970 -492594
978d92594j420390J411754Q90369p8906q68196J092329n85827k071180M1487K023954
968e7200O9334n77051j57929P8484P05416l92406l65994M22362p2718n00433p47370
957a595505L93050J020291J12420K88450K46384m44550q71226j39729j81326J47151
947a024590L26717K77891j740960O56006O84471P74269j441113Q10106m69669
938a146872P51336J326645m52522k144404k86969N45444m01056n44536J701148
929f51786R76274r86766J91582O92171j530105m23583m20988L98996j150585k37141
919c141931K118835j76863j355250M73026J699231J63116r73514q01776J60282
910a834844k3104L57394K244m67062K43055K7941q5396P15282R40631j62652L46829
$$ plain form
978 -492594 -1912984 -501230 389139 310233 -557963 534366 -51461 -2122641 -2081154 -57200
968 -57200 12134 -564917 -722846 -644362 61054 -331352 -697346 -274984 -347702 -848135 -1595505
957 -1595505 -1202455 -182164 -69744 218706 465090 20540 -850686 -990415 -1171741 -1024590
947 -1024590 -697873 -419982 -2160942 -1504936 -820465 -46196 -1487309 -677203 -1146872
938 -1146872 -395536 931109 478587 -1665817 -1952786 -1407342 -1808398 -2352934 -651786
929 -651786 324488 -662278 -470696 221475 -1308630 -1732213 -2153201 -1754205 -2904790 -3141931
919 -3141931 -1023096 -1199959 -2555209 -2082183 -382952 -219836 -1193350 -1995126 -1834844
910 -1834844 -1857948 -1500554 -1498310 -1965372 -1722317 -1694376 -1779772 -1064490 -123859 -286511 60318
899F0318j905402k070057J556125J513208o42426r47437J480593Q95268L60833
890C01023o14481J108277k202281r40068P63378N24605j012946J226403K53997
881e92093j657944M96586P13419K50567P61869m65576j049733j691532J950427
872a284010L31749k283095Q85975K654795m1588j224009K63008N82083p84402
863h99494l51207K99561M39451m37877n52956p78830k6457J638790J542098n40468
853C32611l52250o94761o83785m0677j073723j86142N26402J426564k64747N8370
843i52138P33429o0949k677448J060956J419466L15183r77498j13327q96408r88916
833c137650J178709J183102O25389p31373Q99621o32391j821140M20003K51846
$$ plain form
899 60318 -1845084 -3915141 -2359016 -845808 -1488234 -2435671 -955078 -59810 301023
890 301023 -313458 794819 -1407462 -2347530 -1584152 -1059547 -2072493 -846090 -592093
881 -592093 -2250037 -1753451 -1040032 -789465 -27596 -493172 -1542905 -3234437 -1284010
872 -1284010 -952261 -3235356 -2349381 305414 263826 -960183 -697175 -115092 -899494
863 -899494 -1250701 -951140 -511689 -949566 -1502522 -2281352 -2307809 -669019 873079 332611
853 332611 -19639 -714400 -1398185 -1438862 -2512585 -2698727 -2172325 -745761 -1010508 -952138
843 -952138 -218709 -279658 -2957106 -1896150 -476684 -161501 -1138999 -1252326 -2148734 -3137650
833 -3137650 -1958941 -775839 -150450 -881823 17798 -614593 -2435733 -2015730 -1763884
824a763884j520333J070980K168675l40513j870298J416914J046686k232211j418588
815c442572L540497M75527k860806o48423J443339m18226j047905J665863J737054
806D44348r93495l41093J478461l64944j755929J77471k08736j38428J45091J626154
796F8900J265274j919752j593941J942223L85536j087779J12583P47655k35245
787c14546j746336N39273K053482l07864o14987J403543o726j559534k53795K11013
777e96477R91680j336121N02225J564777j494024j209440O18832K337898r67491
768D11859n34648p30738J999187j275150q50388m41933k57188L9309J724777K80007
758C65094q09395P37357K90216j251408j743128J017469J066570m48895j55664
$$ plain form
824 -1763884 -3284217 -2213237 -44562 -385075 -2255373 -838459 208227 -2023984 -3442572
815 -3442572 97925 573452 -2287354 -2935777 -1492438 -1910664 -2958569 -1292706 444348
806 444348 -549147 -890240 588221 223277 -1532652 -1355181 -1563917 -1702345 -1557254 68900
796 68900 1334174 -585578 -2179519 -237296 148240 -939539 -826956 -79301 -314546
787 -314546 -2060882 -1521609 531873 224009 -390978 1012565 1005839 -553695 -807490 -596477
777 -596477 395203 -940918 -438693 1126084 -367940 -1577380 -958548 1379350 411859
768 411859 -122789 -853527 1145660 -129490 -979878 -1421811 -1678999 -1639690 85087 365094
758 365094 -444301 293056 583272 -668136 -2411264 -1393795 -327225 -776120 -931784
749i31784J28029r47380J87606J326825j340022J60930J132472p51986j287799
740b323109J365057K28250m49854j2472J187310j015012m80223N92401M8850n36733
730a395535P04393J13325m87177m68696O49397j125489Q90357J953298p09155
721A24718j043587m08220J761558j495480j227230J659974l214j745605J777089
712e99997M42210q61126M06240L54166j04989j114233P85808J776082j389362
703c05201j635711J016369p9444k94894J253087M89298N5660r59912L6860P81267
693C57379p1882j370579L16457K586J951849j011295k777157J337929J433954
684A69241j049261j15154J995417k95712j481897P4794J59938J73673j550990
$$ plain form
749 -931784 -803755 -1751135 -1563529 -236704 -1576726 -1415796 -283324 -1035310 -2323109
740 -2323109 -958052 -729802 -1179656 -1192128 -4818 -1019830 -1500053 -907652 -858802 -1395535
730 -1395535 -691142 -577817 -1064994 -1533690 -884293 -2009782 -1119425 833873 124718
721 124718 -918869 -1327089 434469 -1061011 -2288241 -628267 -631481 -2377086 -599997
712 -599997 -157787 -1018913 -612673 -258507 -363496 -1477729 -691921 1084161 -305201
703 -305201 -1940912 -924543 -1003987 -1298881 -45794 443504 499164 -460748 -423888 357379
693 357379 285497 -1085082 -768625 -766039 1185810 174515 -2602642 -1264713 169241
684 169241 -880020 -995174 1000243 704531 -777366 -702572 -542634 -368961 -1919951
675a919951J885144n97947j306538J308467O84358j245472M79797L18824o0516
666d53834m18128L84620O40678k113537J91043J761442l61436N81913J156965
657A369726j836450j682381O64077J2408K29843Q05019K24405l82149o92125P16509
647e71118J20528j753251J475078L40491k81779N29458N91964j104688o66294
638a319611j329P70001j81943n46732M78440j086033N61806N6262O67462j035031
628a636708L83297o15103K36114J17806k0388m16132L88560J068387k80521k69353
618a044041R09550L09978k573040o93336Q17430P76498m04273j73352O13540l61204
608a822250M56425n77795j08961K71388k48889L48290L08481q75931o34876R24096
$$ plain form
675 -1919951 -34807 -632754 -1939292 -630825 53533 -1191939 -712142 -393318 -453834
666 -453834 -871962 -487342 153336 -1960201 -1769158 -7716 -369152 212761 1369726
657 1369726 -466724 -2149105 -1485028 -1472620 -1242777 -437758 -213353 -595502 -1287627 -571118
647 -571118 -450590 -2203841 -728763 -388272 -670051 -140593 451371 -653317 -1319611
638 -1319611 -1320940 -550939 -732882 -1279614 -801174 -1887207 -1325401 -1269139 -601677 -1636708
628 -1636708 -1253411 -1868514 -1632400 -1514594 -1534982 -1951114 -1562554 -494167 -774688 -1044041
618 -1044041 -134491 175487 -2397553 -3090889 -2273459 -1496961 -1901234 -2074586 -1461046 -1822250
608 -1822250 -1365825 -1943620 -2052581 -1781193 -2030082 -1681792 -1373311 -2249242 -2884118 -1960022
598a960022J515988m59464j242398J784575K77984k070777k73691P07086m82694
589b203413J402765l11686o88264K91910k18387N30693J94714m51950P02059P30785
579b0774o62042m33918j463284J783019L56710q81222J199137J469401j744575
570c97548m85484o68609O11542M53700l7763O16713M2056j350405M16637J26076
560f73085j113457K707319q88938r05062J606443j290684n25474L04567J58896
551f19475O70234j198374P4758K945714j094222j442625J72987Q57816J87667
542E54480k088981l47490K493893l85340k189214J979887J31410L39097L58240
533H45982M11597o35257j384531j124108J377219k51477P80627K202042q26308
$$ plain form
598 -1960022 -444034 -903498 -2145896 -361321 -83337 -2154114 -2427805 -1720719 -2203413
589 -2203413 -800648 -1112334 -1800598 -1508688 -1727075 -1196382 -1001668 -1453618 -751559 -20774
579 -20774 -682816 -1116734 -2580018 -796999 -440289 -1321511 -122374 1347027 -397548
570 -397548 -883032 -1551641 -940099 -486399 -524162 92551 134607 -1215798 -799161 -673085
560 -673085 -1786542 920777 31839 -873223 733220 -557464 -1082938 -778371 -619475
551 -619475 50759 -1147615 -1072857 1872857 778635 -663990 -491003 366813 554480
542 554480 -1534501 -1881991 611902 226562 -1962652 17235 148645 487742 845982
533 845982 1257579 622322 -762209 -1886317 -509098 -760575 20052 2222094 1395786
524A395786j294198m00770M69727K69633k090249N96906K131974j218740j594627
515a734558K609139q1830j479779l11712J390579M68836k330286J12379J710965
506C53733r91099j314213J023954J430453p78543o89337J94528J492395n73013
497A48858j528224J149592J783621j644693k138670K490522k12259j848327Q90573
488i09007J795810M04725q20828m28786J77944k038331K38435K507898r26790
479A070j033408J360409o16349L89490O4213J40872j091143j10091J136814L4167
469B76044k313515K730801J82218j795618l0601J656513l86765K79156j077036
460d78803n20829q60489K34788J314383p06670j038663J272938M6213k36163J00368
$$ plain form
524 1395786 101588 -299182 170545 440178 -1650071 -1053165 1078809 -139931 -1734558
515 -1734558 874581 792751 -687028 -998740 391839 860675 -1469611 -1357232 353733
506 353733 -637366 -1951579 -927625 502828 -275715 -965052 -770524 721871 148858
497 148858 -1379366 -229774 1553847 -90846 -2229516 261006 48747 -1799580 -909007
488 -909007 886803 1291528 470700 41914 219858 -1818473 -1580038 927860 1070
479 1070 -1032338 328071 -288278 101212 165425 306297 -784846 -894937 241877 276044
469 276044 -2037471 693330 875548 -920070 -950671 705842 319077 598233 -478803
460 -478803 -999632 -1860121 -1625333 -310950 -1017620 -2056283 -783345 -737132 -973295 -872927
450h72927n52285R44335o2253j442707l1568L54910J13515o80026N53953J423963
440b51090K06459r47143L63213k054210j187901K338398N4178j106887J40427
431b444556Q53700j439278J354228J98738Q43766l206027K218763J12912q88101
422b395855L6531J307417j578667K33336N09752J360648r88447J69654J46398
413a199233p62230j398899J192832Q13213j085082R23178q85864j64445J490772
404a075758O86316Q42316n54307m61068M0332o88122q17684m09701J039737J263846
394a34093m60636k02424J878745j363251j86710J087410p33207j017692Q79191
385b52667Q8846j180211q15455J245460J122867n33307p22932J400405O2971n88353
$$ plain form
450 -872927 -1425212 -480877 -543130 -1985837 -2017405 -1662495 -1548980 -2229006 -1675053 -251090
440 -251090 -44631 -991774 -628561 -2682771 -3870672 -1532274 -1478096 -2584983 -2444556
431 -2444556 -1590856 -3030134 -1675906 -1477168 -633402 -3839429 -1620666 -1507754 -2395855
422 -2395855 -2359324 -1051907 -2630574 -2397238 -1887486 -526838 -1515285 -1345631 -1199233
413 -1199233 -1961463 -3360362 -2167530 -1354317 -2439399 -1516221 -2402085 -2566530 -1075758
404 -1075758 -389442 452874 -101433 -562501 -522169 -1210291 -2027975 -2437676 -1397939 -134093
394 -134093 -594729 -797153 1081592 -281659 -468369 619041 -114166 -1131858 -252667
385 -252667 -163821 -1344032 -2159487 -914027 208840 -324467 -1047399 353006 415977 -172376
375a72376j390757L22012P10545M53137r17825Q93497l33871M7236j203494P57280
365h34616M42778o51161J62778p2329l2583j436836j24792J422191J207041j025197
355i42726j57166R91669K12824o04011r56335n2870P56514j154314o80502R37684
345a649233J118733n07454J120811k73208r69619k67378P55224K57648j806907
336b221383K96952J397214j60762p52918J130137P95715p06020r12351R7643n33694
326a569467l04809J787879n04408j154063P35877J083850j078334j47561Q1481
317a069555J627104p72770q59299K55401J19866k44950L79816J003776n47615
308a08226L57767o43585J556978j453651J058525L05457J4513j695804L24284
$$ plain form
375 -172376 -1563133 -1241121 -530576 -77439 -995264 -101767 -435638 -388402 -1591896 -834616
365 -834616 -391838 -1042999 -880221 -952550 -985133 -2421969 -2546761 -1124570 82471 -942726
355 -942726 -1099892 -108223 104601 -499410 -1455745 -1508615 -752101 -1906415 -2586917 -1649233
345 -1649233 -530500 -1037954 82857 -190351 -1159970 -1427348 -672124 -414476 -2221383
336 -2221383 -1924431 -527217 -687979 -1440897 -310760 484955 -221065 -1133416 -1035773 -1569467
326 -1569467 -1874276 -86397 -590805 -1744868 -1008991 74859 -1003475 -1151036 -1069555
317 -1069555 557549 -215221 -1074520 -819119 -699253 -944203 -564387 439389 -108226
308 -108226 249541 -394044 1162934 -290717 767808 1073265 1087778 -608026 -283742
299b83742m3193k19566J69026J096485j824405j58190J622025R64935j582847
290b59472j321850J385470J38169j727586K52115K517418J019450k430821j64466
281e91573J057421k31931r72630J141147N20524k648771o92895K172044J366j107937
271a353235J708614Q46740j751164n72535R94868j027191j069796Q46116J224978
262a52605r65439Q29414r56609P28287q2902n6976n90935J145762q29536l5406
252i66945j091211Q93655R27388m1398j149956R92197o5062K60843l4970l18014
242e93473n59046q0023o94384J434309O59312m59452M4872p3127p67561M02115
232f86458J511206r27811k37289M67720n5694j108969N98560R76132o83873r34359
$$ plain form
299 -283742 -326935 -546501 -377475 719010 -1105395 -1263585 358440 1323375 -259472
290 -259472 -1581322 -195852 -57683 -1785269 -1533154 984264 2003714 -427107 -591573
281 -591573 465848 233917 -738713 402434 922958 -1725813 -2418708 -246664 -245298 -1353235
271 -1353235 355379 1202119 -549045 -1121580 -126712 -1153903 -2223699 -1377583 -152605
262 -152605 -1118044 -288630 -1245239 -516952 -599854 -656830 -1247765 -102003 -931539 -966945
252 -966945 -2058156 -1164501 -237113 -278511 -1428467 -436270 -501332 -240489 -275459 -593473
242 -593473 -1152519 -1232542 -1926926 -492617 166695 -292757 -247885 -321012 -1088573 -686458
232 -686458 824748 -103063 -340352 127368 71674 -1037295 -438735 537397 -146476 -1080835
222a080835J410696m83557o82905P9136K73421r34089o9456J304355l68168m40837
212i92239r892R54169n7072q29702N94529m7115k65378j12502K765j228419J124600
201h66256L92727N3626l60967J016657p66524j120481l22767J302969j33435L2685
191g71766N55075L00853k91179j236530o3411R694P15256j072275O45513q8892
181a297662R659M76692j15495q22558L99186K84665P52868p37809O5132R35662
171d9660K91465j551912K52001J229182j395840q14894Q33633J48747p83611P21830
161a119059J662454m73355r14701r6703M58726j57385l42184m16213J36451M05038
151h56931L99781k62877o74113M91717J373747k41239j433158p8560J474461j021794
$$ plain form
222 -1080835 329861 -153696 -836601 -757465 -484044 -1418133 -1487589 -183234 -551402 -992239
212 -992239 -1002131 -47962 -105034 -934736 -340207 -387322 -652700 -765202 -762437 -1990856 -866256
201 -866256 -473529 -419903 -780870 235787 -530737 -1651218 -1973985 -671016 -804451 -771766
191 -771766 -216691 84162 -207017 -1443547 -1506958 -1497264 -782008 -1854283 -1208770 -1297662
181 -1297662 -1288003 -811311 -926806 -1749364 -1350178 -1065513 -312645 -1050454 -985322 -49660
171 -49660 241805 -1310107 -1058106 171076 -1224764 -2039658 -1206025 -1057278 -1840889 -1119059
161 -1119059 543395 70040 -844661 -941364 -482638 -640023 -982207 -1398420 -1261969 -856931
151 -856931 -457150 -720027 -1394140 -902423 471324 230085 -1203073 -1281633 192828 -828966
141h28966r40116J439232O71114r86989q61187J499017j143628p99403O11760
132a339166R01845j633197M97346J111928k7326j089939J441950r7305p00364
123i34228n04697J562362j185965j215937J402857K78396j495271L67490R50752
114g74241M9359j8677o2802n55724l50149j89813P31600j60366M8433k38604n89144
103b110128Q7568M11218O99067J14581j46285n85224O33327n14837j0354N92648
93h28419m2030J3820m44330N35918M00196l93505m81196J24443p13654J165151
83f63606J235138j853489L43087Q45638n84961r13095J258018O99643l93898k42172
73b69697O35414j274448l41744Q08656O68588r38335N92698J081052n77245j228612
$$ plain form
141 -828966 -1769082 -329850 341264 -645725 -1506912 -7895 -1151523 -1950926 -1339166
132 -1339166 -437321 -2070518 -1573172 -461244 -488570 -1578509 -136559 -233864 -934228
123 -934228 -1438925 123437 -1062528 -2278465 -875608 -597212 -2092483 -1724993 -774241
114 -774241 -724882 -743559 -806361 -1362085 -1712234 -1902047 -1170447 -1330813 -1282380 -1520984 -2110128
103 -2110128 -2022560 -1611342 -912275 -797694 -943979 -1529203 -895876 -1410713 -1421067 -828419
93 -828419 -870449 -856629 -1300959 -765041 -364845 -758350 -1239546 -1115103 -1828757 -663606
83 -663606 571532 -1281957 -938870 -93232 -678193 -1591288 -333270 366373 -27525 -269697
73 -269697 365717 -908731 -1250475 -441819 226769 -711566 -118868 962184 384939 -843673
63h43673k29957N36609l27754J79152J043442o47888o12645M22782N38386p87411
53g28957m96080R51878N12204j043967k56274N51258l7189q84944N98170Q43385
43I484n19978J82393Q87387j647777j642285K340577J423408j862750o46769J452364
33b3946l19774k056323N92655J444917p5983m3494O35028J89958j068618j249555
23a975135O46509J57331p05702R49157J076588j0484l58520p79o2604n18491P3656
12g28474M44515m34066p04866J480590k59897j054353R97897J178366n68256m42645
2i1189J45316Q40325
0H94452
$$ plain form
63 -843673 -1073630 -537021 -864775 -685623 357819 -290069 -902714 -479932 58454 -728957
53 -728957 -1225037 -273159 239045 -804922 -1061196 -509938 -547127 -1432071 -833901 9484
43 9484 -510494 -328101 559286 -1088491 -2730776 -390199 1033209 -829541 -1476310 -23946
33 -23946 -343720 -2400043 -1807388 -362471 -438454 -481948 153080 343038 -725580 -1975135
23 -1975135 -1328626 -1171295 -1876997 -927840 148748 138264 -220256 -221035 -283639 -802130 -728474
12 -728474 -283959 -718025 -1422891 57699 -202198 -1256551 -258654 919712 351456 -91189
2 -91189 54127 894452
0 894452
$$ Imaginary data points
##PAGE= N=2
##DATA TABLE= (X++(I..I)), XYDATA
16383c975978J089541K74299N24917K64397j280592k37285J586408j000254n27286
16374c281833J233285J90730j089169j40931R64667J72210j727968R70607J185946
16365a522456q34529n40224J875198n0810j465204n93399J320961j58132q53159
16356b821754R92907M64369q20900l07699P24002O27890m86871j373426J035832
16347a965650K09911j886605J047177K412403j72443j249256O04120P89308j182464
16338a393499j618794J425378J051887j311807O51672P76856O6404o3421L60158
16329e5166m82084o56185N41645O09748n00047p35198J018334Q31909j511437
16320i38481K53240J111755l75896p53713M78026N95866L78059k43020K90399
$$ plain form
16383 -3975978 -2886437 -2612138 -2087221 -1822824 -3103416 -3340701 -1754293 -2754547 -3281833
16374 -3281833 -2048548 -1857818 -2946987 -3087918 -2123251 -1951041 -3679009 -2708402 -1522456
16365 -1522456 -2356985 -2897209 -1022011 -1072821 -2538025 -3131424 -1810463 -1968595 -2821754
16356 -2821754 -1828847 -1364478 -2185378 -2493077 -1769075 -1141185 -1628056 -3001482 -1965650
16347 -1965650 -1755739 -3642344 -2595167 -182764 -355207 -1604463 -1000343 -211035 -1393499
16338 -1393499 -3012293 -1586915 -535028 -1846835 -1195163 -418307 -351903 -415324 -55166
16329 -55166 -537250 -1193435 -651790 -42042 -542089 -1277287 -258953 572956 -938481
16320 -938481 -685241 426514 50618 -703095 -225069 370797 748856 505836 796235
16311G96235k17574o99783M17268L79496j24837k23587R48838J17176J0370J9057
16301A422659j042384l48802J240805P62497j102520j113721K565308K39450l175196
16292e51904O80559K981860j203326r73970J29989O55359n55920j57476J639915
16283B645086m47174j457701J538945L85086j829806M92650j22635k01967m48984
16274E53500N15684P71335J71998r5813J074017r50920o73494J617000L09076
16265C292383r25365m89085M80208K03770j289844L94002J925300j278611k34247
16256B078511J303288n36376j55011O5441M69567j364248k48529J877166J005925
16247D495734l018481J74214J645381m8601n55947L02333m73164J193874r45982
$$ plain form
16311 796235 578661 -121122 296146 675642 550805 327218 1276056 1393232 1403602 1422659
16301 1422659 380275 31473 1272278 2034775 932255 -181466 2383842 2623292 -551904
16292 -551904 128655 3110515 1907189 933219 1063208 1718567 1162647 1005171 2645086
16283 2645086 2197912 740211 2279156 2664242 834436 1327086 1204451 1002484 553500
16274 553500 1069184 1840519 2012517 1916704 2990721 2039801 1366307 2983307 3292383
16265 3292383 2367018 1877933 2358141 2561911 1272067 1666069 3591369 2312758 2078511
16256 2078511 3381799 2845423 2690412 2755853 3225420 1861172 1612643 3489809 4495734
16247 4495734 1477253 1651467 3296848 3248247 2692300 2994633 2521469 3715343 2769361
16238B769361m35460L79101J282627m15157r69340l18510J255514m03583m73990
16229B670563J081401p37171k48508R09353n92828o18609O65307o92981J453799
16220C890326M47486m10544P4590J057568n68124j929047L85320O98718p37016
16211B909277Q31104J246650j126862j348724J680392p3522k126846L86485J793982
16202D171936r33299q0382J070143R01777j711345p26764L18690p29269o59443
16193A622044J954050p31185m26774J302051O49148k099205M47425n0554Q10628
16184C477628o56620p11644J221742J374554j550502j131707Q06254M05638j068188
16175B167155m31501J606869K63906j148907J349783L515j341282N0890J24869
$$ plain form
16238 2769361 2333901 2713002 3995629 3580472 2611132 2292622 3548136 3144553 2670563
16229 2670563 3751964 3014793 2766285 3675638 3082810 2464201 3129508 2436527 3890326
16220 3890326 4337812 3927268 4001858 5059426 4491302 2562255 2947575 3646293 2909277
16211 2909277 3740381 4987031 3860169 2511445 4191837 4118315 1991469 2377954 4171936
16202 4171936 3238637 3158255 4228398 5130175 3418830 2692066 3010756 2281487 1622044
16193 1622044 3576094 2844909 2418135 3720186 4369334 2270129 2717554 2667000 3477628
16184 3477628 2821008 2109364 3331106 4705660 3155158 2023451 2829705 3235343 2167155
16175 2167155 1735654 3342523 3606429 2457522 3807305 3810820 2469538 2520428 2645297
16166B645297R253j87734N55038l8799J93709k93788N25950j029398o7883K138949
16156D450594o7730k044734N80520J180801M57097j835671M4864J675493q88781
16147C552453o52013R38450K72761j51945r25335O41623K50924m26078J51032
16138C651872J528295r84645q35808L14770J144012l15926j30065j17918J093825
16129E348412j88459m86630J49734o41106m05147K49943j28099k49102k16718
16120C432828O16298P48320j16241q00466m34059M84478M37534l4857m59547l37764
16110C536524P93588L51488q42429N9385J261956K50571j654557n50295J583604
16101D789835n45273j199866Q57392J049007j342053J31451J029565k16971j016377
$$ plain form
16166 2645297 2654550 2466816 3021854 2983055 3176764 2882976 3408926 2379528 2311645 4450594
16156 4450594 4382864 2338130 2918650 4099451 4556548 2720877 2765741 4441234 3552453
16147 3552453 2900440 3838890 4111651 3959706 3034371 3675994 3926918 3500840 3651872
16138 3651872 5180167 4195522 3359714 3674484 4818496 4502570 4372505 4254587 5348412
16129 5348412 5159953 4673323 4823057 4181951 3776804 4026747 3898648 3649546 3432828
16120 3432828 4049126 4797446 4681205 3880739 3446680 3931158 4368692 4333835 3874288 3536524
16110 3536524 4330112 4681600 3839171 3898556 5160512 5411083 3756526 3206231 4789835
16101 4789835 4244562 3044696 3902088 4951095 3609042 3740493 4770058 4553087 3536710
16092C536710k44618J039008M26190m11396j27138K99287j409528P47125M9880
16083C905520O291j396400L48791K154481m26209j968695J419378J415570j949149
16074C509578j199939K255946L83758k860696M50497L183275j863807j160666
16066B697946K878712J122162l946133m7223K605463m91119k277080R98224J663717
16057E204669r27574j766256J102088L52667n8660m20504L91123J078884j197246
16048C759191n12360J650535O7221j743536r2598J138941N26093j163993n4109
16039C575385J301377p42845p88221J025571n25622n92174M30273r9403K29356
16030C813697l19261Q90247K29655n54546n03024n8635L06354N00502l71494Q76
$$ plain form
16092 3536710 3292092 4331100 4757290 4345894 4218756 4518043 3108515 3855640 3905520
16083 3905520 3911811 2515411 2864202 5018683 4592474 2623779 4043157 5458727 3509578
16074 3509578 2309639 4565585 4949343 2088647 2539144 5722419 3858612 2697946
16066 2697946 5576658 6698820 2752687 2705464 5310927 4819808 2542728 3540952 5204669
16057 5204669 4277095 2510839 3612927 3965594 3906934 3486430 3877553 4956437 3759191
16048 3759191 3246831 4897366 4964587 3221051 3128453 4267394 4793487 3629494 3575385
16039 3575385 4876762 4133917 3345696 4371267 3845645 3253471 3683744 3584341 3813697
16030 3813697 3494436 4384683 4614338 4059792 3556768 3498133 3804487 4304989 3933495 3934371
16020C934371O58840r29755p11005L07121J170209L59393j381477l9078J235565
16011D604184o45569m09397m79818Q12205L29993M74297k41042N47729p14789
$$ plain form
16020 3934371 4593211 3663456 2952451 3259572 4429781 4789174 3407697 3368619 4604184
16011 4604184 3958615 3549218 3069400 3881605 4211598 4685895 4444853 4992582 4277793
$$ [...]
##END NTUPLES=NMR SPECTRUM
##END=
