##TITLE=1H_DE-80H_X3
 200.13MHz, d2o
 8 sc
 
 19ns.26.2.2025
##JCAMPDX= 6.0         $$ Bruker NMR JCAMP-DX V2.0
##DATA TYPE= NMR SPECTRUM
##DATA CLASS= NTUPLES
##ORIGIN= UXNMR, Bruker Analytische Messtechnik GmbH
##OWNER= pz
$$ XWIN-NMR		Version 3.5
$$ Thu Dec 18 10:32:43 2025 Russian Standard Time (UT+4h)  Yarkov@DPX200
##.OBSERVE FREQUENCY= 200.1313
##.OBSERVE NUCLEUS= ^1H
##.ACQUISITION MODE= SIMULTANEOUS
##.ACQUISITION SCHEME= undefined
##.AVERAGES= 8
##.DIGITISER RES= 18
##SPECTROMETER/DATA SYSTEM= spect
##.PULSE SEQUENCE= zg30
##.SOLVENT NAME= DMSO
##.SHIFT REFERENCE= (INTERNAL, DMSO, 0, 15.4957)
##AUDIT TRAIL= $$ (NUMBER, WHEN, WHO, WHERE, WHAT)
$$ ##TITLE= Audit trail, XWIN-NMR		Version 3.5
$$ ##JCAMPDX= 5.01
$$ ##ORIGIN= Bruker BioSpin GmbH
$$ ##OWNER= Yarkov
$$ C:/Bruker/XWIN-NMR/data/yarkov2/nmr/H-C/1/pdata/1/auditp.txt
$$ ##AUDIT TRAIL=  $$ (NUMBER, WHEN, WHO, WHERE, WHAT)
(   1,<2025-12-18 10:31:50.42 +0400>,<Yarkov>,<DPX200>,
      <created by zg, POWCHK disabled, PULCHK disabled
       configuration hash MD5:
       00 E9 B6 7A A2 85 ED C7 34 08 36 98 17 FE 4E 26
       data hash MD5: 16K
       B4 D8 50 0F C6 BD CC A0 6F 8A DF A0 F3 9E 05 AB>)
(   2,<2025-12-18 10:31:53.46 +0400>,<Yarkov>,<DPX200>,
      <Start of raw data processing
       efp BC_mod = 2 LB = 0.25 FT_mod = 6 PKNL = 1 PHC0 = -5305.955 PHC1 = 10.82193 SI = 16K 
       data hash MD5: 16K
       63 68 D6 A1 F3 6F 81 01 BE 0A D5 55 4A 02 2A 54>)
$$ ##END=
$$ 
$$ hash MD5
$$ 0B 7C B9 CF 67 2A 2D 17 6A 80 A8 BD BE B2 7E 45
##$RELAX= 
##$RELAX= 
##$RELAX= 
##$RELAX= 
##$RELAX= 
##$RELAX= 
$$ Bruker specific parameters
$$ --------------------------
##$DU= <C:/Bruker/XWIN-NMR>
##$EXPNO= 1
##$NAME= <H-C>
##$PROCNO= 1
##$TYPE= <nmr>
##$USER= <yarkov2>
##$AMP= (0..31)
100 100 100 100 100 100 100 100 100 100 100 100 100 100 100 100 100 100 
100 100 100 100 100 100 100 100 100 100 100 100 100 100 
##$AQSEQ= 0
##$AQ_mod= 1
##$AUNM= <au_zg>
##$AUTOPOS= <>
##$BF1= 200.13
##$BF2= 200.13
##$BF3= 200.13
##$BF4= 200.13
##$BF5= 200.13
##$BF6= 200.13
##$BF7= 200.13
##$BF8= 200.13
##$BYTORDA= 1
##$CFDGTYP= 0
##$CFRGTYP= 5
##$CHEMSTR= <none>
##$CNST= (0..31)
1 1 145 1 1 1 1 1 1 1 1 1 1 1 1 1 1 1 1 1 1 1 1 1 1 1 1 1 1 1 1 1 
##$CPDPRG= <>
##$CPDPRG1= <>
##$CPDPRG2= <>
##$CPDPRG3= <>
##$CPDPRG4= <mlev>
##$CPDPRG5= <mlev>
##$CPDPRG6= <mlev>
##$CPDPRG7= <mlev>
##$CPDPRG8= <mlev>
##$CPDPRGB= <>
##$CPDPRGT= <>
##$D= (0..31)
0 0.7 0 0 0 0 0 0 0 0 0 0.03 0 0 0 0 0 0 0 0 0 0 0 0 0 0 0 0 0 0 0 0 
##$DATE= 1766039509
##$DBL= (0..7)
120 120 120 120 120 120 120 120 
##$DBP= (0..7)
150 150 150 150 150 150 150 150 
##$DBP07= 0
##$DBPNAM0= <>
##$DBPNAM1= <>
##$DBPNAM2= <>
##$DBPNAM3= <>
##$DBPNAM4= <>
##$DBPNAM5= <>
##$DBPNAM6= <>
##$DBPNAM7= <>
##$DBPOAL= (0..7)
0.5 0.5 0.5 0.5 0.5 0.5 0.5 0.5 
##$DBPOFFS= (0..7)
0 0 0 0 0 0 0 0 
##$DE= 6
##$DECBNUC= <off>
##$DECIM= 32
##$DECNUC= <off>
##$DECSTAT= 4
##$DIGMOD= 1
##$DIGTYP= 9
##$DL= (0..7)
0 120 120 120 120 120 120 120 
##$DP= (0..7)
$$ [...]
##$SUBNAM2= <"">
##$SUBNAM3= <"">
##$SUBNAM4= <"">
##$SUBNAM5= <"">
##$SUBNAM6= <"">
##$SUBNAM7= <"">
##$SUBNAM8= <"">
##$SUBNAM9= <"">
##$SW= 18.0517328524113
##$SWIBOX= (0..15)
0 0 2 0 0 0 0 0 0 0 0 0 0 0 0 0 
##$SW_h= 3612.71676300578
##$TD= 16384
##$TD0= 1
##$TE= 0
##$TE2= 300
##$TE3= 300
##$TEG= 300
##$TL= (0..7)
0 120 120 120 120 120 120 120 
##$TP= (0..7)
150 150 150 150 150 150 150 150 
##$TP07= 0
##$TPNAME0= <>
##$TPNAME1= <>
##$TPNAME2= <>
##$TPNAME3= <>
##$TPNAME4= <>
##$TPNAME5= <>
##$TPNAME6= <>
##$TPNAME7= <>
##$TPOAL= (0..7)
0.5 0.5 0.5 0.5 0.5 0.5 0.5 0.5 
##$TPOFFS= (0..7)
0 0 0 0 0 0 0 0 
##$TUNHIN= 0
##$TUNHOUT= 0
##$TUNXOUT= 0
##$USERA1= <user>
##$USERA2= <user>
##$USERA3= <user>
##$USERA4= <user>
##$USERA5= <user>
##$V9= 5
##$VALIST= <valist>
##$VCLIST= <CCCCCCCCCCCCCCC>
##$VD= 0
##$VDLIST= <DDDDDDDDDDDDDDD>
##$VPLIST= <PPPPPPPPPPPPPPP>
##$VTLIST= <TTTTTTTTTTTTTTT>
##$WBST= 1024
##$WBSW= 4
##$XGAIN= (0..3)
0 0 0 0 
##$XL= 0
##$YL= 0
##$YMAX_a= 174311
##$YMIN_a= -138753
##$ZGOPTNS= <>
##$ZL1= 120
##$ZL2= 120
##$ZL3= 120
##$ZL4= 120
##$ABSF1= 0
##$ABSF2= 0
##$ABSG= 0
##$ABSL= 0
##$ALPHA= 0
##$AQORDER= 0
##$ASSFAC= 0
##$ASSFACI= 0
##$ASSFACX= 0
##$ASSWID= 0
##$AUNMP= <proc_1d>
##$AZFE= 0.1
##$AZFW= 0.1
##$BCFW= 0
##$BC_mod= 2
##$BYTORDP= 0
##$COROFFS= 0
##$CY= -3
##$DATMOD= 1
##$DC= 0
##$DFILT= <>
##$DTYPP= 0
##$F1P= 0
##$F2P= 0
##$FCOR= 1
##$FTSIZE= 16384
##$FT_mod= 6
##$GAMMA= 0
##$GB= 0
##$INTBC= 1
##$INTSCL= 3.241238e-09
##$ISEN= 128
##$LB= 0.25
##$LEV0= 0
##$LPBIN= 0
##$MAXI= 10000
##$MC2= 0
##$MEAN= 0
##$ME_mod= 0
##$MI= 1.114404
##$NCOEF= 0
##$NC_proc= -6
##$NLEV= 6
##$NOISF1= 3.799351
##$NOISF2= 2.8
##$NSP= 0
##$NTH_PI= 0
##$NZP= 0
##$OFFSET= 15.4957
##$PC= 1
##$PHC0= -5305.955
##$PHC1= 10.82193
##$PH_mod= 1
##$PKNL= yes
##$PPARMOD= 0
##$PSCAL= 0
##$PSIGN= 0
##$REVERSE= no
##$SF= 200.130005203802
##$SI= 16384
##$SIGF1= 3
##$SIGF2= 2
##$SINO= 0.751879
##$SIOLD= 32768
##$SREGLST= <19F.Aceton>
##$SSB= 0
##$STSI= 16384
##$STSR= 0
##$SW_p= 3612.71676300578
##$SYMM= 0
##$S_DEV= 0
##$TDeff= 16384
##$TDoff= 0
##$TI= <>
##$TILT= no
##$TM1= 0
##$TM2= 0
##$TOPLEV= 0
##$USERP1= <user>
##$USERP2= <user>
##$USERP3= <user>
##$USERP4= <user>
##$USERP5= <user>
##$WDW= 1
##$XDIM= 16384
##$YMAX_p= 427002589
##$YMIN_p= -356864
$$ End of Bruker specific parameters
$$ ---------------------------------
##NTUPLES= NMR SPECTRUM
##VAR_NAME=  FREQUENCY,     SPECTRUM/REAL,   SPECTRUM/IMAG
##SYMBOL=    X,             R,               I
##VAR_TYPE=  INDEPENDENT,   DEPENDENT,       DEPENDENT
##VAR_FORM=  AFFN,          ASDF,            ASDF
##VAR_DIM=   16384,         16384,           16384
##UNITS=     HZ,            ARBITRARY UNITS, ARBITRARY UNITS
##FACTOR=    0.220516191357247, 1,           1
##FIRST=     3101.15449812274, 0,            0
##LAST=      -511.562264883035, 0,           0
##MIN=       -511.562264883035, -356864,     0
##MAX=       3101.15449812274, 427002589,    0
$$ Real data points
##PAGE= N=1
##DATA TABLE= (X++(R..R)), XYDATA
$$ [...]
8769A6944829j268821r97048p17363o22606n80930o43797p07334p62931p98356
8760I845643o77680o24454l98725k66924k95365j85267j2416K8797K12494K60987
8750G887090M44283M95074N19913N15674M62407M69339M37804M21263N52942O39925
8740A2845714Q89957J121686J417299J493997J465242J078530M70390l14631j011619
8731A9456565j569829j760293j917946j844633j667811j470347j190009j058765
8723F976932q27190o72873n70275m22711l50850l16516k93051q1193j87272k06486
8713C048515j23033j25942j42813j01031j43079j53403r1706o2006k7206p9063
8703A999233m3807j11210k1672j04306j10388k4847n7620o2023k1550l6439m0245
$$ y = [16944829, 15676008, 14678960, 13961597, 13338991, 12758061, 12114264, 11406930, 10643999, 9845643, 9167963, 8543509, 8144784, 7877860, 7582495, 7397228, 7384812, 7413609, 7626103, 7887090, 8331373, 8826447, 9346360, 9862034, 10324441, 10793780, 11231584, 11652847, 12205789, 12845714, 13735671, 14857357, 16274656, 17768653, 19233895, 20312425, 20782815, 20468184, 19456565, 17886736, 16126443, 14208497, 12363864, 10696053, 9225706, 8035697, 6976932, 6149742, 5476869, 4906594, 4483883, 4133033, 3816517, 3523466, 3442273, 3255001, 3048515, 2925482, 2799540, 2656727, 2555696, 2412617, 2259214, 2167508, 2105502, 2078296, 1999233, 1955426, 1844216, 1822544, 1718238, 1607850, 1583003, 1525383, 1463360, 1441810, 1405371, 1365126]
8692A365126n4983o3162o9897J0467J7893l2926l5190j2781n2636n1172m4732
8681I76007N7815j9841m3308J2087l7756j5266Q277j3893m3787j0901Q7040r076
8669I47398l5300K5741j4661k3093q6859l3683J214K8223J39k4423L1952J5031
8657H31679m8074q2813o0669J2972M3405m0162m7501o8068L8165k6134n3005k2594
8645D77201j7267K6372p5687L2243Q24j7705J2602L202K869p1582m628k157l431
8632C62856J7177k0167j7608k3361L1208M6626l1261o080J5701l0437p0414m1430
8620B32810L5212P760k432j8589J0133N3260k1680M9399j5941k3912L150K2586
8608C31756q6973q4357N1197K0613n6965L1358o6968K505K6455n2356J9596j8769
$$ y = [1365126, 1310143, 1246981, 1177084, 1187551, 1205444, 1172518, 1137328, 1124547, 1071911, 1020739, 976007, 1033822, 1013981, 970673, 982760, 945004, 929738, 938015, 924122, 880335, 869434, 956474, 947398, 912098, 937839, 923178, 900085, 813226, 779543, 780757, 808980, 809119, 784696, 816648, 831679, 783605, 700792, 640123, 653095, 696500, 656338, 608837, 540769, 578934, 552800, 499795, 477201, 459934, 486306, 410619, 442862, 443686, 425981, 438583, 441785, 444654, 373072, 368444, 366287, 362856, 380033, 359866, 342258, 318897, 350105, 396731, 365470, 359390, 375091, 344654, 274240, 232810, 268022, 275782, 273350, 254761, 264894, 318154, 296474, 345873, 329932, 306020, 309170, 331756, 244783, 160426, 211623, 232236, 175271, 206629, 139661, 142166, 168621, 116265, 135861, 117092]
8596A17092K7997l2466K8256n5698k9206N1173j9597K9060O960P618m9886p1153
8584A0150J2044m709j05537J32021Q7128l6137m0539n1436J09496N8517o6917
8573A04081l2082J9144k4547k9693P6712q029k4900N3856q9952K0413J7254m8297
8561C3960p094M5754L9778l0011o0242N4789M1198J3154l4820O7112p8835k697
8549H2046l5464l2291P3007j3875j7877k9613L1845J8376K8155m8598q9304N0117
8537A6524n532l302l6563J7463Q8288O501J0891l7131j8757k2437M967J6485r3960
8524e6563O4248N6963l5827n1877N8009P4099n4381K565j3753O907l568p774N1667
8511I0715J06444o8491k6463m6802M5827J5698m1393k3806M0519k0906L8468P681
$$ y = [117092, 145089, 112623, 140879, 85181, 55975, 107148, 87551, 116611, 123571, 131189, 81303, 10150, 22194, 17485, -88052, 43969, 131097, 94960, 54421, 2985, 112481, 170998, 104081, 71999, 91143, 66596, 36903, 113615, 105586, 80686, 134542, 44590, 65003, 82257, 33960, 26866, 72620, 112398, 82387, 22145, 76934, 118132, 131286, 96466, 163578, 84743, 82046, 46582, 14291, 87298, 73423, 55546, 25933, 57778, 76154, 104309, 55711, -33593, 16524, 10992, 7690, -28873, -11410, 76878, 83379, 94270, 57139, 38382, 15945, 20912, 37397, -56563, 7685, 64648, 28821, -23056, 34953, 109052, 54671, 57236, 43483, 50390, 46822, 39048, 90715, 197159, 128668, 102205, 55403, 101230, 116928, 75535, 51729, 92248, 71342, 109810, 117491]
8499A17491L3204j9236j7789k0298j8903N6883K7121p4957j08142J6986Q256O4685
8487F5301r705L2532n3272q7370M5278J0716q121j4491n0300M0524J8170K2149
8475A1411J7411N3916o2641j9797N6752L9370j9478l1638K2184k503r90n6342
8463G655m3861M7372N6462n1493j3409j4701j6784N8678m7591K4983J9949l3359
8451f099K7303O4477m4988k7097J0550L4149J1934m8360Q263l2027J1033N920
8439A5058k6425q065P3672L4810l5793p4822K8532M7842N8458M337K0667m9475
8427H8796K9482L8904p8605K7072Q072O2056O227l2048o1332k7189O3590m2412
8415H2613k0313K4424R750M769k1373j9503J0006N242k3339J2157J367J8844p992
$$ y = [117491, 150695, 131459, 113670, 93372, 74469, 131352, 158473, 83516, -24626, -7640, 616, 65301, 55596, 88128, 34856, -52514, -7236, 3480, -4641, -19132, -69432, -28908, -10738, 11411, 28822, 82738, 20097, 300, 57052, 96422, 76944, 45306, 67490, 64987, 63997, 7655, -36206, 11166, 67628, 16135, 2726, -11975, -28759, 29919, -17672, 7311, 27260, -6099, 21204, 85681, 40693, 13596, 24146, 58295, 70229, 21869, 30132, -1895, 9138, 15058, -11367, -19432, 54240, 89050, 53257, -21565, 6967, 54809, 113267, 117604, 138271, 88796, 118278, 157182, 78577, 105649, 113721, 175777, 182004, 149956, 88624, 61435, 125025, 82613, 62300, 86724, 96474, 101243, 79870, 60367, 70373, 75615, 52276, 64433, 65800, 84644, 76652]
8402G6652m1648J1972O3432K0406L6629j535l2124j5957j709L9004k6778K2633
8390A50977J1592p3234k9918j5654K9583j83N4138j2685j3729l7005M7016J1686
8378A22584j06117N2961j1401M6331q333k9777n223J8806k5502P914L1622J1813
8366A05678n7243J18286N739l3435J0361o8941M6542j8146M3425k5311k0509l4986
8354G1460k2926L0899J7844n6709m9807N7056L7182k6012K0024n6881L2228J5693
8342G0051n8275k6055j1746k5496P2987K4944n1503L3432K7102m3375L6965j4143
8330C4888j497R389o1318K9339M5055N8561l2295Q678n0385n545L4479J3712j7490
8317F5571o1342O940k9320K0129N3490m219m0556L6023N2113K0028m1868k7801
$$ y = [76652, 35004, 46976, 110408, 130814, 167443, 165908, 133784, 117827, 116118, 155122, 128344, 150977, 162569, 89335, 59417, 43763, 73346, 73163, 127301, 114616, 100887, 63882, 110898, 122584, 16467, 69428, 58027, 104358, 96025, 66248, 61025, 79831, 54329, 62243, 93865, 105678, 48435, 166721, 172460, 139025, 149386, 80445, 126987, 108841, 152266, 126955, 106446, 71460, 48534, 79433, 97277, 40568, -9239, 47817, 84999, 58987, 79011, 22130, 54358, 70051, 11776, -14279, -26025, -51521, 21466, 46410, -5093, 28339, 55441, 12066, 49031, 34888, 33391, 42780, -18538, 10801, 55856, 114417, 82122, 90800, 40415, 34870, 69349, 83061, 65571, 4229, 11169, -18151, 1978, 55468, 51249, 10693, 46716, 98829, 118857, 76989, 49188]
8305D9188J045j7350O5507n94m7856n4839N7596K5738m6124m2055O9004p3731
8293a4471m2674l1529N8807l041q812R06r457j906j4362K3700k441M4227q044
8280i097R885j7169j8998k182N9615j0772N2266o1265K9761N291p8619M6238O1033
8267F5987J0287k3807j4103K6004J1861r1294M2984K4118l4131N31n5809O0868
8255B3496J6791l8107O896L3814K2830J1508O298k5420l3029K948N6315M5082
8243A29422J1520n3576O756k8942p5181L7646k8518J2911q7432O5123L3860q7632
8231f4043L3409L3197m564K2428M3193k9313m5658l6741J3711M5496L2159M0396
8219H3670k7349J2817o460m1742L4374m937j9569l7132P5193q6992p470P4019
$$ y = [49188, 50233, 32883, 98390, 97796, 49940, -4899, 52697, 78435, 32311, -9744, 59260, -14471, -57145, -88674, -29867, -32908, -41720, -40814, -50271, -52177, -66539, -42839, -45280, -1053, -9097, 788, -16381, -35379, -37561, 22054, 11282, 63548, 2283, 32044, 37335, -41284, 4954, 65987, 76274, 52467, 38364, 64368, 76229, -15065, 27919, 52037, 17906, 18437, -37372, 23496, 40287, 2180, 9076, 42890, 65720, 77228, 83526, 58106, 25077, 28025, 84340, 129422, 140942, 87366, 94122, 65180, -10001, 27645, -873, 12038, -75394, -10271, 23589, -64043, -30634, 2563, -2001, 20427, 63620, 34307, -11351, -48092, -34381, 11115, 43274, 83670, 56321, 69138, 62678, 20936, 55310, 50373, 30804, -6328, 68865, -18127, -25597, 48422]
8207D8422P1693l4628l1415J107J2290l3211M6702j8389k9483N4073l226k0432
8195F3503p490J28210L6578m1689k01784m6231n752J3966J978Q3580J1881k3993
8183A2757P5204r9933j1986M5585M6658k1667R386m0422k613P7162j393q8833
8171i5n0379J1039K204J2773L9580K5767M589l983j070k5168k9864N086J7526
8158H005k9571l096J1404P61N2191J056L6226k5206n3386j2622P0118J4696j152
8145F9424m4984N891K9095m1863o8664J0583J136K6221K6468M3517m2675l9382
8133b5233K6872j5897J16526k9831j2605j4627j6641L1575O391l3801L8552m6042
8121B5239o9127M901m6717P2007q560m7114K845j5110J445O1165N514M4858K7843
$$ y = [48422, 120115, 85487, 54072, 55179, 67469, 34258, 80960, 62571, 33088, 87161, 83935, 63503, 56013, 184223, 220801, 179112, -22672, -68903, -74655, -60689, -58711, 24869, 36750, 12757, 87961, -11972, -23958, 21627, 68285, 46618, 56004, 15582, 12969, 90131, 88738, -95, -50474, -39435, -37231, -24458, 15122, 40889, 45478, 41495, 40425, 15257, -14607, -9521, 8005, -21566, -24662, -13258, -12497, 39694, 40750, 76976, 51770, -1616, -14238, 55880, 70576, 69424, 24440, 30331, 59426, 17563, -51101, -40518, -39382, -13161, 13307, 56824, 14149, -25233, 1639, -14258, 102268, 72437, 59832, 45205, 28564, 60139, 66530, 32729, 71281, 25239, -43888, -38987, -85704, -13697, -22257, -69371, -66526, -81636, -80191, -19026, -13512, 31346, 59189]
8108E9189m1183N644M3615K5205l5254M2917l0617j7555m6939k6028k9749J20096
8096F9341L5285m4144J2747m7202O2701l2080j8548p095m7518L6353o841K6221
8084C9220L1764K0086j8922j2954N296M14n1519m0171Q0292K5038K39N4697J501
8071A34981l8093p6466O7084k4120o3300N8302k432P332k415O1698m7871j45m3307
8058C1248m141M1624M4468L3145p448k8870o9758l851P8377o3138n96j3573K0825
8045E8312K7018r7466K0925L1557O8651k1952o8015P615l9128m3914M6259m683
8033a4821Q7103k1613k977j9908J593Q4456j8878n4221k3608O8787N4498m9223
8021I1188o6646P3446l9440l8331J3008p92J9118K8927q4093R9651L2225n2495
$$ y = [59189, 18006, 23650, 67265, 92470, 57216, 100133, 69516, 51961, 5022, -21006, -50755, 69341, 104626, 60482, 73229, 26027, 88728, 56648, 38100, 31005, -16513, 19840, 12999, 39220, 70984, 91070, 72148, 59194, 64490, 64904, 13385, -26786, 53506, 78544, 78783, 133480, 134981, 96888, 20422, 87506, 63386, 86, 58388, 55956, 63288, 60873, 122571, 74700, 74555, 31248, 27107, 68731, 113199, 146344, 138896, 110026, 40268, 36417, 114794, 51656, 51060, 37487, 58312, 85330, -12136, 8789, 40346, 108997, 87045, 19030, 26645, -12483, -56397, -10138, -14821, 72282, 50669, 47692, 27784, 29377, 113833, 94955, 40734, 17126, 85913, 140411, 91188, 24542, 97988, 58548, 20217, 33225, 32433, 51551, 80478, -3615, 96036, 128261, 75766]
8009G5766m8786N2725J3033k1334K4194l9790M0776M627l800m453R007K7036l2655
7996I6346k7485j0863J5326O8918k4699j9194k4920k0483L9698K7035k6558j0457
7984H2664L0104m4482k4717M9832j136M7018k1887k9266O224N9819n0625m2703
7972F0845M4313P832l3870O027J0195l3310K0893N4564k8517O892K406J5932k683
7959A31519O577J1959r636m6049L5349L2452j11389m7253K8524L4019K8904J5103
7947A10079m4078m780K8048M993L2438J0750o974k8028n2012K2383N0344K4882
7935A48045J3378L8286j0406O51K4537q7867N956K6995p2166l4082O074M9564
7923A08965N6730P4589j0838k2759k3527j09219N6473P3731o9640k2862M7214
$$ y = [75766, 26980, 79705, 92738, 71404, 95598, 55808, 96584, 101211, 97411, 92958, 101965, 129001, 96346, 68861, 57998, 73324, 142242, 117543, 98349, 73429, 52946, 92644, 119679, 93121, 82664, 112768, 68286, 43569, 93401, 92265, 139283, 117396, 88130, 94354, 154173, 103548, 60845, 105158, 112990, 79120, 85147, 95342, 62032, 82925, 137489, 108972, 115864, 118270, 134202, 131519, 138096, 150055, 140419, 94370, 129719, 162171, 50782, 3529, 32053, 66072, 94976, 110079, 66001, 61221, 89269, 94262, 126700, 137450, 130476, 102448, 50436, 72819, 123163, 148045, 161423, 199709, 189303, 189954, 214491, 126624, 132580, 159575, 87409, 53327, 59401, 108965, 165695, 240284, 229446, 206687, 183160, 73941, 130414, 204145, 134505, 111643, 158857]
7912A58857k642l516L5885k359j3003l8091n097M8041m407K8324l4637J0482O4684
7899B42521n4715r378k0889k3325L2809k2858K8172j4260j5628Q0243L4148J7343
7887B74183m8153M8016k5613L4491l998n3876L1767m1829P527L553P7485k1255
7875B82298o8456l1932j0393L360r0753O3041M3899j4197l2165K3952L0303j2633
7863A86324M8017K552l1442N3005j8866l3256L5140J8833l5413O4962k5626j6867
7851B47363j0576L2501R472j2274L0773l49N9102k5308M58L8757m0991o2562l7311
7838B29055J4751J6952O357j5149K435N1698L6843q4089K4277m7025K6848N8638
7826C21591k2321m2309p5050R0254K5402k4452J646j0768K0707P5881M4205J9756
$$ y = [158857, 156215, 152699, 188584, 186225, 173222, 135131, 130034, 178075, 173668, 201992, 167355, 177837, 242521, 187806, 178428, 157539, 134214, 167023, 144165, 172337, 158077, 142449, 222692, 256840, 274183, 226030, 274046, 248433, 282924, 278926, 225050, 256817, 214988, 222515, 226068, 303553, 282298, 213842, 181910, 171517, 174877, 84124, 147165, 191064, 176867, 144702, 168654, 198957, 186324, 234341, 236893, 205451, 258456, 239590, 206334, 241474, 260307, 224894, 289856, 264230, 247363, 236787, 269288, 278760, 266486, 297259, 296910, 356012, 330704, 331162, 369919, 328928, 266366, 229055, 243806, 260758, 267115, 251966, 254401, 306099, 342942, 258853, 283130, 236105, 262953, 321591, 299270, 256961, 181911, 272165, 297567, 273115, 274761, 263993, 284700, 360581, 404786, 424542]
7814D24542J810J5415j0125l8487j1880k1975p7425K0381J49084N744J52320O508
7802F15912l56927R2208P0923L1486o017K697J00125J22654j48874j12769j8971
7791C92447l85L9870L805k5501K0667L9491O471p737N7322K9596o501R998r311
7778E50232K8408m1838L6794Q2379m6943J6100l9923J4150L2444K3198K992l9506
7766F18487L7819R551N6942J9381q497k7949N4088M4567L3296l213j868M5611
7754H78215m6883L0112J1308J6996N2952j7770Q5875p8983j5774P6218L6430J5932
7742A044628k961O4308M4382M2638O6444N3125m341O8510K7865q683R0881O8978
7730A555774j4572J32030N8745O8403P2612j432K0794N5961J02182M2908Q3179
$$ y = [424542, 426352, 441767, 431642, 393155, 381275, 359300, 281875, 302256, 451340, 457084, 609404, 615912, 258985, 351193, 422116, 453602, 447585, 450282, 550407, 673061, 524187, 411418, 392447, 392062, 431932, 435737, 410236, 430903, 470394, 476865, 469128, 526450, 556046, 549545, 559543, 550232, 578640, 536802, 573596, 655975, 609032, 625132, 585209, 599359, 631803, 655001, 657993, 618487, 656306, 665857, 722799, 742180, 733683, 705734, 759822, 804389, 837685, 834472, 832604, 878215, 831332, 861444, 872752, 889748, 942700, 924930, 1010805, 931822, 916048, 992266, 1028696, 1044628, 1041667, 1105975, 1150357, 1192995, 1259439, 1312564, 1308223, 1376733, 1404598, 1395915, 1486796, 1555774, 1541202, 1673232, 1731977, 1800380, 1872992, 1871560, 1892354, 1948315, 2050497, 2093405, 2176584]
7719B176584J55565J13692L9914Q5987N3718J61420R7697N1322J09904J52890
7709C198693J60973K12209J48484J72368J33366R6080J93615J86326J49810K10949
7699D862873K38837J57954J12501Q7026J76085K11926J95963K07006J55023J26347
7689F531541K3006O704Q4727R1658L6598j1629m6211J26687p5359L573J9448j4075
7677F776668l9718n1757P0339K2710m7138j20378o4508k024j41132j04613j00387
7666F198062j05224j94330j34723j70241j69919j48829j70667j80981k66088k00120
7656D456940j74639j32985j52859m1471j12273k38164k46539j36337j87882q9767
7646B944024r1151j21556r0190q3992r7403j43089n4785j02827j22878n7536k716
$$ y = [2176584, 2332149, 2445841, 2485755, 2571742, 2625460, 2786880, 2884577, 2935899, 3045803, 3198693, 3359666, 3571875, 3720359, 3892727, 4026093, 4122173, 4315788, 4502114, 4651924, 4862873, 5101710, 5259664, 5372165, 5459191, 5635276, 5847202, 6043165, 6250171, 6405194, 6531541, 6554547, 6561251, 6645978, 6737636, 6774234, 6762605, 6716394, 6843081, 6767722, 6771295, 6790743, 6776668, 6736950, 6685193, 6755532, 6778242, 6731104, 6610726, 6546218, 6544194, 6403062, 6298449, 6198062, 6092838, 5898508, 5763785, 5593544, 5423625, 5274796, 5104129, 4923148, 4657060, 4456940, 4282301, 4149316, 3996457, 3954986, 3842713, 3604549, 3358010, 3221673, 3033791, 2944024, 2852873, 2731317, 2641127, 2557135, 2459732, 2316643, 2261858, 2159031, 2036153, 1978617, 1975901]
7635A975901r5588q6233k4953n5951o8573q7388r8115l4994O5408n8988n9194
7624A371332p3868K5698n2373n5399l7112m8754n7445j3578q33j2707p7175j0261
7612I57525M8153l0539m1646j0309r9186P415k1179q602k6462M6868o5963m4873
7600G11202k4030o1403p385j4691M3046k0657K3477l861l6304j787L6274l9223
7588F04658l098p608l1892K4786l0599o1071m0840L5363m9902M3117N8816o9537
7576D72193j3928k0627M1360L0707r3449o4907L2731P0932m286K474m5063m1736
7564C66401M9237K3683k2075J8406p4957k2178R8890j050o687k7440J118K1896
7552D25244J6002o5014j8703N7570N7680p057J52559K02420J51350K30313K44139
$$ y = [1975901, 1880313, 1794080, 1769127, 1713176, 1644603, 1557215, 1459100, 1424106, 1489514, 1430526, 1371332, 1297464, 1323162, 1270789, 1215390, 1178278, 1129524, 1072079, 1058501, 1057668, 1044961, 967786, 957525, 1005678, 975139, 933493, 923184, 823998, 831413, 810234, 801632, 775170, 822038, 756075, 711202, 687172, 625769, 618384, 603693, 646739, 626082, 649559, 645698, 609394, 607607, 643881, 604658, 601560, 593952, 562060, 586846, 556247, 495176, 454336, 489699, 439797, 482914, 541730, 472193, 458265, 437638, 478998, 509705, 416256, 351349, 384080, 455012, 450726, 453200, 408137, 366401, 415638, 439321, 417246, 435652, 360695, 338517, 437407, 436357, 429670, 402230, 403348, 425244, 441246, 376232, 357529, 415099, 472779, 465722, 618281, 820701, 972051, 1202364, 1446503]
7541A446503n4460j24262k45021k10247p9282j42407r9803l6685p2569K0868m1572
7530C61063k0288p401J0155m1948l8817K6194k8809P1570J6365l4651l7638p8829
7518A96966K1383N8545k5672m5362M105k6033R2123j3265n2054l9543K7564O9112
7506B67869o4596k4481K4382M9691k9791J9120l501m8180L075K9134P608j8644
7494B11686q935J9953k916j8902j759j1128l5967m1115M4458J9956j8182m580
7482A52569K9017J0862n0615J9177K1489L8802n9557J6292j6084j317j4659n5687
7470I0289Q1703J6095n7155J8495M4125j7534K2320j5836n2201n4135p510N5020
7458A23676O6830J8331o0648p1091J7883K5642J15753j9267J8990j1914l5383
$$ y = [1446503, 1392043, 1267781, 1022760, 812513, 733231, 590824, 491021, 454336, 381767, 402635, 361063, 340775, 333374, 343529, 301581, 262764, 288958, 260149, 331719, 348084, 313433, 275795, 196966, 218349, 276894, 251222, 205860, 209965, 183932, 276055, 262790, 210736, 171193, 198757, 267869, 203273, 178792, 203174, 252865, 223074, 242194, 238693, 190513, 193588, 222722, 230330, 211686, 202751, 222704, 219788, 200886, 199127, 187999, 152032, 110917, 155375, 175331, 157149, 152569, 181586, 192448, 141833, 161010, 182499, 221301, 161744, 178036, 161952, 160635, 145976, 90289, 171992, 188087, 130932, 149427, 193552, 176018, 198338, 182502, 130301, 76166, 68656, 123676, 190506, 208837, 148189, 77098, 94981, 120623, 236376, 217109, 236099, 224185, 188802]
7447A88802Q829p6363Q5543N283o9560o2292k225K4384J3881N4858k4098k6031
7435A21011Q8453l4553o504r359l6494L542m2876L4961p453r040m7389N6394L274
7422A13967r806O4743l4589l4846K4055J7694n0414L7622m8446k097J2460K0002
7410A10345L5333L2326p9884k9824J42071K4558j37641J1423k8904L2508n7354
7399E4957l3740O0200N6682l5132J5191J3392p0538L9456N7170J5383p509l4298
7387A31214l668J15411k7530o0549K3978o4831n110P9459o0966k3874J6983J1729
7375A32246K7328k0245p1437j3429J976j0946J0349J8812Q097M1616J7520l1106
7363A10781L9375N1384J5610n4303n1397k3710m3607k2850Q7453K5762k2267K997
$$ y = [188802, 197631, 121268, 206811, 212094, 142534, 80242, 78017, 102401, 116282, 171140, 147042, 121011, 209464, 174911, 168407, 159048, 122554, 126096, 83220, 118181, 110728, 101688, 54299, 110693, 113967, 104161, 168904, 134315, 99469, 123524, 141218, 90804, 128426, 79980, 77883, 90343, 110345, 145678, 178004, 98120, 68296, 210367, 234925, 97284, 108707, 79803, 112311, 54957, 21217, 81417, 138099, 102967, 118158, 131550, 61012, 100468, 157638, 173021, 165512, 131214, 127546, 242957, 215427, 154878, 178856, 114025, 108915, 188374, 127408, 103534, 120517, 132246, 159574, 139329, 67892, 54463, 56439, 45493, 55842, 74654, 82751, 124367, 141887, 110781, 150156, 201540, 217150, 162847, 111450, 87740, 44133, 21283, 108736, 134498, 112231, 115228]
7351A15228N4175J2602l0607k6306m4887k2718m1400j5023K5157j5178M4887l3578
7339B2352J0959M9448M209M4896k4692l7194K3228O794m9217K2253k2956L0532
7327H0612j0263r062k463J6692j6353N5383q5431k8919N4783k8687j730O7183
7315I1745o2553L1965M7106m181l9498k2456o871M2140K5166k7964l1849J8489
7303F1239m597M855m623k0433j0291N899K3490k3241k1164N2327k0496n25l35
7290D2105k8809Q592N6560M2419j4957o0873M4371k6888o1173LQ6612M2925q1097
7277D9790P9l7076K3985n0779J8944L3480J6245N2260K3392k7037R696M291L9529
7264A56799m6720L917k3323N1324k4991n9231r410P3232n6452j6356N7324Q569
$$ y = [115228, 169403, 182005, 151398, 125092, 80205, 57487, 16087, 1064, 26221, 11043, 55930, 22352, 33311, 82759, 86968, 131864, 107172, 69978, 93206, 100000, 50783, 73036, 50080, 80612, 70349, 61287, 58824, 75516, 59163, 114546, 29115, 196, 54979, 26292, 24562, 91745, 29192, 61157, 108263, 104082, 64584, 42128, 35257, 77397, 102563, 74599, 42750, 61239, 56642, 61497, 56874, 36441, 26150, 32049, 55539, 32298, 11134, 63461, 42965, 42440, 42105, 13296, 21888, 78448, 120867, 105910, 45037, 89408, 62520, 1347, 1350, 87962, 130887, 49790, 49869, 12793, 36778, -14001, 4943, 38423, 54668, 106928, 130320, 103283, 112979, 117270, 156799, 110079, 113996, 90673, 141997, 117006, 57775, 48365, 121597, 65145, 48789, 106113, 114682]
7252A14682p4258M3350l9382M367M5993k2431M8272j2903l1290J619o076o5810
7240F133j312m552L0762O4000J6367k5406J0465k4408p8627K0154K5203o7733
7228b8954Q1378M0133j1889j6388K8721O6171J958m5903k0798L6708P0507m2745
7216A58899o3786n7817o8294K5487j9921N7829K5606N090l1286N3834N180l1801
7204E9020j8172k8547L1949L8620J5658j4615J9787M656k1365j7756O27J3244
7192H3106R985n1118N4540k0791M3866o730J5009R946r6792L2261L3717M2027
7180A49026M9652n5750n9018m5227P1291K3941k0645j2070k2N824r9671R7292
7168A04623L724p895r137K1790j0342j4159N3086K0760m0635j2700N621j9954
$$ y = [114682, 40424, 83774, 44392, 48759, 94752, 72321, 120593, 107690, 76400, 78019, 71943, 6133, 4821, 269, 31031, 95031, 111398, 85992, 96457, 72049, -6578, 13576, 38779, -28954, 52424, 92557, 80668, 64280, 93001, 159172, 161130, 115227, 94429, 131137, 201644, 158899, 95113, 37296, -30998, -5511, -25432, 32397, 58003, 63093, 31807, 85641, 90821, 59020, 40848, 12301, 44250, 82870, 98528, 83913, 103700, 108356, 86991, 69235, 69862, 83106, 93091, 41973, 96513, 75722, 119588, 112858, 127867, 137813, 41021, 73282, 106999, 149026, 198678, 142928, 83910, 38683, 109974, 133915, 113270, 101200, 101178, 107002, 7331, 104623, 108347, 100452, 91315, 113105, 102763, 88604, 141690, 162450, 121815, 109115, 114736, 94782]
7156I4782p8402O2328J28292l3773k8507p9319O490k190J2878O9513M2887j05282
7144H9697j8367J3708J6490O539J8953N574l452l1966O3346r0671k085R31K6895
7131I5592k1178l2060j3421L7251J6734r6902M3061K062n91O140K4925o801k2884
7118C1928k348P3746j834L4775k8693n092n1075m721O4344K1723n7851o0845n0215
7105c6158O9442j8265q416Q8336N6774j7758k7299M1687r5894m6172J7049l515
7093A9811N1173j7656L3905K8603p8344j3922K0773L0622k3156P6979m3531K0645
7081A05902L4224q4696k8102M5774o881m8603M7546L5701N587j7771M3329l9370
7069I2640j2577m360k3582K2931J383O8123j2576n0445K9569l1132j0025n1821
$$ y = [94782, 16380, 78708, 207000, 173227, 144720, 65401, 71891, 69701, 82579, 152092, 194979, 89697, 71330, 85038, 101528, 108067, 127020, 132594, 129142, 97176, 160522, 69851, 67766, 68697, 95592, 74414, 42354, 28933, 66184, 82918, -13984, 29077, 31139, 30548, 36688, 61613, 54812, 31928, 29580, 103326, 101492, 136267, 107574, 102482, 51407, 46686, 111030, 132753, 74902, 14057, -36158, 33284, 15019, 6603, 94939, 151713, 133955, 106656, 148343, 52449, 6277, 23326, 19811, 70984, 53328, 87233, 115836, 37492, 23570, 44343, 74965, 51809, 128788, 85257, 105902, 140126, 55430, 27328, 73102, 66221, 17618, 65164, 100865, 106452, 88681, 132010, 92640, 80063, 75703, 52121, 75052, 76435, 144558, 131982, 81537, 111106, 79974, 69949, 18128]
7057A8128J21401J98o9012k9211M0318O0826o8978k189k8242O3133J6375j7811
7045A04936j9665J8798k7818K8879L6387k5062l3291L202m1877K5977J7892m0020
7033D8338K7210P5838K7668n2986j5442l4648M1915k5397M0287m3325n4532N226
7021D0152M4895o668j8668n9778P0979k2711n9753Q0202j621K2630p2829J9681
7009C6511O0068P1425J8273l3939r243o2351K4000m6193k2722N0610J7373K5152
6997A28964n4674j5722L9444M2456p2926j2725L4899l967l5645M0861l4793L1215
6985H7387K5677K2665J6006j9744m2560K7340J2153o1297N307P6934n2788J1795
6973A08875P1138n7801K7820p1251N0497K8983l5245n0624J782Q033P692J4105
$$ y = [18128, 139529, 139727, 70715, 41504, 81822, 142648, 73670, 71481, 43239, 106372, 122747, 104936, 85271, 104069, 76251, 105130, 141517, 116455, 83164, 86366, 44489, 70466, 88358, 48338, 75548, 151386, 179054, 126068, 110626, 75978, 117893, 92496, 132783, 89458, 34926, 40152, 85047, 78379, 59711, -67, 70912, 48201, -11552, 68650, 67029, 89659, 16830, 36511, 96579, 168004, 186277, 152338, 143095, 80744, 104744, 58551, 35829, 86439, 103812, 128964, 74290, 58568, 98012, 140468, 67542, 54817, 89716, 85749, 50104, 90965, 56172, 87387, 113064, 135729, 151735, 131991, 89431, 116771, 128924, 67627, 72934, 149868, 97080, 108875, 180013, 122212, 150032, 78781, 129278, 158261, 123016, 72392, 74174, 82207, 89899, 104004]
6961A04004l7666M103N6459j7323r3061q260M5982M0015k1523L2734o200m3159
6949E6105Q507M9034L0477J0381K1646K70K515j5352m4165n5850J6279j2937l415
6936F3495K6414K2826m3280p7536M7180Q3834m3654m4129J6077m4117L4287r195
6924C2202P2388J0799j01680M188J8870L3325J3822j934q406k5118M2284O2224
6912A52964n0043n8786l471J6569k7041K1384K2077l251j5524L408K1217q702
6900G0801l8678N2141k4010j4683j5841m5669M6372Q056m023k056j6791j0548
6888E071O5577M0927m0832j2070r189N0533j0080N707l0824M535K0045j4614L2482
6875A07268k5178J9785l9613N6936J0770k5041m9389q0520N214K0975K5363j8233
$$ y = [104004, 66338, 70441, 126900, 109577, 16516, 8256, 54238, 94253, 72730, 105464, 99264, 56105, 64612, 113646, 144123, 154504, 176150, 176420, 178935, 163583, 119418, 63568, 79847, 66910, 63495, 89909, 112735, 69455, -8081, 39099, 122933, 79279, 35150, 51227, 7110, 41397, 32202, 104590, 115389, 13709, 17897, 36767, 70092, 83914, 81980, 73574, 48456, 90740, 152964, 102921, 44135, 40664, 57233, 30192, 51576, 73653, 70402, 54878, 58286, 79503, 70801, 32123, 84264, 60254, 45571, 29730, -15939, 30433, 38489, 34466, 32410, 15619, 5071, 70648, 111575, 70743, 58673, 49484, 100017, 89937, 95644, 64820, 69355, 89400, 74786, 107268, 82090, 101875, 62262, 119198, 129968, 104927, 55538, -24982, -19768, 1207, 26570, 8337]
6863H337q270m9380Q5822K4089k284K8123j9885K1582l7839N0717J6905M3372
6851A61289n5725n5583M9655J5331k9449j7543l3739N734M7352L9749k078R517
6839A34510k8113P605N604n4923j11636l2405R2848J4246O9321O7597j3475o6382
6827H4797M8911q78o9386m543K0029l006k7569k5740K6561M8977k0795j6438J4634
6814G5554J1633K4343P3880K0622r4889o4528J7575K2683L936j9966k323M5670
6802A14190K5234l7939k7716j5977N4653J9889j3062R1539J7807j8858o0616m1211
6790A07933K676K6365M4238k7692Q933k9068j6110O1377l3164J3985k1119o2807
6778G5547j4443j4956N1780m6699J473P8859p6658M3073L2296j4660p8668J03133
$$ y = [8337, 67, -49313, 36509, 60598, 58314, 86437, 66552, 88134, 50295, 101012, 117917, 161289, 105564, 49981, 99636, 114967, 85518, 67975, 34236, 39970, 87322, 127071, 124993, 134510, 106397, 114002, 119606, 64683, -46953, -79358, 13490, 27736, 97057, 164654, 151179, 84797, 133708, 132830, 63444, 58901, 78930, 75924, 48355, 22615, 49176, 98153, 77358, 60920, 75554, 87187, 111530, 185410, 206032, 111143, 46615, 64190, 86873, 90809, 70843, 68520, 114190, 139424, 101485, 73769, 57792, 112445, 132334, 119272, 210811, 228618, 209760, 149144, 107933, 110609, 136974, 181212, 153520, 162453, 133385, 117275, 178652, 145488, 159473, 138354, 75547, 61104, 46148, 97928, 51229, 52702, 131561, 54903, 97976, 130272, 115612, 36944, 140077]
6766A40077O2153r9132l5511m010P1027J495N0954l7303n4788n0348L8326M7295
6754A30235k0227P4202r499j8292K7044l1011q2725j1823P9308J9133P288o0542
6742A03091k0266J7352K8109O1827L889k8915J53o646J2361J8136k0305n9103
6730A09683r2241Q269K8961P6796M2288J838n75q7704L9715k5807k7021K6324
6718A00526Q1176j6774n3149L7425j6306J5122N5222m4326k8173J4319R539R451
6706A64052j9342p626j1507j1725L565J6483J064l3841n3147O8474n023n081M7891
6693A54237n483n4199K3268L5857o883L0477m7547n1352N514L6036p7516m5567
6681c158L4650J5123M6924n6359j636Q2196l3214m3252O8326L4259p0666j5359
$$ y = [140077, 202230, 103098, 67587, 63577, 134604, 136099, 187053, 149750, 94962, 44614, 82940, 130235, 110008, 184210, 174711, 156419, 183463, 152452, 69727, 57904, 137212, 156345, 163633, 103091, 82825, 100177, 128286, 190113, 194002, 165087, 165240, 158594, 170955, 189091, 168786, 109683, 17442, 25711, 54672, 131468, 173756, 175594, 175019, 87315, 127030, 101223, 74202, 100526, 181702, 164928, 111779, 149204, 132898, 148020, 203242, 158916, 130743, 145062, 154601, 164052, 144710, 137084, 125577, 113852, 117417, 133900, 134964, 101123, 47976, 116450, 111427, 106346, 154237, 148754, 94555, 117823, 153680, 146797, 177274, 129727, 78375, 83889, 119925, 42409, -3158, 31492, 46615, 93539, 37180, 35544, 117740, 84526, 41274, 109600, 143859, 73193, 57834]
6669E7834O0491o874q251K9042l523J307l2578L2256J9776m1085K95n8049N5836
6656A06477L4684l8059p475J2709L9542k1733K0846J1970k767j1071j3819J9033
6644A50337m8542J6603K5606k0748k4428L4305N3992J1095Q2793k4834q9211k0549
6632A46419q7631J2452q379L5909O0577o091K5347j4910j4464K920o9927M1348
6620A23570J6833K7447L4793q6837n729M3565N843K08o7464O336O6148o9945L8219
6607A32987O9824l4972j4018N4417m0671p9174M1020N9705l2332o1241j5542K0958
6595A00961K2521L6357j6784R924L1588j905j0108j6270l2398J5941m0183p161
6583I2483Q3477O7653m593q3816k8927k5403L0732L0160m1981L118n0188p210
$$ y = [57834, 118325, 111451, 103200, 132242, 128719, 130026, 97448, 129704, 149480, 108395, 108690, 50641, 106477, 141161, 103102, 95627, 108336, 147878, 126145, 146991, 158961, 156194, 145123, 131304, 150337, 101795, 118398, 144004, 123256, 98828, 133133, 187125, 198220, 281013, 256179, 166968, 146419, 58788, 71240, 62861, 98770, 159347, 153256, 178603, 163693, 149229, 152149, 82222, 123570, 140403, 167850, 202643, 115806, 110077, 153642, 159485, 159693, 92229, 98565, 164713, 94768, 132987, 202811, 167839, 153821, 208238, 167567, 88393, 129413, 189118, 156786, 95545, 80003, 100961, 123482, 159839, 143055, 152979, 184567, 182662, 172554, 156284, 123886, 139827, 99644, 92483, 175960, 243613, 239020, 155204, 126277, 100874, 131606, 161766, 119785, 122903, 72715, 65505]
6571F5505P8664K5595k9547l4686K9312j2334l3398M5918J5923k284k8630J7624
6559A37662m3421M1350O2961N917J805J7973q725p2094N6385l5515K644l653K9993
6546A93282k7391L0745p320k7505N1324p7887J660M910j7334k1477j8214M4494
6534A29287K0544J4543p547q6443N7965L277M1141m1719j0760P1195l250m2637
6522A45596k783M9891K9578k8166J4734L0113p3784M3327P2346r5401m3356J2124
6510A54219M0330j7691r331K4304k3264r364J3379k6752k6856N4453J8278n8195
6498A33510q0363P8416N4728P054k2713P118L6927K0583n273q6519o423M3585
6486A80630O9593J6352j4419k2647j1322l7191L0004R3447q2790m1135N505l3473
$$ y = [65505, 144169, 169764, 140217, 105531, 134843, 122509, 89111, 135029, 150952, 148668, 120038, 137662, 94241, 135591, 198552, 204469, 206274, 224247, 215522, 143428, 199813, 164298, 166942, 163289, 193282, 165891, 196636, 189316, 161811, 213135, 135248, 136908, 141818, 124484, 103007, 84793, 129287, 149831, 164374, 156827, 70384, 128349, 131626, 172767, 131048, 120288, 191483, 188233, 145596, 142813, 192704, 222282, 194116, 208850, 238963, 165179, 208506, 280852, 185451, 142095, 154219, 194549, 176858, 167527, 191831, 168567, 159203, 172582, 145830, 118974, 173427, 191705, 133510, 53147, 131563, 186291, 193345, 170632, 177750, 214677, 235260, 229987, 143468, 137045, 180630, 250223, 266575, 252156, 229509, 218187, 180996, 211000, 304447, 221657, 180522, 186027, 152554]
6474A52554Q2000L8220o2955K6666n6962K0538j0752N2650J4717M94o009j3725
6462B37436p3081J3249O8036O501l4059O273L615n7663N504N9921q236J1760k1200
6449B18056l2204M5684l9170n7717L5387L0922m1860m6006L3164N0200L0578M5499
6437B72533j03952j356N2479L2599l6354q291J4508q141O565K2840l5913N6022
6425B63539J2134Q257N0451j5088m9955L839K0155l5929M9560L86j3508m9274
6413B44567j8650M1167R872N5756k668n2147M475K1703j1489K6636j5720m3617
6401B59885J3842n6370M0048L6641O519j1404l4894K0166n152J6878Q540N832
6389C00531j3093k5954J1252o502J0330k509J7527r329M2382k6973J5973K9914
$$ y = [152554, 234554, 272774, 209819, 236485, 179523, 200061, 189309, 241959, 256676, 257170, 251161, 237436, 164355, 177604, 245640, 252141, 218082, 224355, 227970, 170307, 175811, 235732, 227496, 239256, 218056, 185852, 231536, 192366, 134649, 170036, 200958, 159098, 113092, 146256, 196456, 227034, 272533, 168581, 167225, 219704, 252303, 215949, 207658, 222166, 214025, 220590, 243430, 207517, 263539, 275673, 283930, 334381, 319293, 269338, 273177, 293332, 257403, 306963, 307349, 293841, 244567, 225917, 267084, 276956, 332712, 330044, 277897, 282372, 304075, 292586, 319222, 303502, 259885, 273727, 217357, 257405, 294046, 300565, 289161, 254267, 274433, 269281, 286159, 294699, 300531, 287438, 261484, 272736, 266234, 276564, 274055, 291582, 282253, 324635, 297662, 313635, 343549]
6377C43549k0861p4798L3621k0792j5820O6160N238l1275n0045P6485N2623o3512
6365C00573L494P885r9990P9648O0102k7798j04643J3561k645R2674J7382l9745
6353C00498p9090J6324O0935K5250m4523J0863L4606L4437L8513o0207k040l7210
6341B98356l58O0431r441j883m171P96K8255j9284p8526J4149J4610m910M939
6328C02963L559R853L6144J4324N360o1202o2297O7013k7370J839P3891O3245
6316D27322k2082l7304m493j3789M395J1296O242J6129L2172J3945l5425O204
6304D04612n9153K6669j0755K0028L50k4821m9155Q3691L3391n0564n5734K1945
6292C40504L2697q62K5832m8162M1440L126k4773j7476O4634L8974n1195m7274
$$ y = [343549, 322688, 247890, 281511, 260719, 244899, 311059, 316297, 285022, 234977, 311462, 364085, 300573, 304067, 311952, 211962, 291610, 351712, 323914, 219271, 232832, 230187, 322861, 340243, 300498, 221408, 237732, 298667, 323917, 279394, 290257, 324863, 359300, 397813, 337606, 335566, 298356, 297998, 358429, 348988, 347105, 342934, 343730, 371985, 352701, 274175, 288324, 302934, 298024, 302963, 306522, 316375, 352519, 366843, 372203, 311001, 248704, 315717, 288347, 290186, 364077, 427322, 405240, 367936, 363443, 349654, 354049, 365345, 371587, 387716, 419888, 433833, 398408, 404612, 345459, 372128, 361373, 381401, 381751, 356930, 307775, 391466, 424857, 374293, 318559, 340504, 373201, 372339, 398171, 350009, 391449, 394575, 369802, 352326, 416960, 455934, 404739, 357465]
6280C57465J9744R4459k8009k6858Q213j1966N8207l6018m2512j10297j2902J21580
6268C91106Q7094J0068k7463j7784m9398J2840K0002o438J5727L080j2831p671
6256D18332o5349M8720P9668M8157l720n6805P027q940M7481p686p4906K4412
6244D56391J2621P5087P542Q841n9617l2697J245Q1621L8774q7648J861o535l7960
6231D59526M5643o256p9463l598L0879L3924k0227K8742n1797K7284J7942O9952
6219E52551N3009m2881j988k5547M6237m8228K3326Q4198K041K0614K3912k9390
6207F57854o4601Q761k4133k4645L9432J2612k1513L5719L0788o9491J5510K4922
6195F21215K4784M3898m0166R3465j1132J4173N2814K6087m6012l1557J8088K0034
$$ y = [357465, 377209, 471668, 443659, 416801, 425014, 413048, 471255, 435237, 392725, 282428, 269526, 391106, 478200, 488268, 460805, 443021, 393623, 406463, 426465, 420027, 435754, 438834, 426003, 418332, 352983, 401703, 481371, 529528, 525808, 469003, 476030, 467090, 514571, 506885, 431979, 456391, 469012, 544099, 551641, 560482, 500865, 468168, 469413, 551034, 589808, 502160, 504021, 497486, 459526, 505169, 498913, 419450, 415852, 446731, 480655, 460428, 489170, 437373, 464657, 482599, 552551, 605560, 562679, 560691, 535144, 581381, 533153, 556479, 640677, 642718, 663332, 687244, 657854, 593253, 602014, 577881, 553236, 592668, 605280, 583767, 619486, 650274, 580783, 596293, 621215, 645999, 689897, 649731, 743196, 732064, 746237, 799051, 825138, 779126, 747569, 765657, 785691]
6183G85691r195j1401J4279r640l2428N2710K5322p4035N2726N1798M0541k6728
6171H59640k9492n362P4676K8019k0713J5405L7578p770j9683J4680K2330Q2505
6159A051813n674l2804n3239J4051N6859P5542r232k835J9862o575K6136N9461
6147A193365Q7074l6472K4450K1782O4998k2790P6058R6465k1074K7346N6149
6136A567351J09595J0689M4836N7132K8400R3556k6161J5909J50019Q5371O133
6125B142830N3870J18935Q4487L3935O9580J01307L575O0213Q1740J00969J47881
6114B999322P2291R8493Q1306K5069J4734Q9125J09696J24314R5452R6639J22814
6103C929255N0286R9227R4296J22661N0545J72582P4241R3805J21440J26975R0990
$$ y = [785691, 776496, 765095, 779374, 769734, 737306, 790016, 815338, 741303, 794029, 845827, 886368, 859640, 830148, 824786, 899462, 927481, 906768, 922173, 959751, 951981, 932298, 946978, 969308, 1051813, 1046139, 1013335, 960096, 974147, 1031006, 1106548, 1097316, 1094481, 1114343, 1107768, 1133904, 1193365, 1280439, 1243967, 1268417, 1290199, 1355197, 1332407, 1408465, 1504930, 1483856, 1511202, 1567351, 1676946, 1687635, 1732471, 1789603, 1818003, 1911559, 1885398, 1901307, 2051326, 2136697, 2142830, 2196700, 2315635, 2400122, 2434057, 2503637, 2604944, 2608519, 2668732, 2750472, 2851441, 2999322, 3071613, 3170106, 3251412, 3276481, 3291215, 3380340, 3490036, 3614350, 3709802, 3806441, 3929255, 3979541, 4078768, 4173064, 4295725, 4346270, 4518852, 4593093, 4686898, 4808338, 4935313, 5026303]
6092E026303L4676P3276Q2599J32895J09733O0091J1515J32301J4897J1331R8843
6081E788460m488M2076J68031J03133p830Q1567L4454L6878J4212K2428L7730
6070F316651J5750Q4908j7007N9638P3807J04750N3184P3226M09n909M0844M1923
6058F842174L8197N9123k9023L264Q0732J1579k3871n963K3203K7349M7855J1002
6046G085621Q7905Q4631K8207O8709J45085J31861J60788M6600J20602K77498
6036H237507J68303J66336K13439K21133J84277J03402K694O7700n306N714j16150
6025I249049k03658j66988k35284k61326k74600k82768l22407k88256j62859k36903
6015F814000l29586k62113j88301k39728k37340j11982j45968j80332j48718r0473
$$ y = [5026303, 5060979, 5134255, 5216854, 5349749, 5459482, 5519573, 5531088, 5663389, 5678286, 5689617, 5788460, 5783972, 5826048, 5994079, 6097212, 6089382, 6170949, 6205403, 6242281, 6256493, 6278921, 6316651, 6332401, 6417309, 6400302, 6459940, 6533747, 6638497, 6691681, 6764907, 6765316, 6759407, 6800251, 6842174, 6880371, 6939494, 6910471, 6913735, 6994467, 7006046, 6982175, 6976212, 6999415, 7026764, 7074619, 7085621, 7173526, 7258157, 7286364, 7355073, 7500158, 7632019, 7792807, 7839407, 7960009, 8237507, 8405810, 8572146, 8785585, 9006718, 9190995, 9294397, 9297091, 9364791, 9359485, 9365199, 9249049, 9045391, 8878403, 8643119, 8381793, 8107193, 7824425, 7502018, 7213762, 7050903, 6814000, 6484414, 6222301, 6034000, 5794272, 5556932, 5444950, 5298982, 5118650, 4969932, 4879459]
6005D879459j49649j13001j17082N009j55484j61927m6255p5127n0015R517N6817
5994D082262M76j9857M0299J0037K8825M4120J76537J15684R6604K6346J07840
5983D709173K20738J44623K27321K62892J68432K15209L62487L69274L70776K10504
5973G261429L00336L14527K44045J43761J31932J06837N978q1235j15085k70364
5963H042161j39535k13615j78879k76257k16664j16429j43904o5912j16182q4853
5953F489931r363l8744K8977M1144K2103m50L3572K851k7589j4916l0186o0698
5941F436632j56785j52369j95339k30835j99092j37007k09953j89332k10446j95139
5931D560335k12258q5662r1255r0457j75112j24787o3554j05820J7523n5551q9387
$$ y = [4879459, 4729810, 4616809, 4499727, 4504736, 4349252, 4187325, 4141070, 4065943, 4015928, 4025445, 4082262, 4082738, 4062881, 4103180, 4113217, 4142042, 4186162, 4362699, 4478383, 4574987, 4601333, 4709173, 4929911, 5074534, 5301855, 5564747, 5733179, 5948388, 6310875, 6680149, 7050925, 7261429, 7561765, 7876292, 8120337, 8264098, 8396030, 8502867, 8508845, 8427610, 8312525, 8042161, 7902626, 7689011, 7510132, 7233875, 7017211, 6900782, 6756878, 6690966, 6574784, 6489931, 6480568, 6441824, 6470801, 6511945, 6534048, 6533598, 6567170, 6570021, 6542432, 6527516, 6497330, 6436632, 6279847, 6127478, 5932139, 5701304, 5502212, 5365205, 5155252, 4965920, 4755474, 4560335, 4348077, 4262415, 4171160, 4080703, 3905591, 3780804, 3717250, 3611430, 3628953, 3573402, 3484015]
5920C484015L4774n1966J1064p0220N3130K0259M1246P4879O3334Q3242J7559
5909C761316N5415O7119J3958J65640P6943L4413J80344J25672J36496J10450
5899D727766J74386J26785K09913K19480K04329J96429J61903K20287J31288J10030
5889F482596J52535R9036Q7801m180k0920k0018j02061j01851p6494r3782j18602
5878F284060j54673j78174o8186k4680j16626r0851p0809m6992J6909L0988k5271
5867E555695K4833J04956P3143O2515O2348J25356J35830J21246O4096J697M3845
5856F375560q1747m8533q6907n5539j70003j54921j98036k43709j43861j95144
5846D997160j30427j55894j95589j77843r5647j2635o0650k7074q4019p0565L5426
$$ y = [3484015, 3518789, 3466823, 3477887, 3407667, 3460797, 3481056, 3522302, 3597181, 3660515, 3743757, 3761316, 3816731, 3883850, 3897808, 4063448, 4140391, 4174804, 4355148, 4480820, 4617316, 4727766, 4902152, 5028937, 5238850, 5458330, 5662659, 5859088, 6020991, 6241278, 6372566, 6482596, 6635131, 6734167, 6821968, 6817788, 6796868, 6776850, 6674789, 6572938, 6496444, 6402662, 6284060, 6129387, 5951213, 5883027, 5858347, 5741721, 5650870, 5580061, 5533069, 5549978, 5580966, 5555695, 5580528, 5685484, 5758627, 5821142, 5883490, 6008846, 6144676, 6265922, 6330018, 6331715, 6375560, 6293813, 6245280, 6158373, 6102834, 5932831, 5777910, 5579874, 5336165, 5192304, 4997160, 4866733, 4710839, 4515250, 4337407, 4241760, 4229125, 4168475, 4141401, 4057382, 3986817, 4022243]
5835D022243N0359O7182K1153J22118P0055R9310J57327Q6908M3239l6537K6779
5824D730136o000o7200q5059j31844q2825j51707j11137j12136j18171q1281j39033
5813C643743r7204j23340p8115o3868n0145m606N9427M0118J4975l5809m6692
5802C258484K3898M2078N0611P9538K357q897K4373K747N986l7314o3175n2408
5790C328278k14o7903j23833j04350r2551q8268l8914r3499o0795o1249r7905
5779B498797j32054l2646r7043m4681L583n5379k7598l8636n1168m8753K2288
5768A996710P65m916k5009r6083j0296j3462o1483p340J01762N6036p1293l4229
5756A831162q0107m2043M0318o564J084m044K0792j5498j0873j2090k7205O5375
$$ y = [4022243, 4072602, 4139784, 4160937, 4283055, 4353110, 4452420, 4609747, 4696655, 4739894, 4703357, 4730136, 4724136, 4656936, 4571877, 4440033, 4357208, 4205501, 4094364, 3982228, 3864057, 3782776, 3643743, 3546539, 3423199, 3345084, 3281216, 3231071, 3226465, 3285892, 3326010, 3340985, 3305176, 3258484, 3282382, 3324460, 3375071, 3454609, 3456966, 3448069, 3472442, 3475189, 3481175, 3443861, 3380686, 3328278, 3328064, 3260161, 3136328, 3031978, 2939427, 2851159, 2812245, 2718746, 2657951, 2596702, 2498797, 2366743, 2334097, 2237054, 2192373, 2195956, 2140577, 2112979, 2074343, 2023175, 1974422, 1996710, 1997475, 1992559, 1967550, 1871467, 1861171, 1847709, 1786226, 1778886, 1880648, 1936684, 1865391, 1831162, 1751055, 1709012, 1749330, 1742766, 1743850, 1739806, 1760598, 1745100, 1734227, 1722137, 1694932, 1760307]
5744A760307Q568m5768n5520j504L1049K21J292M283l1111O679m156M9169n128
5731A718381L2635l1150k0397M3246L1143J7186j2141J824L3289q277J3330l648
5719A815421r825k2780K7710j2032K7291P5403j9987n7084K4753k4470m0475P5698
5707A859623o659m6721J087P739q3925J0264K6803N2233M7720M4028J9490L6812
5695A968494j05359n3697J00486O1175J1815J100M3025k6198n344K8657J4022
5684B038176l176l5803J3313Q187M7487L6774m3573O0348M0693J1755K9767j4809
5672B189139K4457l2054L9567L8138K4925K0520j3345m5487L4394O2013K9207
5661B371474J4460K2908O461m921Q5266R9055Q846j00P0742n885r945M4485N9356
$$ y = [1760307, 1768875, 1723107, 1667587, 1666083, 1697132, 1697353, 1698645, 1702928, 1671817, 1678496, 1674340, 1723509, 1718381, 1751016, 1719866, 1699469, 1742715, 1773858, 1791044, 1778903, 1780727, 1814016, 1805739, 1819069, 1815421, 1805596, 1782816, 1810526, 1798494, 1825785, 1901188, 1881201, 1824117, 1848870, 1824400, 1783925, 1859623, 1852964, 1806243, 1807330, 1815069, 1731144, 1741408, 1768211, 1820444, 1868164, 1912192, 1931682, 1968494, 1863135, 1809438, 1909924, 1971099, 1982914, 1984014, 2027039, 2000841, 1995497, 2024154, 2038176, 2035000, 1999197, 2012510, 2020697, 2068184, 2104958, 2061385, 2121733, 2162426, 2174181, 2203948, 2189139, 2213596, 2181542, 2221109, 2259247, 2284172, 2304692, 2291347, 2245860, 2280254, 2342267, 2371474, 2385934, 2408842, 2415303, 2410382, 2495648, 2594703, 2603549, 2603449, 2674191, 2668306, 2658361, 2702846, 2762202]
5648B762202K2337J7727J7558j7151M1570L1612P6224M7819m893K8516Q3397N9531
5636C166449K5278M0740M0025m1408o818Q4358Q9146O6283m481K0547M7939k2161
5624C505897m0848l8514J4952O2184p290L4414L6951J8245j9l5310K1773R4831
5612C667266q138n883K9651O1854P3446L5112J5472O9218K8705O7497J09804L0241
5600D174245O361J0053J15482M8552J890R8465K0592K5398R0892J05798m92K461
5588D699697M5953K3690J45780R5766M3640j1381N8984N7824J30779J38725P1678
5577E501135Q8046P7155K0817j6055P7407J05807J26655K7075J15210R9840O8528
5566F291620R0457N5365O907J27194J41775R0186L1708J28723J15686K6074J01763
$$ y = [2762202, 2784539, 2802266, 2819824, 2802673, 2844243, 2875855, 2952079, 2999898, 2995005, 3023521, 3106918, 3166449, 3191727, 3232467, 3272492, 3231084, 3224266, 3308624, 3397770, 3464053, 3459572, 3480119, 3528058, 3505897, 3465049, 3426535, 3441487, 3503671, 3496381, 3530795, 3567746, 3585991, 3585972, 3550662, 3572435, 3667266, 3659128, 3653245, 3682896, 3744750, 3818196, 3853308, 3868780, 3937998, 3966703, 4034200, 4144004, 4174245, 4180606, 4190659, 4306141, 4354693, 4356583, 4455048, 4475640, 4501038, 4591930, 4697728, 4697236, 4699697, 4745650, 4769340, 4915120, 5010886, 5054526, 5043145, 5102129, 5159953, 5290732, 5429457, 5501135, 5589181, 5666336, 5687153, 5671098, 5748505, 5854312, 5980967, 6008042, 6123252, 6223092, 6291620, 6382077, 6437442, 6444349, 6571543, 6713318, 6803504, 6835212, 6963935, 7079621, 7105695, 7207458]
5555G207458J11995Q3398R8295J04012Q8101R8502J04006J39990J64390J26301
5545H326448J85202J09844Q5940J91357K11809J75478J66850J26818J68832J99467
5535I948045K29390J93665K01292K18314J02973K27864K26386J48860K76890K34063
5525A2007742K19091K65728J79161K76224K60414K99950K71990K83148K68717
5516A4332165K83563L29654L15562K98130L53206L33912L82729L93566L43951
5507A7366438M22957M81089L47630N11003N46533M62559N78379N66087N13835
5498B1796510N89681P03212O59486O67272P33639P48268Q00448Q31407R14943
5489B8444866R77633R84194J096009J212435J264131J323352J421404J551258
$$ y = [7207458, 7319453, 7402851, 7501146, 7605158, 7693259, 7791761, 7895767, 8035757, 8200147, 8326448, 8511650, 8621494, 8707434, 8898791, 9110600, 9286078, 9452928, 9579746, 9748578, 9948045, 10177435, 10371100, 10572392, 10790706, 10893679, 11121543, 11347929, 11496789, 11773679, 12007742, 12226833, 12492561, 12671722, 12947946, 13208360, 13508310, 13780300, 14063448, 14332165, 14615728, 14945382, 15260944, 15559074, 15912280, 16246192, 16628921, 17022487, 17366438, 17789395, 18270484, 18618114, 19129117, 19675650, 20138209, 20716588, 21282675, 21796510, 22386191, 23089403, 23748889, 24416161, 25149800, 25898068, 26698516, 27529923, 28444866, 29422499, 30406693, 31502702, 32715137, 33979268, 35302620, 36724024, 38275282]
5481C8275282J720743J857917J921688K054948K240024K381734K653154K935970
5473E6041460L250210L544185L943093M373158N007645N603733O265358P119535
5465I5148377P918737Q922789J0201256J1647357J3236455J5186176J7419929
5458A79681076K0042229K2995261K5974113K8813096L1148639L1964110L0650533
5451C71269057K6639321J9427415R666796j315629j1859869k0788676k7148725
5444C65889690l0666605l1867544l1269451k9328065k6564291k3603183k0627284
5437A71963267j7888105j5406088j3250570j1458216r777845q497219p379969
5430H8305255o438689n695789m987269m450470m051698l666657l310055l030337
$$ y = [38275282, 39996025, 41853942, 43775630, 45830578, 48070602, 50452336, 53105490, 56041460, 59291670, 62835855, 66778948, 71152106, 76159751, 81763484, 88028842, 95148377, 103067114, 111989903, 122191159, 133838516, 147074971, 162261147, 179681076, 199723305, 222718566, 248692679, 277505775, 308654414, 340618524, 371269057, 397908378, 417335793, 427002589, 425686960, 413827091, 393038415, 365889690, 335223085, 303355541, 272086090, 242758025, 216193734, 192590551, 171963267, 154075162, 138669074, 125418504, 113960288, 104182443, 95685224, 88305255, 81866566, 76170777, 71183508, 66733038, 62681340, 59014683, 55704628, 52674291]
5422E2674291k755658k587153k353285k074290j949859j857332j690568j595165
5414C5810981j455498j360668j269430j190294j112402j029331r92221r85546
5406B6415591q81426q16500p54165q17208p48690o61770o89420o41780o57452
5397A9747180o24495n87622o16232o16199n18654n09031n35087n36552m02534
5388A4800774m37593m41269l18858l42008l80337m41782l15144l22454l28053
5379A1473276k73861k19937k62948k97370k41585k84261k51656k51762k19236
5370I170660j34407j85146k14472k03691j91982j54790j42823j45040k28048j67450
5360G402811j54158j39620j41423q7985j59529j50936j37134j12111n6001o6086
$$ y = [52674291, 49918633, 47331480, 44978195, 42903905, 40954046, 39096714, 37406146, 35810981, 34355483, 32994815, 31725385, 30535091, 29422689, 28393358, 27401137, 26415591, 25534165, 24717665, 23963500, 23146292, 22397602, 21735832, 21046412, 20404632, 19747180, 19122685, 18535063, 17918831, 17302632, 16783978, 16274947, 15739860, 15203308, 14800774, 14363181, 13921912, 13603054, 13261046, 12880709, 12438927, 12123783, 11801329, 11473276, 11199415, 10979478, 10716530, 10419160, 10177575, 9893314, 9641658, 9389896, 9170660, 9036253, 8851107, 8636635, 8432944, 8240962, 8086172, 7943349, 7798309, 7570261, 7402811, 7248653, 7109033, 6967610, 6879625, 6720096, 6569160, 6432026, 6319915, 6263914, 6197828]
5350F197828j11516j05872j80603m1167q6013j67875j30178j34894j38536j23561
5340D977613k7214j04229j06942n1604j38495j04372p9657n3555p2971m9426o6345
5329D122803m9534o6862j09511j31747o2535l9329o5801m1075P845l9168j08139
5318C416947j47056o9552m0558l1267j3302n1757o4772m1532K1025o2462O5035
5307B980749j25699r2184k5890n9945j4393o1738k6577n774r1717l0040K8368
5296B475160q2924m7447J1049M5582l9473o2069q5244m2805M5234l649j6822n0706
5284B145886j8477q0908n1862p7518J1729j8183r5308L5883l9290j15819p586
5273A688547o0626l2636m9062J475m9300m584j7597K7769k5833q1340m4141q071
$$ y = [6197828, 6086312, 5980440, 5799837, 5758670, 5672657, 5504782, 5374604, 5239710, 5101174, 4977613, 4950399, 4846170, 4739228, 4687624, 4549129, 4444757, 4365100, 4311545, 4238574, 4189148, 4122803, 4073269, 4006407, 3896896, 3765149, 3702614, 3663285, 3597484, 3556409, 3564254, 3525086, 3416947, 3269891, 3200339, 3159781, 3128514, 3115212, 3063455, 2998683, 2957151, 2978176, 2915714, 2980749, 2855050, 2762866, 2736976, 2677031, 2662638, 2600900, 2574323, 2568549, 2476832, 2446792, 2475160, 2392236, 2344789, 2355838, 2401420, 2361947, 2299878, 2214634, 2171829, 2217063, 2213414, 2196592, 2145886, 2127409, 2046501, 1994639, 1917121, 1928850, 1910667, 1815359, 1851242, 1811952, 1696133, 1688547, 1627921, 1595285, 1546223, 1547698, 1498398, 1493814, 1476217, 1503986, 1478153, 1396813, 1352672, 1344601]
5261A344601Q4008k9393l6121N5662P6536l9322m6398l4139l2453J6199M5494
5250A404674J5407j9165p608N1390N6072J877k3088n6731K1782k3657q0973M2264
5238A382244L2430n0339R5465n4797L5051K8097n4022o9825m946K8611l8703L491
5226A332757L2906M6426l5858K0391Q154O0819K32J3653J299l766q703j1139M9007
5213A506178j6521J3910j0247O036O8794o6608R1282K7255l2345O3625N6092N6419
5201A763870M0631L5944M8580L5369O4797J3042O197R1688J10737L9869M2991
5190B293715k7169J01260R8008K9674N7722P3134L2914p515P0708J25420O9355
5179B917226R2726n551Q354M6484N9500J06896O0837Q3015L1966o1422N9168O3271
$$ y = [1344601, 1428609, 1399216, 1363095, 1418757, 1495293, 1455971, 1409573, 1375434, 1342981, 1359180, 1404674, 1420081, 1400916, 1393308, 1444698, 1500770, 1502647, 1479559, 1422828, 1444610, 1420953, 1339980, 1382244, 1414674, 1364335, 1459800, 1405003, 1440054, 1468151, 1414129, 1344304, 1339358, 1367969, 1329266, 1332757, 1365663, 1412089, 1376231, 1396622, 1404776, 1465595, 1465827, 1479480, 1480779, 1477013, 1468310, 1457171, 1506178, 1489657, 1503567, 1493320, 1499356, 1568150, 1501542, 1592824, 1620079, 1587734, 1651359, 1707451, 1763870, 1804501, 1840445, 1889025, 1924394, 1989191, 2002233, 2008430, 2100118, 2210855, 2250724, 2293715, 2266546, 2367806, 2465814, 2495488, 2553210, 2626344, 2659258, 2651743, 2722451, 2847871, 2917226, 3009952, 3004401, 3012755, 3059239, 3118739, 3225635, 3286472, 3369487, 3401453, 3340031, 3399199, 3462470]
5167C462470L6772O0606p7478P6752Q1254P087k7329M3041O0661j2434P3535J4590
5155C799527P097O9879J41905j7672o0280O5587O9852M6297J4766M5635N3652
5144D236245o8974K0302Q0417M5450J5118M8841J07977j3472K2255J09559L2590
5133D636308O8643J03395O067L3040Q535K4027M4631L8901J4277M8690L1557L0508
5121E088579J5074K1214j0884J5310J0837o539j03118n8407Q7895K7545m1902
5110E045604o6260J3456J6210m8764K0581J2624l933l4459l7556L2232q363K2332
5098D963704K827j5947k0712R475m5238q8520l0470l8623o600p4026l9187r8548
5086D518135l5623l2840j0764r4701j40923o6032j01126m6895r1571j68028l8107
$$ y = [3462470, 3499242, 3559848, 3482370, 3559122, 3640376, 3647463, 3620134, 3663175, 3723836, 3711402, 3784937, 3799527, 3806624, 3876503, 4018408, 4000736, 3940456, 4006043, 4075895, 4122192, 4136958, 4182593, 4236245, 4167271, 4187573, 4267990, 4313440, 4328558, 4377399, 4485376, 4471904, 4494159, 4603718, 4636308, 4704951, 4808346, 4814413, 4847453, 4855988, 4880015, 4924646, 4963547, 4977824, 5026514, 5058071, 5088579, 5103653, 5124867, 5113983, 5129293, 5140130, 5133591, 5030473, 4972066, 5059961, 5087506, 5045604, 4979344, 4992800, 5009010, 4960246, 4980827, 4993451, 4989518, 4955059, 4917503, 4949735, 4941372, 4963704, 4966531, 4950584, 4929872, 4939347, 4894109, 4805589, 4775119, 4736496, 4729896, 4655870, 4616683, 4518135, 4482512, 4449672, 4438908, 4344207, 4203284, 4137252, 4036126, 3989231, 3897660, 3729632, 3691525]
5075C691525p2665j34729j4314l4886q8461r5288j31993r2690o4016j10177j66468
5064B685838j27182r9454j00967j8486j6491j00896j24475r3273p1544o297m0517
5053A886256p2330r9874j27852j7533J5385n2227j4078j7782j11044J9274K0569
5042A428764n5571L3089n5863l6042k4982L8l0287k0404J7930O3782k1555j01727
5030A197172K3041K5008k6941o7351L1096K7248l5858m1127L300L1478J2529o419
5018A173176o798K9126P937k6410K5995M2944K5929o8006k2956N7230L9804P2527
5006A350498j909O556R8780K8719J0423P1802J2469Q6952N8972l006K7780K6803
4994A774839k643N4697O0292O446L3715Q6898O2153J09955L0403L1253M6553J43667
$$ y = [3691525, 3618860, 3484131, 3469817, 3434931, 3346470, 3251182, 3119189, 3026499, 2962483, 2852306, 2685838, 2558656, 2459202, 2358235, 2339749, 2323258, 2222362, 2097887, 2004614, 1933070, 1926773, 1886256, 1813926, 1714052, 1586200, 1568667, 1584052, 1531825, 1517747, 1499965, 1388921, 1408195, 1428764, 1373193, 1406282, 1350419, 1314377, 1289395, 1289433, 1259146, 1238742, 1256672, 1320454, 1298899, 1197172, 1220213, 1245221, 1218280, 1150929, 1182025, 1209273, 1173415, 1132288, 1135588, 1167066, 1179595, 1173176, 1166378, 1195504, 1203441, 1177031, 1203026, 1245970, 1271899, 1203893, 1180937, 1238167, 1277971, 1350498, 1348589, 1355145, 1453925, 1482644, 1493067, 1564869, 1577338, 1664290, 1723262, 1720256, 1748036, 1774839, 1772196, 1826893, 1887185, 1893631, 1927346, 2014244, 2076397, 2186352, 2216755, 2248008, 2294561, 2438228]
4982B438228Q9309J2904P1715O904M3405P1859Q3634R8544L9438R4497J25170
4971C175607K2182O3088R9615M644L3455K9862J0584N5044J6697K4432j5461O0526
4959C580275O9319O2103M2352j136j4199L6813J18729L1350Q2473M7657J14541
4948D170277J11925Q8921M4387K4938R8600J23922J18504J23328J40695K86768
4938E332265M24096M73308N66562L64123J17982j64919k67828l37141l83543l28868
4928E796037k54510j58803j18780j58758r2198k8400j03506n9367J136m9920l5028
4917D737903m0772j2544l0693j2962J584k1570J2500M962j8989N8498l0463n0468
4905D596986K0460k7102j9047J7992n9177m5180L5156n226j09709q490k5318n0503
$$ y = [2438228, 2527537, 2540441, 2612156, 2619060, 2662465, 2734324, 2817958, 2916502, 2955940, 3050437, 3175607, 3197789, 3260877, 3360492, 3365136, 3398591, 3428453, 3439037, 3494081, 3510778, 3535210, 3519749, 3580275, 3649594, 3711697, 3754049, 3752913, 3738714, 3775527, 3894256, 3925606, 4008079, 4055736, 4170277, 4282202, 4371123, 4415510, 4440448, 4539048, 4662970, 4781474, 4904802, 5045497, 5332265, 5756361, 6229669, 6796231, 7160354, 7278336, 7113417, 6845589, 6508448, 6124905, 5796037, 5541527, 5382724, 5263944, 5105186, 5012988, 4984588, 4881082, 4821715, 4822851, 4772931, 4737903, 4697131, 4684587, 4653894, 4640932, 4642516, 4620946, 4633446, 4638408, 4619419, 4677917, 4647454, 4596986, 4617446, 4590344, 4571297, 4589289, 4530112, 4484932, 4520088, 4514862, 4405153, 4396663, 4371345, 4320842]
4893D320842Q859j9651m4663j05712m2209J2666p5629j18633j0253j1774j12535
4882C801308j31135m2690j04765m2987j7489k1685p8284j19187L1695o0112j06298
4871C108371n8848J2358p1525k9346p3290r1185O5843o2933n1920p6174q8497
4860B582854q0095k6953J3393p7551j03812p1696m290m1125r135p2037n479K4489
4848B128563r3360n6350O661r2146j07137K3782l4507K3534n4880k8642j00419
4837A615099n3992k5821K2025k233l3733o0493j7079n7880l8624K5733l8830l403
4825A330769l5475r4216K2559L4733p8129r2060n2111P487j3533l89o646r6895
4813I26094l3513P1863m8327J9022M7977k9053q3770Q8956m3143j1636L5137O914
$$ y = [4320842, 4329701, 4310050, 4265387, 4159675, 4117466, 4130132, 4054503, 3935870, 3925617, 3913843, 3801308, 3670173, 3627483, 3522718, 3479731, 3462242, 3440557, 3362273, 3243086, 3274781, 3214669, 3108371, 3049523, 3061881, 2990356, 2961010, 2887720, 2796535, 2862378, 2799445, 2747525, 2671351, 2582854, 2502759, 2475806, 2489199, 2411648, 2307836, 2236140, 2231850, 2190725, 2181590, 2109553, 2104074, 2128563, 2035203, 1978853, 1985514, 1893368, 1786231, 1810013, 1775506, 1799040, 1744160, 1715518, 1615099, 1561107, 1535286, 1557311, 1555078, 1521345, 1460852, 1443773, 1385893, 1347269, 1373002, 1334172, 1330769, 1295294, 1201078, 1223637, 1258370, 1180241, 1088181, 1036070, 1043557, 1030024, 1029635, 1022989, 926094, 892581, 964444, 916117, 935139, 983116, 954063, 870293, 959249, 916106, 904470, 939607, 946521]
4801I46521r3319N6691J8630J5286N3529J22620J74567P8257K18373L45043M48594
4790B384792L58515J75214J49180m0494l36464l96261m64125k92473p0199k02608
4780A265077j53526k7515n0431j3721j43706r8526M3763L7977n8247l3280k472
4769G65393l6857j0948j0709l9040J25941K6199k3384k7664K0627J8611Q8786
4758H96955j626L3339O0787j1507O649l123j5226n1477j49468j8087L2478o961
4746G72733l2161p7404q141J0628L7251J580O2045K611K1340j02345K675K2532
4734G13344k4888M54N5001R488m8168L2913k8705k179j2965j8104L9762M0726
4722G56679l8188K5516P338j379j2603J8039L2316k7300L9666Q4025J7803p2320
$$ y = [946521, 853202, 909893, 928523, 943809, 997338, 1119958, 1294525, 1372782, 1591155, 1936198, 2384792, 2743307, 2918521, 3067701, 3027207, 2690743, 2294482, 1830357, 1537884, 1467685, 1265077, 1111551, 1084036, 1033605, 1019884, 876178, 777652, 821415, 859392, 801145, 767865, 765393, 728536, 717588, 706879, 667839, 793780, 819979, 796595, 768931, 789558, 808169, 896955, 895329, 928668, 989455, 977948, 984597, 981474, 966248, 914771, 765303, 747216, 779694, 772733, 740572, 663168, 655027, 665655, 702906, 704486, 766531, 769142, 790482, 688137, 690812, 713344, 688456, 688910, 743911, 753399, 705231, 738144, 709439, 707260, 694295, 676191, 715953, 756679, 718491, 744007, 751345, 749966, 737363, 755402, 787718, 760418, 800084, 884109, 901912, 829592]
4710H29592P45L508J2952N2166J5643p250r5595j0991J00122j1192k9641L9551
4698H99610J11000n9611l8325Q5583j2835l3850M4670o723L7080O8q824l9752
4686I78091j2621J50447L5571m734N0352j3840l9450K2660J3118O0859n8884K2422
4674A203991R1909N5097M4043j7979K7647k004J505M9919K6721M7298K2182K2760
4662A573089J5972j4577O6017M2354O3068L0783l6287J04225N0682L2522M1222
4651A969070J5355O3121K5275P3272M2054J6132J13117J08361N8571J41102J20386
4640B745816K02975J02198J83760K45090J40146K57122L70588M37304M45493N74541
4630E705033R09231J511930K433851L315158L863254L001574m5722k132171k439421
$$ y = [829592, 830337, 833845, 846797, 898963, 914606, 907356, 811761, 800770, 900892, 889700, 860059, 899610, 1010610, 950999, 912674, 998257, 985422, 951572, 996242, 989519, 1026599, 1026667, 1017843, 978091, 965470, 1115917, 1151488, 1146754, 1197106, 1183266, 1143816, 1166476, 1179594, 1240453, 1181569, 1203991, 1295900, 1350997, 1395040, 1377061, 1404708, 1402704, 1404209, 1454128, 1480849, 1528147, 1550329, 1573089, 1589061, 1574484, 1640501, 1682855, 1745923, 1776706, 1740419, 1844644, 1895326, 1927848, 1969070, 1984425, 2047546, 2072821, 2146093, 2188147, 2204279, 2317396, 2425757, 2484328, 2625430, 2745816, 2948791, 3050989, 3234749, 3479839, 3619985, 3877107, 4247695, 4684999, 5130492, 5705033, 6614264, 8126194, 10560045, 13875203, 17738457, 20740031, 20694309, 18562138, 16122717]
4621A6122717k488439k129878j664996j130735p23764l22794n0851J82864M25034
4612H219158N33611Q56133J207878J608824J811924J804052J629056J225849R97570
4603A9894055J053798J296656K015717K638130K840194K364122J387007L95280
4595C3884959L3412L03969R64471J814731K302540K096639P77156q27159j920724
4586C9429994k150804j784540j097780m16224k41450o18632j316377k294628k688756
4577B6820803k576493k126104j655723j210692j068973j274847j571834j767405
4569A3568732j777554j660585j400478j291005r33359p36209n67877n02233l38722
4560D360710k84142k79256k19098j27437j31984j15415j09149j09857j57549j25918
$$ y = [16122717, 13634278, 11504400, 9839404, 8708669, 7984905, 7662111, 7611260, 7794124, 8219158, 8752769, 9608902, 10816780, 12425604, 14237528, 16041580, 17670636, 18896485, 19894055, 20947853, 22244509, 24260226, 26898356, 29738550, 32102672, 33489679, 33884959, 33918371, 34222340, 35186811, 37001542, 39304082, 41400721, 42177877, 41350718, 39429994, 37279190, 35494650, 34396870, 33980646, 33739196, 33120564, 31804187, 29509559, 26820803, 24244310, 22118206, 20462483, 19251791, 18182818, 16907971, 15336137, 13568732, 11791178, 10130593, 8730115, 7439110, 6505751, 5769542, 5201665, 4699432, 4360710, 4076568, 3797312, 3578214, 3450777, 3318793, 3203378, 3094229, 2984372, 2826823, 2700905]
4550B700905q5758j40702j39750l1983j0223j27734l7237l6584l1540p1411r6785
4539A891198p0177L9991o7965n2115l9357J913m6266j1065p6003o587n0833p3073
4527A439661j6123j11624L2909j4666J1635r0079o863o7887j08283j0553O5223
4516A123350L7499N0262j02904o5943L2412j2743K766m0777o0202p813M3386n6130
4504I43163j1523L0243j8694L989m5385L0450j5564J979J8733j1798K0896O0061
4492A006550j2240J2743J2052p8488j9099N0741j7691j08799m2821r730O4418
4481H57636o9561J5268Q5389l5697o8658j4754L1775N937j1409j727n5271J9069
4469G57997L6557j9120J5375p0060M5625L3889n6876l6514n5881O5687j9967K1404
$$ y = [2700905, 2615147, 2474445, 2334695, 2302712, 2292489, 2164755, 2127518, 2090934, 2059394, 1987983, 1891198, 1821021, 1861012, 1793047, 1740932, 1701575, 1703488, 1657222, 1646157, 1570154, 1563567, 1512734, 1439661, 1423538, 1311914, 1344823, 1330157, 1341792, 1251713, 1244850, 1176963, 1068680, 1058127, 1123350, 1160849, 1211111, 1108207, 1042264, 1074676, 1061933, 1064699, 1023922, 963720, 955907, 999293, 943163, 931640, 961883, 943189, 947178, 901793, 932243, 916679, 918658, 937391, 925593, 946489, 1006550, 994310, 1007053, 1019105, 940617, 921518, 972259, 954568, 845769, 802948, 793218, 857636, 788075, 803343, 888732, 853035, 784377, 769623, 801398, 807335, 795926, 794199, 738928, 757997, 794554, 775434, 790809, 720749, 766374, 800263, 743387, 706873, 650992, 716679, 696712, 718116]
4457G18116m8821l776o4875N3371k085K9321M9470k2255J6279L0939L0127o5497
4445G20314Q622o4357j2425l8952K7209p0835j6794J5122l048j423J9240O4501
4433F47174j3064r3014o6715m9830P4120P1515N0844Q380j02833K5291K6139K2031
4421F00038l4806M764K2438n1350o577M7429j9224p6235L637K4839m6545N3406
4409E21814K358M2203l3335n4210m1198P8473O6204n3235n3561M185Q9386L1502
4397F00586j2845m7673l8019P5718K4449Q848J0319p8105P354J822j3906R964
4385E48512K8993J5283k8815Q480M1474k2107q764o9162M1210Q686j598K4216
4373E86408K9505k724k0382J2840L6125l2820k7746Q0276k5279j0645J5930O1320
$$ y = [718116, 669295, 665519, 600644, 654015, 651930, 681251, 730721, 708466, 724745, 755684, 785811, 720314, 728936, 664579, 652154, 613202, 640411, 569576, 552782, 567904, 564856, 563433, 582673, 647174, 634110, 541096, 474381, 424551, 498671, 570186, 621030, 629410, 526577, 551868, 578007, 600038, 565232, 569996, 592434, 541084, 534507, 581936, 562712, 486477, 490114, 514953, 468408, 521814, 524172, 566375, 533040, 478830, 437632, 516105, 582309, 529074, 475513, 479698, 569084, 600586, 587741, 540068, 502049, 577767, 602216, 611064, 621383, 543278, 550632, 552454, 538548, 548512, 577505, 592788, 563973, 572453, 613927, 591820, 583056, 513894, 555104, 563790, 562192, 586408, 615913, 613189, 592807, 605647, 641772, 608952, 581206, 661482, 636203, 625558, 641488, 702808]
4361G02808K6063L396L6646M9733K9559r7105l6362n5662L5285Q6322K5301M3477
4349H49461L1305o2314R189J7930J2363J9103K5490j0177J4795K8971J7219M2246
4337I95581q5676q319N2985m4633k6181K8839O884j171L1562J5772J4351p876
4325I72118n264P577J7969m001K8255K2313k416K4734o706M5836N6083k7854L0540
4312A159184R2775j2128m7363P872J8694N157m4251m3227N4847K735L1163R6184
4300A321642P9668L6121n6323J1412L5060M3756K7826J8346k421J4532M3834J8346
4288A591799Q1223m09J05261K6816J0446M0051n1986j9937K6443R4912N5031O3005
4276B022655l8223k5687L5081K6696K2573J3213Q575j7900N3585p2458N0099M0729
$$ y = [702808, 728871, 732267, 768913, 818646, 848205, 751100, 714738, 659076, 694361, 780683, 805984, 849461, 880766, 818452, 827641, 845571, 857934, 877037, 902527, 892350, 907145, 936116, 953335, 995581, 909905, 901586, 954571, 909938, 883757, 912596, 919480, 918309, 949871, 965643, 979994, 972118, 966854, 974431, 992400, 988399, 1016654, 1038967, 1036551, 1061285, 1054579, 1100415, 1156498, 1128644, 1159184, 1251959, 1239831, 1192468, 1200340, 1219034, 1224191, 1179940, 1136713, 1191560, 1194295, 1225458, 1321642, 1401310, 1437431, 1381108, 1392520, 1427580, 1471336, 1499162, 1517508, 1515087, 1529619, 1573453, 1591799, 1673022, 1672613, 1777874, 1804690, 1815136, 1855187, 1803201, 1783264, 1809707, 1904619, 1959650, 2022655, 1984432, 1958745, 1993826, 2020522, 2043095, 2056308, 2064883, 2046983, 2100568, 2028110, 2078209, 2118938]
4264B118938O577M5622L8453J0606K7795J8834Q1587Q6058j1380J5516Q5484J01370
4252B625460L1922O3844K7579P8648l37L1477N2318N6159J20934L8447J00104
4241C226555R8352P3986J00887J27408Q8868P7287Q608J45727J07270Q7835M8045
4230D190828J16220K46337J40715J19420J38121J88948J92055K72549L83973L65691
4220F354857M63482M77736N02027N52248N49200O43288P62738R79109J210466
4211A2495151J615474K319627M005817O363578Q509284R740173N838660k935230
4203D7952534n965459n660737n611032m300271l207901k176314j331525n76945
4195A9122350o1382J58816L32357N54334N44263N84361O21051P03707O57548O51761
$$ y = [2118938, 2125515, 2171137, 2209590, 2220196, 2247991, 2266825, 2348412, 2434470, 2423090, 2438606, 2524090, 2625460, 2657382, 2721226, 2748805, 2827453, 2827116, 2858593, 2910911, 2967070, 3088004, 3126451, 3226555, 3324907, 3398893, 3499780, 3627188, 3716056, 3793343, 3801951, 3947678, 4054948, 4142783, 4190828, 4307048, 4553385, 4694100, 4813520, 4951641, 5140589, 5332644, 5605193, 5989166, 6354857, 6818339, 7296075, 7798102, 8350350, 8899550, 9542838, 10305576, 11284685, 12495151, 14110625, 16430252, 20436069, 26799647, 35308931, 45049104, 50887764, 47952534, 41987075, 36326338, 30715306, 26415035, 23207134, 21030820, 19699295, 19122350, 19060968, 19219784, 19552141, 20106475, 20650738, 21235099, 21856150, 22559857, 23217405, 23869166]
4185B3869166O51608O88235N57082N94947O50765N78575M53419M12048L93738
4176B8849583M33449K95765K64621K12644L5298P0535k5778q1154j15872j78909
4166B9760182k90373l48570l59485m76752m55752n70769n76325o47898o65971
4157B5368287p50031p41411p90609p63523q07364q14963p77912p22408p98595
4148A8401471q71815p60615p52832o78790p37840p19264o32926n98706o68351
4139A1980332n75653n56752m95205m92638m80610m82324m24746l85935l93845
4130G692624l45646l12831l47638k98161l22066j96357k44561k45364k35541k32352
4120D912107j50745j39210j29900p5748j31250j84621j51574P629j90447j39439
$$ y = [23869166, 24520774, 25209009, 25766091, 26361038, 27011803, 27590378, 28043797, 28455845, 28849583, 29283032, 29578797, 29843418, 30056062, 30091360, 30161895, 30136117, 30054963, 29939091, 29760182, 29469809, 29121239, 28761754, 28285002, 27829250, 27258481, 26682156, 26034258, 25368287, 24618256, 23876845, 23086236, 22322713, 21515349, 20700386, 19922474, 19200066, 18401471, 17529656, 16769041, 16016209, 15337419, 14599579, 13880315, 13247389, 12648683, 11980332, 11404679, 10847927, 10352722, 9860084, 9379474, 8897150, 8472404, 8086469, 7692624, 7346978, 7034147, 6686509, 6388348, 6066282, 5869925, 5625364, 5380000, 5144459, 4912107, 4761362, 4622152, 4492252, 4416504, 4285254, 4100633, 3949059, 3956688, 3766241, 3626802]
4110C626802p4176m6623m845m2549m7213j216q5965r7631l8093p7942m3784n0295
4098C016470Q970q5196K9221j6556J884O563K5084n6188j00246o2151l9872o7416
4086B660567N0530J03168j6100o4034j55L7774K9566L3101l5332j9900q10M4864
4074B823239M4178j7669N9343k9333o8528P8174J07530Q7029J22265O3342J6389
4063C285959K0815J60968P4574O2048J83593J42080K51773K90136L67621N54868
4053E394435Q44997J251259J975276K388997K087217M18160j087572j505873j715342
4044A0051554j517714j194236q48284o42295m04299k71754m194L5215n6723m5224
4034E102046j24550m1607J463o6952Q7522R7266J25242Q2838l5348m2654O79l8278
$$ y = [3626802, 3552626, 3506003, 3501158, 3458609, 3411396, 3410180, 3324215, 3226584, 3188491, 3110549, 3066765, 3016470, 3025440, 2940244, 2969465, 2952909, 2954793, 2961356, 2986440, 2930252, 2830006, 2767855, 2727983, 2660567, 2711097, 2814265, 2798165, 2734131, 2733976, 2771750, 2801316, 2834417, 2799085, 2779185, 2778375, 2823239, 2867417, 2849748, 2909091, 2879758, 2811230, 2889404, 2996934, 3083963, 3206228, 3269570, 3285959, 3306774, 3467742, 3542316, 3604364, 3787957, 3930037, 4181810, 4471946, 4839567, 5394435, 6239432, 7490691, 9465967, 11854964, 13942181, 14360341, 13272769, 11766896, 10051554, 8533840, 7339604, 6491320, 5849025, 5444726, 5172972, 5168778, 5203993, 5147270, 5102046, 4977496, 4935889, 4937352, 4870400, 4957922, 5055188, 5180430, 5263268, 5227920, 5185266, 5185945, 5147667]
4022E147667o2460k4874N8397k1405J31132J35206R8889J67593J78565J59856
4012E968566J78368K01142K04379K07450K51566K38307L15363L17294K44090L47948
4002H474473L11180L34660K76140K70972K57764J57368K68632K84746J66447K41231
3992A1043613J73704Q0747J68262J98533R9865R3442j3666p7771K6455O3511k3393
3981A1833302l3749p4978M2781j12962j5390m2842q8496r9489k9594o3698k2142
3970A1292743J37455J38055J33735J34716K68434L06293L03172L32931M26675
3961A3474209M96680N29285N68792N93425O94752Q12743Q90601Q12233Q55004
3952A9727724R60252R18707R86075J026817R33173Q87778R79127R60678Q04468
$$ y = [5147667, 5085207, 5060333, 5118730, 5097325, 5228457, 5363663, 5462552, 5630145, 5808710, 5968566, 6146934, 6348076, 6552455, 6759905, 7011471, 7249778, 7565141, 7882435, 8126525, 8474473, 8785653, 9120313, 9396453, 9667425, 9925189, 10082557, 10351189, 10635935, 10802382, 11043613, 11217317, 11298064, 11466326, 11664859, 11764724, 11858166, 11844500, 11766729, 11793184, 11856695, 11833302, 11799553, 11724575, 11767356, 11654394, 11639004, 11596162, 11507666, 11408177, 11378583, 11314885, 11292743, 11430198, 11568253, 11701988, 11836704, 12105138, 12411431, 12714603, 13047534, 13474209, 13970889, 14500174, 15068966, 15662391, 16357143, 17169886, 18060487, 18872720, 19727724, 20687976, 21606683, 22592758, 23619575, 24552748, 25440526, 26419653, 27380331, 28184799]
3943B8184799P86431P61407P33031N81801M91913M62696L95972L43328K67491
3934C3008869K21657J34403J77891L6908L1554L1295k0418q2638n7995p6922o7038
3923C3337566o0555p0957j30065o4359M4775O00J4372J2936P6464Q3443J3505
3912C3257725m7007n1571j4938m3229r6489n4366j76855k06588k44767k89322
3902C2032593l01616l42244l46798m33572n53782o14486o23480o96847p30285
3893B7389483p61039p76537q46425q44972r12116q73214q37076q59300r06374
3884A9772430q96482p65382p70390o42846n80337o08965n41954m25069m64461
3875A4076544m06100k83561k50091k30862j45452j10600j52215p2937k9161P9389
$$ y = [28184799, 28971230, 29732637, 30465668, 31047469, 31539382, 32002078, 32398050, 32741378, 33008869, 33230526, 33364929, 33542820, 33579728, 33611282, 33642577, 33622159, 33539521, 33481526, 33404604, 33337566, 33277011, 33206054, 33075989, 33011630, 33056405, 33057005, 33071377, 33084313, 33160777, 33244220, 33257725, 33210718, 33159147, 33144209, 33100980, 33004491, 32950125, 32773270, 32566682, 32321915, 32032593, 31730977, 31388733, 31041935, 30608363, 30054581, 29440095, 28816615, 28119768, 27389483, 26628444, 25851907, 25005482, 24160510, 23248394, 22375180, 21538104, 20678804, 19772430, 18875948, 18110566, 17340176, 16697330, 16116993, 15508028, 14966074, 14541005, 14076544, 13670444, 13386883, 13136792, 12905930, 12760478, 12649878, 12497663, 12424726, 12395565, 12474954]
3865A2474954J8255R0304P6508J28627O5288R3628J06689Q0887P4832L7534K5548
3854A3273054q729L7110L7303n4726J111p9532j25600j2102j49171j6546q2419
3843A2819753k13185j82656q7262o0303j38991j30778j43770q2478p3937j8559
3833A1687834j11467p7760p4205n126R6377j366M6216J18457J45280N0411Q2099
3822A1956750Q8072J12977O3985O5879J03491J28790J22849O6478m69J38273L3893
3811A2880968N2238o1059k2024n2124j02923j01759m7783m5928j87727j07669
3801A2204210q2646m7187r4485p3191p8797j23972j76361j28684j40228l6212
3791A1222447m0217l4813K7179O0789J11275K04526J61892J80259K86867L83888
$$ y = [12474954, 12493209, 12583513, 12660021, 12788648, 12853936, 12947564, 13054253, 13135140, 13209972, 13247506, 13273054, 13264325, 13301435, 13338738, 13284012, 13285123, 13205591, 13079991, 13067889, 12918718, 12902172, 12819753, 12606568, 12423912, 12336650, 12276347, 12137356, 12006578, 11862808, 11780330, 11706393, 11687834, 11576367, 11498607, 11424402, 11419276, 11515653, 11514287, 11560503, 11678960, 11824240, 11874651, 11956750, 12044822, 12157799, 12221784, 12287663, 12391154, 12519944, 12642793, 12709271, 12708802, 12847075, 12880968, 12933206, 12872147, 12850123, 12797999, 12695076, 12593317, 12545534, 12499606, 12311879, 12204210, 12121564, 12074377, 11979892, 11906701, 11827904, 11703932, 11527571, 11398887, 11258659, 11222447, 11182230, 11147417, 11174596, 11235385, 11346660, 11551186, 11713078, 11893337, 12180204, 12564092]
3781A2564092L85953L40965M60571N85675N99491O43771O91477O91525P65207
3772A7728727P67578P75853Q15392Q68160Q27475Q60686Q16674P84477O96226
3763B4941248P20626P42854O31994N22582M85064N01292L88404L14537K34146
3754B9482747J64703P7542l564r8333r0391j18121k59143l04335l36376k23839
3744B8290890l30734l92692l51366l27576k52516k95221k10978j41517k13960
3735B5774330j21478n406o5864J4831R2405J61959J08487K39933J89653J95243
3725B6584093L04915K94255J82292K79349K63198K43199K33726J72983J81738
3716B8739748N1401M158J01087n4766j90474j85258l50089l43523m13837m99650
$$ y = [12564092, 12950045, 13291010, 13751581, 14337256, 14936747, 15580518, 16271995, 16963520, 17728727, 18496305, 19272158, 20087550, 20955710, 21783185, 22643871, 23460545, 24245022, 24941248, 25661874, 26404728, 27036722, 27559304, 28044368, 28545660, 28934064, 29248601, 29482747, 29647450, 29724992, 29721428, 29623095, 29532704, 29414583, 29155440, 28851105, 28514729, 28290890, 27960156, 27567464, 27216098, 26888522, 26636006, 26340785, 26129807, 25988290, 25774330, 25652852, 25647446, 25581582, 25596413, 25688818, 25850777, 25959264, 26199197, 26388850, 26584093, 26889008, 27183263, 27365555, 27644904, 27908102, 28151301, 28385027, 28558010, 28739748, 28791149, 28795307, 28896394, 28841628, 28651154, 28465896, 28115807, 27772284, 27358447, 26858797]
3706B6858797n18108o53396o27982o56849o20711p37539q44340p68539p89842
3697B0641491p89955p91656p87323p01252p32409q16701p67771q02364n80809
3688A3871251n19634n92259n84634m69551l83357l01511l19082k30719k17084
3679A0253420j39503m8469r5576m7170P8236L5686N1814M0172M5169P8114Q4227
3668A0336120J5096O2457K5528M9036O1648j4654O7876L0660j1275l3810K1079
3657A0609761j768j41810j61405j05788k21302k27342j72578k58425k46196k43719
3647H829428k83338l39573k72588k37612k87884k62708k74392k53652k95659l04706
3637F017316k50604k76145l03825k46098k15228j62623k01368k27870j80683j79034
$$ y = [26858797, 26340689, 25687293, 25059311, 24402462, 23781751, 23044212, 22199872, 21431333, 20641491, 19851536, 19059880, 18272557, 17571305, 16838896, 16022195, 15254424, 14452060, 13871251, 13351617, 12759358, 12174724, 11705173, 11321816, 11020305, 10701223, 10470504, 10253420, 10113917, 10065448, 9969872, 9922702, 10000938, 10036624, 10088438, 10128610, 10173779, 10251893, 10336120, 10351216, 10413673, 10439201, 10488237, 10549885, 10535231, 10603107, 10633767, 10622492, 10588682, 10609761, 10607993, 10466183, 10304778, 10198990, 9977688, 9750346, 9577768, 9319343, 9073147, 8829428, 8546090, 8206517, 7933929, 7696317, 7408433, 7145725, 6871333, 6617681, 6322022, 6017316, 5766712, 5490567, 5186742, 4940644, 4725416, 4562793, 4361425, 4133555, 3952872, 3773838]
3627C773838p6024j19656k41699q7833j11432m2745j02584j74956q2854j34132
3617B599923n0440n4619o2784o7733k7357k5321m7542j18695k0065k927j04825
3606B017615R552q6455L3091o6941j05351j7525p9290o158m4568q194n9437l2847
3594A553492N545j3082m7474n9001j2104m4519R322j4051o6561K4794l9418j10153
3582A186790K4957p14k113p7169M1978m0799l5842J6104o1459l4447j8983k3728
3570I74575L338m872k1595k4262j1378j3636O6768m778o1372o0261L742R687o9791
3557G86165m566N734K8025p2754J6066J5776l7363K4962j0804J0121L9136o5839
3545G34659N487k2830O560K1176o5364o4143M674N4091L5990k4744l8680j4003
$$ y = [3773838, 3697814, 3578158, 3336459, 3248626, 3137194, 3094449, 2991865, 2816909, 2734055, 2599923, 2549483, 2494864, 2432080, 2364347, 2336990, 2311669, 2264127, 2145432, 2125367, 2122440, 2017615, 2027167, 1940712, 1973803, 1906862, 1801511, 1783986, 1704696, 1698538, 1653970, 1645776, 1586339, 1553492, 1559037, 1545955, 1498481, 1439480, 1427376, 1382857, 1392179, 1378128, 1311567, 1336361, 1296943, 1186790, 1211747, 1211033, 1208920, 1131751, 1173729, 1132930, 1097088, 1113192, 1051733, 1017286, 998303, 974575, 977913, 973041, 951446, 927184, 915806, 902170, 968938, 964160, 902788, 842527, 846269, 855956, 786165, 781599, 787333, 815358, 742604, 758670, 774446, 737083, 762045, 751241, 761362, 800498, 734659, 740146, 717316, 723876, 745052, 679688, 615545, 620219, 674310, 710300, 685556, 646876, 632873]
3533F32873k4282r534j9636j0680k9475l9825k2048N3887O618K2628L6074m5895
3521E50705k240k697L1667K3480n7181p5132J3803R310M4991k4472l1383m7095
3509D33756n37K5891L4027k3261k8667J7522J39j1888n3368l5950R1727M4396
3497D93787l0709m5535J0130j9437K6563j1061m6680P7436k671N1740R921j5940
3485D97544m0994k824m7553k0577P5510m6135j3856K6028k3834L4703P422q886
3473D36548J1506p102k4398K7331K6828O2413p9379n0902P2281K1826l2241l5146
3461D29565k5263L5279J1477j4006R84k096J9725R918m5671j248Q5193p4979k9162
3448C99716P3313M4591n1821k4840j7948O0866j9555L410L8749j6888M3203l5391
$$ y = [632873, 608591, 599057, 579421, 568741, 539266, 499441, 477393, 531280, 537898, 560526, 596600, 550705, 548465, 545768, 577435, 600915, 543734, 468602, 482405, 491715, 536706, 512234, 480851, 433756, 433219, 459110, 493137, 469876, 441209, 458731, 458870, 446982, 393614, 357664, 449391, 493787, 463078, 417543, 427673, 408236, 434799, 423738, 377058, 454494, 451823, 503563, 513484, 497544, 456550, 453726, 406173, 385596, 461106, 414971, 401115, 427143, 403309, 438012, 445434, 436548, 448054, 440952, 416554, 443885, 470713, 533126, 453747, 402845, 475126, 496952, 464711, 429565, 404302, 439581, 451058, 437052, 438036, 435940, 455665, 465583, 419912, 418664, 503857, 428878, 399716, 473029, 517620, 465799, 440959, 423011, 483877, 464322, 467732, 506481, 489593, 532796, 497405]
3436D97405k2486j0398O275j1497O1456L4373q7603L9178K2226k0893O3781n984
3424E65833k579j2507K1663J5163j489P6345P1754J8776n4834Q0808l0938j00833
3412F47162K9850m6253l5066j6916l1551j4471m2154k4953J0495j1195j1211q3710
3400C70027n1376N6302L3640r7668m1897L2931p3447R557L3429j083L3969m4460
3388B59924k7897K8834M0641k4110k1513O2584l306l0778M304k6396l5650J360
3376B27997K4909M860P388m8257K6947q133J2297M9297n0412m5142l041j1478
3364A87232J8893J46661M1468J8356l4596k7914O6026O177j4517l2178J8515P6047
3352D70170l5159N398n2784n9969L9316K0613l8543l921O060M2730m5887p4107
$$ y = [497405, 474919, 464521, 470796, 459299, 520755, 555128, 467525, 506703, 528929, 508036, 571817, 565833, 563254, 550747, 572410, 587573, 586084, 662429, 734183, 752959, 698125, 778933, 747995, 647162, 677012, 630759, 595693, 578777, 547226, 532755, 490601, 465648, 476143, 464948, 453737, 370027, 318651, 374953, 408593, 310925, 269028, 301959, 228512, 238069, 271498, 270415, 304384, 259924, 232027, 260861, 301502, 277392, 255879, 318463, 315157, 284379, 288683, 262287, 226637, 227997, 252906, 257766, 265154, 216897, 243844, 235711, 248008, 297305, 246893, 201751, 198710, 187232, 206125, 352786, 394254, 412610, 378014, 350100, 416126, 422303, 407786, 375608, 394123, 470170, 435011, 440409, 387625, 327656, 366972, 387585, 349042, 345121, 351181, 393911, 348024, 273917]
3340B73917k0521l4988l7066K4878J8427n1761J5124N410k1930J063K6257q2371
3328A16439N2293k7187m9965j3825R9232n7833m3012L4360O4342p9140n1596P5542
3316A19650M0351l0268n2058m409L9453N062M2833k9102j7819N3285k7686j0456
3304A28836n5594P7153k4242o6393M4406m0936J0999M2977o7994j2279n2152j3505
3292b8724Q6206M1215K2206K7842p7492k9407j2058j9901L5008M0798l2433M3997
3280I7257K4049j8252j03065L7644N0467K2622p7529J3505P3802k6507J8430N2067
3268A64490L61K0098N0067k1160o9186J51m7427m2648l8075K6575j5412k8611
3256g77M498O7545P641j790n4950M132j2268p49O6062o7837J6647r40m198O6417
$$ y = [273917, 253396, 218408, 181342, 206220, 224647, 172886, 188010, 193420, 171490, 172553, 198810, 116439, 168732, 141545, 91580, 77755, 176987, 119154, 76142, 110502, 174844, 95704, 44108, 119650, 160001, 129733, 77675, 73266, 112719, 117781, 160614, 131512, 113693, 166978, 139292, 128836, 73242, 150395, 126153, 59760, 104166, 63230, 74229, 117206, 49212, 36933, -15219, -28724, 57482, 98697, 120903, 148745, 71253, 41846, 29788, 9887, 44895, 85693, 53260, 97257, 121306, 103054, -11, 37633, 88100, 110722, 33193, 46698, 120500, 93993, 112423, 164490, 164851, 184949, 235016, 213856, 144670, 144821, 97394, 54746, 16671, 43246, 27834, -777, 3721, 71266, 78907, 77117, 22167, 26299, 14031, 13282, 79344, 11507, 28154, 27214, 23016, 89433]
3242H9433K6677j296M1713p953N292k4028N0921K1571m9461m9062p6767m389L1936
3229E4587m3989R631J9786k3768P035M3278M1509M991j04987N3503L7113j5909
3217H2780J7758l8245n6776N7710k7210L1332P041l8171K0728K7370M601j6468
3205G2450j1820q4611q4906Q1676O1214r173O0863Q010j5511m2566n2845L3190
3193A5971k7388L4186l2121K8008M4684n0227M1752k706k6771J4673L5644q7114
3181a1409K9284p74M314m7852l3085M4589K9267P419j1765l6991n720L4120m24
3168I73L2200j432j746M7976n780k0237l2980J9711J9519n6391k1144K7086k6532
3155a8777M7895L2651m6288j3447p722P431p26K4047L8557M0047k1909o65k5212
$$ y = [89433, 116110, 114814, 156527, 148574, 153866, 129838, 180759, 202330, 152869, 103807, 27040, 22651, 54587, 10598, 20229, 40015, 16247, 23282, 66560, 108069, 113060, 8073, 61576, 98689, 82780, 100538, 62293, 5517, 63227, 36017, 67349, 74390, 36219, 56947, 84317, 88918, 72450, 60630, -23981, -108887, -27211, 34003, 24830, 85693, 93703, 78192, 35626, -17219, 15971, -11417, 22769, -9352, 18656, 63340, 13113, 54865, 52159, 25388, 40061, 75705, -11409, 17875, 17101, 21415, -26437, -59522, -14933, 14334, 21753, 9988, -27003, -32723, 1397, 973, 33173, 31741, 29995, 77971, 72191, 51954, 18974, 38685, 58204, 1813, -19331, 7755, -18777, 29118, 61769, 15481, 2034, -5688, 1743, 1017, 25064, 63621, 103668, 81759, 81094, 55882]
3142E5882M8270o5978M1806J61n9662j3017J5532J7323L5991J3341J5328j4198
3130I0779o2742L2968K6759p510n0699l0979J12171L1844m5398o9398M862m8811
3118a6154J380N6477k180j790N2240K4880k7507K4593j7051M1168k4152k8682
3106H3222K79m7851J7803N3571n4249M277J2880k1806O4084j0022L5668K7592
3094A65448k8711p5m7045M9596M1265J2642L3070J9769j5897K994o2920J5075
3082A85211q1377L1916N5374j7854l2854L1239j9169k254n1542J6093o0477O464
3070F0770J9465O3087o1544r271L3006k7498P0277j6248m531J7081K8929n242
3058A68281l1755p716m953j6989J8008K1362p437k0231m3821N1142J3914n90J6548
$$ y = [55882, 104152, 38174, 79980, 80141, 20479, 7462, 22994, 40317, 76308, 89649, 104977, 90779, 28037, 61005, 87764, 80254, 29555, -1424, 110747, 142591, 97193, 27795, 32657, -16154, -14774, 41703, 39523, 37733, 89973, 114853, 87346, 111939, 94888, 136056, 111904, 83222, 83501, 35650, 53453, 107024, 52775, 57052, 69932, 48126, 112210, 102188, 137856, 165448, 136737, 136662, 89617, 139213, 180478, 193120, 226190, 245959, 230062, 233056, 170136, 185211, 103834, 135750, 191124, 173270, 140416, 171655, 152486, 150232, 98690, 114783, 54306, 60770, 80235, 143322, 81778, 72507, 105513, 78015, 148292, 132044, 127513, 144594, 173523, 168281, 136526, 128810, 123857, 106868, 124876, 146238, 138801, 118570, 74749, 125891, 139805, 139215, 155763]
3045A55763M2225N3723q3251n8852L991K5282n9463N634o845L2777M5066l1051
3033A24999m5399m1710K7874O1466K81q976m0347J4272k1341J306l8851L8746
3021G2320J9240p0687L0323L9041j1884p431R230O584l9814m3985j0340M5597
3009C8194M4466l0087J0643P7594n7703k4807p9123m7264N7814P1455o69P856
2997F8369k7723j9929N3209k88o4834M2880l4968J5567N6222q1363j7581J9149
2985H710q6322l9452M0335M9505L1301l1342n612n58N4095j2173j2910J7443q2160
2972f9140n583M4993K1048L0876q400r533o4702k510R6222l0638m2047P85K3405
2959a5224j3294J5174j0840N7611m7732n9448J9020L7469J1736j6381O246j08300
$$ y = [155763, 197988, 251711, 168460, 109608, 113599, 138881, 79418, 85052, 78207, 110984, 156050, 124999, 79600, 37890, 65764, 127230, 127511, 118535, 78188, 92460, 71119, 72425, 33574, 72320, 91560, 20873, 51196, 90237, 78353, 70922, 80152, 86736, 46922, 2937, -7403, 38194, 82660, 52573, 63216, 140810, 83107, 58300, -20823, -68087, -10273, 61182, 60513, 68369, 40646, 20717, 73926, 73638, 8804, 51684, 16716, 32283, 88505, 7142, -10439, 8710, -77612, -117064, -76729, -27224, 4077, -27265, -32877, -33435, 20660, 8487, -4423, 13020, -69140, -74723, -29730, -8682, 22194, 13794, 4261, -60441, -62951, 33271, 2633, -39414, -38629, -15224, -28518, -13344, -24184, 33427, -14305, -73753, -54733, -17264, -5528, -21909, -15663, -123963]
2947a23963K0943M0406L7043J0522l081Q113L4979K6530r4391O6016O260l7937
2935h560j9952q1974L172M6628j8507k1326O247J00615M4999j18835Q9596l0485
2923h382l8119k2379N9834o0148l883K3809N0145k5336n4622R7089P3299J3459
2911A04766o7446k5004K3668k3473j4640q843k1296J3364J0485o2632K0438m3210
2899i3823k0745l0301J579P4594q211k5458P356L0346O930M3769o347n7982J4043
2886f4250J5905K5289l208n6997j2914J0080K1579L3084m2841k5543j0746k0081
2874a30643R7277J4374j8470n9168M5503R260n0226O015M4531K8798M6725M8330
2862H2306K7809m7337k6108n6621R928P080J1184P736m1237r685L1080j1543M6761
$$ y = [-123963, -103020, -62614, -25571, -15049, -18130, -10017, 24962, 51492, -42899, 23117, 29377, -8560, -28512, -110486, -107314, -60686, -79193, -100519, -94272, 6343, 51342, -67493, 22103, -8382, -46501, -68880, -9046, -69194, -73077, -49268, 877, -24459, -79081, 18008, 91307, 104766, 37320, 12316, 35984, 12511, -2129, -10972, -32268, -18904, -8419, -71051, -50613, -93823, -114568, -144869, -143290, -68696, -76907, -102365, -95009, -64663, -57733, -13964, -20311, -78293, -64250, -48345, -23056, -26264, -83261, -96175, -86095, -64516, -31432, -74273, -99816, -110562, -130643, -33366, -18992, -37462, -96630, -51127, -41867, -92093, -86078, -41547, -12749, 33976, 82306, 110115, 62778, 36670, -19951, -10023, -2943, 8241, 15977, -25260, -34945, -3865, -15408, 31353]
2849C1353L429q8354K1395m5348J8885n2205k4863Q2397K5288p2444k6984K2295
2837a05156J6670k0442l4730M293P306N8600k5118j3501K2478j1453Q2320J7762
2825i71M8725m451n82j35097J2454M4755J4426k0744p6390R233P0213r005m2664
2812i0098R5074p7509o2757L8423P557K7615L5057q8787j3631M232N024P3406
2800d6394K9938j6987J4821k2037P246p138m0530l609J0070K4256O2345j3497
2788a516j1895j02L5907k9170J4262n0336M294P4777j4302l1908k2698m6601k0738
2775a00026L9851Q5094p3950o2916L0648P9828k1182k8895Q5461L9301n3541r6063
2763g6390j4522M1086M6409O1882q0623j8715M7687J4123k4474n6696J2437n0044
$$ y = [31353, 34782, -53572, -32177, -77525, -58640, -110845, -135708, -53311, -28023, -100467, -127451, -105156, -88486, -108928, -143658, -139365, -132059, -73459, -98577, -112078, -89600, -101053, -18733, -971, 47754, 43303, 42721, -92376, -79922, -35167, -20741, -41485, -117875, -108642, -38429, -47434, -90098, 4976, -72533, -135290, -96867, -89310, -61695, -26638, -115425, -129056, -124824, -119800, -46394, -16456, -33443, -18622, -40659, -33413, -40551, -81081, -84690, -74620, -50364, 11981, -1516, -13411, -13513, 22394, -6776, 7486, -42850, -38556, 36221, 21919, -9989, -32687, -79288, -100026, -60175, 24919, -49031, -111947, -81299, -1471, -22653, -51548, 33913, 73214, 19673, -76390, -90912, -49826, -3417, 58465, -22158, -40873, 6814, 20937, -3537, -60233, -47796, -97840]
2751i7840j6125M5019L755j0801j2574J8857K8828p1785J3289r339R461O4237
2739c5018M1252q8994k3990J8873O3845J5739j1892K3729j8370n3677n1660N8855
2727f1308n712o2266Q249L3094o160L1380m2853k7709M6899r535K0143J8273L475
2714e4030l2197q730n936O5700n1061l363L2433L9707j3439k2433q44J8217J0550
2701b5426J6481j8129p3898k7273L1149Q7413k9290J3901j4366K8522m414J638
2689a3692N278o6893M4992N5491n9295J8339L1814j1029k173q8760k9472K5431
2677h9969k029m637Q5428j6600P565l2089n82P5393l7790o809r432o7989k4232
2664a23772K2372J8967O8633k8520r98M1176q0407L8000P791n390j3062J2449
$$ y = [-97840, -113965, -68946, -65191, -75992, -88566, -69709, -40881, -112666, -99377, -108716, -99255, -35018, 6234, -82760, -106750, -87877, -24032, -8293, -20185, 3544, -14826, -68503, -120163, -61308, -67020, -129286, -121037, -87943, -94103, -62723, -105576, -133285, -86386, -95921, -75778, -57505, -54030, -86227, -94957, -100893, -35193, -86254, -89617, -57184, -17477, -30916, -53349, -54193, -35976, -25426, -8945, -27074, -100972, -128245, -97096, -9683, -38973, -25072, -39438, -10916, -15330, -13692, -8414, -75307, -30315, 25176, -34119, -15780, 16034, 5005, 2832, -85928, -115400, -89969, -91998, -96635, -11207, -27807, -20242, -52331, -52913, 22480, -15310, -22119, -31551, -99540, -123772, -101400, -82433, -13800, -42320, -43318, -2142, -82549, -44549, -36758, -42148, -55210, -42761]
2652d2761j1550K1736j2081R25M9413j9135p1971k4621O6044l2166N014q739q963
2639h8855J1887L4403J3208K8425k3305o6580l8955M81M4594J17109l941o3963
2627c5492K5931m703O8427q6691q7927J6936k0404L6981J7724L3276m9009j5477
2615a00428L4958O615K7435J213j579l6119k1473L7851k838Q132k7255N7932l7561
2602e3117k2764j6216J7854J1394J4689o159L6790R7648q3737r6448M671q998
2590a04393j0414l2193j3370P9073O5354L6698J4293p971r897o2704k0646O1951
2578d219P776o0099l2124m1935l4307M933J23197L7554o490r7757k6301P8660
2566e1112K0447K4904K89q1597k7487O8580m5893O692J9375J445R359J17k3465
$$ y = [-42761, -54311, -32575, -44656, -43731, 5682, -13453, -85424, -110045, -44001, -76167, -71153, -79892, -88855, -76968, -42565, -29357, -932, -24237, -90817, -129772, -129291, -84697, 32412, 28471, -35492, -9561, -14264, 54163, -32528, -120455, -103519, -123923, -86942, -69218, -35942, -84951, -100428, -65470, -58855, -31420, -30207, -31786, -67905, -89378, -51527, -54365, -46233, -73488, -15556, -53117, -75881, -92097, -74243, -62849, -48160, -54319, -17529, 80119, -3618, -100066, -95395, -104393, -114807, -147000, -160370, -81297, -15943, 20755, 35048, 27077, 17180, -45524, -66170, -4219, 3557, -56542, -88666, -130601, -164908, -159975, -36778, 776, -5714, -103471, -129772, -51112, -30665, -5761, -5472, -87069, -114556, -45976, -91869, -85177, -65802, -64357, -54998, -54881, -78346]
2553g8346L0160m9508N7608L2411p6516L62n204k3949M8528l9046n5618O5506
2541i3612O8527k5550L2160Q91j5760p5157k9717P6112n1407j658l2646J5996
2529a31821M5298J1148K1324j9005M6024Q977N826L6402J7205m5047k4259m3175
2517g1103k9654l4124J6261L0253j6995P9882m131j601m4693j0914M2897L0278
2505a3644l700M519J827J9317k1636k6953q410m0295N0074n8997p2537j9357P8481
2492a11311N7218k3518L3151L0683m2389K7411J3194k0351L8405k578p5739Q317
2480f7507K0579R538k4663L0706R518j4977P574p239L4159M1416j4629o1428o3135
2467a00088J6367J1281L3310n8189M1321n272j2824N4666n3270k4673M0930P2674
$$ y = [-78346, -48186, -97694, -40086, -7675, -84191, -83829, -89033, -112982, -64454, -103500, -159118, -93612, -25085, -50635, -18475, -17584, -33344, -108501, -138218, -62106, -113513, -115171, -147817, -131821, -86523, -75375, -54051, -73056, -27032, -18055, -12229, 24173, 41378, -3669, -27928, -71103, -100757, -134881, -118620, -88367, -105362, -25480, -29611, -31212, -75905, -86819, -43922, -13644, -17344, -12825, -10998, 8319, -13317, -40270, -48680, -88975, -38901, -97898, -170435, -189792, -111311, -54093, -77611, -44460, -13777, -56166, -28755, -15561, -35912, 2493, -85, -75824, -67507, -46928, -37390, -62053, -31347, -21829, -36806, -29232, -36471, -2312, 39104, 24475, -36953, -100088, -83721, -72440, -39130, -97319, -55998, -61270, -74094, -19428, -72698, -97371, -56441, 16233]
2455A6233L2604j9409n4986M3712o039q2544J00230K8630n0036l4873m9118N3094
2443b2502k0135J7099Q517m6032M147M8031l1069j5139k8556Q3937J9980j4978
2431C300p2257K1224j9581m0055P8546L8021k1457m0738J9510k3080o4024L7663
2419h2928R622l680l0735J370M182o0323m0244O1933J05653j8641o0936k1823
2407a36550l0689K6137K6671M0099k9636l6228O6307M6105Q226L0346q6992M3705
2395c2499L1816m2496K2817m2685p243J713O022l7710R951J640j4679K4263P195
2382g1895k5648m90j5283N0585K1064k3761k370n5613l6040K8083J6588M0125
2370g4655k033N2133R925k2343j1793q744l716k5388n3006l6859K1215O3404N4732
$$ y = [16233, 48837, 29428, -25558, 18154, 12115, -70429, 29801, 58431, 8395, -26478, -75596, -22502, -42637, -25538, -17021, -63053, -58906, -10875, -41944, -57083, -85639, -1702, 18278, 3300, -68957, -47733, -67314, -107369, -28823, 9198, -12259, -52997, -33487, -56567, -120591, -82928, -73306, -76986, -107721, -106351, -102169, -162492, -202736, -140803, -35150, -53791, -114727, -136550, -167239, -141102, -114431, -74332, -103968, -140196, -73889, -27784, -19558, 10788, -76204, -32499, -683, -43179, -20362, -63047, -70290, -68577, -62555, -100265, -90314, -88674, -103353, -79090, -71895, -97543, -98033, -113316, -62731, -41667, -65428, -67798, -123411, -159451, -131368, -114780, -74655, -76688, -24555, -14630, -36973, -48766, -57510, -61226, -86614, -139620, -176479, -155264, -91860, -37128]
2357c7128J5529Q570l1665k3651n2836K1572J4880l735O815R8353p572o3553k9623
2344h4044R691q079n0827P4493O138J2808J9847K2707j6455k3947J8106M0696
2332B1134M291p1735N786J0969m4340O91K7348L5449n7471J8674J9437j2600k6269
2319f8636L678N4852J2615J4298J8494K9224o834m9226p7398M7160N3809J0490
2307D2526K4724q965N1209j0495J6980k2112J8012n3809j8359L892p680K622k6418
2294A2127p6191M6827l2768M033K2767n636L3344j0690N036p640j9451n5331k9699
2281a13272J9782M4598o1261N8769J2513K6388r6124j9807J7059N8880J6685m9264
2269h5054O290J4363l851m5085J2338J2839M2027j9061J9077P416q523L1104O855
$$ y = [-37128, -21599, -13029, -44694, -68345, -121181, -99609, -84729, -88464, -81649, 16704, 9132, -54421, -84044, -74353, -82432, -133259, -58766, -52628, -39820, -19973, 2734, -13721, -37668, -19562, 21134, 25425, -46310, -40524, -29555, -73895, -73204, -45856, -10407, -67878, -49204, -29767, -42367, -68636, -64958, -10106, 2509, 16807, 35301, 64525, 57691, 8465, -68933, -21773, 32036, 42526, 67250, 58285, 109494, 98999, 115979, 93867, 111879, 58070, 39711, 43603, 35923, 38545, 12127, -64064, -17237, -50005, -45972, -23205, -28841, 4503, -6187, -1151, -8791, -28242, -83573, -113272, -93490, -48892, -110153, -51384, -38871, -12483, -108607, -128414, -111355, -52475, -35790, -85054, -78764, -64401, -68252, -113337, -100999, -88160, -46133, -65194, -46117, -38701, -47224, -16120, -9265]
2256i265r0218K0608O4277m9984o7332r031L9467J1464O7997P215K2174j9419
$$ y = [-9265, -99483, -78875, -14598, -64582, -131914, -140945, -101478, -90014, -22017, -14802, 7372, -12047]
$$ [...]
##END NTUPLES=NMR SPECTRUM
##END=
