##TITLE=1H_DE-80H_X3
 200.13MHz, d2o
 8 sc
 
 19ns.26.2.2025
##JCAMPDX= 6.0         $$ Bruker NMR JCAMP-DX V2.0
##DATA TYPE= NMR SPECTRUM
##DATA CLASS= NTUPLES
##ORIGIN= UXNMR, Bruker Analytische Messtechnik GmbH
##OWNER= pz
$$ XWIN-NMR		Version 3.5
$$ Tue Dec 16 10:03:03 2025 Russian Standard Time (UT+4h)  Yarkov@DPX200
##.OBSERVE FREQUENCY= 200.1313
##.OBSERVE NUCLEUS= ^1H
##.ACQUISITION MODE= SIMULTANEOUS
##.ACQUISITION SCHEME= undefined
##.AVERAGES= 8
##.DIGITISER RES= 18
##SPECTROMETER/DATA SYSTEM= spect
##.PULSE SEQUENCE= zg30
##.SOLVENT NAME= CDCl3
##.SHIFT REFERENCE= (INTERNAL, CDCl3, 0, 15.4791)
##AUDIT TRAIL= $$ (NUMBER, WHEN, WHO, WHERE, WHAT)
$$ ##TITLE= Audit trail, XWIN-NMR		Version 3.5
$$ ##JCAMPDX= 5.01
$$ ##ORIGIN= Bruker BioSpin GmbH
$$ ##OWNER= Yarkov
$$ C:/Bruker/XWIN-NMR/data/yarkov2/nmr/H-C/1/pdata/1/auditp.txt
$$ ##AUDIT TRAIL=  $$ (NUMBER, WHEN, WHO, WHERE, WHAT)
(   1,<2025-12-16 10:01:42.51 +0400>,<Yarkov>,<DPX200>,
      <created by zg, POWCHK disabled, PULCHK disabled
       configuration hash MD5:
       00 E9 B6 7A A2 85 ED C7 34 08 36 98 17 FE 4E 26
       data hash MD5: 16K
       6B 87 0C 5B 9E 10 6F 40 1B EA 35 B4 A1 E1 18 D2>)
(   2,<2025-12-16 10:01:53.14 +0400>,<Yarkov>,<DPX200>,
      <Start of raw data processing
       efp BC_mod = 2 LB = 0.25 FT_mod = 6 PKNL = 1 PHC0 = -5310.083 PHC1 = 17.82193 SI = 16K 
       data hash MD5: 16K
       A3 49 63 90 BE 12 6E 16 AE 8C C0 EE D9 15 14 8D>)
(   3,<2025-12-16 10:02:04.84 +0400>,<Yarkov>,<DPX200>,
      <abs ABSG = 5 
       data hash MD5: 16K
       F2 4E A8 86 D6 0D 11 96 04 10 00 24 51 B8 6C B0>)
(   4,<2025-12-16 10:02:22.32 +0400>,<Yarkov>,<DPX200>,
      <pk PHC0 = 8.355615 PHC1 = -5.6 
       data hash MD5: 16K
       EF A8 AD B5 92 FB 73 C9 8D 2E 4D E4 8C 0C 87 4A>)
$$ ##END=
$$ 
$$ hash MD5
$$ 20 AE 14 AD A5 66 3F 7B 76 A3 D2 0B A4 B9 C8 2F
##$RELAX= 
##$RELAX= 
##$RELAX= 
##$RELAX= 
##$RELAX= 
##$RELAX= 
$$ Bruker specific parameters
$$ --------------------------
##$DU= <C:/Bruker/XWIN-NMR>
##$EXPNO= 1
##$NAME= <H-C>
##$PROCNO= 1
##$TYPE= <nmr>
##$USER= <yarkov2>
##$AMP= (0..31)
100 100 100 100 100 100 100 100 100 100 100 100 100 100 100 100 100 100 
100 100 100 100 100 100 100 100 100 100 100 100 100 100 
##$AQSEQ= 0
##$AQ_mod= 1
##$AUNM= <au_zg>
##$AUTOPOS= <>
##$BF1= 200.13
##$BF2= 200.13
##$BF3= 200.13
##$BF4= 200.13
##$BF5= 200.13
##$BF6= 200.13
##$BF7= 200.13
##$BF8= 200.13
##$BYTORDA= 1
##$CFDGTYP= 0
##$CFRGTYP= 5
##$CHEMSTR= <none>
##$CNST= (0..31)
1 1 145 1 1 1 1 1 1 1 1 1 1 1 1 1 1 1 1 1 1 1 1 1 1 1 1 1 1 1 1 1 
##$CPDPRG= <>
##$CPDPRG1= <>
##$CPDPRG2= <>
##$CPDPRG3= <>
##$CPDPRG4= <mlev>
##$CPDPRG5= <mlev>
##$CPDPRG6= <mlev>
##$CPDPRG7= <mlev>
##$CPDPRG8= <mlev>
##$CPDPRGB= <>
##$CPDPRGT= <>
##$D= (0..31)
0 0.7 0 0 0 0 0 0 0 0 0 0.03 0 0 0 0 0 0 0 0 0 0 0 0 0 0 0 0 0 0 0 0 
##$DATE= 1765864902
##$DBL= (0..7)
120 120 120 120 120 120 120 120 
##$DBP= (0..7)
150 150 150 150 150 150 150 150 
##$DBP07= 0
##$DBPNAM0= <>
##$DBPNAM1= <>
$$ [...]
##$SUBNAM3= <"">
##$SUBNAM4= <"">
##$SUBNAM5= <"">
##$SUBNAM6= <"">
##$SUBNAM7= <"">
##$SUBNAM8= <"">
##$SUBNAM9= <"">
##$SW= 18.0517328524113
##$SWIBOX= (0..15)
0 0 2 0 0 0 0 0 0 0 0 0 0 0 0 0 
##$SW_h= 3612.71676300578
##$TD= 16384
##$TD0= 1
##$TE= 0
##$TE2= 300
##$TE3= 300
##$TEG= 300
##$TL= (0..7)
0 120 120 120 120 120 120 120 
##$TP= (0..7)
150 150 150 150 150 150 150 150 
##$TP07= 0
##$TPNAME0= <>
##$TPNAME1= <>
##$TPNAME2= <>
##$TPNAME3= <>
##$TPNAME4= <>
##$TPNAME5= <>
##$TPNAME6= <>
##$TPNAME7= <>
##$TPOAL= (0..7)
0.5 0.5 0.5 0.5 0.5 0.5 0.5 0.5 
##$TPOFFS= (0..7)
0 0 0 0 0 0 0 0 
##$TUNHIN= 0
##$TUNHOUT= 0
##$TUNXOUT= 0
##$USERA1= <user>
##$USERA2= <user>
##$USERA3= <user>
##$USERA4= <user>
##$USERA5= <user>
##$V9= 5
##$VALIST= <valist>
##$VCLIST= <CCCCCCCCCCCCCCC>
##$VD= 0
##$VDLIST= <DDDDDDDDDDDDDDD>
##$VPLIST= <PPPPPPPPPPPPPPP>
##$VTLIST= <TTTTTTTTTTTTTTT>
##$WBST= 1024
##$WBSW= 4
##$XGAIN= (0..3)
0 0 0 0 
##$XL= 0
##$YL= 0
##$YMAX_a= 134816
##$YMIN_a= -166635
##$ZGOPTNS= <>
##$ZL1= 120
##$ZL2= 120
##$ZL3= 120
##$ZL4= 120
##$ABSF1= 15.47915
##$ABSF2= -2.5727
##$ABSG= 5
##$ABSL= 3
##$ALPHA= 0
##$AQORDER= 0
##$ASSFAC= 0
##$ASSFACI= 0
##$ASSFACX= 0
##$ASSWID= 0
##$AUNMP= <proc_1d>
##$AZFE= 0.1
##$AZFW= 0.1
##$BCFW= 0
##$BC_mod= 2
##$BYTORDP= 0
##$COROFFS= 0
##$CY= -3
##$DATMOD= 1
##$DC= 0
##$DFILT= <>
##$DTYPP= 0
##$F1P= 0
##$F2P= 0
##$FCOR= 1
##$FTSIZE= 16384
##$FT_mod= 6
##$GAMMA= 0
##$GB= 0
##$INTBC= 1
##$INTSCL= 3.241238e-09
##$ISEN= 128
##$LB= 0.25
##$LEV0= 0
##$LPBIN= 0
##$MAXI= 10000
##$MC2= 0
##$MEAN= 0
##$ME_mod= 0
##$MI= 1.114404
##$NCOEF= 0
##$NC_proc= -8
##$NLEV= 6
##$NOISF1= 3.799351
##$NOISF2= 2.8
##$NSP= 0
##$NTH_PI= 0
##$NZP= 0
##$OFFSET= 15.47915
##$PC= 1
##$PHC0= -5301.728
##$PHC1= 12.22193
##$PH_mod= 1
##$PKNL= yes
##$PPARMOD= 0
##$PSCAL= 0
##$PSIGN= 0
##$REVERSE= no
##$SF= 200.130008515375
##$SI= 16384
##$SIGF1= 3
##$SIGF2= 2
##$SINO= 0.751879
##$SIOLD= 32768
##$SREGLST= <19F.Aceton>
##$SSB= 0
##$STSI= 16384
##$STSR= 0
##$SW_p= 3612.71676300578
##$SYMM= 0
##$S_DEV= 0
##$TDeff= 16384
##$TDoff= 0
##$TI= <>
##$TILT= no
##$TM1= 0
##$TM2= 0
##$TOPLEV= 0
##$USERP1= <user>
##$USERP2= <user>
##$USERP3= <user>
##$USERP4= <user>
##$USERP5= <user>
##$WDW= 1
##$XDIM= 16384
##$YMAX_p= 514827511
##$YMIN_p= -1957312
$$ End of Bruker specific parameters
$$ ---------------------------------
##NTUPLES= NMR SPECTRUM
##VAR_NAME=  FREQUENCY,     SPECTRUM/REAL,   SPECTRUM/IMAG
##SYMBOL=    X,             R,               I
##VAR_TYPE=  INDEPENDENT,   DEPENDENT,       DEPENDENT
##VAR_FORM=  AFFN,          ASDF,            ASDF
##VAR_DIM=   16384,         16384,           16384
##UNITS=     HZ,            ARBITRARY UNITS, ARBITRARY UNITS
##FACTOR=    0.220516191357247, 1,           1
##FIRST=     3097.84238497124, 0,            0
##LAST=      -514.874378034538, 0,           0
##MIN=       -514.874378034538, -1957312,    0
##MAX=       3097.84238497124, 514827511,    0
$$ Real data points
##PAGE= N=1
##DATA TABLE= (X++(R..R)), XYDATA
$$ [...]
$$ plain form
11802 -759461 -829901 -952200 -890454 -1006176 -1088065 -1043220 -1092670 -898875 -754029 -746980 -1050163
11791 -1050163 -828190 -660484 -859571 -1065056 -1056645 -932488 -1042721 -865668 -997253 -1201231
11781 -1201231 -1116918 -814077 -626710 -665952 -723259 -1011622 -739816 -605390 -596413 -771801
11771 -771801 -920900 -795917 -708674 -568683 -413893 -515775 -589096 -610595 -847597 -741282
11761 -741282 -945834 -722859 -617114 -908375 -973614 -1082786 -907941 -701144 -898976 -943533
11751 -943533 -640353 -742365 -741210 -786549 -1030401 -937801 -876043 -1012302 -1062246 -884338 -812649
11740 -812649 -841411 -642840 -564599 -631392 -546077 -900703 -1110671 -956703 -860142 -1071455
11730 -1071455 -638304 -746852 -960456 -857123 -863573 -1107983 -1030960 -814106 -884349 -729788
$$ packed form
11802g59461p0440j22299O1746j15722q1889M4845m9450J93795J44846P049l03183
11791a050163K21973J67706j99087k05485Q411J24157j10233J77053j31585k03978
11781a201231Q4313L02841J87367l9242n7307k88363K71806J34426Q977j75388
11771g71801j49099J24983Q7243J39991J54790j01882p3321k1499k37002J06315
11761g41282k04552K22975J05745k91261o5239j09172J74845K06797j97832m4557
11751i43533L03180j02012J155m5339k43852R2600O1758j36259m9944J77908P1689
11740h12649k8762J98571P8241o6793Q5315l54626k09968J53968R6561k11313
11730a071455M33151j08548k13604J03333o450k44410P7023K16854p0243J54561
$$ plain form
11720 -729788 -928536 -620536 -707264 -882501 -921812 -927730 -1025173 -1052309 -987090 -1032470 -973732
11709 -973732 -1073202 -1101631 -1266094 -1066875 -939273 -1048579 -1067187 -857309 -784168 -908186
11699 -908186 -1143237 -1230505 -1095675 -823767 -874968 -1021972 -1077655 -1135060 -1055990 -968590 -1171425
11688 -1171425 -1185444 -1018479 -1057672 -933346 -986311 -864045 -794226 -960618 -944313 -1230888
11678 -1230888 -1315985 -1142047 -961745 -965930 -1126621 -937321 -811645 -982549 -795807 -920901
11668 -920901 -1128627 -711767 -804308 -1079655 -1273993 -1354327 -1178034 -705729 -672216 -588643
11658 -588643 -789300 -965265 -944783 -1019775 -1014831 -831457 -1040283 -922070 -1097688 -1197423
11648 -1197423 -1010233 -779259 -900080 -1004242 -814398 -906379 -1055461 -1099062 -1243760 -1281628
$$ packed form
11720g29788j98748L08000q6728j75237l9311n918r7443k7136O5219m5380N8738
11709i73732r9470k8429j64463J99219J27602j09306j8608K09878P3141j24018
11699i08186k35051q7268J34830K71908n1201j47004n5683n7405P9070Q7400k02835
11688a171425j4019J66965l9193J24326n2965J22266O9819j66392J6305k86575
11678a230888q5097J73938J80302m185j60691J89300J25676j70904J86742j25094
11668i20901k07726M16860r2541k75347j94338q0334J76293M72305L3513Q3573
11658e88643k00657j75965K0482p4992M944J83374k08826J18213j75618r9735
11648a197423J87190K30974j20821j04162J89844r1981j49082m3601j44698l7868
$$ plain form
11638 -1281628 -1089229 -1010213 -984409 -995643 -1012805 -811521 -870478 -945281 -1008174 -980427 -879924
11627 -879924 -957478 -1064298 -1220278 -1153818 -818712 -916492 -1163920 -1125636 -1137173 -902729
11617 -902729 -871401 -909620 -934105 -930678 -752668 -864242 -739807 -652439 -841476 -868807 -775288
11606 -775288 -613003 -881543 -782838 -712981 -514187 -737402 -980007 -1129310 -1056494 -1117634
11596 -1117634 -1057235 -1132331 -1136474 -1353323 -1167383 -1157980 -857242 -716639 -695938 -817400 -979952
11585 -979952 -969659 -921413 -856847 -1202179 -972598 -1063928 -1021497 -808765 -1173867 -1242613 -1339134
11574 -1339134 -995692 -892953 -874868 -729335 -662522 -612116 -505843 -579069 -1026593 -968024
11564 -968024 -1271014 -1109581 -1057701 -987379 -1319951 -1263569 -883846 -976467 -1160282 -954254
$$ packed form
11638a281628J92399P9016K5804j1234j7162K01284n8957p4803o2893K7747J00503
11627h79924p7554j06820j55980O6460L35106r7780k47428L8284j1537K34444
11617i02729L1328l8219k4485L427J78010j11574J24435Q7368j89037k7331R3519
11606g75288J62285k68540R8705O9857J98794k23215k42605j49303P2816o1140
11596a117634O0399p5096m143k16849J85940R403L00738J40603K0701j21462j62552
11585i79952J0293M8246O4566l45332K29581r1330M2431K12732l65102o8746r6521
11574a339134L43442J02739J8085J45533O6813N0406J06273p3226m47524N8569
11564i68024l02990J61433N1880P0322l32572N6382L79723r2621j83815K06028
$$ plain form
11554 -954254 -983715 -875279 -1027156 -1107971 -1102103 -1077234 -1131508 -1016362 -984394 -1139862 -1032901
11543 -1032901 -1011807 -952619 -984606 -1022064 -949432 -771863 -806479 -851142 -859169 -921806 -1056193
11532 -1056193 -853362 -1069515 -1138944 -767944 -817633 -843234 -933828 -897688 -808348 -976888
11522 -976888 -980399 -794931 -801523 -880744 -834873 -1043789 -1064342 -993678 -1148557 -1045025 -1006557
11511 -1006557 -1005965 -1058755 -1032429 -1110573 -948611 -1028061 -1287279 -1063387 -906681 -1016203 -1010667
11500 -1010667 -1202968 -1066028 -1139966 -1190327 -947504 -1099622 -690588 -715695 -1079612 -1175671
11490 -1175671 -1047364 -1092944 -1069394 -808268 -945619 -1109432 -1115242 -1135148 -1161773 -1362932
11480 -1362932 -1079372 -1076594 -1146770 -1203953 -1195773 -1043112 -903417 -925447 -1194302 -1376823 -1090111
$$ packed form
11554i54254k9461J08436j51877q0815N868K4869n4274J15146L1968j55468J06961
11543a032901K1094N9188l1987l7458P2632J77569l4616m4663q027o2637j34387
11532a056193K02831k16153o9429L71000m9689k5601r0594L6140Q9340j68540
11522i76888l511J85468o592p9221M5871k08916k0553P0664j54879J03532L8468
11511a006557N92n2790K6326p8144J61962p9450k59218K23892J56706j09522N536
11500a010667j92301J36940p3938n0361K42823j52118M09034k5107l63917r6059
11490a175671J28307m5580K3550K61126j37351j63813n810j9906k6625k01159
11480a362932K83560K778p0176n7183Q180J52661J39695k2030k68855j82521K86712
$$ plain form
11469 -1090111 -944917 -920814 -984212 -907331 -833191 -1040430 -1048045 -913726 -801110 -754553 -791133
11458 -791133 -602575 -619987 -744992 -898665 -1174808 -1298157 -1365485 -1127966 -843535 -967880
11448 -967880 -1285034 -1167940 -895933 -932494 -965452 -972555 -935853 -925682 -912694 -1016028 -953527
11437 -953527 -1182021 -1056504 -739444 -937986 -823655 -718518 -649793 -909370 -786717 -971439
11427 -971439 -805935 -552408 -452016 -488133 -738767 -1017951 -838942 -998833 -872189 -809313
11417 -809313 -749799 -642464 -788533 -758394 -812964 -742130 -756008 -760767 -811512 -751074 -821137
11406 -821137 -782812 -933076 -1017161 -832407 -836625 -1020773 -1011466 -1001080 -1049525 -910901 -875544
11395 -875544 -977740 -1127451 -770930 -608497 -601580 -776724 -1058431 -812487 -974971 -976993
$$ packed form
11469a090111J45194K4103o3398P6881P4140k07239p615J34319J12616M6557l6580
11458g91133J88558j7412j25005j53673k76143j23349o7328K37519K84431j24345
11448i67880l17154J17094K72007l6561l2958p103L6702J0171J2988j03334O2501
11437i53527k28494J25517L17060j98542J14331J05137O8725k59577J22653j84722
11427i71439J65504K53527J00392l6117k50634k79184J79009j59891J26644O2876
11417h09313N9514J07335j46069L0139n4570P0834j3878m759n0745O0438p0063
11406h21137L8325j50264q4085J84754m218j84148R307J0386m8445J38624L5357
11395h75544j02196j49711L56521J62433O917j75144k81707K45944j62484k022
$$ plain form
11385 -976993 -1014340 -927578 -792569 -906101 -945169 -1128858 -1050300 -730681 -1051917 -1213930
11375 -1213930 -1102211 -1045203 -932601 -1075419 -1023771 -939837 -888864 -872379 -738671 -767625
11365 -767625 -841655 -713261 -546824 -692943 -962002 -973517 -889124 -698903 -819285 -742048
11355 -742048 -730378 -975221 -1003191 -962497 -1035382 -897346 -1079557 -989305 -911146 -936780 -728619
11344 -728619 -666397 -917423 -895741 -591608 -674334 -763224 -929517 -1046658 -1074675 -1099251 -1249746
11333 -1249746 -767289 -674898 -1242520 -1264028 -1241858 -871883 -737624 -1130377 -1201005 -1267150
11323 -1267150 -1172416 -1190134 -1290274 -1100709 -825961 -851393 -1198573 -1281721 -1321502 -1304360
11313 -1304360 -1310233 -1161253 -836305 -1098045 -1054905 -980176 -958464 -895256 -1289604 -1096569
$$ packed form
11385i76993l7347Q6762J35009j13532l9068j83689P8558L19619l21236j62013
11375a213930J11719N7008J12602j42818N1648Q3934N0973J6485J33708k8954
11365g67625p4030J28394J66437j46119k69059j1515Q4393J90221j20382P7237
11355g42048J1670k44843k7970M0694p2885J38036j82211R0252P8159k5634K08161
11344g28619O2222k51026K1682L04133q2726q8890j66293j17141k8017k4576j50495
11333a249746M82457R2391n67622k1508K2170L69975J34259l92753p0628o6145
11323a267150R4734j7718j00140J89565K74748k5432l47180q3148l9781J7142
11313a304360n873J48980L24948k61740M3140P4729K1712O3208l94348J93035
$$ plain form
11303 -1096569 -1075175 -1123134 -1184307 -987852 -849909 -1042403 -909935 -969766 -1120568 -1316816
11293 -1316816 -1169676 -742047 -736203 -870239 -1173770 -1025765 -908882 -1133119 -1033179 -909803
11283 -909803 -783202 -989992 -935780 -1168607 -1076896 -995118 -998110 -940515 -947541 -882331 -836734
11272 -836734 -750664 -984878 -1029377 -838029 -863176 -991414 -733997 -1089635 -902481 -961843
11262 -961843 -874655 -1083257 -994309 -929602 -987939 -906419 -960142 -798388 -950325 -1019972 -1047860
11251 -1047860 -763534 -999750 -1010009 -1213489 -1186344 -1092241 -1144060 -1177971 -997120 -822130
11241 -822130 -794743 -925228 -952503 -827506 -1036778 -1087520 -691727 -782992 -653872 -982599
11231 -982599 -702796 -637398 -884645 -909395 -1128528 -1038656 -1255614 -1023594 -894428 -724894
$$ packed form
11303a096569K1394m7959o1173J96455J37943j92494J32468n9831j50802j96248
11293a316816J47140M27629N844j34036l03531J48005J16883k24237R9940J23376
11283i09803J26601k06790N4212k32827R1711Q1778k992N7595p026O5210M5597
11272h36734Q6070k34214m4499J91348k5147j28238K57417l55638J87154n9362
11262i61843Q7188k08602Q8948O4707n8337Q1520n3723J61754j51937o9647k7888
11251a047860K84326k36216j0259k03480K7145R4103n1819l3911J80851J74990
11241h22130K7387j30485k7275J24997k09272n0742L95793r1265J29120l28727
11231i82599K79803O5398k47247k4750k19133Q9872k16958K32020J29166J69534
$$ plain form
11221 -724894 -768442 -1210515 -1093717 -964926 -1086785 -933530 -859638 -834301 -951256 -924901
11211 -924901 -1022223 -1028938 -687869 -793163 -1106893 -1049155 -872771 -912470 -815225 -899937 -838499
11200 -838499 -709868 -624727 -769912 -895967 -1001772 -978861 -676610 -837162 -1009174 -800334
11190 -800334 -812561 -799790 -595208 -551810 -785115 -803769 -887810 -1000373 -972299 -834940 -898094
11179 -898094 -1135397 -918538 -856015 -815979 -977670 -1028974 -1264027 -1078137 -1042853 -936226
11169 -936226 -763021 -727162 -967945 -880747 -1000090 -935611 -918511 -1227999 -1199187 -1125723 -856498
11158 -856498 -908963 -777396 -923422 -1157374 -983001 -1067393 -974168 -935116 -922816 -738889
11148 -738889 -810799 -1092720 -1090072 -654031 -861132 -1188621 -1046998 -1046139 -1274912 -1119380 -905390
$$ packed form
11221g24894m3548m42073J16798J28791j21859J53255P3892K5337j16955K6355
11211i24901r7322o715L41069j05294l13730N7738J76384l9699R7245q4712O1438
11200h38499J28631Q5141j45185j26055j05805K2911L02251j60552j72012K08840
11190h00334j2227J2771K04582M3398k33305j8654q4041j12563K8074J37359o3154
11179h98094k37303K16859O2523M0036j61691n1304k35053J85890L5284J06627
11169i36226J73205L5859k40783Q7198j19343O4479J7100l09488K8812P3464K69225
11158h56498n2465J31567j46026k33952J74373q4392R3225L9052J2300J83927
11148g38889p1910k81921K648M36041k07101l27489J41623Q59k28773J55532K13990
$$ plain form
11137 -905390 -710025 -558843 -877029 -1100447 -1284945 -1140849 -1178939 -1169665 -1137107 -1087447
11127 -1087447 -798254 -696599 -825079 -951160 -967917 -1111218 -1013332 -913526 -870885 -858065
11117 -858065 -953035 -951410 -1202675 -1442548 -1246018 -944406 -812606 -948743 -1181515 -1065214
11107 -1065214 -1147322 -1505527 -1280004 -1103420 -838518 -1025683 -833486 -939998 -1002643 -912539
11097 -912539 -921223 -753995 -1126686 -1286309 -1309093 -1088963 -982879 -1223000 -1237911 -1190072
11087 -1190072 -1167933 -1032877 -1145367 -967549 -820791 -600449 -618332 -791385 -851757 -797241
11077 -797241 -787138 -788277 -820169 -754031 -708041 -954806 -932568 -849143 -914101 -1073703 -943608
11066 -943608 -882419 -998969 -963104 -858873 -1084830 -1224390 -1025499 -1110611 -1275366 -1369602
$$ packed form
11137i05390J95365J51182l18186k23418j84498J44096l8090R274L2558M9660
11127a087447K89193J01655j28480j26081j6757j43301R7886R9806M2641J2820
11117h58065r4970J625k51265k39873J96530L01612J31800j36137k32772J16301
11107a065214q2108l58205K25523J76584K64902j87165J92197j06512o2645R0104
11097i12539q684J67228l72691j59623k2784K20130J06084k40121j4911M7839
11087a190072K2139J35056j12490J77818J46758K20342j7883j73053o0372N4516
11077g97241J0103j139l1892O6138M5990k46765K2238Q3425o4958j59602J30095
11066i43608O1189j16550L5865J04231k25957j39560J98891q5112j64755r4236
$$ plain form
11056 -1369602 -1005714 -881888 -1285063 -1298953 -1144534 -979839 -966045 -899275 -879679 -777613
11046 -777613 -853391 -841581 -537760 -511331 -711920 -738260 -958515 -828365 -594965 -737901
11036 -737901 -859598 -861355 -803481 -913360 -1143540 -980368 -1054173 -967610 -1223241 -1218275 -1255756
11025 -1255756 -1304816 -1183556 -1148067 -973180 -774019 -728855 -811648 -765516 -1032633 -942261
11015 -942261 -778375 -829657 -849494 -978812 -948780 -1172741 -1002468 -1103338 -1200804 -931032
11005 -931032 -918326 -870578 -884426 -855570 -1234918 -1234762 -1091131 -705147 -805956 -840663 -687387
10994 -687387 -837615 -958481 -896424 -1004796 -1148840 -1111874 -1172860 -1226881 -878561 -954795
10984 -954795 -990031 -1058649 -805784 -897404 -1004792 -992989 -1008516 -924097 -933281 -924062 -920859 -709331
$$ packed form
11056a369602L63888J23826m03175j3890J54419J64695J3794O6770J9596J02066
11046g77613p5778J1810L03821K6429k00589k6340k20255J30150K33400j42936
11036g37901j21697j757N7874j09879k30180J63172p3805Q6563k55631M966l7481
11025a255756m9060J21260L5489J74887J99161M5164q2793M6132k67117R0372
11015i42261J63886n1282j9837j29318L0032k23961J70273j00870r7466K69772
11005i31032J2706M7748j3848K8856l79348J56J43631L85984j00809l4707J53276
10994f87387j50228j20866O2057j08372j44044L6966o0986n4021L48320p6234
10984i54795l5236o8618K52865r1620j07388J1803j5527Q4419r184R219L203K11528
$$ plain form
10972 -709331 -775014 -1022771 -1057312 -906681 -840859 -993415 -1227100 -1348999 -1017739 -736427
10962 -736427 -710953 -808488 -1037236 -1162980 -768172 -830699 -1029790 -761162 -887838 -1173415
10952 -1173415 -1064126 -973324 -772732 -619781 -668561 -807040 -1062175 -922824 -852048 -742074
10942 -742074 -694154 -593776 -856021 -1305811 -1136074 -1000514 -892610 -986150 -976056 -1088195
10932 -1088195 -1291998 -1397303 -1283541 -1096286 -1144833 -977151 -784006 -694671 -966282 -1110087
10922 -1110087 -1225506 -1197139 -1088736 -1051013 -1181645 -1157326 -1275661 -1048287 -919049 -915912
10912 -915912 -935196 -827474 -836538 -777666 -1024330 -832941 -599522 -835267 -671235 -600196
10902 -600196 -807240 -1044742 -971945 -934444 -972551 -920220 -858860 -943160 -1029374 -805904 -1032653
$$ packed form
10972g09331o5683k47757l4541J50631O5822j52556k33685j21899L31260K81312
10962g36427K5474r7535k28748j25744L94808o2527j99091K68628j26676k85577
10952a173415J09289R0802K00592J52951m8780j38479k55135J39351P0776J09974
10942g42074M7920J00378k62245m49790J69737J35560J07904r3540J0094j12139
10932a088195k03803j05305J13762J87255m8547J67682J93145Q9335k71611j43805
10922a110087j15419K8367J08403L7723j30632K4319j18335K27374J29238L137
10912i15912j9284J07722r064N8872k46664J91389K33419k35745J64032P1039
10902f00196k07044k37502P2797L7501l8107N2331O1360q4300q6214K23470k26749
$$ plain form
10891 -1032653 -1039999 -1114828 -782677 -964758 -1015374 -934192 -995851 -1100578 -1248321 -1081733
10881 -1081733 -1108017 -905756 -884794 -804024 -740536 -1028112 -810216 -915939 -1086942 -1049429
10871 -1049429 -798887 -688567 -839210 -914065 -1059402 -750008 -958102 -1082586 -1159892 -1046183
10861 -1046183 -1007052 -868602 -1156421 -941098 -1035230 -1149212 -1173678 -1049632 -1088613 -966527
10851 -966527 -966897 -871920 -1197767 -1338146 -966351 -893261 -651431 -1097454 -1230664 -1115914
10841 -1115914 -894269 -883114 -1012209 -950466 -878014 -829826 -723044 -824268 -999995 -1016853
10831 -1016853 -1183432 -1113273 -1030262 -1101042 -1143795 -939810 -1073871 -1105283 -988845 -846498
10821 -846498 -670577 -540538 -805471 -1000913 -987617 -1067301 -916580 -905479 -1067442 -1246197
$$ packed form
10891a032653p346p4829L32151j82081n0616Q1182o1659j04727j47743J66588
10881a081733k6284K02261K0962Q0770O3488k87576K17896j05723j71003L7513
10871a049429K50542J10320j50643p4855j45337L09394k08094j24484p7306J13709
10861a046183L9131J38450k87819K15323r4132j13982k4466J24046l8981J22086
10851i66527l70R4977l25847j40379L71795P3090K41830m46023j33210J14750
10841a115914K21645J1155j29095O1743P2452M8188J06782j01224j75727j6858
10831a016853j66579P0159Q3011p0780m2753K03985j34061l1412J16438J42347
10821h46498J75921J30039k64933j95442J3296p9684J50721J1101j61963j78755
$$ plain form
10811 -1246197 -1202358 -947754 -912134 -965613 -1030396 -1055568 -1136540 -1169031 -1196274 -1241736 -1122942
10800 -1122942 -1058028 -1082694 -964368 -813264 -1017700 -1211757 -1144770 -1286332 -1201240 -1056247
10790 -1056247 -1048420 -1107284 -1258034 -1112576 -819403 -550862 -681847 -772877 -938280 -811362
10780 -811362 -804384 -1051538 -1386365 -1258420 -1152132 -907427 -893084 -979085 -821551 -925607
10770 -925607 -1114516 -918431 -1162512 -1117933 -843661 -906029 -812537 -799786 -1002138 -1079629
10760 -1079629 -1009175 -694163 -928095 -1234344 -1215934 -1126485 -1108315 -928623 -710956 -743976
10750 -743976 -886560 -903526 -981943 -928467 -937720 -907900 -1094481 -1278675 -1142352 -831996 -758894
10739 -758894 -823237 -1079533 -1187685 -940646 -1237778 -1182279 -1333823 -1146371 -907744 -872663
$$ packed form
10811a246197M3839K54604L5620n3479o4783k5172q0972l2491k7243m5462J18794
10800a122942O4914k4666J18326J51104k04436j94057O6987j41562Q5092J44993
10790a056247P827n8864j50750J45458K93173K68541j30985r1030j65403J26918
10780h11362O978k47154l34827J27945J06288K44705J4343q6001J57534j04056
10770i25607j88909J96085k44081M4579K74272o2368R3492J2751k02352p7491
10760a079629P0454L15012k33932l06249J8410Q9449J8170J79692K17667l3020
10750g43976j42584j6966p8417N3476r253K9820j86581j84194J36323L10356P3102
10739g58894o4343k56296j08152K47039k97132N5499j51544J87452K38627L5081
$$ plain form
10729 -872663 -781063 -790988 -1045127 -839505 -1070352 -1059214 -1116442 -1137866 -1084623 -1191556 -1206397
10718 -1206397 -1109649 -927085 -1021332 -1075110 -1159652 -937946 -633444 -780119 -906723 -1108383
10708 -1108383 -824541 -732229 -847816 -837047 -753266 -868016 -1035922 -985652 -840408 -1009170
10698 -1009170 -1003974 -1296882 -1488735 -1144746 -1153634 -1275728 -1225594 -1180419 -1281660 -1073956
10688 -1073956 -891358 -868179 -1100761 -1034277 -1184221 -1097409 -828495 -653836 -891132 -876255
10678 -876255 -1119207 -1411983 -1355459 -1379845 -1257183 -1308412 -1027950 -961635 -1290783 -1191746
10668 -1191746 -1114238 -1247596 -1330718 -1204353 -1329901 -1174660 -1109862 -1017699 -843110 -997491
10658 -997491 -1178089 -874909 -764813 -916510 -1044343 -968846 -839973 -995087 -793320 -1001342
$$ packed form
10729h72663R1600r925k54139K05622k30847J1138n7228k1424N3243j06933j4841
10718a206397R6748J82564r4247n3778q4542K21706L04502j46675j26604k01660
10708a108383K83842R2312j15587J0769Q3781j14750j67906N0270J45244j68762
10698a009170N196k92908j91853L43989q888j22094N0134M5175j01241K07704
10688a073956J82598K3179k32582O6484j49944Q6812K68914J74659k37296J4877
10678h76255k42952k92776N6524k4386J22662n1229K80462O6315l29148R9037
10668a191746P7508j33358q3122J26365j25548J55241O4798R2163J74589j54381
10658i97491j80598L03180J10096j51697j27833P5497J28873j55114K01767k08022
$$ plain form
10648 -1001342 -1058833 -921156 -1027179 -902154 -847163 -1045107 -730158 -991565 -843578 -521584
10638 -521584 -579720 -815570 -1020335 -1026145 -1001982 -873302 -1021587 -888930 -1018523 -1324213
10628 -1324213 -1204801 -870176 -1067922 -1175319 -997592 -951047 -1049234 -996667 -710771 -774040
10618 -774040 -971742 -1368986 -1241902 -913118 -962425 -1148483 -1001407 -759049 -692479 -843310
10608 -843310 -933373 -1126034 -1330586 -1380963 -1038008 -696735 -825586 -931686 -1011961 -1117254
10598 -1117254 -877177 -646165 -816809 -739599 -825139 -959778 -995474 -1022324 -1114067 -1261880
10588 -1261880 -1292914 -1088881 -1197866 -1264174 -1092017 -716209 -731676 -1038532 -921657 -1083984
10578 -1083984 -1133586 -907535 -1216363 -1564175 -1609972 -1165447 -789460 -707608 -891417 -697851
$$ packed form
10648a001342n7491J37677j06023J25025N4991j97944L14949k61407J47987L21994
10638e21584n8136k35850k04765n810K4163J28680j48285J32657j29593l05690
10628a324213J19412L34625j97746j07397J77727M6545r8187N2567K85896o3269
10618g74040j97702l97244J27084L28784m9307j86058J47076K42358O6570j50831
10608h43310r0063j92661k04552n0377L42955L41273j28851j06100q0275j05293
10598a117254K40077K31012j70644P7210q5540j34639l5696k6850r1743j47813
10588a261880l1034K04033j08985o6308J72157L75808j5467l06856J16875j62327
10578a083984m9602K26051l08828l47812m5797M44525L75987Q1852j83809J93566
$$ plain form
10568 -697851 -707115 -967110 -1044901 -995521 -1101936 -1151734 -1359740 -1149442 -700389 -771186 -946466
10557 -946466 -1023940 -980796 -842520 -958351 -1216155 -1266563 -1211131 -1009259 -1053218 -1104648 -1185381
10546 -1185381 -1226028 -1209869 -1059773 -978072 -1064898 -1114498 -1186105 -1090459 -1044019 -1194178 -832424
10535 -832424 -918651 -970512 -1152209 -1116039 -1094121 -1013918 -1029672 -1007315 -752190 -1099758 -1137568
10524 -1137568 -1154654 -1099522 -881996 -758788 -936479 -1202260 -1141587 -877307 -888220 -981139
10514 -981139 -969309 -973203 -856154 -805723 -1000706 -1007015 -968527 -967981 -831199 -998749 -801757
10503 -801757 -928738 -1155185 -957753 -771488 -923669 -1107468 -1034267 -1058759 -1166464 -966783
10493 -966783 -1249316 -1333179 -962616 -916858 -946586 -1073651 -788005 -878150 -1169205 -1188197
$$ packed form
10568f97851r264k59995p7791M9380j06415m9798k08006K10298M49053p0797j75280
10557i46466p7474M3144J38276j15831k57804n0408N5432K01872m3959n1430q0733
10546a185381m0647J6159J50096Q1701q6826m9600p1607R5646M6440j50159L61754
10535h32424q6227n1861j81697L6170K1918Q0203j5754K2357K55125l47568l7810
10524a137568j7086N5132K17526J23208j77691k65781O0673K64280j0913r2919
10514i81139J1830l894J17049N0431j94983o309L8488N46J36782j67550J96992
10503h01757j26981k26447J97432J86265j52181j83799P3201k4492j07705J99681
10493i66783k82533q3863L70563M5758k9728j27065K85646r0145k91055j8992
$$ plain form
10483 -1188197 -1023951 -1055440 -1206614 -881931 -893161 -842767 -1019410 -1200252 -1165342 -1173636
10473 -1173636 -929767 -944039 -1145346 -1193393 -1121720 -994290 -937858 -839992 -990899 -1270185
10463 -1270185 -883039 -729983 -1013290 -1091595 -1047564 -917515 -973480 -1050222 -1157350 -866378
10453 -866378 -497893 -888328 -951225 -751295 -783305 -874398 -758313 -959802 -1124802 -1093014
10443 -1093014 -811003 -687578 -829887 -842695 -898007 -895223 -854133 -1245698 -1148848 -1121547 -1015318
10432 -1015318 -965452 -1148817 -909331 -983756 -1120556 -1197166 -890164 -867140 -1273820 -1124545
10422 -1124545 -1193167 -1219311 -1229342 -1105097 -1042402 -842521 -739062 -1057448 -1110296 -975605
10412 -975605 -882767 -1167860 -1032294 -810664 -854885 -1086436 -1265757 -1376580 -1355498 -1027359
$$ packed form
10483a188197J64246l1489j51174L24683j1230N0394j76643j80842L4910q294
10473a173636K43869j4272k01307m8047P1673J27430N6432R7866j50907k79286
10463a270185L87146J53056k83307p8305M4031J30049n5965p6742j07128K90972
10453h66378L68485l90435o2897J99930l2010r1093J16085k01489j65000L1788
10443a093014K82011J23425j42309j2808n5312K784M1090l91565R6850K7301J06229
10432a015318M9866j83365K39486p4425j36800p6610L07002K3024m06680J49275
10422a124545o8622k6144j0031J24245O2695J99881J03459l18386n2848J34691
10412i75605R2838k85093J35566K21630m4221k31551j79321j10823K1082L28139
$$ plain form
10402 -1027359 -1081746 -1024968 -852389 -794691 -789898 -1082516 -973761 -873249 -1303632 -1478547
10392 -1478547 -1170630 -899705 -799097 -876586 -759446 -723085 -866895 -1194103 -983694 -878801
10382 -878801 -1020805 -818482 -908692 -823236 -813990 -1022281 -862138 -1061368 -670040 -686810
10372 -686810 -722932 -647552 -964291 -886111 -1053151 -1103622 -715248 -782748 -1039275 -1018570 -1118699
10361 -1118699 -980320 -1060057 -1196771 -1011651 -772124 -962205 -922228 -936878 -1097945 -1090038
10351 -1090038 -824712 -974369 -1027766 -983266 -1272940 -1205596 -933636 -1183431 -1045240 -965144
10341 -965144 -985039 -745974 -892049 -913514 -1093200 -1089261 -1138374 -1193645 -1122260 -1158879 -1051074
10330 -1051074 -1042176 -1199664 -840329 -863379 -751566 -799727 -984825 -797256 -876262 -955769
$$ packed form
10402a027359n4387N6778J72579N7698M793k92618J08755J00512m30383j74915
10392a478547L07917K70925J00608p7489J17140L6361j43810l27208K10409J04893
10382h78801j42004K02323r0210Q5456R246k08291J60143j99230L91328j6770
10372f86810l6122P5380l16739P8180j67040n0471L88374o7500k56527K0705j00129
10361a118699J38379p9737j36714J85120K39527j90081L9977j4650j61067P907
10351a090038K65326j49657n3397M4500k89674O7344K71960k49795J38191Q0096
10341i65144j9895K39065j46075k1465j79686L939m9113n5271P1385l6619J07805
10330a051074Q898j57488L59335k3050J11813m8161j85098J87569p9006p9507
$$ plain form
10320 -955769 -1203908 -1178126 -1052353 -1113620 -967754 -784421 -813836 -1056423 -1102650 -1287315
10310 -1287315 -1107892 -1135709 -1147002 -1100184 -1031653 -1195717 -1088291 -927540 -1177876 -1233765
10300 -1233765 -1246942 -968936 -1227766 -1275321 -896766 -938824 -995871 -873885 -991569 -822618
10290 -822618 -997217 -987039 -1093696 -1132317 -1071742 -798594 -847023 -803730 -961609 -1048285 -917975
10279 -917975 -1024374 -1056974 -1130410 -1195576 -1173777 -1026442 -1032691 -1402793 -1302222 -945743 -1096373
10268 -1096373 -940482 -1010537 -768918 -819716 -939544 -1026728 -1112031 -1103653 -1085686 -1027635 -1009019
10257 -1009019 -1125889 -946907 -908304 -977237 -884611 -876782 -1082081 -1211968 -987409 -693949
10247 -693949 -938543 -1116861 -762326 -728313 -852211 -837055 -820834 -1182449 -1060954 -951529
$$ packed form
10320i55769k48139K5782J25773o1267J45866J83333k9415k42587m6227j84665
10310a287315J79423k7817j1293M6818O8531j64064J07426J60751k50336n5889
10300a233765j3177K78006k58830m7555L78555m2058n7047J21986j17684J68951
10290h22618j74599J0178j06657l8621O0575K73148m8429M3293j57879q6676J30310
10279i17975j06399l2600p3436o5166K1799J47335o249l70102J00571L56479j50630
10268a096373J55891p0055K41619n0798j19828q7184q5303Q378J7967N8051J8616
10257a009019j16870J78982L8603o8933R2626P829k05299j29887K24559K93460
10247f93949k44594j78318L54535L4013j23898J5156J6221l61615J21495J09425
$$ plain form
10237 -951529 -762608 -848184 -923715 -890519 -1046720 -1137196 -1115437 -1128142 -1393478 -1145062 -1151455
10226 -1151455 -1120620 -1137564 -1231653 -1210631 -1217835 -1091939 -857354 -847845 -883328 -738862 -710711
10215 -710711 -801893 -907928 -1014449 -1020403 -1205598 -1322412 -1086781 -1119140 -803794 -889352
10205 -889352 -783702 -919349 -1213898 -982287 -867171 -971005 -998141 -1049271 -856392 -806679
10195 -806679 -720519 -664406 -778380 -989809 -1002552 -785098 -766980 -652196 -741396 -1013648
10185 -1013648 -1072561 -955908 -1083430 -1103289 -1111035 -1169416 -1140472 -1039150 -1052873 -873680 -948888
10174 -948888 -772614 -983311 -984906 -908884 -868271 -820490 -754607 -853319 -1180044 -1020527 -1122001
10163 -1122001 -1021803 -908444 -1067820 -1195046 -1177650 -1257586 -1023604 -902465 -1340094 -1225429
$$ packed form
10237i51529J88921q5576p5531L3196j56201r0476K1759j2705k65336K48416o393
10226a151455L0835j6944r4089K1022p204J25896K34585R509l5483J44466K8151
10215g10711r1182j06035j06521n954j85195j16814K35631l2359L15346q5558
10205h89352J05650j35647k94549K31611J15116j03834k7136n1130J92879M9713
10195h06679Q6160N6113j13974k11429j2743K17454J8118J14784q9200k72252
10185a013648n8913J16653j27522j9859p746n8381K8944J01322j3723J79193p5208
10174i48888J76274k10697j595P6022M0613M7781O5883r8712l26725J59517j01474
10163a122001J00198J13359j59376j27226J7396p9936K33982J21139m37629J14665
$$ plain form
10153 -1225429 -1042108 -941117 -952103 -783534 -854736 -1051580 -1244221 -1334183 -1129189 -1099827
10143 -1099827 -1116146 -993811 -996204 -1018027 -1067851 -1052992 -946135 -899211 -890569 -861594 -977430
10132 -977430 -1066208 -1129979 -955042 -1042255 -1225336 -1242326 -1072823 -977563 -852365 -970730
10122 -970730 -991323 -765653 -936190 -1037756 -1048444 -975868 -1044546 -713963 -803373 -782425 -744606
10111 -744606 -506701 -701531 -1199921 -880995 -783846 -979748 -963151 -901569 -1008449 -929774
10101 -929774 -751022 -681526 -587768 -839761 -757459 -733228 -718292 -860989 -1053269 -888734
10091 -888734 -970053 -1202079 -1230537 -1200020 -799958 -982703 -1170700 -1032249 -1019162 -1075597
10081 -1075597 -850368 -736945 -665521 -774585 -1056135 -1203450 -1126975 -1258502 -1214471 -1123001
$$ packed form
10153a225429J83321J00991j0986J68569p1202j96844j92641q9962K04994K9362
10143a099827j6319J22335k393k1823m9824J4859J06857M6924Q642K8975j15836
10132i77430q8778o3771J74937q7213j83081j6990J69503R5260J25198j18365
10122i70730k0593K25670j70537j01566j0688P2576o8678L30583q9410K0948L7819
10111g44606K37905j94830m98390L18926R7149j95902J6597O1582j06880P8675
10101i29774J78752O9496R3758k51993Q2302K4231J4936j42697j92280J64535
10091h88734q1319k32026k8458L0517M00062j82745j87997J38451J3087n6435
10081a075597K25229J13423P1424j09064k81550j47315P6475j31527M4031R1470
$$ plain form
10071 -1123001 -1313885 -784959 -688463 -1239602 -1240037 -966004 -865236 -1035830 -1234082 -772466
10061 -772466 -753543 -1186897 -1190189 -1165832 -838339 -771775 -922369 -892270 -978002 -840382 -902984
10050 -902984 -1040920 -1155566 -939962 -1000501 -1259177 -1205913 -1095186 -981992 -893862 -1026395
10040 -1026395 -1406374 -1219466 -1047994 -1272611 -1362832 -1184512 -885100 -1121019 -1052752 -1050782
10030 -1050782 -874284 -811724 -959205 -1044629 -975647 -981551 -1144426 -1332729 -1112381 -1061305
10020 -1061305 -1122176 -1108370 -1023253 -1178862 -1314257 -1280144 -870091 -945844 -940702 -631455 -973412
10009 -973412 -1021987 -765162 -814660 -1060845 -1007447 -1088432 -1173082 -1278965 -1072527 -980145 -867602
9998 -867602 -923497 -1070475 -1030486 -1157810 -1352811 -1117799 -923475 -1013714 -951066 -1123435
$$ packed form
10071a123001j90884N28926R6496n51139m35K74033J00768j70594j98252M61616
10061g72466J8923m33354l292K4357L27493O6564j50594L0099q5732J37620o2602
10050i02984j37936j14646K15604o0539k58676N3264J10727J13194Q8130j32533
10040a026395l79979J86908J71472k24617r0221J78320K99412k35919O8267J970
10030a050782J76498O2560j47481q5424O8982n904j62875j88303K20348N1076
10020a061305o0871J3806Q5117j55609j35395L4113M10053p5753N142L09247l41957
10009i73412m8575K56825m9498k46185N3398q0985q4650j05883K06438R2382J12543
9998h67602n5895j46978L9989j27324j95001K35012J94324r0239O2648j72369
$$ plain form
9988 -1123435 -1207238 -789251 -959095 -1369803 -1279383 -1255303 -1279947 -959167 -762400 -961496
9978 -961496 -967759 -918611 -907517 -873413 -1023904 -1046565 -944154 -854087 -899769 -1055544 -1022284
9967 -1022284 -762252 -1000446 -1202371 -1077782 -932739 -915539 -905716 -1015633 -1222938 -978513
9957 -978513 -1038416 -1140886 -1291945 -809768 -742255 -900425 -996039 -1027182 -781626 -1127702
9947 -1127702 -1221329 -1013532 -824178 -883819 -854446 -1064241 -1183316 -1014340 -772765 -680187
9937 -680187 -735991 -757938 -749403 -910960 -1159109 -1061244 -872494 -573893 -729401 -1083987 -1381184
9926 -1381184 -1314979 -1011177 -775846 -695374 -879722 -815053 -970365 -826944 -858505 -764146
9916 -764146 -993944 -1280346 -1228280 -1300712 -1369769 -911447 -742360 -833865 -963534 -961038 -1041003
$$ packed form
9988a123435q3803M17987j69844m10708R0420K4080k4644L20780J96767j99096
9978i61496o263M9148J1094L4104j50491k2661J02411R0067m5682j55775L3260
9967a022284K60032k38194k01925J24589J45043J7200R823j09917k07305K44425
9957i78513n9903j02470j51059M82177O7513j58170r5614l1143K45556l46076
9947a127702r3627K07797J89354n9641K9373k09795j19075J68976K41575R2578
9937f80187n5804k1947Q535j61557k48149R7865J88750K98601j55508l54586k97197
9926a381184O6205L03802K35331Q0472j84348O4669j55312J43421l1561R4359
9916g64146k29798k86402N2066p2432o9057M58322J69087r1505j29669K496p9965
$$ plain form
9905 -1041003 -697972 -946798 -1085462 -975644 -1146167 -1092510 -1273158 -990716 -994620 -1451401
9895 -1451401 -1365978 -1228727 -1169691 -1091727 -1269435 -1083117 -1028119 -1134663 -1248229 -1078788
9885 -1078788 -922510 -912838 -900973 -995925 -953674 -831677 -1081287 -902754 -1007144 -1110497
9875 -1110497 -1089365 -920102 -1026525 -863466 -985464 -997361 -919583 -1078840 -1219626 -894861
9865 -894861 -1055936 -1464844 -1596729 -1483849 -1244329 -1108544 -998477 -1094316 -1025676 -1127566
9855 -1127566 -1171871 -1091522 -1260585 -1130489 -1023017 -1068440 -1071166 -1084557 -992248 -1194709 -1096332
9844 -1096332 -902501 -715426 -816020 -968604 -997677 -979526 -1111064 -991376 -738195 -1092311
9834 -1092311 -945133 -889253 -1268681 -1100085 -1098784 -1058221 -793206 -840664 -718144 -767875 -626192
$$ packed form
9905a041003L43031k48826j38664J09818j70523N3657j80648K82442l904m56781
9895a451401Q5423J37251N9036P7964j77708J86318N4998j06544j13566J69441
9885a078788J56278R672J1865r4952M2251J21997k49610J78533j04390j03353
9875a110497K1132J69263j06423J63059j21998j1897P7778j59257j40786L24765
9865h94861j61075m08908j31885J12880K39520J35785J10067r5839O8640j01890
9855a127566m4305Q0349j69063J30096J07472m5423k726j3391R2309k02461R8377
9844a096332J93831J87075j00594j52584k9073J8151j31538J19688K53181l54116
9834a092311J47178N5880l79428J68596J301M0563K65015m7458J22520m9731J41683
$$ plain form
9823 -626192 -681144 -779589 -741804 -1196366 -1299737 -1284991 -1107001 -1206521 -1201394 -1183535 -1239884
9812 -1239884 -976075 -961852 -1134562 -950794 -947161 -1217483 -1184800 -987581 -802612 -596167
9802 -596167 -727316 -576024 -931085 -1188859 -983923 -939533 -1063264 -1171720 -1179847 -1064707
9792 -1064707 -1316033 -1226619 -945864 -783059 -705151 -520485 -688730 -773017 -860578 -1043132
9782 -1043132 -961293 -784766 -923407 -1179788 -978355 -910597 -928273 -806653 -670949 -567119
9772 -567119 -672085 -954943 -820269 -767823 -1060616 -1009511 -1001151 -1031577 -1006512 -897892 -729416
9761 -729416 -861217 -789832 -868132 -986401 -941774 -666249 -698215 -672408 -950954 -963643 -1086748
9750 -1086748 -1132288 -1043182 -1020871 -964998 -931402 -1076651 -972187 -1032352 -1135857 -910504 -882065
$$ packed form
9823f26192n4952r8445L7785m54562j03371J4746J77990r9520N127J7859n6349
9812a239884K63809J4223j72710J83768L633k70322L2683J97219J84969K06445
9802e96167j31149J51292l55061k57774K04936M4390j23731j08456q127J15140
9792a064707k51326Q9414K80755J62805P7908J84666j68245q4287q7561j82554
9782a043132Q1839J76527j38641k56381K01433O7758j7676J21620J35704J03830
9772e67119j04966k82858J34674N2446k92793N1105Q360l0426K5065J08620J68476
9761g29416j31801P1385p8300j18269M4627K75525l1966K5807k78546j2689j23105
9750a086748m5540Q9106K2311N5873L3596j45249J04464o0165j03505K25353K8439
$$ plain form
9739 -882065 -909621 -1189600 -891922 -648640 -796405 -962357 -1169185 -1090066 -1273819 -1060271
9729 -1060271 -820344 -1207785 -1364369 -1323693 -1316352 -1079716 -977067 -741880 -1044879 -1191219
9719 -1191219 -1280377 -1175664 -615783 -753165 -764836 -682196 -989693 -1049644 -892768 -916643
9709 -916643 -1015464 -962192 -988578 -1104630 -874539 -848393 -832348 -1017049 -1209917 -801694 -945699
9698 -945699 -923592 -665236 -818557 -641831 -699979 -731254 -692814 -732528 -831479 -859217 -732042
9687 -732042 -682492 -993394 -876419 -801074 -928614 -850729 -972468 -1112335 -943097 -776659
9677 -776659 -730800 -791535 -1055730 -914447 -856371 -725531 -961660 -916958 -838039 -1003115 -926597
9666 -926597 -1080964 -1007108 -1240049 -1198133 -926779 -864272 -825196 -916719 -993779 -897127 -781129
$$ packed form
9739h82065k7556k79979K97678K43282j47765j65952k06828P9119j83753K13548
9729a060271K39927l87441j56584M0676P341K36636J02649K35187l02999j46340
9719a191219q9158J04713N59881j37382j1671Q2640l07497n9951J56876k3875
9709i16643r8821N3272k6386j16052K30091K6146J6045j84701j92868M08223j44005
9698i45699K2107K58356j53321J76726n8148l1275L8440l9714r8951k7738J27175
9687g32042M9550l10902J16975P5345j27540P7885j21739j39867J69238J66438
9677g76659M5859o0735k64195J41283N8076J30840k36129M4702P8919j65076P6518
9666i26597j54367P3856k32941M1916K71354O2507L9076r1523p7060R6652J15998
$$ plain form
9655 -781129 -872863 -812281 -714420 -760640 -598706 -1043875 -1005952 -953953 -1031253 -999400 -863475
9644 -863475 -860218 -906301 -956742 -817194 -940617 -885034 -637041 -688752 -712972 -762277 -516084
9633 -516084 -311868 -679794 -925171 -917704 -1053438 -805523 -759285 -725434 -980529 -1111286
9623 -1111286 -1016526 -746397 -755629 -780594 -1072511 -1170965 -934964 -811345 -974003 -829770
9613 -829770 -797209 -598951 -648768 -976022 -881915 -655941 -625301 -807912 -739869 -681541 -805748
9602 -805748 -832413 -1043682 -821589 -718913 -948356 -898009 -1149227 -868940 -879481 -825777
9592 -825777 -705823 -1153121 -1035554 -750355 -810452 -651448 -785732 -857669 -972462 -897422
9582 -897422 -675523 -440527 -582519 -867274 -782320 -728627 -720305 -776906 -549864 -495060 -482669
$$ packed form
9655g81129r1734O0582R7861m6220J61934m45169L7923N1999p7300L1853J35925
9644h63475L257m6083n0441J39548j23423N5583K47993n1711k4220m9305K46193
9633e16084K04216l67926k45377P467j35734K47915M6238L3851k55095j30757
9623a111286R4760K70129r232k4965k91917r8454K36001J23619j62658J44233
9613h29770L2561J98258m9817l27254R4107K25974L0640j82611O8043N8328j24207
9602h05748k6665k11269K22093J02676k29443N0347k51218K80287j0541N3704
9592h25777J19954m47298J17567K85199o0097J59004j34284p1937j14793P5040
9582h97422K21899K34996j41992k84755Q4954N3693Q322n6601K27042N4804J2391
$$ plain form
9571 -482669 -951535 -1016779 -1025492 -956969 -812568 -653725 -429367 -694959 -960994 -712850
9561 -712850 -757999 -1007673 -856705 -1083458 -970190 -779722 -469705 -611642 -431030 -364283
9551 -364283 -350228 -480302 -467745 -631120 -807107 -962813 -975793 -744925 -750918 -872385 -843006
9540 -843006 -852968 -754582 -813309 -586375 -708603 -730183 -740579 -1005540 -849133 -738340 -770900
9529 -770900 -859864 -660088 -668862 -469493 -627238 -781912 -721663 -973825 -1187872 -894789
9519 -894789 -524217 -360498 -698619 -544920 -585199 -970559 -1174127 -1190009 -1100335 -856445
9509 -856445 -673802 -622853 -585007 -683367 -643519 -639600 -954064 -948672 -854600 -648205 -643448 -709074
9497 -709074 -544842 -619869 -788912 -553808 -820740 -1029376 -639122 -586469 -562372 -534462
$$ packed form
9571d82669m68866o5244q713O8523J44401J58843K24358k65592k66035K48144
9561g12850m5149k49674J50968k26753J13268J90468L10017j41937J80612O6747
9551c64283J4055j30074J2557j63375j75987j55706j2980K30868n993j21467K9379
9540h43006r962R8386n8727K26934j22228k1580j0396k64961J56407J10793l2560
9529g70900q8964J99776q774J99369j57745j54674O0249k52162k14047K93083
9519h94789L70572J63719l38121J53699m0279l85360k03568j5882Q9674K43890
9509h56445J82643N0949L7846r8360L9848L919l14464N392R4072K06395M757o5626
9497g09074J64232p5027j69043K35104k66932k08636L90254N2653K4097K7910
$$ plain form
9487 -534462 -586256 -860210 -646294 -482639 -916607 -803460 -474843 -431114 -403931 -404763 -371729
9476 -371729 -527841 -557465 -499410 -570531 -388850 -607071 -492927 -574232 -697771 -553743
9466 -553743 -788253 -831565 -604766 -680501 -619682 -525831 -736804 -749592 -879066 -732457 -717134
9455 -717134 -809471 -964829 -1141708 -839551 -696979 -758677 -783126 -681145 -1056063 -1047362 -968025
9444 -968025 -871287 -590351 -677532 -634221 -690533 -760326 -802880 -590042 -482046 -634959 -686267
9433 -686267 -1004090 -811717 -731167 -470513 -344280 -374228 -292566 -397276 -352461 -591651
9423 -591651 -868103 -768662 -595430 -547929 -184597 -410225 -714008 -711897 -506975 -585862 -467946
9412 -467946 -505470 -468680 -479526 -426552 -196395 -208234 -151374 -309022 -217955 -186831 85897
$$ packed form
9487e34462n1794k73954K13916J63655m33968J13147L28617M3729K7183q32L3034
9476c71729j56112k9624N8055p1121J81681k18221J14144q1305j23539J44028
9466e53743k34510m3312K26799p5735O0819R3851k10973j2788j29474J46609J5323
9455g17134r2337j55358j76879L02157J42572o1698k4449J01981l74918Q701P9337
9444i68025R6738K80936q7181M3311n6312o9793m2554K12838J07996j52913n1308
9433f86267l17823J92373Q0550K60654J26233k9948Q1662j04710M4815k39190
9423e91651k76452R9441J73232M7501L63332k25628l03783K111K04922p8887J17916
9412d67946l7524L6790j0846N2974K30157j1839N6860j57648R1067L1124K72728
$$ plain form
9401 85897 458618 637654 1054922 1190898 1201338 1053008 649088 587210 511087 87374
9391 87374 -79501 39985 -35439 -233355 -59358 -86281 -115750 -99890 -169920 -161193 -263084
9380 -263084 -255059 -299596 -424959 -328592 -118449 -82607 -15751 171810 62462 148907 172219
9369 172219 -22739 -169910 -344947 -507895 -232649 -231012 -275038 -545894 -290207 -154319
9359 -154319 -418555 -341466 87510 18157 64189 -179383 -226285 28005 -141497 -45529 130380
9348 130380 -50377 162106 44185 -136452 -75698 -120444 -60696 -27986 -249447 -153184 192670
9337 192670 102949 346353 460573 663652 591174 430143 517657 376374 645600 1015080
9327 1015080 1129610 1319507 1010297 910131 793415 1037261 868561 568474 748852 813811
$$ packed form
9401H5897L72721J79036M17268J35976J0440j48330m03920o1878p6123m23713
9391H7374j66875J19486p5424j97916J73997k6923k9469J5860p0030Q727j01891
9380b63084Q025m4537j25363R6367K10143L5842O6856J87561j09348Q6445K3312
9369A72219j94958j47171j75037j62948K75246J637m4026k70856K55687J35888
9359a54319k64236P7089M28976o9353M6032k43572m6902K54290j69502R5968J75909
9348A30380j80757K12483j17921j80637O0754m4746N9748L2710k21461R6263L45854
9337A92670q9721K43404J14220K03079p2478j61031Q7514j41283K69226L69480
9327A015080J14530J89897l09210j00166j16716K43846j68700l00087J80378O4959
$$ plain form
9317 813811 667033 784227 631262 439771 699218 626026 671651 448673 279884 353256
9307 353256 528575 785890 481372 512772 653567 941001 871739 750758 833246 1556765
9297 1556765 1696893 1603263 1399708 1234461 1454578 1430323 1167367 1263460 1379848 1535388
9287 1535388 1673288 1813436 1684052 1498730 1601532 1745642 1409236 1387312 1467772 1393655
9277 1393655 1486329 1615678 1787211 1868665 1887929 1453000 1251575 1303002 1403975 1316224
9267 1316224 1166747 1247472 1109197 1118016 1129396 1370827 1473264 1291172 1327632 1342562 1295658
9256 1295658 864031 534808 531702 510465 591716 569694 576242 801342 799194 669468 493896
9245 493896 350320 511318 766828 873270 845542 812784 833567 887865 911724 972925 1106683
$$ packed form
9317H13811j46778J17194j52965j91491K59447p3192M5625k22978j68789P3372
9307C53256J75319K57315l04518L1400J40795K87434o9262j20981Q2488P23519
9297A556765J40128r3630k03555j65247K20117k4255k62956R6093J16388J55540
9287A535388J37900J40148j29384j85322J02802J44110l36406k1924Q0460p4117
9277A393655R2674J29349J71533Q1454J9264m34929k01425N1427J00973q7751
9267A316224j49477Q0725j38275Q819J1380K41431J02437j82092L6460J4930m6904
9256A295658m31627l29223l106k1237Q1251k2022O548K25100k148j29726j75572
9245D93896j43576J60998K55510J06442k7728l2758K0783N4298K3859O1201J33758
$$ plain form
9234 1106683 1288368 1240573 1068581 1282927 1490516 1577925 1799183 2117901 2488537 2656739
9224 2656739 2324170 2251865 2330768 2169796 2062149 1812539 2183151 2850433 3101586 3275028
9214 3275028 2850186 2716381 2715530 2876794 3260445 4604980 6428358 7785833 8072990 7453690
9204 7453690 6663469 5763216 5292793 4807531 4986829 6004112 7498495 8523659 8355904
9195 8355904 7613401 6340465 5272796 4312423 4034956 3386333 2769918 2586531 2449630
9186 2449630 2008156 1834835 1710533 1773493 1811326 1787151 1549307 1481329 1418951 1362789 1346677
9175 1346677 1610046 1866650 1823802 1370270 1455632 1577574 1498610 1381288 1420748 1349154
9165 1349154 1215879 1123955 856163 985606 1175513 1449719 1287668 1214090 1150594 1274922
$$ packed form
9234A106683J81685m7795j71992K14346K07589Q7409K21258L18718L70636J68202
9224B656739l32569p2305P8903j60972j07647k49610L70612O67282K51153J73442
9214C275028m24842j33805q51J61264L83651J344535J823378J357475K87157o19300
9204G453690p90221r00253m70423m85262J79298J017283J494383J025164j67755
9195H355904p42503j272936j067669r60373k77467o48623o16415j83387j36901
9186B449630m41474j73321j24302O2960L7833k4175k37844o7978o2378n6162j6112
9175A346677K63369K56604m2848m53532Q5362J21942p8964j17322L9460p1594
9165A349154j33275r1924k67792J29443J89907K74206j62051p3578o3496J24328
$$ plain form
9155 1274922 1110845 955565 929214 1420874 1518056 1418675 1327154 1309301 1095103 1030548 1364266
9144 1364266 1424388 1457247 1392484 1381157 1457703 1265846 1254611 1344051 1750879 1849178 1748529
9133 1748529 1673354 1578876 1631273 1504124 1548029 1509601 1649038 1737075 1551391 1730807 1872005
9122 1872005 1904110 1862755 1653403 1812270 1949953 1960437 2065692 2140529 1959315 1756111
9112 1756111 1829467 1822895 1857261 2393931 2502659 2413595 2244862 2199471 1845747 2221961 2531681
9101 2531681 2623456 2804112 2935641 2827762 2607072 2520407 2735596 2773367 2507705 2326455
9091 2326455 2308947 2268952 2170533 2280595 2305913 2601762 2598967 2762267 2646849 2537670 2494814
9080 2494814 2530700 2474104 2789981 2946363 3027924 2511759 2611163 2933350 3168893 3041974
$$ packed form
9155A274922j64077j55280k6351M91660R7182r9381r1521j7853k14198o4555L33718
9144A364266O0122L2859o4763j1327P6546j91857j1235Q9440M06828R8299j00649
9133A748529p5175r4478N2397j27149M3905l8428J39437Q8037j85684J79416J41198
9122A872005L2105m1355k09352J58867J37683J0484J05255P4837j81214k03204
9112A756111P3356o572L4366N36670J08728q9064j68733m5391l53724L76214L09720
9101B531681R1775J80656J31529j07879k20690q6665K15189L7771k65662j81250
9091B326455j7508l9995r8419J10062K5318K95849k795J63300j15418j09179m2856
9080B494814L5886n6596L15877J56382Q1561n16165R9404L22187K35543j26919
$$ plain form
9070 3041974 3393326 3643376 3495727 3392509 3636799 3435046 3740876 3690281 3667012 3649081
9060 3649081 3817068 3595357 3308149 3380347 3534865 3631402 3575770 3866635 3638723 3692013
9050 3692013 4107815 3932978 3912910 4222359 4202550 4125385 4178100 4098875 4126292 4231906 4699225
9039 4699225 5107615 5227410 5411189 5371525 5214223 5130647 5494576 5413105 5699833 5919049
9029 5919049 5873073 6157558 6311876 6081055 6137195 6335596 6381928 6388969 6346483 6328245 6727266
9018 6727266 6967740 7036206 7152491 7564202 7738104 7836146 7630295 7857748 8116195 8346311
9008 8346311 8795067 8987003 9197330 9476151 9829525 10250625 10272314 10333996 10380450 10622636
8998 10622636 10777212 11545102 12241919 12548575 12641420 12577684 13042212 13195370 13489479 14048305
$$ packed form
9070C041974L51352K50050j47649j03218K44290k01753L05830n0595k3269j7931
9060C649081J67987k21711k87208P2198J54518R6537n5632K90865k27912N3290
9050C692013M15802j74837k0068L09449j9809p7165N2715p9225K7417J05614M67319
9039D699225M08390J19795J83779l9664j57302q3576L63929q1471K86728K19216
9029E919049m5976K84485J54318k30821N6140J98401M6332P041m2486j8238L99021
9018F727266K40474O8466J16285M11711J73902R8042k05851K27453K58447K30116
9008H346311M48756J91936K10327K78821L53374M21100K1689O1682M6454K42186
8998A0622636J54576P67890O96817L06656R2845o3736M64528J53158K94109N58826
$$ plain form
8988 14048305 14534574 15100847 15610633 16246007 16601369 16866179 16987555 17470392 17750041
8979 17750041 18236797 18964682 19776291 21008628 21826952 22154097 22465532 22708348 23160279
8970 23160279 23437241 24208383 24642664 25193770 25803385 26986522 28341052 30077362 31794269
8961 31794269 33342072 34563381 35658566 36961756 39018686 41582546 44521475 49192101
8953 49192101 55879263 66204449 80853197 96128776 106107157 109066829 106873110 101208527
8945 101208527 97214877 97312875 102796816 115220679 136623886 163408143 183612448 188810000
8937 188810000 182848342 168276803 152466321 140121571 133923533 132219236 136620400 148470821
8929 148470821 176096559 228778443 312229657 373608454 375919708 352934148 302872939
$$ packed form
8988A4048305M86269N66273N09786O35374L55362K64810J21376M82837K79649
8979A7750041M86756P27885Q11609J232337Q18324L27145L11435K42816M51931
8970B3160279K76962P71142M34281N51106O09615J183137J354530J736310J716907
8961C1794269J547803J221309J095185J303190K056930K563860K938929M670626
8953D9192101O687162J0325186J4648748J5275579R978381K959672k193719n664583
8945A01208527l993650R7998N483941J2423863K1403207K6784257K0204305N197552
8937A88810000n961658j4571539j5810482j2344750o198038j704297M401164J1850421
8929A48470821K7625738N2681884Q3451214O1378797K311254k2985560n0061209
$$ plain form
8922 302872939 256198598 233562799 234726029 250733319 268940217 276075346 271576855
8915 271576855 260536267 248874870 247730038 266140545 309717883 375231368 443443282
8908 443443282 496891046 514827511 484074196 424891308 352854878 284291641 230090088
8901 230090088 191110985 163621109 144570883 132264295 123996357 116584414 108366392
8894 108366392 99160583 89352576 80197263 72623729 65983753 60371138 56022316 52140949
8886 52140949 49083307 46647040 44601901 42587270 41063568 39603999 37672657 36086584
8878 36086584 34509469 33541499 32613482 31874069 31209442 30407099 28707077 27317262 26503470
8869 26503470 25594422 24760235 23967840 23490691 22943526 22285309 21666019 21096535 20530083
$$ packed form
8922C02872939m6674341k2635799J163230J6007290J8206898P135129m498491
8915B71576855j1040588j1661397j144832J8410507M3577338O5513485O8211914
8908D43443282N3447764J7936465l0753315n9182888p2036430o8563237n4201553
8901B30090088l8979103k7489876j9050226j2306588q267938p411943q218022
8894A08366392r205809r808007r155313p573534o639976n612615m348822l881367
8886E2140949l057642k436267k045139k014631j523702j459569j931342j586073
8878C6086584j577115r67970r28017p39413o64627q02343j700022j389815q13792
8869B6503470r09048q34187p92395m77149n47165o58217o19290n69484n66452
$$ plain form
8860 20530083 19779232 19063164 18467889 18118492 17554284 16855394 16109065 15698766 15462053
8851 15462053 14953322 14890369 14754161 14384890 14291617 13736785 13441303 13212977 12887932 12403062
8841 12403062 11915105 11655852 11366136 10939950 11065291 11195142 11110330 10707552 10612531 10218870
8831 10218870 9841378 10059926 10086615 9938332 9562089 9483110 9146642 9140606 9220361 9058766
8821 9058766 9049818 8807153 8879350 8933831 8814531 8618516 8395805 8151364 8322332 8542613
8811 8542613 8210090 8216646 8020253 7749066 8053217 7996268 7763132 7508973 7619847 7872859
8801 7872859 7294613 6915281 7220715 7223196 7049162 7150618 7033588 6912489 7173907 6757323
8791 6757323 6593669 6634108 6674877 6688561 6589142 6534415 6752158 6600164 6177108 6102099 5852356
$$ packed form
8860B0530083p50851p16068n95275l49397n64208o98890p46329m10299k36713
8851A5462053n08731o2953j36208l69271r3273n54832k95482k28326l25045m84870
8841A2403062m87957k59253k89716m26186J25341J29851q4812m02778r5021l93661
8831A0218870l77492K18548K6689j48283l76243p8979l36468o036P9755j61595
8821I058766q948k42665P2197N4481j19300j96015k22711k44441J70968K20281
8811H542613l32523O556j96393k71187L04151n6949k33136k54159J10874K53012
8801G872859n78246l79332L05434K481j74034J01456j17030j21099K61418m16584
8791F757323j63654M0439M0769J3684r9419n4727K17743j51994m23056p5009k49743
$$ plain form
8780 5852356 5703111 5664543 5400478 5247869 5305059 5344544 5467974 5713899 6031367 6059940
8770 6059940 5870464 5515279 5368209 5357092 5221879 5219778 5461583 5509334 5625990 5861134
8760 5861134 6002275 5813719 5474505 5171719 5256038 5334961 5227160 5520568 5693515 5596246
8750 5596246 5804644 5777590 5419194 5444082 5700924 5753321 5885511 5861282 5987395 6057089
8740 6057089 6143944 6310861 6522400 6546259 6599244 6582719 6761774 7000712 6920612 6712359
8730 6712359 6869213 6825124 7041674 7315282 7241172 7125736 7387420 7464210 7487435 7222813
8720 7222813 6555639 6702773 6323572 6063288 6173124 6166957 6161126 6259326 6247035 6400614 6233863
8709 6233863 5954182 6056406 6364211 6245479 6082920 5721866 5725585 5627584 5845020 5880902
$$ packed form
8780E852356j49245l8568k64065j52609N7190L9485J23430K45925L17468K8573
8770F059940j89476l55185j47070j1117j35213k101K41805M7751J16656K35144
8760E861134J41141j88556l39214l02786Q4319P8923j07801K93408J72947r7269
8750E596246K08398k7054l58396K4888K56842N2397J32190k4229J26113O9694
8740F057089Q6855J66917K11539K3859N2985j6525J79055K38938q0100k08253
8730F712359J56854m4089K16550K73608p4110j15436K61684P6790K3225k64622
8720G222813o67174J47134l79201k60284J09836o167n831R8200j2291J53579j66751
8709F233863k79681J02224L07805j18732j62559l61054L719r8001K17436L5882
$$ plain form
8699 5880902 5870355 6331014 6322122 6394885 6370375 6470659 6504617 6564433 6425946 6429212 6288548
8688 6288548 6190829 5900021 5640634 6066503 6258932 6368002 6217320 6447400 6642505 6695412
8678 6695412 6827388 6674663 6904604 7228519 7092786 7289440 7375910 7218693 6783041 6928532
8668 6928532 6873575 6696984 6477131 6100219 6069932 5815926 5719844 5807796 5706948 5369326
8658 5369326 5060763 4984870 5239860 5186568 5366210 5440539 5485795 5341689 5587772 5684973
8648 5684973 5764542 5824508 5929999 5982016 5906589 6057923 6204635 6224946 6103473 6202463 6454720
8637 6454720 6423535 6568651 6549915 6517841 6422655 5957213 5713967 5903549 6077839 6056187
8627 6056187 5712996 5580623 5562799 5533227 5365613 5037796 5049657 4917799 4771029 5247344
$$ packed form
8699E880902j0547M60659q892P2763k4510J00284L3958N9816j38487L266j40664
8688F288548r7719k90808k59387M25869J92429J09070j50682K30080J95105N2907
8678F695412J31976j52725K29941L23915j35733J96654Q6470j57217m35652J45491
8668F928532n4957j76591k19853l76912l0287k54006r6082Q7952j00848l37622
8658E369326l08563p5893K54990n3292J79642P4329M5256j44106K46083R7201
8648E684973P9569N9966J05491N2017p5427J51334J46712K0311j21473R8990K52257
8637F454720l1185J45116j8736l2074r5186m65442k43246J89582J74290k1652
8627F056187l43191j32373j7824k9572j67614l27817J1861j31858j46770M76315
$$ plain form
8617 5247344 5465445 5366954 5290870 5263845 5463920 5308439 5163821 5283812 5231682 5492175
8607 5492175 5398750 5499059 5737230 5774526 5809087 5877507 6304717 6383621 6302315 6283697 6324661
8596 6324661 6404243 6725436 6733044 6774135 7298316 7369801 7483082 7284602 7536328 7760196
8586 7760196 7912030 7986170 7932186 8041333 8172025 8472496 8652181 8970416 8656933 8737455
8576 8737455 9028439 9477074 9819332 10095870 10226222 10846875 11173620 11791663 12283441 12795294
8566 12795294 13688972 14161386 15096111 15951875 17186155 18304490 19340029 20345189 21310346
8557 21310346 22877147 24669763 26737498 29273343 32296682 35936191 40663378 47495457
8549 47495457 57098480 70495497 89151693 112929291 138939294 161965100 176245546
$$ packed form
8617E247344K18101r8491p6084k7025K00075j55481j44618J19991n2130K60493
8607E492175r3425J00309K38171L7296L4561O8420M27210P8904q1306j8618M0964
8596F324661P9582L21193P608M1091N24181P1485J13281j98480K51726K23868
8586G760196J51834P4140n3984J09147J30692L00471J79685L18235l13483Q0522
8576H737455K90984M48635L42258K76538J30352O20653L26745O18043M91778N11853
8566A2795294Q93678M72414R34725Q55764J234280J118335J035539J005160R65157
8557B1310346J566801J792616K067735K535845L023339L639509M727187O832079
8549D7495457R603023J3397017J8656196K3777598K6010003K3025806J4280446
$$ plain form
8542 176245546 177714683 167080133 149164862 128020473 108142548 92923608 81848397
8535 81848397 74836264 71510173 70894034 70629489 69426278 66012459 61221136 55780871
8527 55780871 50116054 45303646 41827798 39180590 37021042 35465092 34661178 34696044 35590433
8518 35590433 37028877 39459394 42704724 47039226 52533477 57421385 60124506 60872708
8510 60872708 59820637 58451929 58797807 61417676 67835008 78898299 95145883 115214311
8502 115214311 133735188 146004669 148709102 140896714 125026530 106106761 87549975
8495 87549975 71273319 58445047 48484166 40912149 35413209 31527609 28360747 26154636
8487 26154636 24587705 23685108 22817636 21831815 20588616 19321441 17827941 16963652 16462843
$$ packed form
8542A76245546J469137j0634550j7915271k1144389j9877925j5218940j1075211
8535H1848397p012133l326091o16139k64545j203211l413819m791323n440265
8527E5780871n664817m812408l475848k647208k159548j555950q03914L4866Q94389
8518C5590433J438444K430517L245330M334502N494251M887908K703121P48202
8510F0872708j052071j368708L45878K619869O417332J1063291J6247584K0068428
8502A15214311J8520877J2269481K704433p812388j5870184j8919769j8556786
8495H7549975j6276656j2828272r960881p572017n498940l885600l166862k206111
8487B6154636j566931r02597q67472r85821j243199j267175j493500q64289n00809
$$ plain form
8478 16462843 15566179 14771463 13989850 13817222 13268864 12355390 11533760 11275566 10905217
8469 10905217 10246863 9593330 9377391 9153725 8785137 8591620 8141935 7849772 8059867
8460 8059867 7970108 7648888 7943093 7843019 7962058 7956946 7917580 7891212 8167540 8409776
8450 8409776 8831841 8923584 8881300 8891145 8451210 8040057 7680780 7197256 7029630 6474351
8440 6474351 6420235 6026558 5599957 5388974 5140580 5060380 4781521 4362887 4021197 3841566
8430 3841566 3672309 3614103 3554049 3245275 3283496 3254552 3025323 2645618 2686115 2719556 2777311
8419 2777311 3017003 3174144 2989498 2987513 3129668 3015532 2770341 2642938 2593048 2387135
8409 2387135 2134800 1912514 1850371 1664102 1825200 1714839 1583341 1556426 1561583 1687920
$$ packed form
8478A6462843q96664p94716p81613j72628n48358r13474q21630k58194l70349
8469A0905217o58354o53533k15939k23666l68588j93517m49685k92163K10095
8460H059867q9759l21220K94205j00074J19039n112l9366k6368K76328K42236
8450H409776M22065R1743m2284R845m39935m11153l59277m83524j67626n55279
8440F474351n4116l93677m26601k10983k48394q0200k78859m18634l41690j79631
8430C841566j69257n8206o0054l08774L8221k8944k29229l79705M0497L3441N7755
8419B777311K39692J57141j84646j985J42155j14136k45191j27403m9890k05913
8409B387135k52335k22286o2143j86269J61098j10361j31498k6915N157J26337
$$ plain form
8399 1687920 1451110 1440730 1307912 1184729 1441332 1285208 1296134 1058149 808361 903598
8389 903598 855583 771768 753668 521673 551099 575406 512902 455089 702520 680263 714125
8378 714125 708623 748707 764160 698990 758436 521041 397799 581360 852401 721670 635634
8367 635634 561970 415169 601234 546464 702642 714558 764552 498807 219114 219828 319994
8356 319994 452446 529631 316650 335449 307275 180090 18608 -5690 410059 375546 175949
8345 175949 150312 -23329 274351 -47092 -408662 -260003 -162731 -177173 -300819 -179731
8335 -179731 -43366 -261825 -73630 98788 -97144 149180 262311 46501 78257 176928
8325 176928 209472 287268 187670 136078 -211685 -259378 -22982 -38985 -58065 -185963 -450884
$$ packed form
8399A687920k36810j0380j32818j23183K56603j56124J0926k37985k49788R5237
8389I03598m8015q3815j8100k31995K9426K4307o2504n7813K47431k2257L3862
8378G14125n502M0084J5453o5170N9446k37395j23242J83561K71041j30731q6036
8367F35634p3664j46801J86065n4770J56178J1916M9994k65745k79693P14J00166
8356C19994J32452P7185k12981J8799k8174j27185j61482k4298M15749l4513j99597
8345A75949k5637j73641K97680l21443l61570J48659R7272j4442j23646J21088
8335a79731J36365k18459J88195J72418j95932K46324J13131k15810L1756R8671
8325A76928L2544P7796r9598n1592l47763m7693K36396j6003j9080j27898k64921
$$ plain form
8314 -450884 -265450 -328341 -333784 -266477 -345162 -79879 286198 236394 47587 -22977 130967
8303 130967 11181 -134765 -111233 31353 168194 17004 -169333 -89506 83815 -192507
8293 -192507 -349859 -298623 -375207 -211658 -64225 -136903 64002 7070 -105420 -307459
8283 -307459 -465925 -486817 -475839 -441815 -452920 -410180 13 -81393 -424827 -478068 -429082
8272 -429082 -93116 17488 -26840 84542 111232 142274 24479 -141207 -352215 -458287
8262 -458287 -372762 -278475 -322770 -486453 -495256 -386606 -417097 -536238 -240396 -447183 -479694
8251 -479694 -254878 -338773 -206059 -265644 -213014 206005 314732 45526 66639 312576
8241 312576 267009 71993 -241705 -194827 -198996 -257428 -488963 -446296 -267556 -83851 -141258
$$ packed form
8314d50884J85434o2891n443O7307p8685K65283L66077m9804j88807p0564J53944
8303A30967j19786j45946K3532J42586J36841j51190j86337P9827J73321k76322
8293a92507j57352N1236p6584J63549J47433p2678K00905n6932j12490k02039
8283c07459j58466k0892J0978L4024j1105M2740M10193q1406l43434n3241M8986
8272d29082L35966J10604m4328J11382K6690L1042j17795j65686k11008j06072
8262d58287Q5525R4287m4295j63683q803J08650l0491j19141K95842k06787l2511
8251d79694K24816q3895J32714n9585N2630M19019J08727k69206K1113K45937
8241C12576m5567j95016l13698M6878m169n8432k31535M2667J78740J83705n7407
$$ plain form
8230 -141258 -565238 -625218 -459314 -380652 -111455 -358481 -582551 -703182 -542882 -849347
8220 -849347 -651010 -627525 -509952 -381203 -445297 -237495 -606531 -409569 -212854 -335851
8210 -335851 -373951 -179744 -129592 -60735 -10770 58370 63641 -207118 -122574 -249313 -459727
8199 -459727 -480256 -251712 21717 16281 163253 -81324 -560429 -1957312 -1167160 -640899
8189 -640899 -432425 -366684 -562265 52055 119767 64504 -213143 69958 -78374 158899
8179 158899 153196 240240 318599 439148 697341 813993 969011 719430 707922 720791 667780
8168 667780 829352 1156753 1493498 1181364 1040521 1084989 781279 521621 507307 677118
8158 677118 475631 -18520 -238966 273647 209877 -113104 49096 137658 -102557 -102868 79256
$$ packed form
8230a41258m23980n9980J65904P8662K69197k47026k24070j20631J60300l06465
8220h49347J98337K3485J17573J28749o4094K07802l69036J96962J96715j22997
8210c35851l8100J94207N0152O8857M9965O9140N271k70759Q4544j26739k10414
8199d59727k0529K28544K73429n436J46972k44577m79105j396883P90152N26261
8189f40899K08474O5741j95581O14320O7712n5263k77647K83101j48332K37273
8179A58899n703Q7044P8359J20549K58193J16652J55018k49581j1508J2869n3011
8168F67780J61572L27401L36745l12134j40843M4468l03710k59658j4314J69811
8158F77118k01487m94151k20446N12613o3770l22981J62200Q8562k40215l11J82124
$$ plain form
8147 79256 161413 298105 247123 -16578 -15443 314248 81017 248372 566423 379432 43314
8136 43314 167310 365057 545229 746386 682070 432880 372440 344566 173860 253725 431830
8125 431830 461433 163320 365420 389896 432779 287545 -53636 -395727 -449831 -431865 -354480
8114 -354480 -129762 -373494 -469155 -497134 -568950 -524169 -366395 -347921 -345107 -375285 -447978
8103 -447978 -303674 -149187 -177196 -318871 -267221 -375413 -455526 -128031 38380 -108309
8093 -108309 -355025 -137703 -58249 -338348 -248016 -342224 -253108 -36944 140859 222419 371144
8082 371144 510971 872437 918845 1051560 1010587 1122057 798212 131770 71048 184855
8072 184855 67524 36948 99678 75852 -147801 -208456 -144240 -157055 -173008 -551557 -604693
$$ packed form
8147G9256Q2157J36692n0982k63701J135L29691k33231J67355L18051j86991l36118
8136D3314J23996J97747J80172K01157o4316k49190o0440k7874j70706P9865J78105
8125D31830K9603k98113K02100K4476M2883j45234l41181l42091n4104J7966P7385
8114c54480K24718k43732r5661k7979p1816M4781J57774J8474K814l0178p2693
8103d47978J44304J54487k8009j41675N1650j08192q0113L27495J66411j46689
8093a08309k46716K17322P9454k80099R0332r4208Q9116K16164J77803Q1560J48725
8082C71144J39827L61466M6408J32715m0973J11470l23845o66442o0722J13807
8072A84855j17331l0576O2730k3826k23653o0655O4216j2815j5953l78549n3136
$$ plain form
8061 -604693 -499507 -276481 -303531 -362024 -348624 -122844 -311902 -182691 -133038 -500165
8051 -500165 -305366 -156088 -258001 -202943 -257538 -212137 -299672 -261499 54983 311518 840524
8040 840524 1030439 1088131 1031973 860504 743240 517904 42229 -74956 -251793 -607521
8030 -607521 -317809 -73981 -48525 -144379 -205758 -425071 -532979 -279542 -208647 198865
8020 198865 382904 345704 170256 -230620 -249128 -357327 -351473 -276587 -379578 35341 152616
8009 152616 -63959 -394976 -283440 -190673 -338323 -405254 -468110 -390902 -509930 -597857 -553523
7998 -553523 -395091 -324664 -471172 -549821 -160414 -304697 -375155 -265356 -321864 -675413
7988 -675413 -388362 -280199 -320963 -349163 -175203 62658 82108 12079 42196 32357 -47426
$$ packed form
8061f04693J05186K23026k7050n8493J3400K25780j89058J29211M9653l67127
8051e00165J94799J49278j01913N5058n4595M5401q7535L8173L16482K56535N29006
8040H40524J89915N7692n6158j71469j17264k25336m75675j17185j76837l55728
8030f07521K89712K43828K5456r5854o1379k19313j07908K53437P0895M07512
8020A98865J84039l7200j75448m00876j8508j08199N854P4886j02991M14919J17275
8009A52616k16575l31017J11536R2767j47650o6931o2856P7208j19028q7927M4334
7998e53523J58432P0427j46508p8649L89407j44283p0458J09799n6508l53549
7988f75413K87051J08163m0764k8200J73960K37861J9450p0029L0117r839p9783
$$ plain form
7977 -47426 26377 -61080 -227366 -216738 -500358 -576072 -457433 -326995 -511087 -715247 -531941
7966 -531941 -282791 -373134 -646332 -550287 -289249 -398405 -391769 -327821 -344221 -117625 -374767
7955 -374767 -823385 -836178 -622789 -493128 -700828 -777276 -724815 -524331 -612012 -659979 -456966
7944 -456966 -229904 -76551 -571402 -605394 -262639 -175703 -487809 -515306 -675635 -644811
7934 -644811 -411423 -529834 -429510 -472507 -525848 -498697 -328264 -450511 -359897 -307693 -200265
7923 -200265 80359 5025 -200513 -663224 -462954 -576610 -649894 -322755 -381948 -601107
7913 -601107 -376943 -379671 -534768 -548894 -534417 -435165 -447888 -611779 -488448 -748354 -695449
7902 -695449 -645163 -667242 -820093 -834562 -446280 -569041 -650221 -717241 -920549 -1087833 -684957
$$ packed form
7977d7426P3803q7457j66286J0628k83620p5714J18639J30438j84092k04160J83306
7966e31941K49150r0343k73198R6045K61038j09156O636O3948j6400K26596k57142
7955c74767m48618j2793K13389J29661k07700p6448N2461K00484q7681m7967K03013
7944d56966K27062J53353m94851l3992L42755Q6936l12106k7497j60329L0824
7934f44811K33388j18411J00324m2997n3341K7151J70433j22247R0614N2204J07428
7923b00265K80624p5334k05538m62711K00270j13656p3284L27139n9193k19159
7913f01107K24164k728j55097j4126J4477R9252j2723j63891J23331k59906N2905
7902f95449N0286k2079j52851j4469L88282j22761q1180o7020k03308j67284M02876
$$ plain form
7891 -684957 -563605 -669633 -580149 -765500 -10231 195325 -62703 103952 71030 26709
7881 26709 -111909 -214228 -88552 -266346 -174534 -241330 -164293 -458067 -369644 -303353 -343319
7870 -343319 -448231 -272650 -50824 -246349 -384953 -437243 -346761 -161643 -287769 -632557
7860 -632557 -772555 -858294 -493198 -495940 -723606 -689402 -315909 -546455 -248907 -191944 -442946
7849 -442946 -444237 -338210 -56645 33123 -13209 208132 245774 -75501 -176061 -195960 -152880
7838 -152880 -209823 -418129 -258800 131485 208818 7225 -158088 -1508 -215461 -306332
7828 -306332 -527367 -657495 -626730 -609505 -516692 -318417 153592 -133092 -296144 -514073
7818 -514073 -725884 -500074 -563876 -613702 -272432 -418327 -392776 -345205 -252646 -299382 -283974
$$ packed form
7891f84957J21352j06028Q9484j85351P55269K05556k58028J66655l2922m4321
7881B6709j38618j02319J25676j77794R1812o6796P7037k93774Q8423O6291l9966
7870c43319j04912J75581K21826j95525j38604n2290R0482J85118j26126l44788
7860f32557j39998q5739L65096k742k27666L4204L73493k30546K97548N6963k51002
7849d42946j291J06027K81565Q9768m6332K21341L7642l21275j00560j9899M3080
7838a52880n6943k08306J59329L90285P7333k01593j65313J56580k13953r0871
7828c06332k21035j30128L0765J7225R2813J98275M72009k86684j63052k17929
7818e14073k11811K25810o3802m9826L41270j45895K5551M7571R2559m6736J5408
$$ plain form
7807 -283974 -284169 -129417 -471436 -720414 -518803 -484172 -524364 -382904 103221 285720 285080
7796 285080 204920 21969 -144533 -438154 -351666 -169246 -8375 -238366 -288382 -302916
7786 -302916 -406560 -275524 -418919 -319906 -330193 -296180 -323007 -431455 -525386 -439394 -627601
7775 -627601 -674595 -698427 -796442 -413021 -451668 -625448 -599646 -419526 -501441 -619467 -354030
7764 -354030 -311938 -462062 -258703 -507740 -719250 -555182 -416983 -282640 -378874 -780293
7754 -780293 -611771 -573472 -678597 -467630 -612981 -809332 -812863 -732785 -720667 -566690 -466574
7743 -466574 -476838 -614766 -337825 -382163 -369224 -166549 -95403 -348346 -345901 -400818 -267976
7732 -267976 -295372 -222630 -195715 -377264 -395185 -384086 -170325 -141012 -354844 -590334 -676107
$$ packed form
7807b83974j95J54752l42019k48978K01611L4631m0192J41460M86125J82499o40
7796B85080q0160j82951j66502k93621Q6488J82420J60871k29991n0016j4534
7786c02916j03644J31036j43395R9013j0287L4013k6827j08448r3931Q5992j88207
7775f27601m6994k3832r8015L83421l8647j73780K5802J80120q1915j18026K65437
7764c54030M2092j50124K03359k49037k11510J64068J38199J34343r6234m01419
7754g80293J68522L8299j05125K10967j45351j96351l531Q0078J2118J53977J00116
7743d66574j0264j37928K76941m4338J2939K02675P1146k52943K445n4917J32842
7732b67976k7396P2742K6915j81549j7921J1099K13761K9313k13832k35490q5773
$$ plain form
7721 -676107 -793380 -889074 -861791 -397506 -647856 -398477 -480368 -738335 -706769 -576767
7711 -576767 -261964 -378272 -433348 -565479 -378430 -408530 -126527 -34329 -418097 -526119
7701 -526119 -801264 -501872 -48890 -288690 -406872 -577320 -629431 -740318 -561926 -358231
7691 -358231 -676623 -622518 -619047 -601306 -602433 -501085 -342554 -602570 -461570 -496195 -534333
7680 -534333 -725848 -531102 -492826 -540170 -727628 -838077 -793219 -686320 -554421 -610321
7670 -610321 -419226 -600057 -950795 -819689 -890807 -647386 -599074 -571801 -645934 -711887 -612363
7659 -612363 -1028962 -736355 -545065 -773920 -987041 -877372 -581476 -430024 -588424 -756253
7649 -756253 -695304 -403037 -722789 -815712 -633158 -747994 -985606 -1016284 -921118 -750590
$$ packed form
7721f76107j17273r5694K7283M64285k50350K49379q1891k57967L1566J30002
7711e76767L14803j16308n5076j32131J87049l0100K82003R2198l83768j08022
7701e26119k75145K99392M52982k39800j18182j70448n2111j10887J78392K03695
7691c58231l18392N4105L471J7741j127J01348J58531k60016J41000l4625l8138
7680e34333j91515J94746L8276m7344j87458j10449M4858J06899J31899n5900
7670f10321J91095j80831l50738J31106p1118K43421M8312K7273p4133o5953R9524
7659f12363m16599K92607J91290k28855k13121J09669K95896J51452j58400j67829
7649g56253O0949K92267l19752r2923J82554j14836k37612l0678R5166J70528
$$ plain form
7639 -750590 -844211 -689219 -446671 -685915 -790580 -724741 -693924 -659158 -653602 -717198 -707857
7628 -707857 -481722 -552087 -618723 -306098 -334800 -588334 -704777 -816516 -922867 -851011
7618 -851011 -970503 -823011 -832830 -758542 -559529 -446343 -470047 -623235 -630758 -562742 -488579
7607 -488579 -597910 -645591 -608793 -638953 -568065 -710682 -662696 -763499 -720163 -810811 -1013402
7596 -1013402 -873977 -629386 -588987 -639300 -530713 -932326 -1046465 -548109 -263182 -538095
7586 -538095 -803113 -823069 -665323 -850221 -590126 -456664 -385165 -538672 -668393 -884846
7576 -884846 -973869 -653223 -560113 -710821 -853773 -1007121 -822079 -856482 -761103 -591479
7566 -591479 -545466 -518513 -618375 -836586 -955431 -794733 -760564 -665225 -622746 -505051 -647660
$$ packed form
7639g50590r3621J54992K42548k39244j04665O5839L0817L4766N556o3596R341
7628g07857K26135p0365o6636L12625k8702k53534j16443j11739j06351P1856
7618h51011j19492J47492r819P4288J99013J13186k3704j53188p523O8016P4163
7607d88579j09331m7681L6798l0160P0888j42617M7986j00803M3336r0648k02591
7596a013402J39425K44591M0399n0313J08587m01613j14139M98356K84927k74913
7586e38095k65018j9956J57746j84898K60095J33462P1499j53507j29721k16453
7576h84846q9023L20646R3110j50708j42952j53348J85042l4403R5379J69624
7566e91479M6013K6953r9862k18211j18845J60698L4169R5339M2479J17695j42609
$$ plain form
7555 -647660 -806164 -750315 -420795 -528374 -683859 -720105 -961630 -846423 -717689 -869087
7545 -869087 -555092 -437471 -687161 -798984 -624431 -733969 -905773 -681627 -664054 -795997
7535 -795997 -843586 -950230 -793738 -685782 -698851 -555164 -702222 -498001 -596666 -734165
7525 -734165 -631937 -556753 -344489 -391244 -679400 -645576 -799498 -762378 -797570 -708252 -647382
7514 -647382 -647359 -553283 -1046411 -895677 -753029 -669542 -688112 -617539 -952588 -1100317 -911688
7503 -911688 -844942 -887901 -944028 -999989 -1009467 -921700 -645997 -428642 -540874 -602845 -644669
7492 -644669 -655218 -578389 -588021 -665595 -631288 -713518 -728845 -530268 -211583 -422737 -633719
7481 -633719 -589401 -544817 -692818 -940562 -1303219 -1085032 -897815 -881923 -849362 -675220
$$ packed form
7555f47660j58504N5849L29520j07579j55485l6246k41525J15207J28734j51398
7545h69087L13995J17621k49690j11823J74553j09538j71804K24146J7573j31943
7535g95997m7589j06644J56492J07956j3069J43687j47058K04221r8665j37499
7525g34165J02228P5184K12264m6755k88156L3824j53922L7120l5192Q9318O0870
7514f47382K3R4076m93128J50734J42648Q3487j8570P0573l35049j47729J88629
7503i11688O6746m2959n6127n5961r478Q7767K75703K17355j12232o1971m1824
7492f44669j0549P6829r632p7574L4307q2230j5327J98577L18685k11154k10982
7481f33719M4318M4584j48001k47744l62657K18187J87217J5892L2561J74142
$$ plain form
7471 -675220 -491621 -815106 -849088 -938383 -679800 -348342 -539582 -723328 -669783 -557276
7461 -557276 -745654 -1151680 -1095352 -927462 -860970 -724432 -557698 -699032 -571471 -738744
7451 -738744 -876197 -752821 -565205 -681987 -722123 -661963 -856957 -832781 -804623 -715861 -660527
7440 -660527 -492517 -593279 -854860 -816401 -661360 -637293 -449456 -714865 -892471 -635567
7430 -635567 -712765 -850619 -705311 -717227 -902339 -743030 -752466 -756567 -604137 -698317 -724455
7419 -724455 -713265 -573278 -491699 -481736 -689677 -642014 -642915 -740825 -870119 -834985 -898332 -814548
7407 -814548 -918639 -795524 -759720 -893418 -749280 -808181 -791957 -629295 -514730 -664403
7397 -664403 -791331 -688189 -717381 -763791 -757828 -779178 -633634 -764367 -747676 -835250 -620981
$$ packed form
7471f75220J83599l23485l3982q9295K58583L31458j91240j83746N3545J12507
7461e57276j88378m06026N6328J67890O6492J36538J66734j41334J27561j67273
7451g38744j37453J23376J87616j16782m0136O0160j94994K4176K8158Q8762N5334
7440f60527J68010j00762k61581L8459J55041K4067J87837k65409j77606K56904
7430f35567p7198j37854J45308j1916j85112J59309r436m101J52430r4180k6138
7419g24455J1190J39987Q1579R963k07941M7663r01r7910j29294L5134o3347Q3784
7407h14548j04091J23115L5804j33698J44138n8901J6224J62662J14565j49673
7397f64403j26928J03142k9192m6410N963k1350J45544j30733J6691q7574K14269
$$ plain form
7386 -620981 -814801 -840527 -698926 -565211 -839139 -766543 -777305 -693915 -583129 -854001
7376 -854001 -999043 -729132 -561795 -431655 -491716 -684113 -595048 -802826 -988194 -576402
7366 -576402 -673524 -676835 -676938 -1049952 -879348 -929532 -872227 -968714 -904958 -879656 -864614 -764627
7354 -764627 -1034093 -1316508 -1100925 -911286 -567001 -488893 -581230 -988828 -858206 -706854
7344 -706854 -609767 -697611 -776042 -689325 -661874 -955766 -982540 -830865 -724709 -540353 -776270
7333 -776270 -680455 -614960 -797127 -454745 -527860 -659209 -645341 -754682 -611970 -568541 -744993
7322 -744993 -789776 -849842 -825171 -750652 -1016691 -1157257 -786504 -567972 -421921 -475234 -591083
7311 -591083 -744994 -781297 -636965 -492414 -476264 -755294 -470530 -375479 -529819 -717504
$$ packed form
7386f20981j93820k5726J41601J33715k73928P2596j0762Q3390J10786k70872
7376h54001j45042K69911J67337J30140o0061j92397Q9065k07778j85368M11792
7366e76402r7122l311j03l73014J70604n0184N7305r6487O3756K5302J5042R9987
7354g64627k69466k82415K15583J89639L44285P8108r2337m07598J30622J51352
7344g06854R7087q7844p8431Q6717K7451k93892k6774J51675J06156J84356k35917
7333g76270R5815O5495j82167L42382p3115j31349J3868j09341J42712M3429j76452
7322g44993m4783o0066K4671P4519k66039j40566L70753K18532J46051n3313j15849
7311e91083j53911l6303J44332J44551J6150k79030K84764R5051j54340j87685
$$ plain form
7301 -717504 -643235 -520659 -268961 -493760 -706614 -831558 -599733 -517121 -507216 -689418
7291 -689418 -912970 -651625 -565908 -794799 -848154 -595998 -756172 -800375 -739980 -843243
7281 -843243 -711202 -606309 -960914 -1184763 -866260 -735530 -746302 -974227 -883880 -523478
7271 -523478 -785819 -660278 -675357 -881760 -571800 -715818 -585433 -759002 -703254 -574489
7261 -574489 -700310 -816876 -964988 -740052 -607765 -592253 -615974 -586583 -600665 -800344
7251 -800344 -738081 -453530 -827235 -580194 -568353 -700598 -855140 -859477 -631182 -835533
7241 -835533 -917096 -525132 -728078 -919652 -758094 -427574 -755789 -896105 -772067 -705467
7231 -705467 -694737 -853486 -841095 -931427 -792560 -861242 -848262 -785086 -740867 -785905 -638524
$$ packed form
7301g17504P4269J22576K51698k24799k12854j24944K31825Q2612R905j82202
7291f89418k23552K61345Q5717k28891n3355K52156j60174m4203O0395j03263
7281h43243J32041J04893l54605k23849L18503J30730j0772k27925R0347L60402
7271e23478k62341J25541j5079k06403L09960j44018J30385j73569N5748J28765
7261e74489j25821j16566j48112K24936J32287J5512k3721K9391j4082j99679
7251h00344O2263K84551l73705K47041J1841j32245j54542m337K28295k04351
7241h35533q1563L91964k02946j91574J61558L30520l28215j40316J24038O6600
7231g05467J0730j58749J2391r0332J38867o8682J2980O3176M4219m5038J47381
$$ plain form
7220 -638524 -487010 -448960 -559729 -787147 -732362 -654651 -721059 -650981 -687515 -517411 -407398
7209 -407398 -262859 -426799 -366157 -529171 -614789 -476927 -563872 -683218 -726156 -578385
7199 -578385 -399677 -522258 -494969 -504924 -639300 -606518 -697871 -882503 -771895 -926171 -625168
7188 -625168 -660431 -669886 -427619 -539592 -441074 -529288 -657142 -718274 -459952 -517110 -522227
7177 -522227 -604110 -616937 -258379 -258778 -381521 -270844 -367530 -511286 -478708 -472523 -767405
7166 -767405 -520071 -525199 -452084 -699675 -687207 -775025 -542696 -530081 -648945 -677536 -610046
7155 -610046 -518043 -437665 -398377 -258611 -94816 -506823 -390403 -412375 -330131 -147407 -210194
7144 -210194 -265892 -72159 -138855 -371934 -344572 -295507 -496031 -447026 -408329 -542383 -827435
$$ packed form
7220f38524J51514L8050j10769k27418N4785P7711o6408P0078l6534J70104J10013
7209d07398J44539j63940O0642j63014q5618J37862q6945j19346m2938J47771
7199e78385J78708j22581K7289r955j34376L2782r1353j84632J10608j54276L01003
7188f25168l5263r455K42267j11973R8518q8214j27854o1132K58322n7158n117
7177e22227q1883j2827L58558l99j22743J10677r6686j43756L2578O185k94882
7166g67405K47334n128P3115k47591J2468q7818K32329J2615j18864k8591O7490
7155f10046R2003Q0378L9288J39766J63795m12007J16420k1972Q2244J82724o2787
7144b10194n5698J93733o6696k33079K7362M9065k00524M9005L8697j34054k85052
$$ plain form
7133 -827435 -849121 -830456 -618534 -602567 -710724 -910307 -873565 -776784 -657671 -547645 -592729
7122 -592729 -599838 -556413 -577136 -954893 -1035597 -869052 -646382 -703462 -792425 -468893 -650007
7111 -650007 -694152 -459282 -576298 -614291 -505505 -622584 -763139 -961985 -858453 -814472
7101 -814472 -946145 -631693 -633982 -770335 -594277 -477579 -514913 -549703 -465109 -534425 -714939
7090 -714939 -635871 -470518 -369407 -501929 -386534 -359075 -657954 -694881 -485899 -294805
7080 -294805 -432576 -435374 -483766 -660499 -428216 -621136 -698200 -814148 -557154 -630464 -798419
7069 -798419 -894600 -819703 -438517 -515171 -573827 -596007 -535075 -533679 -584703 -677555 -713250 -555834
7057 -555834 -528562 -538549 -435392 -364538 -474625 -685849 -744092 -599466 -639092 -512224 -212180
$$ packed form
7133h27435k1686J8665K11922J5967j08157j99583L6742R6781J19113J10026m5084
7122e92729p109M3425k0723l77757q0704J66545K22670n7080q8963L23532j81114
7111f50007m4145K34870j17016l7993J08786j17079j40555j98846J03532M3981
7101h14472j31673L14452k289j36353J76058J16698l7334l4790Q4594o9316j80514
7090g14939P9068J65353J01111j32522J15395K7459k98879l6927K08982J91094
7080b94805j37771k798m8392j76733K32283j92920p7064j15948K56994p3310j67955
7069g98419r6181P4897L81186p6654n8656k2180O0932J396n1024r2852l5695J57416
7057e55834K7272r987J03157P0854j10087k11224n8243J44626l9626J26868L00044
$$ plain form
7046 -212180 -543210 -609635 -280430 -209970 -388565 -554487 -361890 -259923 -467436 -741453
7036 -741453 -695269 -660352 -561602 -121327 -338803 -543620 -627645 -463972 -394873 -181673 -114170
7025 -114170 -487521 -570915 -209695 -80065 -192741 -399758 -158876 -162403 -365904 -227804
7015 -227804 -175830 -282542 -496072 -573357 -757178 -594980 -577099 -637264 -815246 -583016
7005 -583016 -448480 -427812 -747069 -643317 -513589 -404334 -466845 -511389 -507255 -754834 -882688
6994 -882688 -710916 -613637 -581433 -622246 -534898 -545176 -736120 -647153 -396627 -467372 -700691
6983 -700691 -588819 -645037 -676327 -589802 -395443 -498512 -456146 -523193 -596036 -367578 -229895
6972 -229895 -604862 -475121 -573691 -875695 -975529 -625229 -612394 -456935 -465361 -632128 -584159
$$ packed form
7046b12180l31030o6425L29205P0460j78595j65922J92597J01967k07513k74017
7036g41453M6184L4917R8750M40275k17476k04817q4025J63673O9099K13200O7503
7025a14170l73351q3394L61220J29630j12676k07017K40882l527k03501J38100
7015b27804N1974j06712k13530p7285j83821J62198J7881o0165j77982K32230
7005e83016J34536K0668l19257J03752J29728J09255o2511m4544M134k47579j27854
6994h82688J71772R7279L2204m0813Q7348j0278j90944Q8967K50526p0745k33319
6983g00691J11872n6218l1290Q6525J94359j03069M2366o7047p2843K28458J37683
6972b29895l74967J29741r8570l02004r9834L50300J2835J55459q426j66767M7969
$$ plain form
6961 -584159 -541399 -400581 -286904 -389877 -498067 -621256 -496682 -521840 -756299 -743108
6951 -743108 -807483 -731861 -748173 -801787 -742539 -643875 -588771 -449230 -495362 -571850 -625537
6940 -625537 -724043 -614425 -794654 -602966 -611330 -710498 -724265 -800900 -671368 -658429 -614244
6929 -614244 -628483 -470135 -516347 -395989 -416118 -641709 -800202 -604612 -379460 -367463
6919 -367463 -705502 -796653 -478065 -656945 -708517 -616449 -671533 -719677 -743756 -641069 -626919
6908 -626919 -472591 -541029 -323490 -527759 -628112 -561508 -485609 -353204 -293469 -466642
6898 -466642 -679056 -458555 -417814 -388720 -400704 -596096 -491731 -404824 -658854 -831898
6888 -831898 -297319 -477112 -384949 -477530 -828430 -666637 -633704 -535016 -679006 -793267
$$ packed form
6961e84159M2760J40818J13677j02973j08190j23189J24574k5158k34459J3191
6951g43108o4375P5622j6312n3614N9248R8664N5104J39541m6132p6488n3687
6940f25537r8506J09618j80229J91688q364r9168j3767p6635J29532J2939M4185
6929f14244j4239J58348m6212J20358k0129k25591j58493J95590K25152J1997
6919c67463l38039r1151L18588j78880n1572R2068n5084m8144k4079J02687J4150
6908f26919J54328o8438K17539k04269j00353O6604P5899J32405N9735j73173
6898d66642k12414K20501M0741K9094j1984j95392J04365Q6907k54030j73044
6888h31898N34579j79793R2163r2581l50900J61793L2933R8688j43990j14261
$$ plain form
6878 -793267 -773060 -708683 -581505 -330170 -399944 -401586 -773127 -715682 -784800 -363817 -496760
6867 -496760 -643138 -565066 -306906 -234241 -255758 -160593 -330242 -660990 -655626 -510516 -559218
6856 -559218 -743536 -947887 -545689 -667564 -665279 -859149 -844817 -757051 -788223 -767133 -513810
6845 -513810 -749842 -630990 -362474 -210714 -330741 -511039 -723571 -573146 -540898 -662875
6835 -662875 -491144 -540797 -912268 -942720 -341664 -292904 -497660 -543706 -560787 -512077 -666887
6824 -666887 -538460 -322281 -556541 -612774 -727693 -801100 -760170 -778201 -544876 -194770
6814 -194770 -453856 -466286 -639842 -472724 -327205 -418134 -421239 -609291 -762494 -561287
6804 -561287 -440730 -439418 -241304 -369171 -513698 -615694 -811982 -166557 -192248 -271089
$$ packed form
6878g93267K0207O4377J27178K51335o9774j642l71541N7445o9118M20983j32943
6867d96760j46378P8072K58160P2665k1517R5165j69649l30748N364J45110m8702
6856e59218j84318k04351M02198j21875K285j93870J4332Q7766l1172K1090K53323
6845e13810k36032J18852K68516J51760j20027j80298k12532J50425L2248j21977
6835f62875J71731m9653l71471l0452O01056M8760k04756m6046j7081M8710j54810
6824f66887J28427K16179k34260n6233j14919p3407M0930j8031K33325L50106
6814a94770k59086j2430j73556J67118J45519r0929l105j88052j53203K01207
6804e61287J20557J312J98114j27867j44527j01996j96288O45425k5691p8841
$$ plain form
6794 -271089 -511411 -800723 -579386 -440130 -355285 -669062 -817458 -610577 -540285 -507658
6784 -507658 -390358 -385135 -77951 -392094 -468436 -530959 -683939 -641237 -578931 -605279 -634706
6773 -634706 -652696 -693752 -679244 -783138 -763723 -684948 -780251 -746106 -681487 -549841 -616141
6762 -616141 -460916 -645179 -775135 -536537 -324940 -266666 -379747 -383110 -449002 -648462
6752 -648462 -703043 -468576 -184239 -23087 -166329 -196393 -439076 -303523 -331017 -549750
6742 -549750 -583590 -250397 -188912 -250826 -298680 -560301 -699413 -655099 -587041 -618634 -677746
6731 -677746 -478632 -483013 -664089 -404851 -107198 -153832 -410966 -485662 -192306 -603729
6721 -603729 -651408 -672306 -608029 -561145 -636058 -396578 -134990 -177333 -328683 -19007 -332370
$$ packed form
6794b71089k40322k89312K21337J39256Q4845l13777j48396K06881P0292L2627
6784e07658J17300N223L07184l14143p6342o2523j52980M2702O2306k6348k9427
6773f34706j7990m1056J4508j03894J9415P8775r5303L4145O4619J31646o6300
6762f16141J55225j84263j29956K38598K11597N8274j13081l363o5892j99460
6752f48462n4581K34467K84337J61152j43242l0064k42683J35553k7494k18733
6742e49750l3840L33193O1485o1914m7854k61621j39112M4314O8058l1593n9112
6731f77746J99114m381j81076K59238K97653m6634k57134p4696K93356m11423
6721f03729m7679k0898O4277M6884p4913K39480K61588m2343j51350L09676l13363
$$ plain form
6710 -332370 -280402 -351158 -384118 -408356 -643000 -477867 -368600 -479514 -722918 -836806
6700 -836806 -617126 -393878 -341804 -647832 -705158 -628800 -496129 -428861 -637683 -447969
6690 -447969 -458460 -677040 -442227 -478449 -404927 -658815 -516298 -702735 -486936 -378070
6680 -378070 -427229 -199048 -343488 -773329 -602577 -545000 -576295 -394642 -370472 -401512 -657929
6669 -657929 -739923 -804149 -552323 -509705 -534089 -676720 -791568 -803893 -636598 -526246 -394966
6658 -394966 -376754 -493445 -385625 -435596 -431130 -291612 -439788 -246941 -315831 -432280 -440740
6647 -440740 -387684 -486147 -771054 -780407 -620980 -533227 -531123 -581767 -375114 -319815 -488455
6636 -488455 -642640 -360046 -351907 -557120 -212808 -1979 -278431 -553675 -778316 -477825
$$ packed form
6710c32370N1968p0756l2960k4238k34644J65133J09267j10914k43404j13888
6700h36806K19680K23248N2074l06028n7326P6358J32671O7268k08822J89714
6690d47969j0491k18580K34813l6222P3522k53888J42517j86437K15799J08866
6680c78070m9159K28181j44440m29841J70752N7577l1295J81653K4170l1040k56417
6669f57929q1994o4226K51826M2618k4384j42631j14848j2325J67295J10352J31280
6658c94966J8212j16691J07820m9971M466J39518j48176J92847o8890j16449q460
6647d40740N3056r8463k84907r353J59427Q7753K104n0644K06653N5299j68640
6636d88455j54185K82594Q139k05213L44312K10829k76452k75244k24641L00491
$$ plain form
6626 -477825 -492208 -576272 -301654 -328242 -601305 -732635 -752449 -882506 -777210 -614123
6616 -614123 -753322 -644183 -609776 -606417 -511887 -295439 -290496 -514622 -473889 -625455 -701383
6605 -701383 -519118 -596430 -523550 -324049 -490625 -478232 -164589 -134299 -557014 -672293
6595 -672293 -671762 -615723 -402044 -278538 -270301 -413288 -344931 -253330 -393601 -299919 -388667
6584 -388667 -143309 -120334 -347658 -457951 -568733 -337025 -292183 -472658 -702391 -714634
6574 -714634 -589772 -296189 -355682 -655343 -430277 -140854 -344643 -422563 -333510 -328768 -495940
6563 -495940 -632070 -392456 -378894 -606358 -792657 -521796 -464942 -133425 -298784 -460504
6553 -460504 -275678 -190156 -368040 -521802 -441831 -305633 -370632 -254959 -474100 -367218
$$ packed form
6626d77825j4383q4064K74618k6588k73063j31330j9814j30057J05296J63087
6616f14123j39199J09139L4407L359R4530K16448M943k24126M0733j51566p5928
6605g01383J82265p7312P2880J99501j66576J2393L13643L0290m22715j15279
6595f72293N31N6039K13679J23506Q237j42987O8357R1601j40271R3682q8748
6584c88667K45358K2975k27324j10293j10782K31708M4842j80475k29733j2243
6574g14634J24862K93583n9493k99661K25066K89423k03789p7920Q9053M742j67172
6563d95940j36130K39614J3562k27464j86299K70861N6854L31517j65359j61720
6553d60504J84826Q5522j77884j53762P9971J36198o4999J15673k19141J06882
$$ plain form
6543 -367218 -235247 -511081 -585746 -270687 -132862 -469341 -489466 -599580 -548239 -577757
6533 -577757 -434287 -315137 -255045 -349510 -374601 -433158 -261898 -73613 44799 -114867
6523 -114867 -371368 -314530 -425365 -309988 -368142 -310375 -203900 -460936 -489185 -321170
6513 -321170 -422717 -580634 -445459 -753904 -887275 -803121 -466688 -515742 -620980 -408605
6503 -408605 -473306 -410110 -165526 -379449 -680206 -686287 -634017 -441027 -537338 -584740 -348321
6492 -348321 -431071 -641853 -343506 -692794 -785034 -446910 -285654 -369538 -253291 -224963
6482 -224963 -487906 -549061 -395956 -216331 -356863 -383520 -647155 -587805 -426501 -165561
6472 -165561 -209311 -245742 -102546 -222557 -391596 -544255 -651087 -604654 -321913 -230793
$$ packed form
6543c67218J31971k75834p4665L15059J37825l36479k0125j10114N1341k9518
6533e77757J43470J19150O0092r4465k5091n8557J71260J88285J18412j59666
6523a14867k56501N6838j10835J15377n8154N7767J06475k57036k8249J68015
6513c21170j01547j57917J35175l08445j33371Q4154L36433m9054j05238K12375
6503d08605o4701O3196K44584k13923l00757o081N2270J92990r6311m7402K36419
6492c48321q2750k10782K98347l49288r2240L38124J61256q3884J16247K8328
6482b24963k62943o1155J53105J79625j40532k6657k63635N9350J61304K60940
6472a65561m3750l6431J43196j20011j69039j52659j06832M6433K82741R1120
$$ plain form
6462 -230793 -185591 -117508 -52936 3450 -217781 -365917 -123497 -218429 -165452 -429774 -542212
6451 -542212 -530679 -335494 -120621 -454233 -99196 -74671 -361879 -423972 -661302 -535491
6441 -535491 -528976 -602592 -260697 -361300 -445629 -406597 -351075 -392358 -467001 -348280 -222311
6430 -222311 -497685 -591653 -530176 -227657 -141869 -119029 -103024 -224682 -345097 -381618 -173431
6419 -173431 -255230 -235263 -200675 -328193 -186134 -247793 -725201 -542428 -186244 -273237 23275
6408 23275 37333 -201804 -196866 -53743 51914 108478 -145099 -73343 73 91130 89256
6397 89256 -28182 -25357 -327312 -142875 -217909 -453281 -489315 -47293 -44478 54399 73115
6386 73115 136671 130680 -236398 -302532 -392245 -199383 -225555 -70107 -83574 -153301 -329261
$$ packed form
6462b30793M5202O8083O4572N6386k21231j48136K42420r4932N2977k64322j12438
6451e42212J1533J95185K14873l33612L55037K4525k87208o2093k37330J25811
6441e35491O515p3616L41895j00603q4329L9032N5522m1283p4643J18721J25969
6430b22311k75374r3968O1477L02519Q5788K2840J6005j21658j20415l6521K08187
6419a73431q1799J9967L4588j27518J42059o1659m77408J82773L56184q6993K96512
6408B3275J4058k39137M938J43123J05657N6564k53577P1756P3416R1057j874
6397H9256j17438K825l01955J84437p5034k35372l6034M42022K815R8877J8716
6386G3115O3556n991l67078o6134q9713J92862k6172J55448j3467o9727j75960
$$ plain form
6375 -329261 -335092 -452533 -472640 -186915 -130864 -38521 -55032 -241531 -433314 -311958 -224407
6364 -224407 -91531 -91667 -345174 -91271 -391663 -558184 -326583 -267066 87577 -105656
6354 -105656 -154907 -110263 -64062 -275327 -246226 -392567 -233617 -73413 -242239 -19332
6344 -19332 52406 -225038 -406044 -452236 -260781 -347902 31473 313183 208306 38712
6334 38712 -16578 -25490 -180196 -257214 -300434 -138949 6501 -188039 -391023 -410689 -390700
6323 -390700 -674548 -716154 -478063 -67361 -252529 -17299 231100 -7129 75470 62813
6313 62813 89241 -172837 -161001 -168996 13607 -157614 -199068 -77584 -114580 -43208 15384
6302 15384 109870 101923 48484 59890 -34119 -133266 -200903 -8202 95135 193649 378426
$$ packed form
6375c29261n831j17441k0107K85725N6051R2343j6511j86499j91783J21356Q7551
6364b24407J32876j36k53507K53903l00392j66521K31601N9517L54643j93233
6354a05656m9251M4644M6201k11265K9101j46341J58950J60204j68826K22907
6344a9332P1738k77444j81006m6192J91455q7121L79375K81710j04877j69594
6334C8712n5290q912j54706p7018m3220J61485J45450j94540k02984j9666J9989
6323c90700k83848m1606K38091M10702j85168K35230K48399k38229Q2599j2657
6313F2813K6428k62078J1836p995J82603j71221m1454J21484l6996P1372N8592
6302A5384R4486p947n3439J1406r4009r9147o7637J92701J03337R8514J84777
$$ plain form
6291 378426 403211 332910 125248 100001 201957 111247 130797 -102168 81782 102626 75205
6280 75205 224470 220138 286751 113726 61136 220543 253406 191243 211577 322100 101294
6269 101294 99717 337126 147844 16257 69545 304223 -49230 -72413 200497 263548 155881
6258 155881 179866 530295 384736 311032 189392 263315 455156 518646 415017 310943
6248 310943 307086 573786 183040 123876 268212 368647 493844 439367 352177 362103 370455
6237 370455 301343 635091 551015 171421 118774 209083 716138 768589 572693 528942 807407
6226 807407 893688 1075485 981861 892556 893680 643297 870521 739189 600727 667616 612865
6215 612865 487977 793629 905336 939687 793495 550124 557923 721135 809931 927163
$$ packed form
6291C78426K4785p0301k07662k5247J01956r0710J9550k32965J83950K0844k7421
6280G5205J49265m332O6613j73025n2590J59407L2863o2163K0334J10523k20806
6269A01294j577K37409j89282j31587N3288K34678l53453k3183K72910O3051j07667
6258A55881K3985L50429j45559p3704j21640P3923J91841O3490j03629j04074
6248C10943l857K66700l90746n9164J44336J00435J25197n4477q7190R926Q352
6237C70455o9112L33748q4076l79594n2647R0309N07055N2451j95896m3751K78465
6226H07407Q6281J81797r3624q9305J124k50383K27224j31332j38462O6889n4751
6215F12865j24888L05652J11707L4351j46192k43371P799J63212Q8796J17232
$$ plain form
6205 927163 828505 818509 1011842 967386 959172 959006 801609 872136 996882 826185 561902
6194 561902 986148 1003967 812943 808742 932974 1055920 1078713 883476 737803 741767 777965
6183 777965 676103 630786 478657 699388 872657 788798 1003043 911205 886655 778000
6173 778000 629607 800216 911663 945094 818116 880518 754645 683018 732265 731730 858585
6162 858585 852040 860828 745295 870274 1032889 1142559 1469328 1366297 1329537 1366520 1182609
6151 1182609 1082563 1050413 1047007 1098067 1187377 1250406 1420289 1284692 1329876 1350005 1248825
6140 1248825 1211938 1038872 1226284 1119600 1064856 1044382 1231105 1561397 1403794 1468028
6130 1468028 1500869 1340247 1463716 1657647 1278782 1344643 1385820 1185737 1336599 1385055
$$ packed form
6205I27163r8658r996J93333m4456q214j66j57397P0527J24746j70697k64283
6194E61902M24246J7819j91024m201J24232J22946K2793j95237j45673L964L6198
6183G77965j01862m5317j52129K20731J73269q3859K14245r1838k4550j08655
6173G78000j48393J70609J11447L3431j26978O2402j25873p1627M9247n35J26855
6162H58585o545Q788j15533J24979J62615J09670L26769j03031l6760L6983j83911
6151A182609j00046l2150l406N1060Q9310O3029J69883j35597M5184K0129j01180
6140A248825l6887j73066J87412j06684n4744k0474J86723L30292j57603O4234
6130A468028L2841j60622J23469J93931l78865O5861M1177k00083J50862M8456
$$ plain form
6120 1385055 1707293 1731119 1560068 1516169 1547908 1712560 1706635 1745625 1915341 1948437 1710154
6109 1710154 1846509 2162191 2033718 1811632 1888495 1658577 1990515 1964466 1824450 2195730
6099 2195730 2236696 2021922 1957823 1963626 1905801 1883053 1928068 1951329 2206098 2205805 2133035 2295257
6087 2295257 2507973 2448467 2373700 2246854 2103305 2244036 2201962 2153555 2331262 2075957
6077 2075957 2132996 2123965 2306375 2425821 2285040 2180948 2460028 2717881 2809098 2849578
6067 2849578 2835268 2900848 3082888 3035647 2874486 2749625 2817228 2877860 2790891 3021703 2902720
6056 2902720 3201607 3313455 3325259 3215740 3272795 2856801 3103159 3302819 3450225 3620673
6046 3620673 3297838 3103277 3531365 3473529 3343135 3262366 3540986 3626997 3514088 3529828
$$ packed form
6120A385055L22238K3826j71051m3899L1739J64652n925L8990J69716L3096k38283
6109A710154J36355L15682j28473k22086P6863k29918L31938k6049j40016L71280
6099B195730M0966k14774o4099N803n7825k2748M5015K3261K54769k93p2770J62222
6087B295257K12716n9506p4767j26846j43549J40731m2074m8407J77707k55305
6077B075957N7039r031J82410J19446j40781j04092K79080K57853R1217M0480
6067B849578j4310O5580J82040m7241j61161j24861O7603O0632q6969K30812j18983
6056B902720K98887J11848J1804j09519N7055m15994K46358J99660J47406J70448
6046C620673l22835j94561M28088n7836j30394q0769K78620Q6011j12909J5740
$$ plain form
6036 3529828 3469098 3533517 3697295 3969355 4023595 3963007 3953441 4112952 3970722 3815805 3697636
6025 3697636 4161694 4251581 4186692 4573219 4630406 4757200 4678141 4655488 4693116 4725537 4759378
6014 4759378 4960408 5134705 5166325 5126701 5142131 5367912 5440982 5492806 5702482 5790408 5882121
6003 5882121 6168879 6311943 6418460 6573168 6659745 6631309 6588063 6599823 6773080 7152138
5993 7152138 7366351 7518586 7723804 8125951 8188578 8305202 8741114 8949644 9344891 9785765
5983 9785765 10146778 10469399 11096664 11848669 13020031 13781114 14966788 16353454 17761669
$$ packed form
6036C529828o0730O4419J63778K72060N4240o0588r566J59511j42230j54917j18169
6025C697636M64058Q9887o4889L86527N7187J26794p9059k2653L7628L2421L3841
6014D759378K01030J74297L1620l9624J5430K25781P3070N1824K09676Q7926R1713
6003E882121K86758J43064J06517J54708Q6577k8436m3246J1760J73257L79058
5993G152138K14213J52235K05218M02147O2627J16624M35912K08530L95247M40874
5983I785765L61013L22621O27265P52005J171362P61083J185674J386666J408215
$$ [...]
##END NTUPLES=NMR SPECTRUM
##END=
