##TITLE=1H_DE-80H_X3
 200.13MHz, d2o
 8 sc
 
 19ns.26.2.2025
##JCAMPDX= 6.0         $$ Bruker NMR JCAMP-DX V2.0
##DATA TYPE= NMR SPECTRUM
##DATA CLASS= NTUPLES
##ORIGIN= UXNMR, Bruker Analytische Messtechnik GmbH
##OWNER= pz
$$ XWIN-NMR		Version 3.5
$$ Thu Dec 18 10:27:30 2025 Russian Standard Time (UT+4h)  Yarkov@DPX200
##.OBSERVE FREQUENCY= 200.1313
##.OBSERVE NUCLEUS= ^1H
##.ACQUISITION MODE= SIMULTANEOUS
##.ACQUISITION SCHEME= undefined
##.AVERAGES= 8
##.DIGITISER RES= 18
##SPECTROMETER/DATA SYSTEM= spect
##.PULSE SEQUENCE= zg30
##.SOLVENT NAME= CDCl3
##.SHIFT REFERENCE= (INTERNAL, CDCl3, 0, 15.4858)
##AUDIT TRAIL= $$ (NUMBER, WHEN, WHO, WHERE, WHAT)
$$ ##TITLE= Audit trail, XWIN-NMR		Version 3.5
$$ ##JCAMPDX= 5.01
$$ ##ORIGIN= Bruker BioSpin GmbH
$$ ##OWNER= Yarkov
$$ C:/Bruker/XWIN-NMR/data/yarkov2/nmr/H-C/1/pdata/1/auditp.txt
$$ ##AUDIT TRAIL=  $$ (NUMBER, WHEN, WHO, WHERE, WHAT)
(   1,<2025-12-18 10:26:41.29 +0400>,<Yarkov>,<DPX200>,
      <created by zg, POWCHK disabled, PULCHK disabled
       configuration hash MD5:
       00 E9 B6 7A A2 85 ED C7 34 08 36 98 17 FE 4E 26
       data hash MD5: 16K
       60 3C 30 78 7A C5 1C 41 2F A2 0A 0C 92 55 0D E1>)
(   2,<2025-12-18 10:26:54.85 +0400>,<Yarkov>,<DPX200>,
      <Start of raw data processing
       efp BC_mod = 2 LB = 0.25 FT_mod = 6 PKNL = 1 PHC0 = -5305.955 PHC1 = 10.82193 SI = 16K 
       data hash MD5: 16K
       5E 28 50 6F 1F FA 9F B8 4C 46 FC 41 3A DB 65 60>)
$$ ##END=
$$ 
$$ hash MD5
$$ 93 37 99 AF 55 14 55 91 15 89 1B 5A 5F 04 5D 99
##$RELAX= 
##$RELAX= 
##$RELAX= 
##$RELAX= 
##$RELAX= 
##$RELAX= 
$$ Bruker specific parameters
$$ --------------------------
##$DU= <C:/Bruker/XWIN-NMR>
##$EXPNO= 1
##$NAME= <H-C>
##$PROCNO= 1
##$TYPE= <nmr>
##$USER= <yarkov2>
##$AMP= (0..31)
100 100 100 100 100 100 100 100 100 100 100 100 100 100 100 100 100 100 
100 100 100 100 100 100 100 100 100 100 100 100 100 100 
##$AQSEQ= 0
##$AQ_mod= 1
##$AUNM= <au_zg>
##$AUTOPOS= <>
##$BF1= 200.13
##$BF2= 200.13
##$BF3= 200.13
##$BF4= 200.13
##$BF5= 200.13
##$BF6= 200.13
##$BF7= 200.13
##$BF8= 200.13
##$BYTORDA= 1
##$CFDGTYP= 0
##$CFRGTYP= 5
##$CHEMSTR= <none>
##$CNST= (0..31)
1 1 145 1 1 1 1 1 1 1 1 1 1 1 1 1 1 1 1 1 1 1 1 1 1 1 1 1 1 1 1 1 
##$CPDPRG= <>
##$CPDPRG1= <>
##$CPDPRG2= <>
##$CPDPRG3= <>
##$CPDPRG4= <mlev>
##$CPDPRG5= <mlev>
##$CPDPRG6= <mlev>
##$CPDPRG7= <mlev>
##$CPDPRG8= <mlev>
##$CPDPRGB= <>
##$CPDPRGT= <>
##$D= (0..31)
0 0.7 0 0 0 0 0 0 0 0 0 0.03 0 0 0 0 0 0 0 0 0 0 0 0 0 0 0 0 0 0 0 0 
##$DATE= 1766039200
##$DBL= (0..7)
120 120 120 120 120 120 120 120 
##$DBP= (0..7)
150 150 150 150 150 150 150 150 
##$DBP07= 0
##$DBPNAM0= <>
##$DBPNAM1= <>
##$DBPNAM2= <>
##$DBPNAM3= <>
##$DBPNAM4= <>
##$DBPNAM5= <>
##$DBPNAM6= <>
##$DBPNAM7= <>
##$DBPOAL= (0..7)
0.5 0.5 0.5 0.5 0.5 0.5 0.5 0.5 
##$DBPOFFS= (0..7)
0 0 0 0 0 0 0 0 
##$DE= 6
##$DECBNUC= <off>
##$DECIM= 32
##$DECNUC= <off>
##$DECSTAT= 4
##$DIGMOD= 1
##$DIGTYP= 9
##$DL= (0..7)
0 120 120 120 120 120 120 120 
##$DP= (0..7)
$$ [...]
##$SUBNAM2= <"">
##$SUBNAM3= <"">
##$SUBNAM4= <"">
##$SUBNAM5= <"">
##$SUBNAM6= <"">
##$SUBNAM7= <"">
##$SUBNAM8= <"">
##$SUBNAM9= <"">
##$SW= 18.0517328524113
##$SWIBOX= (0..15)
0 0 2 0 0 0 0 0 0 0 0 0 0 0 0 0 
##$SW_h= 3612.71676300578
##$TD= 16384
##$TD0= 1
##$TE= 0
##$TE2= 300
##$TE3= 300
##$TEG= 300
##$TL= (0..7)
0 120 120 120 120 120 120 120 
##$TP= (0..7)
150 150 150 150 150 150 150 150 
##$TP07= 0
##$TPNAME0= <>
##$TPNAME1= <>
##$TPNAME2= <>
##$TPNAME3= <>
##$TPNAME4= <>
##$TPNAME5= <>
##$TPNAME6= <>
##$TPNAME7= <>
##$TPOAL= (0..7)
0.5 0.5 0.5 0.5 0.5 0.5 0.5 0.5 
##$TPOFFS= (0..7)
0 0 0 0 0 0 0 0 
##$TUNHIN= 0
##$TUNHOUT= 0
##$TUNXOUT= 0
##$USERA1= <user>
##$USERA2= <user>
##$USERA3= <user>
##$USERA4= <user>
##$USERA5= <user>
##$V9= 5
##$VALIST= <valist>
##$VCLIST= <CCCCCCCCCCCCCCC>
##$VD= 0
##$VDLIST= <DDDDDDDDDDDDDDD>
##$VPLIST= <PPPPPPPPPPPPPPP>
##$VTLIST= <TTTTTTTTTTTTTTT>
##$WBST= 1024
##$WBSW= 4
##$XGAIN= (0..3)
0 0 0 0 
##$XL= 0
##$YL= 0
##$YMAX_a= 26295
##$YMIN_a= -28332
##$ZGOPTNS= <>
##$ZL1= 120
##$ZL2= 120
##$ZL3= 120
##$ZL4= 120
##$ABSF1= 0
##$ABSF2= 0
##$ABSG= 0
##$ABSL= 0
##$ALPHA= 0
##$AQORDER= 0
##$ASSFAC= 0
##$ASSFACI= 0
##$ASSFACX= 0
##$ASSWID= 0
##$AUNMP= <proc_1d>
##$AZFE= 0.1
##$AZFW= 0.1
##$BCFW= 0
##$BC_mod= 2
##$BYTORDP= 0
##$COROFFS= 0
##$CY= -3
##$DATMOD= 1
##$DC= 0
##$DFILT= <>
##$DTYPP= 0
##$F1P= 0
##$F2P= 0
##$FCOR= 1
##$FTSIZE= 16384
##$FT_mod= 6
##$GAMMA= 0
##$GB= 0
##$INTBC= 1
##$INTSCL= 3.241238e-09
##$ISEN= 128
##$LB= 0.25
##$LEV0= 0
##$LPBIN= 0
##$MAXI= 10000
##$MC2= 0
##$MEAN= 0
##$ME_mod= 0
##$MI= 1.114404
##$NCOEF= 0
##$NC_proc= -9
##$NLEV= 6
##$NOISF1= 3.799351
##$NOISF2= 2.8
##$NSP= 0
##$NTH_PI= 0
##$NZP= 0
##$OFFSET= 15.48576
##$PC= 1
##$PHC0= -5305.955
##$PHC1= 10.82193
##$PH_mod= 1
##$PKNL= yes
##$PPARMOD= 0
##$PSCAL= 0
##$PSIGN= 0
##$REVERSE= no
##$SF= 200.130007193333
##$SI= 16384
##$SIGF1= 3
##$SIGF2= 2
##$SINO= 0.751879
##$SIOLD= 32768
##$SREGLST= <19F.Aceton>
##$SSB= 0
##$STSI= 16384
##$STSR= 0
##$SW_p= 3612.71676300578
##$SYMM= 0
##$S_DEV= 0
##$TDeff= 16384
##$TDoff= 0
##$TI= <>
##$TILT= no
##$TM1= 0
##$TM2= 0
##$TOPLEV= 0
##$USERP1= <user>
##$USERP2= <user>
##$USERP3= <user>
##$USERP4= <user>
##$USERP5= <user>
##$WDW= 1
##$XDIM= 16384
##$YMAX_p= 462185289
##$YMIN_p= -1263577
$$ End of Bruker specific parameters
$$ ---------------------------------
##NTUPLES= NMR SPECTRUM
##VAR_NAME=  FREQUENCY,     SPECTRUM/REAL,   SPECTRUM/IMAG
##SYMBOL=    X,             R,               I
##VAR_TYPE=  INDEPENDENT,   DEPENDENT,       DEPENDENT
##VAR_FORM=  AFFN,          ASDF,            ASDF
##VAR_DIM=   16384,         16384,           16384
##UNITS=     HZ,            ARBITRARY UNITS, ARBITRARY UNITS
##FACTOR=    0.220516191357247, 1,           1
##FIRST=     3099.16520718128, 0,            0
##LAST=      -513.551555824505, 0,           0
##MIN=       -513.551555824505, -1263577,    0
##MAX=       3099.16520718128, 462185289,    0
$$ Real data points
##PAGE= N=1
##DATA TABLE= (X++(R..R)), XYDATA
$$ [...]
$$ plain form
7212 848192 973745 1603466 1440714 1233077 646929 457316 944051 381204 151376 706318
7202 706318 855347 813470 757158 199113 523764 1145711 1413572 1264929 711429 502175
7192 502175 550208 245409 713322 829750 975839 736315 780489 603272 253639 533126
7182 533126 412197 407290 677198 545841 755474 751620 476325 996316 680910 928031
7172 928031 1575969 1350220 760157 922901 572438 565079 1386069 1359118 567553 671581
7162 671581 1074590 1033590 379961 370924 610686 752481 406109 540841 841954 1048612
7152 1048612 1160738 1048855 1357875 1204010 1143876 1492472 1663485 1711987 1428607 1792632
7142 1792632 1356739 963770 527367 400982 584756 67812 29639 377010 490030 492716
$$ packed form
7212H48192J25553O29721j62752k07637n86148j89613M86735n62847k29828N54942
7202G06318J49029m1877n6312n58045L24651O21947K67861j48643n53500k09254
7192E02175M8033l04799M67913J16428J46089k39524M4174j77217l49633K79487
7182E33126j20929m907K69908j31357K09633l854k75295N19991l15406K47121
7172I28031O47938k25749n90063J62744l50463p359Q20990k6951p91565J04028
7162F71581M03009m1000o53629r037K39762J41795l46372J34732L01113K06658
7152A048612J12126j11883L09020j53865o0134L48596J71013M8502k83380L64025
7142A792632m35893l92969m36403j26385J83774n16944l8173L47371J13020K686
$$ plain form
7132 492716 1213090 741996 511336 454248 871938 980144 697782 968663 1279732 1142143
7122 1142143 1116302 565360 738464 1244765 906378 709636 734792 1025427 966634 1346751
7112 1346751 1475688 1580876 1147044 1065885 1180621 782080 1084630 1084274 1156769 850104
7102 850104 1205782 772007 1061174 1225029 1737071 2183799 1866930 1293588 1045261 1293813
7092 1293813 1080640 1287269 1185049 1269457 702666 662806 815358 707675 713705 812145
7082 812145 1379440 877006 1152451 1469356 961174 973059 1064772 878475 231285 435541
7072 435541 631729 871749 555086 968716 1252593 1067959 1594708 1121693 661211 644471
7062 644471 723231 966977 962501 356502 767706 1154892 600373 1000258 1173009 954662
$$ packed form
7132D92716P20374m71094k30660n7088M17690J08206k82362K70881L11069j37589
7122A142143k5841n50942J73104N06301l38387j96742K5156K90635n8793L80117
7112A346751J28937J05188m33832q1159J14736l98541L02550l56P2495l06665
7102H50104L55678m33775K89167J63855N12042M46728l16869n73342k48327K48552
7092A293813k13173K06629j02220Q4408n66791l9860J52552j07683O030R8440
7082H12145N67295n02434K75445L16905n08182J1885R1713j86297o47190K04256
7072D35541J96188K40020l16663M13630K83877j84634N26749m73015m60482j6740
7062F44471P8760K43746m476o05999M11204L87186n54519L99885J72751k18347
$$ plain form
7052 954662 875868 697790 864520 1177499 1189960 1150132 878614 1002417 884363 951999
7042 951999 1325809 1008470 1134539 1267132 1111336 1489181 1071068 805874 1145119 1145381
7032 1145381 1203634 862953 1120694 1941420 1692149 1122367 1299199 1272177 1043085 764126
7022 764126 1007457 913358 823536 1076596 1037821 1295942 916433 780404 694770 410966
7012 410966 1024965 953194 1025694 1499446 1339784 1198715 1369473 932440 856190 937300
7002 937300 1232395 514735 730769 921952 577806 795838 633667 998108 839799 658420
6992 658420 270171 314021 1328224 931068 1297977 1125338 479847 677509 651652 658916
6982 658916 1103107 1646600 1538780 1544086 1541599 1347480 942914 1178179 889096 534503
$$ packed form
7052I54662p8794j78078J66730L12979J2461l9828k71518J23803j18054O7636
7042I51999L73810l17339J26069J32593j55796L77845m18113k65194L39245K62
7032A145381N8253l40681K57741Q20726k49271n69782J76832k7022k29092k78959
7022G64126K43331r4099q9822K53060l8775K58121l79509j36029q5634k83804
7012D10966O13999p1771P2500M73752j59662j41069J70758m37033p6250Q1110
7002I37300K95095p17660K16034J91183l44146K18032j62171L64441j58309j81379
6992F58420l88249M3850J014203l97156L66909j72639o45491J97662k5857P264
6982F58916M44191N43493j07820N306k487j94119m04566K35265k89083l54593
$$ plain form
6972 534503 743330 1298615 1855994 1901695 1747147 1156225 948996 1415733 1035117 1214482
6962 1214482 1355394 1251936 1283180 1008412 1092595 1453317 973538 783118 1179809 1219942
6952 1219942 937754 891710 641510 480224 631455 491584 540729 862888 975987 789863
6942 789863 270261 259194 793626 1284582 1508834 1318150 1248764 1027355 851140 1194345
6932 1194345 1111743 651678 799497 879284 774479 981356 566266 356446 1231729 1139048
6922 1139048 574249 613698 968183 1200438 750227 930484 759479 1062744 1011577 439945
6912 439945 571632 821605 553805 1048319 1351893 1282948 1123821 1646614 1567149 768791
6902 768791 239940 263258 854628 991261 542110 680291 736530 1527071 1097565 1090388
$$ packed form
6972E34503K08827N55285N57379M5701j54548n90922k07229M66737l80616J79365
6962A214482J40912j03458L1244k74768Q4183L60722m79779j90420L96691M0133
6952A219942k82188m6044k50200j61286J51231j39871M9145L22159J13099j86124
6942G89863n19602j1067N34432M90956K24252j90684o9386k21409j76215L43205
6932A194345q2602m60065J47819P9787j04805K06877m15090k09820Q75283r2681
6922A139048n64799L9449L54485K32255m50211J80257j71005L03265n1167n71632
6912D39945J31687K49973k67800M94514L03574o8945j59127N22793p9465p98358
6902G68791n28851K3318N91370J36633m49151J38181N6239P90541m29506p177
$$ plain form
6892 1090388 1551273 1140111 1368348 1326673 1033547 647218 899832 963380 1002661 1076418
6882 1076418 1297337 1033739 985023 1244778 1221549 1064313 1243324 1430912 1793151 1265331
6872 1265331 663375 859850 676137 626057 730755 910183 1243523 1001812 580452 344652
6862 344652 539184 721798 891388 1071014 751307 404941 884088 1110905 1131163 634527
6852 634527 1076232 1246025 1045348 848470 999636 982298 1181676 1460677 1474880 1367356
6842 1367356 1497931 1624281 1449330 1138703 1285895 1151143 1028057 575331 546128 852283
6832 852283 806064 759463 1061318 850797 1205790 1189602 1246442 1587145 1631863 1453141 1337516
6821 1337516 1704057 1433306 1098816 394163 838183 662046 436177 892044 974795 627463
$$ packed form
6892A090388M60885m11162K28237m1675k93126l86329K52614O3548L9281P3757
6882A076418K20919k63598m8716K59755k3229j57236J79011J87588L62239n27820
6872A265331o01956J96475j83713n0080J04698J79428L33340k41711m21360k35800
6862C44652J94532J82614J69590J79626l19707l46366M79147K26817K0258m96636
6852F34527M41705J69793k00677j96878J51166j7338J99378K79001J4203j07524
6842A367356J30575J26350j74951l10627J47192j34752j23086m52726k9203L06155
6832H52283m6219m6601L01855k10521L54993j6188N6840L40703M4718j78722j15625
6821A337516L66541k70751l34490p04653M44020j76137k25869M55867Q2751l47332
$$ plain form
6811 627463 460981 736085 762026 812528 771729 670936 454916 896299 1486111 1407823
6801 1407823 1096074 893051 1274629 1995319 1661098 1416304 1143317 427385 1109263 1422240
6791 1422240 873039 1288869 961758 920852 1120005 1276668 1319263 1264647 1314488 1251101
6781 1251101 1530867 1336575 666470 319070 647740 1222087 1625761 1379787 1554876 1196517
6771 1196517 1385395 1216834 974569 1308295 1588348 1372779 1248564 1268705 1797631 1399411
6761 1399411 1236049 1039453 1104484 1752985 1540892 1191599 1387084 1731228 1327237 1050200
6751 1050200 1866634 1565157 1100155 1752312 1612327 1625339 1546431 1347855 1533620 1308378
6741 1308378 1359890 1433108 1631203 2130011 2036654 1270392 1220431 867429 1125080 1397325
$$ packed form
6811F27463j66482K75104K5941N0502m0799j00793k16020M41383N89812p8288
6801A407823l11749k03023L81578P20690l34221k44794k72987p15932O81878L12977
6791A422240n49201M15830l27111m0906J99153J56663M2595n4616M9841o3387
6781A251101K79766j94292o70105l47400L28670N74347M03674k45974J75089l58359
6771A196517J88878j68561k42265L33726K80053k15569j24215K0141N28926l98220
6761A399411j63362j96596O5031O48501k12093l49293J95485L44144m03991k77037
6751A050200Q16434l01477m65002O52157j39985J3012p8908j98576J85765k25242
6741A308378N1512P3218J98095M98808r3357p66262m9961l53002K57651K72245
$$ plain form
6731 1397325 1371698 1039595 906038 944165 916434 1004177 1278135 1838980 1985041 1861432
6721 1861432 1912365 1641910 1685232 1769404 1642516 1602518 1502054 1535016 1052187 1337046
6711 1337046 1996355 2337257 2315353 1854464 1468386 1818261 1832940 1452335 1394262 1711477
6701 1711477 2163746 1762498 1159039 1607409 1488811 1226586 1004158 1242633 877056 936536
6691 936536 1255749 1471319 1422249 1154856 1663318 2061561 2042399 2148237 2221009 2287669
6681 2287669 2323380 2170313 2082362 1958811 1952859 1830574 2090401 1852395 1782910 1344676
6671 1344676 1258112 1691074 1380457 1211654 1036347 1460596 1478503 1204429 1627707 1636049
6661 1636049 1153990 625645 1339991 1245826 1241286 1438838 1456198 1330178 1043718 1137208
$$ packed form
6731A397325k5627l32103j33557L8127k7731Q7743K73958N60845J46061j23609
6721A861432N0933k70455M3322Q4172j26888l9998j00464L2962m82829K84859
6711A337046O59309L40902k1904m60889l86078L49875J4679l80605n8073L17215
6701A711477M52269m01248o03459M48370j18598k62225k22428K38475l65577N9480
6691I36536L19213K15570m9070k67393N08462L98243j9162J05838P2772O6660
6681B287669L5711j53067q7951j23551n952j22285K59827k38006o9485m38234
6671A344676q6564M32962l10617j68803j75307M24249J7907k74074M23278Q342
6661A636049m82059n28345P14346r4165m540J97552J7360j26020k86460R3490
$$ plain form
6651 1137208 1828231 1956826 1520751 1352291 1102811 1587618 1796366 1985585 1923247 1918835
6641 1918835 2198347 1803407 1005373 1115575 1238493 1592478 1318683 1928990 1965870 1888396
6631 1888396 2016110 1426883 1450411 1513179 606213 684033 922817 1291781 1339563 1544101
6621 1544101 1513014 883839 961893 1040253 1553366 1525720 1646727 1175551 1512439 2120098
6611 2120098 1630209 1590926 1576397 1410685 1642730 1702050 1292939 1507523 1119624 2082975
6601 2082975 2056388 1847304 1882723 1461344 1388947 1407017 1791678 1848232 1937608 2266928 2038330
6590 2038330 2187851 2100788 1763880 1713937 1506452 1737936 1645821 1997025 1850366 1089740
6580 1089740 991579 1811814 1527897 1165386 957258 1569519 1952217 1702834 1109080 1696620
$$ packed form
6651A137208O91023J28595m36075j68460k49480M84807K08748J89219o2338m412
6641A918835K79512l94940p98034J10202J22918L53985k73795O10307L6880p7474
6631A888396J27714n89227K3528O2768r06966P7820K38784L68964M7782K04538
6621A544101l1087o29175P8054P8360N13113k7646J21007m71176L36888O07659
6611B120098m89889l9283j4529j65712K32045N9320m09111K14584l87899R63351
6601B082975k6587k09084L5419m21379p2397J8070L84661N6554Q9376L29320k28598
6590B038330J49521q7063l36908m9943k07485K31484r2115L51204j46659p60626
6580A089740r8161Q20235k83917l62511k08128O12261L82698k49383n93754N87540
$$ plain form
6570 1696620 1821476 1663269 2309944 1796536 1325310 1458348 1918497 1890741 1673673 1421970
6560 1421970 1499603 1670199 1569222 1678820 1778311 1863770 1669741 1306895 1847766 2244050
6550 2244050 2010043 2020100 1839742 1646134 1864858 2028519 1696161 1948357 1659883 1834672
6540 1834672 1471171 1636787 1955386 1578613 1704002 1565775 1030182 1130519 1749560 1233555
6530 1233555 1372717 2021260 1606760 1536558 2037070 2367350 1644499 1399038 1616248 1737388
6520 1737388 1661691 2065109 2139212 1759656 1977266 1920432 1589958 1991255 1655486 1528074
6510 1528074 1847981 1871317 2372459 2209267 2298983 1954319 1456564 1749738 2144881 2014323
6500 2014323 1792614 1862643 2178720 2220907 2237158 2283762 2710547 2097656 1723199 1947669
$$ packed form
6570A696620J24856j58207O46675n13408m71226J33038M60149k7756k17068k51703
6560A421970P7633J70596j00977J09598R9491Q5459j94029l62846N40871L96284
6550B244050k34007J0057j80358j93608K18724J63661l32358K52196k88474J74789
6540A834672l63501J65616L18599l76773J25389j38227n35593J00337O19041n16005
6530A233555J39162O48543m14500p0202N00512L30280p22851k45461K17210J21140
6520A737388p5697M03418P4103l79556K17610n6834l30474M01297l35769j27412
6510A528074L19907K3336N01142j63192Q9716l44664m97755K93174L95143j30558
6500B014323k21709P0029L16077M2187J6251M6604M26785o12891l74457K24470
$$ plain form
6490 1947669 2068356 2315638 2492381 2746921 2955997 2654452 2264463 2062653 1757852 1889928
6480 1889928 1930423 2587412 2383005 2428651 2312272 2830182 2595750 2217853 2965847 2948750
6470 2948750 2678299 2228963 2125017 2653481 3189122 2660966 2662851 3445379 3339243 2763513
6460 2763513 3215111 3780302 3571455 3601395 4007070 3954632 3873890 3988752 4253724 4202578
6450 4202578 4549696 4482295 4525284 3933092 4152508 4407092 4855325 4863749 4715398 4499247
6440 4499247 4747049 5316166 4998295 4835383 4889916 4793445 5352775 5593339 5346102 5276853
6430 5276853 5550176 6025053 5808869 6065524 5961069 5889711 6355157 6431948 6100937 6849308
6420 6849308 6854703 6976461 7234094 7088312 7459932 6888421 7048913 7073948 7015395 7765031
$$ packed form
6490A947669J20687K47282J76743K54540K09076l01545l89989k01810l04801J32076
6480A889928M0495O56989k04407M5646j16379N17910k34432l77897P47994j7097
6470B948750k70451m49336j03946N28464N35641n28156J885P82528j06136n75730
6460B763513M51598N65191k08847K9940M05675n2438q0742J14862K64972n1146
6450D202578L47118o7401M2989n92192K19416K54584M48233Q424j48351k16151
6440D499247K47802N69117l17871j62912N4533r6471N59330K40564k47237o9249
6430E276853K73323M74877k16184K56655j04455p1358M65446P6791l31011P48371
6420F849308N395J21758K57633j45782L71620n71511J60492K5035n8553P49636
$$ plain form
6410 7765031 7969009 7740290 7853106 8122521 8450745 8076630 7350189 6709586 6963189 7607588
6400 7607588 7848167 8403051 8337742 8000405 8051790 8058432 7763322 7775105 7920258 7785507
6390 7785507 7967946 8205898 8257260 7602022 6982395 7491490 7396149 7838337 8289925 7759895
6380 7759895 7402569 7163413 7161823 7299095 6857181 6823187 6783700 6414679 6663956 6338795
6370 6338795 6523399 6414286 6424239 6584036 5675633 5587711 5839615 5569337 5341976 5765160
6360 5765160 5701946 5550738 5216375 5111359 5362723 5318805 4872201 5685289 5738973 5253559
6350 5253559 5021322 5264617 5409067 5161768 4813011 4360957 4124425 4479544 4805647 4601139
6340 4601139 3810867 3457776 3784852 3509017 3451282 3586312 3905766 3683194 3325196 3283947
$$ packed form
6410G765031K03978k28719J12816K69415L28224l74115p26441o40603K53603O44399
6400G607588K40579N54884o5309l37337N1385O642k95110J1783J45153j34751
6390G785507J82439K37952N1362o55238o19627N09095r5341M42188M51588n30030
6380G759895l57326k39156j590J37272m41914l3994l9487l69021K49277l25161
6370F338795J84604j09113R953J59797r08403q7922K51904k70278k27361M23184
6360E765160o3214j51208l34363j05016K51364m3918m46604Q13088N3684m85414
6350E253559k32237K43295J44450k47299l48757m52054k36532L55119L26103k04508
6340D601139p90272l53091L27076k75835n7735J35030L19454k22572l57998m1249
$$ plain form
6330 3283947 3269480 3009559 2895653 2428773 2237447 2474612 2568242 3058176 3109987 2698974
6320 2698974 2252026 2679620 2811149 2185409 2248654 2090186 2897490 2434298 2824524 2507241
6310 2507241 1852289 2261113 1897784 2399370 2626078 2084315 1894345 1989945 1742369 1634324
6300 1634324 1494052 1503982 1433668 2298685 2586837 2504355 2151446 1880204 1776513 2097404
6290 2097404 2407834 2314600 2328515 2014531 1175765 1260252 2013565 1986315 1962827 2404263
6280 2404263 2595866 2347563 1926893 1808888 2382270 2751738 3087781 2644768 2639287 3209752
6270 3209752 2982556 2695585 3256076 2813095 2513480 2810734 2720453 2380774 2349514 2331170
6260 2331170 2973542 3471776 3176398 2932103 2859429 3159118 2255570 1907649 2357171 2455891
$$ packed form
6330C283947j4467k59921j13906m66880j91326K37165R3630M89934N1811m11013
6320B698974m46948M27594J31529o25740O3245j58468Q07304m63192L90226l17283
6310B507241o54952M08824l63329N01586K26708n41763j89970R5600k47576j08045
6300A634324j40272R930p0314Q65017K88152q2482l52909k71242j03691L20891
6290B097404L10430r3234J3915l13984q38766Q4487P53313k7250k3488M41436
6280B404263J91603k48303m20670j18005N73382L69468L36043m43013n481N70465
6270C209752k27196k86971N60491m42981k99615K97254r0281l39679l1260j8344
6260B331170O42372M98234k95378k44295p2674K99689r03548l47921M49522R8720
$$ plain form
6250 2455891 2378947 2621185 2855580 2506484 2207145 2185213 2357299 2122110 2269859 2737607
6240 2737607 2918632 3124516 2770283 2962646 3307183 3160553 3101931 3564681 3251488 2719612
6230 2719612 2949079 3021152 3119357 3350257 3307640 3104879 2997550 3374639 3285817 2988858
6220 2988858 2536243 2775266 2898812 2836486 2975378 2944637 2517347 2683140 3326356 3094508
6210 3094508 3361860 3335133 3434130 3298601 3483976 3732552 3929273 3659600 3463676 3622451
6200 3622451 3885720 3938838 4018382 3996487 3550601 3769041 3849447 3664167 3754130 3917376
6190 3917376 3677170 3854534 3570613 3582197 3283823 2928807 3259526 3870620 4298830 3916473
6180 3916473 4204575 3976969 4171874 4199741 4205600 4125781 3941930 3926159 3856911 3705848 3595355
$$ packed form
6250B455891p6944K42238K34395l49096k99339k1932J72086k35189J47749M67748
6240B737607J81025K05884l54233J92363L44537j46630n8622M62750l13193n31876
6230B719612K29467P2073R8205K30900m2617k02761j07329L77089q8822k96959
6220B988858m52615K39023J23546o2326J38892l0741m27290J65793O43216k31848
6210C094508K67352k6727R8997j35529J85375K48576J96721k69673j95924J58775
6200C622451K63269N3118P9544k1895m45886K18440Q0406j85280Q9963J63246
6190C917376k40206J77364k83921J1584k98374l55016L30719O11094M28210l82357
6180C916473K88102k27606J94905K7867N859p9819j83851j5771o9248j51063j10493
$$ plain form
6169 3595355 4079857 4458965 4124494 3772710 3393169 3857643 4266214 3944812 3627836 3989198
6159 3989198 4118336 4321577 4375086 4200400 3930089 4040254 4102379 3654213 3815324 4205457
6149 4205457 3835868 3616649 3981499 4304982 4361459 4349845 4115317 3965075 4297267 4425094
6139 4425094 4643964 4456394 3985629 4265090 4289826 4094832 4063792 4408556 4391450 4064505
6129 4064505 4562865 4964479 5185532 4989630 4954734 5078143 5113649 4788895 5238288 5446379
6119 5446379 4539289 4160777 4897228 4999049 4776894 4796771 4894184 4716833 4539248 4626081
6109 4626081 5631223 5491703 5530156 5352632 5305969 5576212 5800869 5784945 6083844 6151991
6099 6151991 6168793 6676664 6708054 7123225 7977580 7737408 7765647 7965523 8119483 8229154
$$ packed form
6169C595355M84502L79108l34471l51784l79541M64474M08571l21402l16976L61362
6159C989198J29138K03241N3509j74686k70311J10165O2125m48166J61111L90133
6149D205457l69589k19219L64850L23483N6477j1614k34528j50242L32192J27827
6139D425094K18870j87570m70765K79461K4736j94994l1040L44764j7106l26945
6129D064505M98360M01614K21053j95902l4896J23409L5506l24754M49393K08091
6119E446379r07090l78512P36451J01821k22155J9877R7413j77351j77585Q6833
6109D626081J005142j39520L8453j77524m6663K70243K24657j5924K98899O8147
6099F151991J6802N07871L1390M15171Q54355k40172K8239J99876J53960J09671
$$ plain form
6089 8229154 8489089 7953112 8325586 7886255 7804546 8015013 7422358 7736207 8101572 8020930
6079 8020930 7734260 7483259 7569618 7758494 7688427 7783413 7303723 7697325 7574110 7856733
6069 7856733 7831052 7656877 7477608 7075469 6604960 6732637 6818601 6427969 6168073 6062403
6059 6062403 5798612 5999929 5806243 5708174 5729016 6015339 5793486 5504263 5887502 6114355
6049 6114355 5860328 5635418 5759490 6044115 5895440 6574619 6278217 6340472 6419994 6325024
6039 6325024 6574513 6578070 6992188 8509617 9160069 8794104 8499105 8823636 9447314 9620274
6029 9620274 9373369 8950845 9487627 9520380 9553149 9894764 9443035 8530530 8625419 8986055
6019 8986055 8675075 8463697 8266235 8334728 8668159 8154923 8730630 8667311 8015377 8770415
$$ packed form
6089H229154K59935n35977L72474m39331q1709K10467n92655L13849L65365q0642
6079H020930k86670k51001Q6359J88876p0067R4986m79690L93602j23215K82623
6069G856733k5681j74175j79269m02139m70509J27677Q5964l90632k59896j05670
6059F062403k63791K01317j93686r8069K0842K86323k21853k89223L83239K26853
6049F114355k54027k24910J24072K84625j48675O79179k96402O2255P9522r4970
6039F325024K49489L557M14118J517429O50452l65965k94999L24531O23678J72960
6029I620274k46905m22524N36782L2753L2769L41615m51729r12505R4889L60636
6019H986055l10980k11378j97462O8493L33431n13236N75707o3319o51934P55038
$$ plain form
6009 8770415 9158223 8364122 8325215 8859260 8292758 7983290 7864619 7583801 7129166 6551819
5999 6551819 6423071 5587035 4986760 5560633 5660369 6178633 5588633 5309207 5165120 5144688
5989 5144688 5265565 5205349 5228569 4636848 4561022 4649906 4401150 4510754 4852213 4424338
5979 4424338 4142719 3886000 3472370 2980906 3126717 2940155 2978085 3259724 3747156 3539615
5969 3539615 3777693 4086612 3264321 2771319 3442883 3809946 3955598 4202486 3529711 3449324
5959 3449324 3872598 3913954 3965702 3767532 3865483 3969411 3708146 3592649 3382403 3520528
5949 3520528 3790853 3724279 3835267 3813220 3776081 3604909 3816220 4270688 4338325 3646589
5939 3646589 3574005 3676192 3659742 3480774 3659099 3459215 3243137 3509430 3975856 3685894
$$ packed form
6009H770415L87808p94101l8907N34045n66502l09468j18671k80818m54635n77347
5999F551819j28748q36036o00275N73873R9736N18264n90000k79426j44087k0432
5989E144688J20877o0216K3220n91721p5826Q8884k48756J09604L41459m27875
5979D424338k81619k56719m13630m91464J45811j86562L7930K81639M87432k07541
5969C539615K38078L08919q22291m93002O71564L67063J45652K46888o72775q0387
5959C449324M23274M1356N1748j98170R7951J03928k61265j15497k10246J38125
5949C520528K70325o6574J10988k2047l7139j71172K11311M54468O7637o91736
5939C646589p2584J02187j6450j78968J78325j99884k16078K66293M66426k89962
$$ plain form
5929 3685894 4000147 3705060 3613170 3449301 3477707 3846577 3881434 4003394 3278386 3806738
5919 3806738 4033696 3740104 3750091 4753156 5018794 5075883 5036071 4396941 4442047 4702857
5909 4702857 4591669 4017890 4009336 4064559 3666911 4029424 4325106 4241191 3973600 4084984
5899 4084984 4586840 4561103 3936920 4255531 4455746 4577442 4492585 4072606 4242739 4627925
5889 4627925 4332430 4014326 4240430 4431083 5048360 5492728 5443936 4873418 4863906 5613554
5879 5613554 5312416 5177416 5056030 5133916 4741454 5238335 5727648 5614470 6201705 6603075
5869 6603075 6236123 6206920 6100446 6501310 6751848 6752410 7847028 8089658 8723001 8512036
5859 8512036 8716927 9335623 9648946 9836118 9978306 10400107 10132953 9864025 9091705 9354581
$$ packed form
5929C685894L14253k95087r1890j63869K8406L68870L4857J21960p25008N28352
5919C806738K26958k93592R987J003065K65638N7089l9812o39130M5106K60810
5909D702857j11188n73779q554N5223l97648L62513K95682q3915k67591J11384
5899D084984N01856k5737o24183L18611K00215J21696q4857m19979J70133L85186
5889D627925k95495l18104K26104J90653O17277M44368m8792n70518r512P49648
5879E613554l01138j35000j21386P7886l92462M96881M89313j13178N87235M01370
5869F603075l66952k9203j06474M00864K50538N62J094618K42630O33343k10965
5859H512036K04891O18696L13323J87172J42188M21801k67154k68928p72320K62876
$$ plain form
5849 9354581 9135997 9013436 8351163 8143051 8265192 7898079 8182177 8293727 7785404 7599861
5839 7599861 7821868 7702466 8348339 7957334 7551321 7520607 7291281 7323642 7582452 7881073
5829 7881073 7632046 8033333 8048167 7744396 8234290 8244891 8399173 8644910 8980544 9307379
5819 9307379 9617530 9935126 10732913 10135895 9465961 9670554 8987492 8785431 9158375 8782772
5809 8782772 8713492 8643777 8569583 8577106 8220400 8167933 7583320 7787196 7654653 7577404 7871348
5798 7871348 7690995 8117143 8602168 8871888 8910703 8757779 8751153 8669168 8523968 8585942
5788 8585942 7949975 7967017 7658980 7609475 7393972 7347920 6952945 6478274 6659906 6280759
5778 6280759 6388192 6318316 6256346 6155614 5872763 5793435 5811722 5676654 5381862 5703154
$$ packed form
5849I354581k18584j22561o62273k08112J22141l67113K84098J11550n08323j85543
5839G599861K22007j19402O45873l91005m06013l0714k29326L2361K58810K98621
5829G881073k49027M01287J4834l03771M89894J0601J54282K45737L35634L26835
5819I307379L10151L17596P97787n97018o69934K04593o83062k02061L72944l75603
5809H782772o9280o9715p4194P523l56706n2467n84613K03876j32543p7249K93944
5798G871348j80353M26148M85025K69720L8815j52924o626q1985j45200O1974
5788H585942o35967J7042l08037m9505k15503m6052l94975m74671J81632l79147
5778F280759J07433o9876o1970j00732k82851p9328J8287j35068k94792L21292
$$ plain form
5768 5703154 5787138 5865089 5339212 6003422 6272465 6029021 6532797 6136827 5626929 5861760
5758 5861760 6939104 7095503 7136209 6684912 6792895 6698788 6425442 6045081 5783673 5996366
5748 5996366 6411805 6265180 6098249 5972769 5590806 5493093 4800661 4624540 4312762 4416559
5738 4416559 4604869 4553131 4070920 4157015 4265312 4029561 3970920 4058769 3568512 3426965
5728 3426965 3695967 3666674 4088608 4145455 4222885 3797963 3848976 3703835 3726175 3780188 3645603
5717 3645603 3300454 3634232 3863371 4050726 3591142 3538145 3404675 3357330 3610451 2860279
5707 2860279 2641779 3166018 3833668 3521306 3274578 3203848 3635516 2863186 2493894 3040502
5697 3040502 3272885 3218045 3244751 3363418 3040249 3286454 3496988 3420510 3135721 3350053
$$ packed form
5768E703154Q3984P7951n25877O64210K69043k43444N03776l95970n09898K34831
5758E861760J077344J56399M0706m51297J07983r4107k73346l80361k61408K12693
5748E996366M15439j46625j66931j25480l81963r7713o92432j76121l11778J03797
5738D416559J88310n1738m82211Q6095J08297k35751n8641Q7849m90257j41547
5728C426965K69002k9293M21934N6847P7430m24922N1013j45141K2340N4013j34585
5717C645603l45149L33778K29139J87355m59584n2997j33470m7345K53121p50172
5707B860279k18500N24239O67650l12362k46728p0730M31668p72330l69292N46608
5697C040502K32383n4840K6706J18667l23169K46205K10534p6478k84789K14332
$$ plain form
5687 3350053 3232580 2999598 3326900 3179325 3971624 3330153 3031243 3397961 3231319 3147616
5677 3147616 3397314 3393318 3313538 3808984 3666338 2980159 2716932 2985251 3921445 3645948
5667 3645948 3168594 3513665 3273552 3658352 3498033 3590332 2633279 2591845 2978860 3063626
5657 3063626 3264357 3608850 3589936 3365172 3777194 3639155 3019973 3222605 3432489 3072861
5647 3072861 3172661 3261688 3238738 3243838 2844798 2767828 3314702 3721991 3600536 3112486 2895788
5636 2895788 2855023 3149567 3393372 3009515 3338120 3181501 3174736 3723615 3401170 3637855
5626 3637855 4033116 3239849 2717560 3094341 3146503 3012022 3057213 3373924 3321896 2880408
5616 2880408 2832454 2662287 3044164 2928825 2183451 2795046 3008421 2672870 2461614 2653281
$$ packed form
5687C350053j17473k32982L27302j47575P92299o41471k98910L66718j66642q3703
5677C147616K49698l996p9780M95446j42646o86179k63227K68319R36194k75497
5667C645948m77354L45071k40113L84800j60319R2299r57053m1434L87015Q4766
5657C063626K00731L44493j8914k24764M12022j38039o19182K02632K09884l59628
5647C072861R9800Q9027k2950N100l99040p6970N46874M07289j21455m88050k16698
5636B895788m0765K94544K43805l83857L28605j56619o765N48879l22445K36685
5626C637855L95261p93267n22289L76781N2162j34481M5191L16711n2028m41488
5616B880408m7954j70167L81877j15339p45374O11595K13375l35551k11256J91667
$$ plain form
5606 2653281 2941773 3266595 2682511 2571996 2752064 2744998 2856218 3121396 2906562 3025281
5596 3025281 2954361 2593855 3252330 3432902 3383204 3140473 2932099 2758496 2589346 2442797
5586 2442797 3072745 3047540 2890446 2995255 2753285 2134332 2435247 2659664 2672497 2667424
5576 2667424 2794319 3444162 3315824 3294626 3352363 3194967 2864486 2569646 1873562 2558278
5566 2558278 2910655 2750239 3445323 3612006 3436446 3485928 3191040 3126408 3519580 3605961
5556 3605961 3420108 3109640 3017581 2930173 2558828 2605198 2869916 1808418 1774121 2744753
5546 2744753 3057382 3516955 2929403 2768704 2726517 2926442 2793200 2057623 2421084 2837004
5536 2837004 2970506 3346446 3372308 3367671 3338250 3245093 3191223 3171025 3354371 3444086 2887374
$$ packed form
5606B653281K88492L24822n84084j10515J80068p066J11220K65178k14834J18719
5596C025281p0920l60506O58475J80572m9698k42731k08374j73603j69150j46549
5586B442797O29948k5205j57094J04809k41970o18953L00915K24417J2833n073
5576B667424J26895O49843j28338k1198N7737j57396l30481k94840o96084O84716
5566B558278L52377j60416O95084J66683j75560M9482k94888o4632L93172Q6381
5556C605961j85853l10468r2059q7408l71345M6370K64718j061498l4297R70632
5546B744753L12629M59573n87552j60699m2187J99925j33242p35577L63461M15920
5536B837004J33502L75940K5862m637k9421r3157n3870k0198J83346Q9715n56712
$$ plain form
5525 2887374 3104505 3419193 3472016 3428152 3395142 3366429 3042742 3066348 3434889 3668445
5515 3668445 3710830 3726216 3712861 3196493 2931357 3122952 3220665 2721113 2627822 3523868
5505 3523868 3411608 2858399 2517150 2866733 2899038 3330029 3582464 3252745 3244822 3589971
5495 3589971 3729386 3714556 3731975 3600851 3805687 3707886 3389287 3501615 3374312 3416601
5485 3416601 3458018 3335715 3216672 2698880 2959788 3280793 3207929 3545920 3501605 2987872
5475 2987872 2931587 3381765 2846416 3185628 3158148 3266551 3671499 3390165 3903477 4122459
5465 4122459 3794945 4164077 3809364 3022210 3106978 3520371 3065687 3654596 3707367 2795540
5455 2795540 3045368 3634863 3765478 3303949 3239507 3425358 3312083 3138088 3599768 3470593
$$ packed form
5525B887374K17131L14688N2823m3864l3010k8713l23687K3606L68541K33556
5515C668445M2385J5386j3355n16368k65136J91595R7713m99552r3291Q96046
5505C523868j12260n53209l41249L49583L2305M30991K52435l29719p923L45149
5495C589971J39415j4830J7419j31124K04836r7801l18599J12328j27303M2289
5485C416601M1417j22303j19043n17792K60908L21005p2864L37991m4315n13733
5475B987872n6285M50178n35349L39212k7480J08403M04948k81334N13312K18982
5465D122459l27514L69132l54713p87154Q4768M13393m54684N88909N2771r11827
5455B795540K49828N89495J30615m61529o4442J85851j13275j73995M61680j29175
$$ plain form
5445 3470593 3197055 3038620 3627717 4707177 4527580 4326828 4786642 5192186 5467059
5436 5467059 6025446 6518051 6970774 7331981 7707556 7752868 7965385 7368550 6247902 5691373
5426 5691373 5877798 6037144 5290666 5232811 5357716 5476904 5476389 5408905 5625361 6163889
5416 6163889 6619051 6657703 6571826 6782504 7378689 7961012 8251597 8491071 7968260 8066914
5406 8066914 7584585 7080487 7334545 7592176 7217529 7093778 7298378 7046140 6845552 7213922
5396 7213922 7163878 7366675 7166179 6910401 6919735 7102440 7239396 7225164 7641821 7840565
5386 7840565 8014622 8119929 8322446 7879090 7435635 7668926 7803593 8315217 8106960 8033971
5376 8033971 8078013 8319863 8446851 7876688 7519967 7867349 8380397 7819903 7618319 8088003
$$ packed form
5445C470593k73538j58435N89097J079460j79597k00752M59814M05544K74873
5436E467059N58387M92605M52723L61207L75575M5312K12517n96835j120648n56529
5426E691373J86425J59346p46478n7855J24905J19188n15o7484K16456N38528
5416F163889M55162L8652q5877K10678N96185N82323K90585K39474n22811R8654
5406H066914m82329n04098K54058K57631l74647j23751K04600k52238k00588L68370
5396G213922n0044K02797k00496k55778R334J82705J36956j4232M16657J98744
5386G840565J74057J05307K02517m43356m43455K33291J34667N11624k08257p2989
5376H033971M4042K41850J26988n70163l56721L47382N13048n60494k01584M69684
$$ plain form
5366 8088003 8281305 8001687 7823586 8126960 8248464 8164150 8175623 8000993 8305538 8158776
5356 8158776 8223238 8214389 8334667 8212916 8089763 7858764 8108405 8098684 8030798 7902004 8030513
5345 8030513 8396570 8732875 8575110 8887949 9119080 8863347 8533488 7897483 8021754 8534662
5335 8534662 8856123 8785365 8768399 8591722 8850257 8883058 8674605 8467524 8996633 9238965
5325 9238965 8874710 8700422 8757039 8610961 8433995 8299680 7993438 8724690 8680913 8353976
5315 8353976 8226740 7810947 7961133 7802849 7834567 7635543 7422820 7538241 7201966 6902513
5305 6902513 6588636 6481314 6739499 7024315 6961015 6798724 6234467 6290447 6855125 6503537
5295 6503537 6390853 6292357 5628333 5726119 5032208 4783002 4980742 5033981 5065275 5139523
$$ packed form
5366H088003J93302k79618j78101L03374J21504q4314J1473j74630L04545j46762
5356H158776O4462q849J20278j21751j23153k30999K49641r721o7886j28794J28509
5345H030513L66057L36305j57765L12839K31131k55733l29859o36005J24271N12908
5335H534662L21461p0758j6966j76677K58535L2801k08453k07081N29109K42332
5325I238965l64255j74288N6617j46078j76966j34315l06242P31252m3777l26937
5315H353976j27236m15793J50186j58284L1718j99024k12723J15421l36275k99453
5305F902513l13877j07322K58185K84816o3300j62291n64257N5980N64678l51588
5295F503537j12684r8496o64024R7786o93911k49206J97740N3239L1294P4248
$$ plain form
5285 5139523 5089059 4757395 5168279 5367050 4913142 4424991 5184516 4766217 4624328 4532764
5275 4532764 4104188 3934433 4016138 4078221 4512195 4360618 3812833 4023055 3715788 3626877
5265 3626877 4033348 4285214 3995302 3352599 3590925 3466443 3691965 3780691 3554387 4041212
5255 4041212 3498398 3222071 3535157 3061822 3343394 3343882 3203445 3246878 3371604 3843379
5245 3843379 3832448 3342273 3271791 3380474 3307131 3419789 3358035 3539911 3934170 4483646
5235 4483646 4086650 3946896 3833147 3759702 3865255 3859609 3499992 3762414 4273932 4027212
5225 4027212 3763388 3482801 3299970 2758656 2790686 3208213 3171137 3391101 3325545 3346193
5215 3346193 2973879 3146757 3594037 3499852 2935331 2829278 3460300 3123763 3089962 3201895
$$ packed form
5285E139523n0464l31664M10884J98771m53908m88151P59525m18299j41889r1564
5275D532764m28576j69755Q1705O2083M33974j51577n47785K10222l07267q8911
5265C626877M06471K51866k89912o42703K38326j24482K25522Q8726k26304M86825
5255D041212n42814k76327L13086m73335K81572M88j40437M3433J24726M71775
5245C843379j0931m90175p0482J08683p3343J12658o1754J81876L94259N49476
5235D483646l96996j39754j13749p3445J05553n646l59617K62422N11518k46720
5225D027212k63824k80587j82831n41314L2030M17527l7076K19964o5556K0648
5215C346193l72314J72878M47280r4185n64521j06053O31022l36537l3801J11933
$$ plain form
5205 3201895 3132478 3237960 2652073 3217776 3631906 3552733 3136859 2904800 3636593 3416605
5195 3416605 3777606 3780218 3624360 4083295 3657431 3607711 3542093 3702889 3644279 3190381
5185 3190381 3304209 2901480 2702267 3257354 3380689 3166354 3236369 3129259 2880681 2952080
5175 2952080 2897325 3225189 3065123 3081156 3118914 3083686 3327077 3317845 3299717 3030413 3505023
5164 3505023 3144897 3143530 3001829 3036956 3087462 3008525 2475340 2516302 3291970 3479582 3361205
5153 3361205 3359885 3224669 3545497 3653703 3199854 3658005 3455954 3361495 3595010 3655713
5143 3655713 3480805 3700988 3704067 3820539 3954500 3980731 3775381 3721691 3809767 3891387 3798466
5132 3798466 3750575 3415413 3196015 3507779 3400908 3316764 3501988 3210799 3202379 3278160
$$ packed form
5205C201895o9417J05482n85887N65703M14130p9173m15874k32059P31793k19988
5195C416605L61001K612j55858M58935m25864m9720o5618J60796n8610m53898
5185C190381J13828m02729j99213N55087J23335k14335P0015j07110k48578P1399
5175B952080n4755L27864j60066J6033L7758l5228K43391r232j8128k69304M74610
5164C505023l60126j367j41701L5127N0506p8937n33185M0962P75668J87612j18377
5153C361205j320j35216L20828J08206m53849M58151k02051r4459K33515O0703
5143C655713j74908K20183L079J16472J33961K6231k05350n3690Q8076Q1620r2921
5132C798466m7891l35162k19398L11764j06871q4144J85224k91189q420P5781
$$ plain form
5122 3278160 3642097 3475821 3227954 3589611 3162420 2798337 3323664 3672432 3043688 3160141
5112 3160141 2981481 3219718 3345773 3374498 3715842 3594383 3735450 3676268 3376643 3304454
5102 3304454 3449236 3053874 2728545 2574477 3000263 3178490 3776751 3454353 3034840 3448119
5092 3448119 3495189 3800807 3890246 3497511 3394851 3774715 3942415 4085745 4022054 4198585
5082 4198585 3945231 3509261 3253242 3500272 3575443 4019545 4176627 3408038 3719556 3938121
5072 3938121 3638046 3689122 3543483 4047566 3994796 4248947 4224948 4057703 3983555 4215804
5062 4215804 4413168 4627067 4705101 4414591 4339468 4784147 4518350 4194437 4353511 4422073
5052 4422073 4262261 4788743 4793276 4320720 4746173 4955921 4313496 4225562 4558913 4932788
$$ packed form
5122C278160L63937j66276k47867L61657m27191l64083N25327L48768o28744J16453
5112C160141j78660K38237J26055K8725L41344j21459J41067n9182k99625p2189
5102C304454J44782l95362l25329j54068M25786J78227N98261l22398m19513M13279
5092C448119M7070L05618Q9439l92735j02660L79864J67700J43330o3691J76531
5082D198585k53354m35970k56019K47030P5171M44102J57082p68589L11518K18565
5072C938121l00075N1076j45639N04083n2770K54151k3999j67245p4148K32249
5062D215804J97364K13899P8034k90510p5123M44679k65797l23913J59074O8562
5052D422073j59812N26482M533m72556M25453K09748o42425q7934L33351L73875
$$ plain form
5042 4932788 5019441 5329628 5444789 5385049 5253401 4862052 4880575 4994977 5784444 5234381
5032 5234381 5217754 5293752 5204844 5426797 5741846 5342354 5567614 5149114 4944596 5269549
5022 5269549 5916956 5794627 6098592 6224085 5601152 6261388 6193462 6409310 7086841 7525407
5012 7525407 7064678 6749452 7299986 7732163 8381394 8941000 9607129 9749234 9280407 9118995
5002 9118995 9017048 8593619 8950205 8568983 7945338 8190463 8346975 8346210 7881350 8423323
4992 8423323 8141474 8473676 8010548 7730784 8308787 7959221 8190405 8330548 8290770 8704536
4982 8704536 8835113 8926208 8683690 8387038 8666351 8916307 8496907 8301906 8746402 9077823
4972 9077823 9108028 8918501 9488633 9259334 8760925 8764736 9120726 9298393 9458529 9212525
$$ packed form
5042D932788Q6653L10187J15161n9740j31648l91349J8523J14402P89467n50063
5032E234381j6627P5998q8908K21953L15049l99492K25260m18500k04518L24953
5022E269549O47407j22329L03965J25493o22933O60236o7926K15848O77531M38566
5012G525407m60729l15226N50534M32177O49231N59606O66129J42105m68827j61412
5002I118995j01947m23429L56586l81222o23645K45125J56512p65m64860N41973
4992H423323k81849L32202m63128k79764N78003l49566K31184J40143l9778M13766
4982H704536J30577R1095k42518k96652K79313K49956m19400j95001M44496L31421
4972I077823L0205j89527N70132k29299m98409L811L55990J77667J60136k46004
$$ plain form
4962 9212525 9222568 9408263 9184336 8986345 9036599 9034014 9168996 9405942 10090200 10251845
4952 10251845 9562618 9883113 10042061 9284733 9732512 9884836 10182025 10691233 10945925
4943 10945925 10424667 10165869 10448819 10143221 9807691 9672272 9667968 9813320 9873487 9764429
4933 9764429 9625894 9435797 9632657 10118479 10302358 9977623 9984225 9806866 9380848 9514030
4923 9514030 9881988 9942279 9352983 9438729 9080279 8978880 8939110 8807812 9211525 9239131
4913 9239131 9431305 8966806 8788644 8769242 8631120 8790170 8963744 8931333 8684620 8488791
4903 8488791 8264877 7868217 8801386 8489580 8559428 8141976 8429762 8381447 8556039 9313174
4893 9313174 8921914 8506563 8464687 8371486 7867632 7551282 7338022 7611613 7832256 7892476
$$ packed form
4962I212525J0043J85695k23927j97991N0254k585J34982K36946O84258J61645
4952A0251845o89227L20495J58948p57328M47779J52324K97189N09208K54692
4943A0945925n21258k58798K82950l05598l35530j35419m304J45352O0167j09058
4933I764429j38535j90097J96860M85822J83879l24735O602j77359m26018J33182
4923I514030L67958O0291n89296Q5746l58450j01399l9770j31298M03713K7606
4913I239131J92174m64499j78162j9402j38122J59050J73574l2411k46713j95829
4903H488791k23914l96660R33169l11806O9848m17452K87786m8315J74592P57135
4893I313174l91260m15351m1876r3201n03854l16350k13260K73591K20643O0220
$$ plain form
4883 7892476 7822287 7899758 7812785 7397427 7708396 8254581 8329688 8557108 8646579 8606728 8463711
4872 8463711 8144737 8317596 8167132 7961671 7600802 6927087 6978830 7175851 6523582 6852047
4862 6852047 7582269 6878293 6930933 7042361 6873681 7242197 7364858 7361208 6679810 7253619
4852 7253619 7384162 6961339 6748797 6038090 6266258 6702470 7089718 7318247 7204157 6962967
4842 6962967 6419430 6518938 6227223 6315099 7215252 6862872 6718226 6606751 7163645 7472740
4832 7472740 7266483 7134442 6857867 6806215 6938276 6975880 7210337 6780314 6381568 6109492
4822 6109492 6439816 6884996 7024983 6750528 6712846 6272596 6652883 6416716 6695742 6684806
4812 6684806 6106390 6497497 6829551 7418265 7164228 7143338 6978835 6965211 6723399 6992981
$$ packed form
4883G892476p0189P7471q6973m15358L10969N46185P5107K27420Q9471l9851j43017
4872H463711l18974J72859j50464k05461l60869o73715N1743J97021o52269L28465
4862F852047P30222p03976N2640J11428j68680L68516J22661l650o81398N73809
4852G253619J30543m22823k12542p10707K28168M36212L87248K28529j14090k41190
4842F962967n43537R9508k91715Q7876R00153l52380j44646j11475N56894L09095
4832G472740k06257j32041k76575n1652J32061L7604K34457m30023l98746k72076
4822F109492L30324M45180J39987k74455l7682m40250L80287k36167K79026j0936
4812F684806n78416L91107L32054N88714k54037k0890j64503j3624k41812K69582
$$ plain form
4802 6992981 7004885 6999156 7293797 7476357 7724672 7617806 6564978 6169718 6753375 7268361
4792 7268361 6945502 6848279 6526420 7066150 7464511 7345935 7010484 6516153 6959141 6818539
4782 6818539 7146263 7426967 7647732 6984141 6908942 7193101 7193356 7256724 7377504 6889973
4772 6889973 7342477 7257317 6894662 7179637 7078681 6744056 6762062 6628397 6611600 6860734
4762 6860734 7141480 7300706 7043613 7253098 7770533 7965906 7812265 8033708 8035441 7357011
4752 7357011 7225717 7306053 7139144 7641401 7579884 7848985 7635491 7542974 7669538 7653698
4742 7653698 8008017 8077412 8123715 8396459 8249513 8128885 8075536 7968243 8303780 7837140
4732 7837140 8041609 8192949 8589983 9198478 9059940 9276124 9080620 9052328 8771540 8362372
$$ packed form
4802F992981J1904n729K94641J82560K48315j06866j052828l95260N83657N14986
4792G268361l22859r7223l21859N39730L98361j18576l35451m94331M42988j40602
4782F818539L27724K80704K20765o63591p5199K84159K55O3368J20780m87531
4772F889973M52504q5160l62655K84975j00956l34625J8006j33665j6797K49134
4762F860734K80746J59226k57093K09485N17435J95373j53641K21443J733o78430
4752G357011j31294Q0336j66909N02257o1517K69101k13494r2517J26564j5840
4742G653698L54319O9395M6303K72744j46946j20628n3349j07293L35537m66640
4732G837140K04469J51340L97034O08495j38538K16184j95504k8292k80788m09168
$$ plain form
4722 8362372 8320577 8376228 8474896 8165462 8498700 8156222 7769030 8313102 8146790 8104407
4712 8104407 8036724 7611497 7862221 7930795 7789370 8521988 8817453 8313438 8507430 8151163
4702 8151163 8151710 8482554 8068123 8192115 8032083 8201671 8252382 8765158 8514537 8178655
4692 8178655 7908877 8167047 8706499 8572442 8357622 8408460 8463597 8528152 8364327 8007792
4682 8007792 8389672 8485976 8462787 8336703 8031743 8154799 8506725 8561037 8036556 8199772
4672 8199772 8157038 8742707 8941889 8665880 8948429 8573795 8835749 8357638 7948075 8681314
4662 8681314 8911186 8801475 8958576 8828444 8439545 8716368 9125367 8651144 8825323 8482313
4652 8482313 8054821 8066534 8572291 8840571 8193271 7772253 7838841 8338368 8205000 8493723
$$ packed form
4722H362372m1795N5651R8668l09434L33238l42478l87192N44072j66312m2383
4712H104407o7683m25227K50724O8574j41425P32618K95465n04015J93992l56267
4702H151163N47L30844m14431J23992j60032J69588N0711N12776k50621l35882
4692H178655k69778K58170N39452j34057k14820N0838N5137O4555j63825l56535
4682H007792L81880R6304k3189j26084l04960J23056L51926N4312n24481J63216
4672H199772m2734N85669J99182k76009K82549l74634K61954m78111m09563P33239
4662H681314K29872j09711J57101j30132l88899K76823M08999m74223J74179l43010
4652H482313m27492J1713N05757K68280o47300m21018O6588M99527j33368K88723
$$ plain form
4642 8493723 8951705 8511573 8336921 8094313 7931372 8208737 8088885 8109347 8448116 8467536
4632 8467536 8250274 8160879 8170539 8402508 8641500 8446423 8373713 8824719 8341153 8417402
4622 8417402 8606636 8307689 8024260 8330337 8243395 8296126 7903362 7736056 7929035 7885072
4612 7885072 8075156 7773999 8324189 8212483 7839419 8122974 8350102 8397158 7678034 7828031
4602 7828031 7658715 7889911 8283346 8466851 8758421 9077315 9176309 9323513 9423167 9229989
4592 9229989 8786151 7951096 7796224 7691831 8004576 7533816 7381438 7697981 8001761 7943928
4582 7943928 7832467 7761767 7805275 7334493 7640362 7288010 7130505 7177387 6983774 7319247
4572 7319247 7363299 7221363 7104205 6711997 7121888 7314409 6855429 6603122 6906547 6927546
$$ packed form
4642H493723M57982m40132j74652k42608j62941K77365j19852K0462L38769J9420
4632H467536k17262q9395R660K31969K38992j95077p2710M51006m83566P6249
4622H417402J89234k98947k83429L06077q6942N2731l92764j67306J92979m3963
4612G885072J90084l01157N50190j11706l73064K83555K27128M7056p19124J49997
4602G828031j69316K31196L93435J83505K91570L18894R8994J47204R9654j93178
4592I229989m43838q35055j54872j04393L12745m70760j52378L16543L03780n7833
4582G943928j11461p0700M3508m70782L05869l52352j57505M6882j93613L35473
4572G319247M4052j41936j17158l92208M09891J92521m58980k52307L03425K0999
$$ plain form
4562 6927546 7547755 7334551 6570865 6593541 6842520 7000761 7159376 7078563 6796156 7264173
4552 7264173 7213911 7318512 7253916 7135896 6396025 5947124 6043241 5998673 6201252 6614067
4542 6614067 6684025 6533767 6093044 5905233 6526790 6820223 7080920 6609416 6581907 6766050
4532 6766050 6248406 6067045 6166237 6247441 6210257 6309961 6455776 6342083 6258188 6188320 6200005
4521 6200005 6614585 6646870 6777066 7068493 6379642 6014531 6289390 5911124 6138021 6460520
4511 6460520 5926486 6003650 6258387 5744938 5372189 5505069 5935299 5980480 5445533 5162628
4501 5162628 5031443 5449786 5766567 5601057 5606891 5768451 5913553 5855068 5523663 5315487
4491 5315487 4881866 5058297 4881273 5302335 5193737 4790401 4948331 5450554 5610551 4933647
$$ packed form
4562F927546O20209k13204p63686K2676K48979J58241J58615q0813k82407M68017
4552G264173n0262J04601o4596j18020p39871m48901R6117m4568K02579M12815
4542F614067O9958j50258m40723j87811O21557K93433K60697m71504k7509J84143
4532F766050n17644j81361R9192Q1204l7184R9704J45815j13693q3895o9868J1685
4521F200005M14580L2285J30196K91427o88851l65111K74859l78266K26897L22499
4511F460520n34034P7164K54737n13449l72749J32880M30230M5181n34947k82905
4501E162628j31185M18343L16781j65510N834J61560J45102n8485l31405k08176
4491E315487m33621J76431j77024M21062j08598m03336J57930N02223J59997o76904
$$ plain form
4481 4933647 5266644 5076607 4988787 4842811 4904598 5130354 4968621 4608885 5612169 5580621
4471 5580621 5873512 5477327 5125443 5455219 5708535 5622934 5117973 5629315 5698374 5444987
4461 5444987 5075831 4772075 5217234 5332135 5026865 5857795 6055468 5610507 5344878 5596080
4451 5596080 5582601 5212477 5557334 5982914 5933633 5967248 5917492 5476466 5361317 5465500
4441 5465500 5723005 6340438 6933016 7401280 7381740 6336860 6588067 6429429 6630811 6768470
4431 6768470 6971974 6516722 6539994 6862276 6682973 6284132 6665490 6234285 6259595 6399145
4421 6399145 6024646 6075593 5876114 5783195 5752213 5707311 6154139 6865909 6974242 6885940
4411 6885940 6931371 7131750 6946250 6462865 6657222 6875862 6600121 6610993 6551019 6634125
$$ packed form
4481D933647L32997j90037q7820j45976O1787K25756j61733l59736J003284l1548
4471E580621K92891l96185l51884L29776K53316q5601n04961N11342O9059k53387
4461E444987l69156l03756M45159J14901l05270Q30930J97673m44961k65629K51202
4451E596080j3479l70124L44857M25580m9281L3615m9756m41026j15149J04183
4441E465500K57505O17433N92578M68264j9540j044880K51207j58638K01382J37659
4431F768470K03504m55252K3272L22282j79303l98841L81358m31205K5310J39550
4421F399145l74499N0947j99479r2919l0982m4902M46828P11770J08333q8302
4411F885940M5431K00379j85500m83385J94357K18640k75741J0872n9974Q3106
$$ plain form
4401 6634125 6625151 7026945 7350003 6691767 6642476 7206776 6931303 7245371 7035172 6974868
4391 6974868 7086147 7169027 7406305 7275431 7228793 7201585 7195434 7511242 7515934 7386637 7205544
4380 7205544 7290521 7992561 7716142 7651186 8155138 8099169 8472792 8751702 8672310 8258416
4370 8258416 8721262 8916850 8716869 8326385 8615758 8727587 9208418 9525666 9224791 9031860
4360 9031860 9755097 9804936 10113679 10446632 11025612 11473887 12208571 13101755 13881265 14183824
4350 14183824 14102012 13761268 14045577 13499752 13480512 13420753 13797567 13489474 13850424 14675498
4340 14675498 15110780 14846139 15598423 15967183 16796119 17439903 18091405 18479787 18467704 18227906
4330 18227906 19256035 20445592 20959702 21356430 23478514 25219097 27710116 29687917
$$ packed form
4401F634125q974M01794L23058o58236m9291N64300k75473L14068k10199o0304
4391F974868J11279Q2880K37278j30874m6638k7208o151L15808M692j29297j81093
4380G205544Q4977P02040k76419o4956N03952n5969L73623K78910p9392m13894
4370H258416M62846J95588j99981l90484K89373J11829M80831L17248l00875j92931
4360I031860P23237M9839L08743L32953N78980M48275P34684Q93184P79510L02559
4350A4183824q1812l40744K84309n45825j9240n9759L76814l08093L60950Q25074
4340A4675498M35282k64641P52284L68760Q28936O43784O51502L88382j2083k39798
4330A8227906J028129J189557N14110L96728K122084J740583K491019J977801
$$ plain form
4322 29687917 31938513 34870083 38216855 41997115 46775536 52386462 60061580 68954058
4314 68954058 81067759 97125875 123270921 166377331 259503892 387883272 462185289
4307 462185289 428792128 297875685 189440384 129029260 93542280 71605983 58219863
4300 58219863 51583912 48026439 45908931 43843946 41856458 39002462 37473249 34908015
4292 34908015 32159723 30077471 29761465 28283440 27305206 26214001 25733635 25512305 24833773
4283 24833773 23566043 23167996 22534444 21802170 21865914 22308465 22770863 23386848 23616558
4274 23616558 24401016 24888473 24399288 23129119 22949637 22369267 22096275 21750434 21171716
4265 21171716 19981109 18238829 17012697 16514476 15326660 14731857 13901370 13220556 12568100
$$ packed form
4322B9687917K250596K931570L346772L780260M778421N610926P675118Q892478
4314F8954058J2113701J6058116K6145046M3106410R3126561J28379380P4302017
4307D62185289l3393161j30916443j08435301o0411124l5486980k1936297j3386120
4300E8219863o635951l557473k117508k064985j987488k853996j529213k565234
4292C4908015k748292k082252l16006j478025r78234j091205m80366k21330o78532
4283B4833773j267730l98047o33552p32274O3744M42551M62398O15985K29710
4274B3616558P84458M87457m89185j270169j79482n80370k72992l45841n78718
4265B1171716j190607j742280j226132m98221j187816n94803q30487o80814o52456
$$ plain form
4256 12568100 12339005 11960709 11295310 11248545 11238643 10558404 10420076 10204529 9366568 8535184
4246 8535184 8671799 8559603 8281275 7731448 7538248 7307028 7257679 7345384 7000925 6599330
4236 6599330 6471827 6683574 6194825 5789862 5352795 4976385 4863087 4947262 4842942 4476829
4226 4476829 4645118 4311678 4365732 4790664 4864690 5094394 4857638 4812201 4615235 4865270
4216 4865270 4749837 4021171 3878005 3822289 3748244 3651999 3920140 3936330 4101729 3677827
4206 3677827 3350098 3706088 3779197 3292075 3559811 3796133 4251666 3837430 3261261 3605429
4196 3605429 3685036 3150369 2970752 4005732 4513379 4313465 4088396 3721405 3579261 3351175
4186 3351175 3488118 3713188 3199012 2812474 3213722 3137725 3095008 3108027 3292075 3355070
$$ packed form
4256A2568100k29095l78296o65399m6765r902o80239j38328k15547q37961q31384
4246H535184J36615j12196k78328n49827j93200k31220m9349Q7705l44459m01595
4236F599330j27503K11747m88749m04963m37067l76410j13298Q4175j04320l66113
4226D476829J68289l33440N4054M24932P4026K29704k36756m5437j96966K50035
4216D865270j15433p28666j43166n5716p4045r6245K68141J6190J65399m23902
4206C677827l27729L55990P3109m87122K67736K36322M55533m14236n76169L44168
4196C605429P9607n34667j79617J034980N07647j99914k25069l66991j42144k28086
4186C351175J36943K25070n14176l86538M01248p5997m2717J3019J84048O2995
$$ plain form
4176 3355070 3386068 2904937 2708441 3199592 2917981 3325309 2891287 2486435 3260341 3252211
4166 3252211 3513418 3223331 2507568 2841717 3234599 3402785 3011148 2834677 3030962 2759111
4156 2759111 2872914 3318486 2908846 2940086 2960253 2504757 2755336 3153425 2883668 2681131
4146 2681131 2607963 3271541 3395954 2963591 2516289 2697057 2223381 2483907 3068761 2974285
4136 2974285 3097718 3019693 2824754 2784087 2670392 2050632 1898834 2159055 2657785 2444044
4126 2444044 2498667 2714672 2542272 3222462 3019803 2609418 2978236 2434546 2208627 2873542
4116 2873542 3070624 2575819 2745056 2723765 3129129 3000676 2797444 3038422 3128975 2477215
4106 2477215 2406737 2703275 2882560 2896321 2690110 2932267 2409461 2764579 2985574 2877410
$$ packed form
4176C355070L0998m81131j96496M91151k81611M07328m34022m04852P73906q130
4166C252211K61207k90087p15763L34149L92882J68186l91637j76471J96285k71851
4156B759111J13803M45572m09640L1240K0167m55496K50579L98089k69757k02537
4146B681131p3168O63578J24413m32363m47302J80768m73676K60526N84854r4476
4136B974285J23433p8025j94939m0667j13695o19760j51798K60221M98730k13741
4126B444044N4623K16005j72400O80190k02659m10385L68818n43690k25919O64915
4116B873542J97082m94805J69237k1291M05364j28453k03232K40978R0553o51760
4106B477215p0478K96538J79285J3761k06211K42157n22806L55118K20995j08164
$$ plain form
4096 2877410 2533981 2971144 3028861 2965287 2789548 3021292 3203111 2786743 2531951 3329932
4086 3329932 3441503 3256163 3309688 3373969 3591639 3290393 3148538 3355504 3134751 3164133
4076 3164133 3117765 3624740 4033186 3869577 3413719 3203299 3645010 3711503 4307453 4465459
4066 4465459 3822108 3747286 4268490 3772952 3615311 3611576 3375997 3658527 3803349 4314618
4056 4314618 5068028 5152711 5321483 4453190 4230985 4547229 4638784 5563066 6412204 7352914
4046 7352914 7521191 8304028 8670170 8068375 7828301 8107149 8021350 7848698 7988552 6969131
4036 6969131 6264208 5612518 5288214 4866421 4256467 3992838 4184228 4686923 4438686 3499319
4026 3499319 3630820 4498215 4446849 4493193 5140165 5767002 6115213 5878228 5745023 5849571
$$ packed form
4096B877410l43429M37163N7717o3574j75739K31744J81819m16368k54792P97981
4086C329932J11571j85340N3525O4281K17670l01246j41855K06966k20753K9382
4076C164133m6368N06975M08446j63609m55858k10420M41711O6493N95950J58006
4066D465459o43351p4822N21204m95538j57641l735k35579K82530J44822N11269
4056D314618P53410Q4683J68772q68293k22205L16244R1555R24282Q49138R40710
4046G352914J68277P82837L66142o01795k40074K78848q5799j72652J39854j019421
4036F969131p04923o51690l24304m21793o09954k63629J91390N02695k48237r39367
4026C499319J31501Q67395n1366M6344O46972O26837L48211k36985j33205J04548
$$ plain form
4016 5849571 5934076 5982849 5885137 5317283 5202184 4273301 4431937 4450541 4514858 4769293
4006 4769293 4412201 4891945 4580613 4557099 4477031 4698402 4677919 4319298 4661828 4889553
3996 4889553 4256741 4671497 4700289 4704343 5128721 5192419 5226471 5054053 4936594 4842133 5423695
3985 5423695 5692475 5147144 6043190 6026776 5459128 5616338 5631280 5930662 5978309 6344945
3975 6344945 6607222 7121779 7052462 7153515 6673007 6564811 6792380 7438806 7705694 8154259
3965 8154259 8178039 8650265 8590596 8423151 8568184 8278622 8232121 7865586 8026994 9037701
3955 9037701 9130506 9376451 9845034 9469587 9190575 8829405 9081551 8914043 9054446 8855020
3945 8855020 9022560 8938120 9105792 9274208 9266428 9250052 9290009 9184504 9419051 9315360
$$ packed form
4016E849571Q4505M8773r7712n67854j15099r28883J58636J8604O4317K54435
4006D769293l57092M79744l11332k3514q0068K21371k0483l58621L42530K27725
3996D889553o32812M14756K8792M054M24378O3698L4052j72418j17459r4461N81562
3985E423695K68780n45331Q96046j6414n67648J57210J4942K99382M7647L66636
3975F344945K62277N14557o9317J01053m80508j08196K27569O46426K66888M48565
3965H154259K3780M72226n9669j67445J45033k89562m6501l66535J61408J010707
3955I037701R2805K45945M68583l75447k79012l61170K52146j67508J40403j99426
3945H855020J67540q4440J67672J68416p780j6376L9957j05505K34547j03691
$$ plain form
3935 9315360 9092517 8976502 8747374 8929902 8805170 8700814 8624932 8389629 9103419 10259908
3925 10259908 10493568 10358020 10517730 10446290 10364478 10893678 10682560 10703359 11062067 11778244
3915 11778244 12527086 12399985 12520348 12601836 12834547 13664885 14254924 14382988 14499263 14282075
3905 14282075 14508562 14272203 14529549 14677558 14896611 14983912 14839342 15181453 14589217 14618723
3895 14618723 14659430 14463031 14493336 14525149 14480577 14206834 14097184 13748221 13568362 13610289
3885 13610289 13649342 13460369 13663278 14138481 14784873 16682605 18268933 19163975 18213940
3876 18213940 16458309 14097434 11960539 11324239 10378511 10232991 10034296 9747432 10077808
3867 10077808 9871411 9756584 9670676 10057724 10009944 9994389 10110026 10311278 10182951 9650456
$$ packed form
3935I315360k22843j16015k29128J82528j24732j04356p5882k35303P13790J156489
3925A0259908K33660j35548J59710p1440q1812N29200k11118K0799L58708P16177
3915A1778244P48842j27101J20363Q1488K32711Q30338N90039J28064J16275k17188
3905A4282075K26487k36359K57346J48009K19053Q7301j44570L42111n92236K9506
3895A4618723M0707j96399L0305L1813m4572k73743j09650l48963j79859M1927
3885A3610289L9053j88973K02909M75203O46392J897732J586328Q95042r50035
3876A8213940j755631k360875k136895o36300r45728j45520j98695k86864L30376
3867A0077808k06397j14827q5908L87048m7780j5555J15637K01252j28327n32495
$$ plain form
3857 9650456 10207972 10677549 10856100 10818030 11333015 11742174 11813333 12663252 12774472 12744653
3847 12744653 12267526 12624245 13806593 13986407 14190823 14824085 14793673 14601072 15123250
3838 15123250 15722155 15361877 14956484 15144105 15009113 15308383 15212094 14735120 14746382 14462996
3828 14462996 14288630 13759477 13246761 13243921 13557035 13332818 12529498 12450366 12183774 11859682
3818 11859682 11743324 11598833 11067539 10351273 10395336 10922305 10307417 10061686 9757394 9665285
3808 9665285 9403010 9219106 9375381 9383604 10134643 10466698 10431078 10324663 10586234 10792072
3798 10792072 10282730 10408338 10020172 10211143 10410056 11133510 11901473 11987551 12196146 11844369
3788 11844369 11430874 11416975 11723486 11776664 11568531 12092397 12197966 12127694 12541289 13108613
$$ packed form
3857I650456N57516M69577J78551l8070N14985M09159P1159Q49919J11220k9819
3847A2744653m77127L56719J182348J79814K04416O33262l0412j92601N22178
3838A5123250N98905l60278m05393J87621j34992K99270r6289m76974J1262k83386
3828A4462996j74366n29153n12716k840L13114k24217q03320p9132k66592l24092
3818A1859682j16358j44491n31294p16266M4063N26969o14888k45731l04292r2109
3808I665285k62275j83904J56275Q223P51039L32055l5620j06415K61571K05838
3798A0792072n09342J25608l88166J90971J98913P23454P67963Q6078K08595l51777
3788A1844369m13495j3899L06511N3178k08133N23866J05569p0272M13595N67324
$$ plain form
3778 13108613 12988228 12900616 12687197 12694140 13568763 13318545 12777699 12875073 13319583 13023610
3768 13023610 13667926 14391473 14076673 14152004 14744416 15052283 14753872 14493095 14486886 14907129
3758 14907129 14874800 14751767 14741470 14495139 13972207 13320682 13525711 13415084 13408052 13139054
3748 13139054 13023315 13324376 12907422 12425101 12292305 12923043 12921250 12733530 12728237 13290977
3738 13290977 13752897 13699380 14020033 14026579 14344711 14153388 14744794 14865641 15493782 15685565
3728 15685565 15486028 15539825 15284868 14959065 15323919 15583662 15562387 15310270 16073524 17200722
3718 17200722 17369815 17322806 17808391 18296931 17950594 18280467 18271380 18580894 19442636 19510162
3708 19510162 19959923 19466962 19006864 18839309 19083366 18627740 18450213 18182772 18017424
$$ packed form
3778A3108613j20385q7612k13419O943Q74623k50218n40846R7374M44510k95973
3768A3023610O44316P23547l14800P5331N92412L07867k98411k60777o209M20243
3758A4907129l2329j23033j0297k46331n22932o51525K05029j10627p032k68998
3748A3139054j15739L01061m16954m82321j32796O30738j793j87720n293N62740
3738A3290977M61920n3517L20653O546L18132j91323N91406J20847O28141J91783
3728A5685565j99537N3797k54957l25803L64854K59743k1275k52117P63254J127198
3718A7200722J69093m7009M85585M88540l46337L29873r087L09514Q61742O7526
3708A9510162M49761m92961m60098j67555K44057m55626j77527k67441j65348
$$ plain form
3699 18017424 18167743 18122984 18315794 18428636 18411942 18119157 18506003 18511527 18922411 19336700
3689 19336700 19226362 19424150 20101401 20636959 20731761 20762532 21400938 21747267 21671513 21394783
3679 21394783 21986524 21738516 21679130 21524698 21350442 21249501 21019216 21103455 21078295 20903319
3669 20903319 20462966 20193491 19839591 20019023 20070167 19793696 19489138 19638927 19597684 19814098
3659 19814098 20116411 20103295 19848490 20286109 20665009 20724316 21015544 21240950 21356428 21024913
3649 21024913 20501312 20480225 21143123 20392774 20271911 19834542 19254986 19086934 18508991 17790393
3639 17790393 17624689 17228862 16853153 16156199 16062858 15234654 14306401 13830155 14107836 13931563
3629 13931563 13295789 13117364 13115423 12930973 13374874 13159088 12998664 13198420 12839553 13110516
$$ packed form
3699A8017424J50319m4759J92810J12842j6694k92785L86846N524M10884M14289
3689A9336700j10338J97788O77251N35558R4802L0771O38406L46329p5754k76730
3679B1394783N91741k48008n9386j54432j74256j00941k30285Q4239k5160j74976
3669B0903319m40353k69475l53900J79432N1144k76471l04558J49789m1243K16414
3659A9814098L02313j3116k54805M37619L78900N9307K91228K25406J15478l31515
3649B1024913n23601k1087O62898p50349j20863m37369n79556j68052n77943p18598
3639A7790393j65704l95827l75709o96954r3341q28204r28253m76246K77681j76273
3629A3931563o35774j78425j941j84450M43901k15786j60424J99756l58867K70963
$$ plain form
3619 13110516 12763608 12967496 13245855 13378012 13538890 13679910 14040352 14518325 14180692
3610 14180692 14491698 15346302 15324300 15584811 15261577 15816042 16588426 16612298 16857674 17381581
3600 17381581 17937421 18344570 17950414 18072481 18523366 19181270 19681389 19541132 19766825
3591 19766825 19721300 20310981 20967797 21536075 21285797 21711902 22275279 22183460 21957819 21791345
3581 21791345 22198794 22260250 22008498 22344841 21777256 21789611 21768273 21918224 21797246 21530726
3571 21530726 21273613 20650827 20385259 19691602 19514552 19874676 19790777 19339762 18957321 18870052
3561 18870052 18865308 18576024 17966708 18684495 18922450 18949764 19465013 19441588 19794308 20400572
3551 20400572 20359071 20194706 20219521 19899762 20118953 20470677 20935193 21468217 22864626 24018439
$$ packed form
3619A3110516l46908K03888K78359J32157J60878J41020L60442M77973l37633
3610A4180692L11006Q54604k2002K60511l23234N54465P72384K3872K45376N23907
3600A7381581N55840M07149l94156J22067M50885O57904N00119j40257K25693
3591A9766825m5525N89681O56816N68278k50278M26105N63377r1819k25641j66474
3581B1791345M07449O1456k51752L36343n67585J2355k1338J49951j20978k66520
3571B1530726k57113o22786k65568o93657j77050L60124q3899m51015l82441q7269
3561A8870052m744k89284o09316P17787K37955K7314N15249k3425L52720O06264
3551B0400572m1501j64365K4815l19759K19191L51724M64516N33024J396409J153813
$$ plain form
3541 24018439 24009953 24364949 25185418 26308405 26429146 27130204 28049522 29154107 30000368
3532 30000368 30586844 31159198 32254133 33406050 34353796 35660908 36368144 37189018 38497604
3523 38497604 39985602 41687126 43404618 45388920 47730389 49707299 52387165 54753901
3515 54753901 56316911 57732333 59775542 60937445 61675296 62199950 62513588 62727435 62669447
3506 62669447 62871039 62442182 61799078 61404051 60758226 60235007 59886259 58840186 57639048
3497 57639048 56539495 55424101 53300549 50762783 48085854 45772399 43322215 40102712
3489 40102712 37158323 35860208 33845729 31873343 30110724 28859064 27657677 26315962
3481 26315962 26323734 25527638 24549990 23557641 22764189 22483182 22843662 23331648 24147107 25550258
$$ packed form
3541B4018439q486L54996Q20469J122987J20741P01058R19318J104585Q46261
3532C0000368N86476N72354J094935J151917R47746J307112P07236Q20874J308586
3523C8497604J487998J701524J717492J984302K341469J976910K679866K366736
3515E4753901J563010J415422K043209J161903P37851N24654L13638K13847n7988
3506F2669447K01592m28857o43104l95027o45825n23219l48748j046073j201138
3497E7639048j099553j115394k123552k537766k676929k313455k450184l219503
3489D0102712k944389j298115k014479j972386j762619j251660j201387j341715
3481B6315962P772p96096r77648r92349p93452k81007L60480M87986Q15459J403151
$$ plain form
3471 25550258 26418582 25758890 23947428 22229339 20733755 19932693 19106666 18084026 16707053
3462 16707053 16231245 15816227 15233998 14268392 14074966 13954810 13727739 13220734 12246709
3453 12246709 12310183 12439346 12336941 11739158 11669243 11400045 11772314 11939886 12121105 12295835
3443 12295835 12323708 11848128 11544935 11272818 11091732 10843548 11252639 11002801 11103519 10414328
3433 10414328 10425035 10802613 10329129 9752184 10248984 10758368 10163949 9625280 9829592 10266121
3423 10266121 10542074 10693079 10560413 10465955 10816977 10982290 10432841 10627231 10283190 10225000
3413 10225000 10495336 10174692 10497880 10878902 11091887 10818053 11186944 10660600 10549570
3404 10549570 10363024 10549838 10352681 10441122 10396473 10205378 9845261 9468488 9585028 9182125
$$ packed form
3471B5550258Q68324o59692j811462j718089j495584q01062q26027j022640j376973
3462A6707053m75808m15018n82229r65606j93426j20156k27071n07005r74025
3453A2246709O3474J29163j02405n97783o9915k69198L72269J67572J81219J74730
3443A2295835K7873m75580l03193k72117j81086k48184M09091k49838J00718o89191
3433A0414328J0707L77578m73484n76945M96800N09384n94419n38669K04312M36529
3423A0266121K75953J51005j32666r4458L51022J65313n49449J94390l44041n8190
3413A0225000K70336l20644L23188L81022K12985k73834L68891n26344j11030
3404A0549570j86546J86814j97157Q8441m4649j91095l60117l76773J16540m02903
$$ plain form
3394 9182125 9319305 9449278 9648618 9495760 9352102 9527051 10206437 9517421 9436148 9607566
3384 9607566 10022055 9948044 10341867 10361445 10440337 10707680 11080050 11108586 10855388 11129583
3374 11129583 11387871 11391443 11350222 11692902 12193589 12712127 13003675 13291654 13595416 14320970
3364 14320970 14483919 14904716 15345756 15876216 16355757 16982014 17911132 18627273 20235466
3355 20235466 21085020 22053889 23421222 24513576 25026099 26079570 26432686 26094812 25896408
3346 25896408 25681719 25354775 25081690 24336080 23993299 23834514 24022798 23483316 23601668
3337 23601668 23460474 23632460 24092191 23968223 23796201 23417084 23575904 23637274 22378863
3328 22378863 21392238 20522058 19674667 18822945 18277235 17705587 15839989 14115306 13636324
$$ packed form
3394I182125J37180J29973J99340j52858j43658J74949O79386o89016q1273J71418
3384I607566M14489p4011L93823J9578P8892K67343L72370K8536k53198K74195
3374A1129583K58288L572m1221L42680N00687N18538K91548K87979L03762P25554
3364A4320970J62949M20797M41040N30460M79541O26257R29118P16141J608193
3355B0235466Q49554R68869J367333J092354N12523J053471L53116l37874j98404
3346B5896408k14689l26944k73085p45610l42781j58785J88284n39482J18352
3337B3601668j41194J71986M59731j23968j72022l79117J58820O1370j258411
3328B2378863r86625q70180q47391q51722n45710n71648j865598j724683m78982
$$ plain form
3319 13636324 12651746 11766173 11366036 10655356 10760815 10304393 9249700 8163701 8354109
3310 8354109 8504923 7845137 7527149 7158385 6907406 6645341 6250835 6081372 6081618 6079779
3300 6079779 5592357 6218801 6408140 6365492 6237977 5738681 6138596 6220874 6216837 6123587
3290 6123587 5803568 5925809 5315119 4993645 5179656 5519552 5447580 5319759 5814953 5596141
3280 5596141 5631849 5704572 5674099 5899925 5900293 6152989 6071800 6427166 6741606 6809222 6575504
3269 6575504 6194864 6394736 6191290 5933933 5428429 4952908 5343283 4977765 5080005 5168495
3259 5168495 5524696 4986023 4662963 4608754 4340070 4128177 4580915 4760198 4713995 4477113
3249 4477113 4505726 4650635 4498390 4954993 5001774 4972703 4994218 5121143 5018889 4904726
$$ packed form
3319A3636324r84578q85573m00137p10680J05459m56422j054693j085999J90408
3310H354109J50814o59786l17988l68764k50979k62065l94506j69463K46j839
3300F079779m87422O26444J89339m2648j27515m99296L99915Q2278m037r3250
3290F123587l20019J22241o10690l21474J86011L39896p1972j27821M95194k18812
3280E596141L5708P2723l0473K25826L68K52696q1189L55366L14440O7616k33718
3269F575504l80640J99872k03446k57357n05504m75521L90375l65518J02240Q8490
3259E168495L56201n38673l23060n4209k68684k11893M52738J79283m6203k36882
3249D477113K8613J44909j52245M56603M6781k9071K1515J26925j02254j14163
$$ plain form
3239 4904726 4891642 4875432 5019259 4640109 4131087 4541443 4489110 4612286 4753200 4160173
3229 4160173 4711075 4982841 5020457 5190146 5208722 5257296 5216101 4911922 5098778 5739291
3219 5739291 6241258 6181869 5963957 6222083 6049261 6565211 7009707 6584675 6653396 6673757
3209 6673757 6734675 6899665 6746613 6676695 7561241 7471854 7507367 8276703 7999871 7910259
3199 7910259 7972422 8399851 8484527 8347267 8402601 8872184 8952473 9262714 9720778 9830443
3189 9830443 10287404 10676889 10740828 10996662 10838165 10580043 11104503 11198583 10883918 10959092
3179 10959092 11055386 11166113 11956345 11856589 11933273 12495545 12488198 12476365 12342398 12661938
3169 12661938 12832670 12129904 11778746 12857420 12869891 12052879 11508107 11723686 11312241
$$ packed form
3239D904726j3084j6210J43827l79150n09022M10356n2333J23176J40914n93027
3229D160173N50902K71766L7616J69689J8576M8574m1195l04179J86856O40513
3219E739291N01967n9389k17912K58126j72822N15950M44496m25032O8721K0361
3209F673757O0918J64990j53052o9918Q84546q9387L5513P69336k76832q9612
3199G910259O2163M27429Q4676j37260N5334M69583Q0289L10241M58064J09665
3189I830443M56961L89485O3939K55834j58497k58122N24460R4080l14665P5174
3179A0959092R6294J10727P90232r9756P6684N62272p347j1833j33967L19540
3169A2661938J70732p02766l51158J078674J2471q17012n44772K15579m11445
$$ plain form
3160 11312241 10988933 11193826 11348578 11213761 11041928 10903391 10740956 11025876 10877927
3151 10877927 10049143 10303906 10067129 10064739 10059426 9888842 10298693 10895446 10648431 10671634
3141 10671634 10762427 10684435 10710667 11800863 12089565 12240665 12530398 13036343 12716149 13042614
3131 13042614 13792873 14097374 14784515 14945362 15602043 15573574 16268301 16543024 16789973 17488854
3121 17488854 17703127 18044416 18691635 19059092 18973315 19378339 20046683 20201382 20838877 20734120
3111 20734120 20705263 20863159 21417862 22370327 22088700 21376143 21353846 21344338 21375947 21836700
3101 21836700 22302270 22405972 22515623 22398854 22706452 22893653 23606864 23808979 23992514
3092 23992514 24044786 25358174 26062110 26771615 27930524 28924273 30376920 31686838 34227036
$$ packed form
3160A1312241l23308K04893J54752j34817j71833j38537j62435K84920j47949
3151A0877927q28784K54763k36777k390n313j70584M09851N96753k47015K3203
3141A0671634R0793p7992K6232J090196K88702J51100K89733N05945l20194L26465
3131A3042614P50259L04501O87141J60847O56681k8469O94727K74723K46949O98881
3121A7488854K14273L41289O47219L67457q5777M05024O68344J54699O37495j04757
3111B0734120k8857J57896N54703R52465k81627p12557k2297r508L1609M60753
3101B1836700M65570J03702J09651j16769L07598J87201P13211K02115J83535
3092B3992514N2272J313388P03936P09505J158909R93749J452647J309918K540198
$$ plain form
3083 34227036 36746149 38950138 42012478 45177788 49390791 53852622 59375118 66176352
3075 66176352 73059093 80363761 87641804 94606286 100630208 104122781 106022901 105074375
3067 105074375 102607176 100948240 100403420 100238327 101107727 102627008 102420677 101126751 96933424
3058 96933424 90719667 83120210 74607981 66738826 59602277 53720191 48639701 44410300
3050 44410300 39952905 36259407 33465364 30841510 29477281 27807853 26089985 24609676
3042 24609676 23430177 21970811 20552562 19625375 18650964 17792958 16701988 15540253 14779686
3033 14779686 13887591 14112251 13558208 12880583 11868330 11528465 11302338 10921583 10337053
3024 10337053 10012603 9756729 9014882 8691725 8721837 8868622 8991273 8480715 8392174 7667630
$$ packed form
3083C4227036K519113K203989L062340L165310M213003M461831N522496O801234
3075F6176352O882741P304668P278043O964482O023922L492573J900120r48526
3067A05074375k467199j658936n44820j65093Q69400J519281k06331j293926m193327
3058I6933424o213757p599457q512229p869155p136549n882086n080490m229401
3050D4410300m457395l693498k794043k623854j364229j669428j717868j480309
3042B4609676j179499j459366j418249r27187r74411q58006j090970j161735p60567
3033A4779686q92095K24660n54043o77625j012253l39865k26127l80755n84530
3024A0337053l24450k55874p41847l23157L0112J46785J22651n10558q8541p24544
$$ plain form
3014 7667630 7270525 7230531 6771786 6621778 6479657 5675843 5062380 5360648 5904740 6149686
3004 6149686 5789817 5686921 5819617 5512181 5881024 6029407 5858195 6063524 6078683 5856594
2994 5856594 5586278 6040963 6351374 6155046 6465331 6933239 7566359 7610047 7925359 8095308
2984 8095308 7685873 7138586 6290508 5437514 5064207 5030843 4005430 4603833 4512816 3912574
2974 3912574 3194763 3386066 3120929 3238896 3586849 3484957 3303381 3300337 3349481 3322923
2964 3322923 3050861 3693063 3879955 3567692 3656686 3207237 3354236 3937552 4066640 3908517
2954 3908517 4000603 3775565 4129628 3850287 3716448 3727925 2820887 2990640 2333804 2420948
2944 2420948 2571354 2169078 1929489 2270100 2201830 2007584 1181327 1358877 1234314 1028812
$$ packed form
3014G667630l97105l9994m58745j50008j42121q03814o13463K98268N44092K44946
3004F149686l59869j02896J32696l07436L68843J48383j71212K05329J5159k22089
2994E856594k70316M54685L10411j96328L10285M67908O33120M3688L15312J69949
2984H095308m09435n47287q48078q52994l73307l3364j025413N98403r1017o00242
2974C912574p17811J91303k65137J17967L47953j01892j81576l044M9144k6558
2964C322923k72062O42202J86892l12263Q8994m49449J46999N83316J29088j58123
2954C908517R2086k25038L54063k79341j33839J1477r07038J69753o56836Q7144
2944B420948J50406m02276k39589L40611o8270j94246q26257J77550j24563k05502
$$ plain form
2934 1028812 1243897 751136 1475507 1802333 2261874 1350230 1106198 1041720 948807 1054801
2924 1054801 1027995 981067 915808 840862 572325 671294 450351 -37396 439985 573282
2914 573282 34407 416112 600921 761886 1032812 678520 806832 640438 580039 387319
2904 387319 662017 525518 441943 560100 670294 485645 748491 897874 821160 321456
2894 321456 321956 663340 480489 781039 586436 554668 163131 463365 175243 -165644
2884 -165644 -163504 43872 66757 -250513 110303 -358806 -641208 -833996 -724785 -548678
2874 -548678 -705247 -194451 404201 -240340 -401527 -223699 306407 395411 227574 -179606
2864 -179606 -281968 -552673 -501920 -265188 -87117 123214 119095 92981 -66380 176538
$$ packed form
2934A028812K15085m92761P24371L26826M59541r11644k44032o4478r2913J05994
2924A054801k6806m6928o5259p4946k68537R8969k20943m87747M77381J33297
2914E73282n38875L81705J84809J60965K70926l54292J28312j66394o0399j92720
2904C87319K74698j36499q3575J18157J10194j84649K62846J49383p6714m99704
2894C21456N00L41384j82851L00550j94603l1768l91537L00234k88122l40887
2884a65644K140K07376K2885l17270L60816m69109k82402j92788J09211J76107
2874e48678j56569N10796N98652o44541j61187J77828N30106Q9004j67837m07180
2864a79606j02362k70705N0753K36732J78071K10331m119k6114j59361K42918
$$ plain form
2854 176538 23523 -374571 -1166687 -1136532 -557217 -183480 -103396 178650 -278683 -457386
2844 -457386 191103 146012 61604 -23763 -153817 195652 -261883 31327 93321 -43374
2834 -43374 341053 204781 66666 -199253 -499542 -322806 -106081 184466 357016 284964
2824 284964 -148512 -725345 -214047 -231092 82851 -38182 50851 295836 8337 769926
2814 769926 404738 117927 483125 -350804 -52141 109611 273532 -7537 -44923 93625
2804 93625 -232306 -178844 -579111 -258154 158426 277441 346235 98811 -365482 -55030
2794 -55030 -111655 213292 236563 321604 79300 179621 440534 492758 432217 632747 344601
2783 344601 61538 -97319 -249281 -17498 407591 531123 114775 262838 547338 625495
$$ packed form
2854A76538j53015l98094p92116L0155N79315L73737Q0084K82046m57333j78703
2844d57386O48489m5091q4408q5367j30054L49469m57535K93210O1994j36695
2834d3374L84427j36272j38115k65919l00289J76736K16725K90547J72550p2052
2824B84964m33476n76833N11298j7045L13943j21033Q9033K44985k87499P61589
2814G69926l65188k86811L65198q33929K98663J61752J63921k81069l7386J38548
2804I3625l25931N3462m00267L20957M16580J19015O8794k47424m64293L10452
2794e5030n6625L24947K3271Q5041k42304J00321K60913N2224o0541K00530k88146
2783C44601k83063j58857j51962K31783M25089J23532m16348J48063K84500P8157
$$ plain form
2773 625495 327222 -129264 -118002 280733 813358 711614 407166 381884 195351 504591
2763 504591 993018 671182 425123 132718 357017 442878 452360 74963 367322 579741
2753 579741 -89747 54380 106780 -590363 -517822 -363739 -192150 264645 -222677 116432
2743 116432 337773 582927 889182 1055496 262758 3623 633693 216118 -92158 278748
2733 278748 477704 612858 377941 25225 -133615 207430 -11433 -220428 -282569 29144
2723 29144 -57838 -15112 -96782 -401947 -528679 -273049 74756 138494 -276183 -477009 -9699
2712 -9699 385583 351343 152616 737763 406684 135423 348135 133019 -124877 75374
2702 75374 -134183 -237671 -162735 -218309 -650996 -283520 -271674 125313 543674 281765
$$ packed form
2773F25495k98273m56486J1262L98735N32625j01744l04448k5282j86533L09240
2763E04591M88427l21836k46059k92405K24299Q5861R482l77397K92359K12419
2753E79741o69488J44127N2400o97143P2541J54083J71589M56795m87322L39109
2743A16432K21341K45154L06255J66314p92738k59135O30070m17575l08276L70906
2733B78748J98956J35154k34917l52716j58840L41045k18863k08995o2141L11713
2723B9144q6982M2726q1670l05165j26732K55630L47805O3738m14677k00826M67310
2712i699L95282l4240j98727N85147l31079k71261K12712k15116k57896K00251
2702G5374k09557j03488P4936n5574m32687L67476J1846L96987M18361k61909
$$ plain form
2692 281765 207182 371577 250773 -47981 250790 -110380 -79384 99137 -553724 -712194
2682 -712194 -170351 -286248 -413867 -499798 -628789 -325891 -333955 -370632 67200 -179180
2672 -179180 235010 117322 149720 -267221 -153149 75878 -44409 1772 -55815 123333
2662 123333 391359 171760 -66061 384235 267707 -95088 -551100 -337984 -56838 -520961
2652 -520961 -329357 449927 -12378 -226851 254156 593036 215648 120206 501076 -432314
2642 -432314 -565323 -168704 -68899 73273 96594 -31628 -214812 -1088387 -828028 -273022
2632 -273022 -244791 6299 -5021 -330354 306232 495415 -381765 -711238 -449834 -16130
2622 -16130 416996 485104 347814 674595 -79525 382154 293643 -441550 132773 11258
$$ packed form
2692B81765p4583J64395j20804k98754K98771l61170L0996J78521o52861j58470
2682g12194N41843j15897j27619q5931j28991L02898q064l6677M37832k46380
2672a79180M14190j17688L2398m16941J14072K29027j20287M6181n7587J79148
2662A23333K68026k19599k37821M50296j16528l62795m56012K13116K81146m64123
2652e20961J91604P79284m62305k14473M81007L38880l77388r5442L80870r33390
2642d32314j33009L96619R9805J42172K3321j28222j83184q73575K60359N55006
2632b73022K8231K51090j1320l25333O36586J89183q77180l29473K61404M33704
2622a6130M33126O8108j37290L26781p54120M61679q8511p35193N74323j21515
$$ plain form
2612 11258 169285 44731 405139 810268 622480 847801 558022 511613 -161485 -134283
2602 -134283 235297 190727 77294 424518 680555 1619925 1164908 1248767 1432688 1573658
2592 1573658 1156054 955403 738419 197615 568137 540268 1047788 536509 238991 623884
2582 623884 394315 228554 153568 -381167 -378936 -74514 361543 769041 183549 31077
2572 31077 273026 20323 320793 109808 -22511 84581 572130 973552 708543 240441
2562 240441 311230 282478 277739 61329 593144 744820 764520 794098 1210307 611938 -7768
2551 -7768 -138035 -14017 467459 237785 26977 74982 263214 493771 995442 686599
2541 686599 267714 -147130 280216 703595 919850 808101 705061 532316 559870 391661
$$ packed form
2612A1258J58027j24554L60408M05129j87788K25321k89779m6409o73098K7202
2602a34283L69580m4570j13433L47224K56037R39370m55017Q3859J83921J40970
2592A573658m17604k00651k16984n40804L70522k7869N07520n11279k97518L84893
2582F23884k29569j65761p4986n34735K231L04422M36057M07498n85492j52472
2572C1077K41949k52703L00470k10985j32319J07092M87549M01422k65009m68102
2562B40441P0789k8752m739k16410N31815J51676J9700K9578M16209n98369o19706
2551g768j30267J24018M81476k29674k10808M8005J88232K30557N01671l08843
2541F86599m18885m14844M27346M23379K16255j11749j03040j72745K7554j68209
$$ plain form
2531 391661 709522 447232 581628 832953 915998 644730 719205 180400 444345 616362
2521 616362 542368 365121 569962 969040 821181 657571 287370 712414 905174 785055
2511 785055 723058 1205371 1004619 719418 247358 158093 691037 446002 396005 -21632
2501 -21632 -20974 546235 115638 252243 850454 1216272 1525852 1428567 374922 193364
2491 193364 143378 -106227 109145 -92321 517342 853929 426529 880856 822286 702147
2481 702147 830290 871042 982323 1324963 727310 438453 617996 749284 996372 1495431
2471 1495431 1446982 953095 1322642 1386473 1299875 1550952 1557851 1143760 713942 437003
2461 437003 951490 1117761 599527 995139 1426380 1424667 1197851 1542461 1599795 1553813
$$ packed form
2531C91661L17861k62290J34396K51325Q3045k71268P4475n38805K63945J72017
2521F16362p3994j77247K04841L99078j47859j63610l70201M25044J92760j20119
2511G85055o1997M82313k00752k85201m72060q9265N32944k45035m9997m17637
2501b1632O58N67209m30597J36605N98211L65818L09580r7285j053645j81558
2491A93364m9986k49605K15372k01466O09663L36587m27400M54327n8570j20139
2481G02147J28143M0752J11281L42640n97653k88857J79543J31288K47088M99059
2471A495431m8449m93887L69547O3831q6598K51077O899m14091m29818k76939
2461D37003N14487J66271n18234L95612M31241j713k26816L44610N7334m5982
$$ plain form
2451 1553813 1215458 824727 988246 1240157 1313771 2006159 2019634 1248854 677203 1039458
2441 1039458 1396522 1033587 937128 1083776 1576778 1829987 1214370 1231751 1459093 2144168
2431 2144168 2331271 2230737 2045332 2163319 2239161 1758339 1985900 2053754 1532948 1523146
2421 1523146 1695261 2354485 2570655 2529142 2439309 2834459 2599349 2380560 2709752 2330451
2411 2330451 2147601 2616018 2511961 2799648 2851080 2963661 3265000 3368629 3062858 2801385
2401 2801385 2888710 3362662 3721012 3657948 3626078 4022388 4414957 4338048 3924548 3931649 4113007
2390 4113007 3996279 4239441 4386483 4574997 4078787 4095520 4272889 4456136 4522441 4831928
2380 4831928 4900682 5013405 5307259 5729954 5498412 5484322 5855238 5794953 5780116 5739781
$$ packed form
2451A553813l38355l90731J63519K51911P3614O92388J3475p70780n71651L62255
2441A039458L57064l62935r6459J46648M93002K53209o15617J7381K27342O85075
2431B144168J87103j00534j85405J17987P5842m80822K27561O7854n20806r802
2421A523146J72115O59224K16170m1513q9833L95150k35110k18789L29192l79301
2411B330451j82850M68417j04057K87687N1432J12581L01339J03629l05771k61473
2401B801385Q7325M73952L58350o3064l1870L96310L92569p6909m13500P101J81358
2390D113007j16728K43162J47042J88514m96210J6733J77369J83247O6305L09487
2380D831928O8754J12723K93854M22695k31542j4090L70916o0285j4837m0335
$$ plain form
2370 5739781 5761734 6169918 6512523 7093107 7457427 8294338 8133402 8658364 8771731 9107034
2360 9107034 9665028 10428804 10335855 11649352 12254656 12046510 12390081 12778698 13253633 14272244
2350 14272244 14798866 16446500 16962680 19265604 23042177 27360758 30022717 30799935 29999204
2341 29999204 30823784 33136911 38208012 43077676 50413634 58333499 71887338 89378519
2333 89378519 116619885 167384416 272066038 379964544 417180495 346729421 221014147
2326 221014147 140848968 94318489 67801196 47960793 36251739 28474542 24357128
2319 24357128 21540629 20796419 19626978 21023329 22364340 23239948 20476503 16675181
2311 16675181 13821613 12592536 10929325 9433448 8329067 7326938 6394709 5577795
$$ packed form
2370E739781K1953M08184L42605N80584L64320Q36911j60936N24962J13367L35303
2360I107034N57994P63776r2949J313497O05304k08146L43571L88617M74935J018611
2350A4272244N26622J647634N16180K302924L776573M318581K661959P77218q00731
2341B9999204Q24580K313127N071101M869664P335958P919865J3553839J7491181
2333H9378519K7241366N0764531J04681622J07898506L7215951p0451074j25715274
2326B21014147q0165179m6530479k6517293j9840403j1709054p777197m117414
2319B4357128k816499p44210j169441J396351J341011Q75608k763445l801322
2311A6675181k853568j229077j663211j495877j104381j002129r32229q16914
$$ plain form
2303 5577795 4527690 4525502 4201111 4031830 4791170 4139849 4189529 4537663 4376613 3964096
2293 3964096 3630335 3518332 2837688 2643566 3380805 3071806 2683832 3063806 3204114 2624140
2283 2624140 2534229 2202507 2222462 2089564 1558356 1551329 1220593 1411871 1263651 919818
2273 919818 1401391 1682718 1594736 1334598 1008176 1174215 1345678 1125507 728503 553075
2263 553075 359546 195795 538457 678020 784248 499139 923032 572713 269808 -118408
2253 -118408 254431 319602 351032 418354 371781 30229 69011 213602 413466 -179283 -347089
2242 -347089 -482546 -377582 12506 595149 163417 375523 345167 -163655 147521 254237
2232 254237 -99250 -37318 -223340 -14628 -483131 -13979 275801 52751 -70287 -138570
$$ packed form
2303E577795j050105k188l24391j69281P59340o51321M9680L48134j61050m12517
2293C964096l33761j12003o80644j94122P37239l08999l87974L79974J40308n79974
2283B624140q9911l31722J9955j32898n31208p027l30736J91278j48220l43833
2273I19818M81573K81327q7982k60138l26422J66039J71463k20171l97004j75428
2263E53075j93529j63751L42662J39563J06228k85109M23893l50319l02905l88216
2253a18408L72839O5171L1430O7322m6573l41552L8782J44591J99864n92749j67806
2242c47089j35457J04964L90088N82643m31732K12106l0356n08822L11176J06716
2232B54237l53487O1932j86022K08712m68503M69152K89780k23050j23038o8283
$$ plain form
2222 -138570 287451 115181 168979 41471 122788 19600 -61266 -68848 -494925 -136388 304240
2211 304240 -182711 -398683 -78903 -493628 -210614 -213694 -784305 -1009432 -442371 -210891
2201 -210891 -460041 -298077 377839 646806 -9629 85613 121028 391085 647617 191778
2191 191778 78336 148454 -46741 -512013 -671864 -809862 -370310 -586949 -44203 -472905
2181 -472905 -1029677 -671751 -709714 88401 16061 -156553 -553764 -146513 -189022 -201533
2171 -201533 243694 -220429 -480451 -276914 -584495 18419 -27472 -642084 -176192 -132256
2161 -132256 -246927 13654 10539 -450991 -726335 -555264 -867224 -638774 -322646 -448571
2151 -448571 -514963 -1116088 -1194184 -875244 -358440 -62440 -1087041 -1219825 -874757 -613480
$$ packed form
2222a38570M26021j72270N3798j27508Q1317j03188q0866p582m26077L58537M40628
2211C04240m86951k15972L19780m14725K83014l080n70611k25127N67061K31480
2201b10891k49150J61964O75916K68967o56435R5242L5415K70057K56532m55839
2191A91778j13442P0118j95195m65272j59851j37998M39552k16639N42746m28702
2181d72905n56772L57926l7963P98115p2340j72614l97211M07251m2509j2511
2171b01533M45227m64123k60022K03537l07581O02914m5891o14612M65892M3936
2161a32256j14671K60581l115m61530k75344J71071l11960K28450L16128j25925
2151d48571o6392o01125p8096L18940N16804K96000j024601j32784L45068K61277
$$ plain form
2141 -613480 -453002 -151 -472369 -268733 -473025 195826 727597 402689 -351933 -603707
2131 -603707 -176617 -83096 -1565 -182287 -561579 -552425 -400719 -543350 -624729 -580619 -357560
2120 -357560 -206863 -554376 -365527 -190836 80434 315358 339419 -130903 -322281 4221
2110 4221 -195668 -640870 -1263577 -757457 -888392 -571332 -441620 -153655 -22790 -185533
2100 -185533 148153 -252711 -713172 -524269 -177462 -58852 -385584 -435243 -420514 -546652
2090 -546652 69004 -103224 -265721 34479 14005 -58431 -378457 -427636 -962388 -676226
2080 -676226 -373098 -70677 -571651 -741902 -392513 -212530 106642 22296 -236765 -244231
2070 -244231 -43756 -516927 -805939 -577525 -252236 -62226 -17903 274878 995752 1491021
$$ packed form
2141f13480J60478M52851m72218K03636k04292O68851N31771l24908p54622k51774
2131f03707M27090R3521Q1531j80722l79292R154J51706j42631q1379M4110K23059
2120c57560J50697l47513J88849J74691K71270K34924K4061m70322j91378L26502
2110D221j99889m45202o22707N06120j30935L17060J29712K87965J30865j62743
2100a85533L33686m00864m60461J88903L46807J18610l26732m9659J4729j26138
2090e46652O15656j72228j62497L00200k0474p2436l20026m9179n34752K86162
2080f76226L03128L02421n00974j70251L49389J79983L19172q4346k59061p466
2070b44231K00475m73171k89012K28414L25289J90010M4323K92781P20874M95269
$$ plain form
2060 1491021 1259964 1204458 837532 33409 172388 422489 -71328 28159 689970 401472
2050 401472 -662658 -427000 22924 260645 347413 326699 -100311 -132942 -475022 -379585
2040 -379585 352576 405300 -75312 -290877 120154 326647 161567 208538 175805 -313385
2030 -313385 -289585 -154444 54629 21093 619073 402530 13295 -598966 -835504 -447567
2020 -447567 -516370 -943469 -804550 -601476 -470982 -556430 -836419 -320786 -166843 -113138
2010 -113138 -174165 194671 341328 -104691 -747633 -841832 -260992 357929 -340860 -868642
2000 -868642 -387904 -769157 -336735 -751166 -972761 -1056344 -516578 -98712 -499400 36039
1990 36039 128927 37450 -436490 -518900 -153354 -177034 -88932 -348683 10616 -223846 -50855
$$ packed form
2060A491021k31057n5506l66926q04123J38979K50101m93817R9487O61811k88498
2050D01472j064130K35658M49924K37721Q6768k0714m27010l2631l42080R5437
2040c79585P32161N2724m80612k15565M11031K06493j65080M6971l2733m89190
2030c13385K3800J35141K09073l3536N97980k16543l89235o12261k36538L87937
2020d47567o8803m27099J38919K03074J30494q5448k79989N15633J53943N3705
2010a13138o1027L68836J46657m46019o42942r4199N80840O18921o98789n27782
2000h68642M80738l81253M32422m14431k21595q3583N39766M17866m00688N35439
1990C6039R2888r1477m73940q2410L65546k3680Q8102k59751L59299k34462J72991
$$ plain form
1979 -50855 111057 -810991 -735584 -701474 -668858 -551410 -623043 -537726 -102077 673310 427641
1968 427641 -113847 -100918 -504160 -696628 -239588 -239541 -412672 -443992 -942345 -1078562 -1099344
1957 -1099344 -1065025 -630232 -405076 -383531 -382650 -118762 -288622 -272634 -163395 -530848 -753389
1946 -753389 -966878 -1196790 -872087 -137301 -85154 -507682 -499402 -264210 -259396 -437240 23698
1935 23698 524020 66850 -419347 -939857 -372483 -82195 13068 -200503 -394130 198520
1925 198520 529291 380337 181646 -178716 -300314 -199633 -305123 32297 85465 83662
1915 83662 -92926 -234791 20270 378078 215504 -256206 58588 -158435 -746999 -1014868
1905 -1014868 -504524 -371049 37920 -165880 -852828 -646273 -124905 -78029 123350 -54657
$$ packed form
1979e0855J61912r22048P5407L4110L2616J17448p1633Q5317M35649P75387k45669
1968D27641n41488J2929m03242j92468M57040M7j73131l1320m98353j36217k0782
1957a099344L4319M34793K25156K1545Q81K63888j69860J5988J09239l67453k22541
1946g53389k13489k29912L24703P34786N2147m22528Q280K35192M814j77844M60938
1935B3698N00322m57170m86197n20510N67374K90288R5263k13571j93627N92650
1925A98520L30771j48954j98691l60362j21598J00681j05490L37420N3168j803
1915H3662j76588j41865K55061L57808j62574m71710L14794k17023n88564k67869
1905a014868N10344J33475M08969k03800o86948K06555N21368M6876K01379j78007
$$ plain form
1895 -54657 -370698 -6152 -394994 -400999 81424 -28770 292207 414277 -165240 -271620
1885 -271620 -113037 -349577 -431611 -298444 -108799 -129441 -113831 -184507 -11414 -280322
1875 -280322 -154361 381625 314858 377033 -24469 -121613 -54845 -262268 -260930 -276130 283790
1864 283790 331904 46274 318831 220648 181430 205570 -11922 -198584 -354439 -499026
1854 -499026 -446058 -383690 -191637 -689285 -155115 67595 94636 258032 465800 673472
1844 673472 238562 -158279 88665 -490675 -539947 -566955 -804878 24645 100368 213031
1834 213031 -5621 41376 109679 -302856 -129092 -175130 125229 -181728 53210 -49702
1824 -49702 -207519 213681 258690 -369470 -90863 -120995 -282155 3581 97507 -453486
$$ packed form
1895e4657l16041L64546l88842o005M82423j10194L20977J22070n79517j06380
1885b71620J58583k36540q2034J33167J89645k0642J5610p0676J73093k68908
1875b80322J25961N35986o6767O2175m01502r7144O6768k07423J338j5200N59920
1864B83790M8114k85630K72557r8183l9218K4140k17492j86662j55855j44587
1854d99026N2968O2368J92053m97648N34170K22710K7041J63396K07768K07672
1844F73472m34910l96841K46944n79340m9272k7008k37923Q29523P5723J12663
1834B13031k18652M6997O8303m12535J73764m6038L00359l06957K34938j02912
1824d9702j57817M21200M5009o28160K78607l0132j61160K85736R3926n50993
$$ plain form
1814 -453486 -789592 102598 94877 259888 234363 320 81899 452250 41234 -141142
1804 -141142 -42203 -330566 -539920 -456088 -420741 -808580 -240915 -186788 -87679 -169765 -17388
1793 -17388 376797 -101073 -427752 -11095 118882 -82209 -324407 45526 304612 -180801
1783 -180801 -426321 -657707 -742015 -408299 -177970 -453733 -187619 -26607 19138 -139052
1773 -139052 253260 84152 -270745 -566230 -248946 -23970 -499908 -911247 -666835 -408817
1763 -408817 189544 82935 -262725 -421008 -301454 -588252 -297998 -88383 -318867 -684281
1753 -684281 -436164 510742 627189 559615 380734 504848 303805 -5941 5052 288227
1743 288227 -8781 -137537 -315402 -304783 172778 -118473 -644003 -127446 104713 -168193
$$ packed form
1814d53486l36106Q92190p721J65011k5525k34043Q1579L70351m11016j82376
1804a41142R8939k88363k09354Q3832L5347l87839N67665N4127R9109q2086J52377
1793a7388L94185m77870l26679M16657J29977k01091k42198L69933K59086m85413
1783a80801k45520k31386q4308L33716K30329k75763K66114J61012M5745j58190
1773a39052L92312j69108l54897k95485L17284K24976m75938m11339K44412K58018
1763d08817N98361j06609l45660j58283J19554k86798K90254K09615k30484l65414
1753f84281K48117R46906J16447o7574j78881J24114k01043l09746J0993K83175
1743B88227k97008j28756j77865J0619M77561k91251n25530N16557K32159k72906
$$ plain form
1733 -168193 189677 78146 -383619 -675036 -532308 -300459 -525993 -303586 -62323 86173
1723 86173 130266 41156 -26923 -383054 25140 295963 308084 -122956 -662522 -120269 -523519
1712 -523519 -1239645 -716500 -280665 279155 572002 261611 61454 255985 28395 -32129
1702 -32129 -154243 -267625 12085 -167162 -297128 -322699 -615510 -677435 -175212 -435324
1692 -435324 -293163 -122410 -286509 195224 314578 -328709 -98023 128131 -617612 -391329
1682 -391329 -502492 -2437 -15357 -600843 -390780 -86360 323404 5329 -10583 -205778
1672 -205778 -776476 -380713 -40771 153311 -90953 -111053 -196721 -90814 58033 424172
1662 424172 307318 559212 857152 -148774 90708 -65440 -289419 -262556 -312689 282293
$$ packed form
1733a68193L57870j11531m61765k91417J42728K31849k25534K22407K41263J48496
1723H6173M4093q9110o8079l56131M08194K70823J2121m31040n39566N42253m03250
1712e23519p16126N23145M35835N59820K92847l10391k00157J94531k27590o0524
1702c2129j22114j13382K79710j79247j29966k5571k92811o1925N02223k60112
1692d35324J42161J70753j64099M81733J19354o43287K30686K26154p45743K26283
1682c91329j11163N00055j2920n85486K10063L04420M09764l18075j5912j95195
1672b05778n70698L95763L39942J94082k44264k0100q5668J05907J48847L66139
1662D24172j16854K51894K97940j005926K39482j56148k23979K6863n0133N94982
$$ plain form
1652 282293 525415 -204816 -192402 -317779 -191513 -241340 -95221 -317178 -15430 163120
1642 163120 -84642 -449406 -558780 -97600 309173 135214 -8607 -357325 -294415 -320432
1632 -320432 -110828 -546150 -236383 -279085 -346058 256879 -285418 -633197 -672156 -676868 -5676
1621 -5676 349194 32558 -494438 -600833 -21397 175570 -72700 209589 -83603 -166780
1611 -166780 146959 -150401 436668 94154 175998 404165 241293 -47609 -182849 -639467
1601 -639467 -512713 -849910 -960365 -481378 -598121 -382197 -508212 -226277 322106 323068
1591 323068 258640 -532691 -517583 -89734 25628 -181413 45104 303279 255186 342472
1581 342472 -61199 -382105 170201 -109541 -23825 246701 537023 176955 144076 79054
$$ packed form
1652B82293K43122p30231J2414j25377J26266m9827J46119k21957L01748J78550
1642A63120k47762l64764j09374M61180M06773j73959j43821l48718O2910k6017
1632c20432K09604m35322L09767m2702o6973O02937n42297l47779l8959m712O71192
1621e676L54870l16636n26996j06395N79436J96967k48270K82289k93192q3177
1611a66780L13739k97360N87069l42514Q1844K28167j62872k88902j35240m56618
1601f39467J26754l37197j10455M78987j16743K15924j26015K81935N48383R62
1591C23068o4428p91331J5108M27849J15362k07041K26517K58175m8093Q7286
1581C42472m03671l20906N52306k79742Q5716K70526K90322l60068l2879o5022
$$ plain form
1571 79054 -354439 -380644 -639365 -550956 -109984 -644043 -1035827 -289704 100201 -10913
1561 -10913 -6443 72135 -304286 -89430 116233 -765428 -703093 -201461 112300 472355 175565
1550 175565 -162285 -91311 -135503 -74087 -222418 -617617 -834065 -348053 354504 279015
1540 279015 346581 219264 -325926 -683600 -135424 -62621 79886 -352185 -246354 16259
1530 16259 -280234 -301489 -165134 -349023 358049 -9590 -84263 -307752 -353758 24923
1520 24923 -278163 284380 115691 -88504 -198679 -341977 -503577 -622769 -177573 177961
1510 177961 -365767 -548244 -100644 -580396 -869930 -396554 -364057 -16091 379891 1057196
1500 1057196 466477 268455 395604 53276 -295460 -204699 -236629 -7665 -805322 -896166
$$ packed form
1571G9054m33493k6205k58721Q8409M40972n34059l91784P46123L89905j11114
1561a0913M470P8578l76421K14856K05663q81661O2335N01632L13761L60055k96790
1550A75565l37850P0974m4192O1416j48331l95199k16448M86012P02557p5489
1540B79015O7566j27317n45190l57674N48176P2803J42507m32071J05831K62613
1530A6259k96493k1255J36355j83889P07072l67639p4673k23489m6006L78681
1520B4923l03086N62543j68689k04195j10175j43298j61600j19192M45196L55534
1510A77961n43728j82477M47600m79752k89534M73376L2497L47966L95982O77305
1500A057196n90719j98022J27149l42328l48736R0761l1930K28964p97657r0844
$$ plain form
1490 -896166 -332166 -472827 -334081 -737338 -566924 -209527 -129325 -81084 -281899 -477048
1480 -477048 -443783 -169991 167554 -404799 -242981 -303141 319712 726831 95511 -127351
1470 -127351 89322 381328 333657 171553 149693 55016 268308 250630 593917 755458
1460 755458 272451 -393077 -174015 211795 -24457 442919 219371 -51806 494100 -29415
1450 -29415 -434755 -207006 -590875 -172681 127565 425552 489196 180821 388799 394772
$$ packed form
1490h96166N64000j40661J38746m03257J70414L57397Q0202M8241k00815j95149
1480d77048L3265K73792L37545n72353J61818o0160O22853M07119o31320k22862
1470a27351K16673K92006m7671j62104k1860r4677K13292j7678L43287J61541
1460G55458m83007o65528K19062L85810k36252M67376k23548k71177N45906n23515
1450b9415m05340K27749l83869M18194L00246K97987O3644l08375K07978N973
$$ [...]
##END NTUPLES=NMR SPECTRUM
##END=
