##TITLE=1H_DE-80H_X3
 200.13MHz, d2o
 8 sc
 
 19ns.26.2.2025
##JCAMPDX= 6.0         $$ Bruker NMR JCAMP-DX V2.0
##DATA TYPE= NMR SPECTRUM
##DATA CLASS= NTUPLES
##ORIGIN= UXNMR, Bruker Analytische Messtechnik GmbH
##OWNER= pz
$$ XWIN-NMR		Version 3.5
$$ Tue Dec 23 10:46:20 2025 Russian Standard Time (UT+4h)  Yarkov@DPX200
##.OBSERVE FREQUENCY= 200.1313
##.OBSERVE NUCLEUS= ^1H
##.ACQUISITION MODE= SIMULTANEOUS
##.ACQUISITION SCHEME= undefined
##.AVERAGES= 8
##.DIGITISER RES= 18
##SPECTROMETER/DATA SYSTEM= spect
##.PULSE SEQUENCE= zg30
##.SOLVENT NAME= CDCl3
##.SHIFT REFERENCE= (INTERNAL, CDCl3, 0, 15.4825)
##AUDIT TRAIL= $$ (NUMBER, WHEN, WHO, WHERE, WHAT)
$$ ##TITLE= Audit trail, XWIN-NMR		Version 3.5
$$ ##JCAMPDX= 5.01
$$ ##ORIGIN= Bruker BioSpin GmbH
$$ ##OWNER= Yarkov
$$ C:/Bruker/XWIN-NMR/data/yarkov2/nmr/H-C/1/pdata/1/auditp.txt
$$ ##AUDIT TRAIL=  $$ (NUMBER, WHEN, WHO, WHERE, WHAT)
(   1,<2025-12-23 10:45:24.29 +0400>,<Yarkov>,<DPX200>,
      <created by zg, POWCHK disabled, PULCHK disabled
       configuration hash MD5:
       00 E9 B6 7A A2 85 ED C7 34 08 36 98 17 FE 4E 26
       data hash MD5: 16K
       53 0B CE B6 D0 A8 6A D2 C8 8C 51 81 70 35 C0 EE>)
(   2,<2025-12-23 10:45:37.54 +0400>,<Yarkov>,<DPX200>,
      <Start of raw data processing
       efp BC_mod = 2 LB = 0.25 FT_mod = 6 PKNL = 1 PHC0 = -5299.955 PHC1 = 10.82193 SI = 16K 
       data hash MD5: 16K
       51 CD 66 5D 41 64 FB 93 A7 92 16 F0 C4 29 31 F5>)
$$ ##END=
$$ 
$$ hash MD5
$$ C2 3B DF EA 82 31 99 F8 D5 49 4D B6 DE 75 39 75
##$RELAX= 
##$RELAX= 
##$RELAX= 
##$RELAX= 
##$RELAX= 
##$RELAX= 
$$ Bruker specific parameters
$$ --------------------------
##$DU= <C:/Bruker/XWIN-NMR>
##$EXPNO= 1
##$NAME= <H-C>
##$PROCNO= 1
##$TYPE= <nmr>
##$USER= <yarkov2>
##$AMP= (0..31)
100 100 100 100 100 100 100 100 100 100 100 100 100 100 100 100 100 100 
100 100 100 100 100 100 100 100 100 100 100 100 100 100 
##$AQSEQ= 0
##$AQ_mod= 1
##$AUNM= <au_zg>
##$AUTOPOS= <>
##$BF1= 200.13
##$BF2= 200.13
##$BF3= 200.13
##$BF4= 200.13
##$BF5= 200.13
##$BF6= 200.13
##$BF7= 200.13
##$BF8= 200.13
##$BYTORDA= 1
##$CFDGTYP= 0
##$CFRGTYP= 5
##$CHEMSTR= <none>
##$CNST= (0..31)
1 1 145 1 1 1 1 1 1 1 1 1 1 1 1 1 1 1 1 1 1 1 1 1 1 1 1 1 1 1 1 1 
##$CPDPRG= <>
##$CPDPRG1= <>
##$CPDPRG2= <>
##$CPDPRG3= <>
##$CPDPRG4= <mlev>
##$CPDPRG5= <mlev>
##$CPDPRG6= <mlev>
##$CPDPRG7= <mlev>
##$CPDPRG8= <mlev>
##$CPDPRGB= <>
##$CPDPRGT= <>
##$D= (0..31)
0 0.7 0 0 0 0 0 0 0 0 0 0.03 0 0 0 0 0 0 0 0 0 0 0 0 0 0 0 0 0 0 0 0 
##$DATE= 1766472323
##$DBL= (0..7)
120 120 120 120 120 120 120 120 
##$DBP= (0..7)
150 150 150 150 150 150 150 150 
##$DBP07= 0
##$DBPNAM0= <>
##$DBPNAM1= <>
##$DBPNAM2= <>
##$DBPNAM3= <>
##$DBPNAM4= <>
##$DBPNAM5= <>
##$DBPNAM6= <>
##$DBPNAM7= <>
##$DBPOAL= (0..7)
0.5 0.5 0.5 0.5 0.5 0.5 0.5 0.5 
##$DBPOFFS= (0..7)
0 0 0 0 0 0 0 0 
##$DE= 6
##$DECBNUC= <off>
##$DECIM= 32
##$DECNUC= <off>
##$DECSTAT= 4
##$DIGMOD= 1
##$DIGTYP= 9
##$DL= (0..7)
0 120 120 120 120 120 120 120 
##$DP= (0..7)
$$ [...]
##$SUBNAM2= <"">
##$SUBNAM3= <"">
##$SUBNAM4= <"">
##$SUBNAM5= <"">
##$SUBNAM6= <"">
##$SUBNAM7= <"">
##$SUBNAM8= <"">
##$SUBNAM9= <"">
##$SW= 18.0517328524113
##$SWIBOX= (0..15)
0 0 2 0 0 0 0 0 0 0 0 0 0 0 0 0 
##$SW_h= 3612.71676300578
##$TD= 16384
##$TD0= 1
##$TE= 0
##$TE2= 300
##$TE3= 300
##$TEG= 300
##$TL= (0..7)
0 120 120 120 120 120 120 120 
##$TP= (0..7)
150 150 150 150 150 150 150 150 
##$TP07= 0
##$TPNAME0= <>
##$TPNAME1= <>
##$TPNAME2= <>
##$TPNAME3= <>
##$TPNAME4= <>
##$TPNAME5= <>
##$TPNAME6= <>
##$TPNAME7= <>
##$TPOAL= (0..7)
0.5 0.5 0.5 0.5 0.5 0.5 0.5 0.5 
##$TPOFFS= (0..7)
0 0 0 0 0 0 0 0 
##$TUNHIN= 0
##$TUNHOUT= 0
##$TUNXOUT= 0
##$USERA1= <user>
##$USERA2= <user>
##$USERA3= <user>
##$USERA4= <user>
##$USERA5= <user>
##$V9= 5
##$VALIST= <valist>
##$VCLIST= <CCCCCCCCCCCCCCC>
##$VD= 0
##$VDLIST= <DDDDDDDDDDDDDDD>
##$VPLIST= <PPPPPPPPPPPPPPP>
##$VTLIST= <TTTTTTTTTTTTTTT>
##$WBST= 1024
##$WBSW= 4
##$XGAIN= (0..3)
0 0 0 0 
##$XL= 0
##$YL= 0
##$YMAX_a= 37873
##$YMIN_a= -41798
##$ZGOPTNS= <>
##$ZL1= 120
##$ZL2= 120
##$ZL3= 120
##$ZL4= 120
##$ABSF1= 0
##$ABSF2= 0
##$ABSG= 0
##$ABSL= 0
##$ALPHA= 0
##$AQORDER= 0
##$ASSFAC= 0
##$ASSFACI= 0
##$ASSFACX= 0
##$ASSWID= 0
##$AUNMP= <proc_1d>
##$AZFE= 0.1
##$AZFW= 0.1
##$BCFW= 0
##$BC_mod= 2
##$BYTORDP= 0
##$COROFFS= 0
##$CY= -3
##$DATMOD= 1
##$DC= 0
##$DFILT= <>
##$DTYPP= 0
##$F1P= 0
##$F2P= 0
##$FCOR= 1
##$FTSIZE= 16384
##$FT_mod= 6
##$GAMMA= 0
##$GB= 0
##$INTBC= 1
##$INTSCL= 3.241238e-09
##$ISEN= 128
##$LB= 0.25
##$LEV0= 0
##$LPBIN= 0
##$MAXI= 10000
##$MC2= 0
##$MEAN= 0
##$ME_mod= 0
##$MI= 1.114404
##$NCOEF= 0
##$NC_proc= -9
##$NLEV= 6
##$NOISF1= 3.799351
##$NOISF2= 2.8
##$NSP= 0
##$NTH_PI= 0
##$NZP= 0
##$OFFSET= 15.48246
##$PC= 1
##$PHC0= -5299.955
##$PHC1= 10.82193
##$PH_mod= 1
##$PKNL= yes
##$PPARMOD= 0
##$PSCAL= 0
##$PSIGN= 0
##$REVERSE= no
##$SF= 200.130007854416
##$SI= 16384
##$SIGF1= 3
##$SIGF2= 2
##$SINO= 0.751879
##$SIOLD= 32768
##$SREGLST= <19F.Aceton>
##$SSB= 0
##$STSI= 16384
##$STSR= 0
##$SW_p= 3612.71676300578
##$SYMM= 0
##$S_DEV= 0
##$TDeff= 16384
##$TDoff= 0
##$TI= <>
##$TILT= no
##$TM1= 0
##$TM2= 0
##$TOPLEV= 0
##$USERP1= <user>
##$USERP2= <user>
##$USERP3= <user>
##$USERP4= <user>
##$USERP5= <user>
##$WDW= 1
##$XDIM= 16384
##$YMAX_p= 526267943
##$YMIN_p= -2158604
$$ End of Bruker specific parameters
$$ ---------------------------------
##NTUPLES= NMR SPECTRUM
##VAR_NAME=  FREQUENCY,     SPECTRUM/REAL,   SPECTRUM/IMAG
##SYMBOL=    X,             R,               I
##VAR_TYPE=  INDEPENDENT,   DEPENDENT,       DEPENDENT
##VAR_FORM=  AFFN,          ASDF,            ASDF
##VAR_DIM=   16384,         16384,           16384
##UNITS=     HZ,            ARBITRARY UNITS, ARBITRARY UNITS
##FACTOR=    0.220516191357247, 1,           1
##FIRST=     3098.50484580307, 0,            0
##LAST=      -514.211917202711, 0,           0
##MIN=       -514.211917202711, -2158604,    0
##MAX=       3098.50484580307, 526267943,    0
$$ Real data points
##PAGE= N=1
##DATA TABLE= (X++(R..R)), XYDATA
$$ [...]
7136B891586j08493O68705p7210J00209n7209K81830o75707J14000r79150k4327
$$ 2891586 2783093 3451798 3374588 3474797 3417588 3699418 3023711 3137711 2158561 2134234
7126B134234Q66728N19299j13510L58972J71530n54052N0238l92449n44779l25114
$$ 2134234 3000962 3520261 3406751 3765723 3937253 3383201 3433439 3040990 2496211 2171097
7116B171097j95735N5846J070693j02997l87001N91076l51325m22913P39699n64368
$$ 2171097 1975362 2031208 3101901 2998904 2611903 3202979 2851654 2428741 3168440 2604072
7106B604072r96686K89770L91817J69529P09016j84632l98492M69836J96336j13443
$$ 2604072 1607386 1897156 2288973 2458502 3167518 2982886 2584394 3054230 3250566 3137123
7096C137123L24970N0907k90845K41805o29271n17471J71720k37709l97859L53329
$$ 3137123 3462093 3513000 3222155 3463960 2834689 2317218 2488938 2251229 1853370 2206699
7086B206699M62628l41857P09391l72875j02855J043942n15550q59790M64618
$$ 2206699 2669327 2327470 3036861 2663986 2561131 3605073 3089523 2229733 2694351
7077B694351m13507N88979K05232j31412q1828L70914k95565n02931K29659J12206
$$ 2694351 2280844 2869823 3075055 2943643 2861815 3232729 2937164 2434233 2663892 2776098
7067B776098m56717L921k62376r8038P44943J75660k3630N78333K04658p88334
$$ 2776098 2319381 2323302 2060926 1962888 2707831 2883491 2859861 3438194 3642852 2854518
7057B854518m22871q06505k31015J69237O81461P4462O01537j18642M42233K9455
$$ 2854518 2431647 1625142 1394127 1563364 2244825 2319287 2920824 2802182 3244415 3273870
7047C273870n12302k11348k64471P71112L84924p63792M89489K60050o11471N40186
$$ 3273870 2761568 2550220 2285749 3056861 3441785 2677993 3167482 3427532 2816061 3356247
7037C356247K73163l46530j17647p47400l80284M69475N4932q43934M07662L62156
$$ 3356247 3629410 3282880 3165233 2417833 2037549 2507024 2561956 1718022 2125684 2487840
7027B487840l74519O8325r8278m85881O62537J78738j11205P5329n0862j97706
$$ 2487840 2113321 2181646 2083368 1597487 2260024 2438762 2327557 2402886 2352024 2154318
7017B154318M75760n84059q81955P00987L65162L01479n8306l12423J64762J77760
$$ 2154318 2630078 2046019 1164064 1865051 2230213 2531692 2473386 2160963 2325725 2503485
7007B503485J99479j86895P9120L13792l76851l45410k08596K7298K2767j14597
$$ 2503485 2702964 2516069 2595189 2908981 2532130 2186720 1978124 2005422 2028189 1913592
6997A913592L92878j92263n5054K68361r0569L58346k68382K61449p0039m50751
$$ 1913592 2306470 2114207 2059153 2327514 2236945 2595291 2326909 2588358 2518319 2067568
6987B067568K46169Q5841J17740m0362o9577q4591M66985P0548o94456L78439
$$ 2067568 2313737 2399578 2517318 2476956 2407379 2322788 2789773 2860321 2165865 2544304
6977B544304l09502j50745L0698j86513m6431J43585K66994L27039M53892p64816
$$ 2544304 2234802 2084057 2114755 1928242 1881811 2025396 2292390 2619429 3073321 2308505
6967B308505r8223l5044n77343K03316L06558O16145l37264k55037l9397P4883
$$ 2308505 2210282 2175238 1597895 1801211 2107769 2723914 2386650 2131613 2092216 2167099
6957B167099O9756K28451k90004k26399p3641K1547J7821o8865K77853N59527
$$ 2167099 2236855 2465306 2175302 1948903 1875262 1896809 1914630 1845765 2123618 2683145
6947B683145J5889n20334P8885J14088K1075j21004j88101l86652N68092J7612
$$ 2683145 2699034 2178700 2257585 2371673 2392748 2271744 2083643 1696991 2265083 2282695
6937B282695j07158N2363N58824k6098o88495l35423o31688Q03260N6875m46552
$$ 2282695 2175537 2227900 2786724 2760626 2072131 1736708 1105020 1908280 1965155 1518603
6927A518603j60492K95899n06770K65117K72019p8879K39902p6989Q8601m52322
$$ 1518603 1358111 1654010 1147240 1412357 1684376 1605497 1845399 1768410 1857011 1404689
6917A404689r5778K45445l05233j22902K54941J28945M83011j044m74253J19832
$$ 1404689 1308911 1554356 1249123 1126221 1381162 1510107 1993118 1992074 1517821 1637653
6907A637653O28100L26633k59482q63524m02802P666L17156K06789N21820j89011
$$ 1637653 2265753 2592386 2332904 1469380 1066578 1074244 1391400 1598189 2120009 1930998
6897A930998L35865P5095l72846J08049l44051k95048n55716R2914O53707N03847
$$ 1930998 2266863 2341958 1969112 2077161 1733110 1438062 882346 975260 1628967 2132814
6887B132814M49438k7301p61987J33413L22218L23755R9982p66733n50700L75599
$$ 2132814 2582252 2554951 1792964 1926377 2248595 2572350 2672332 1905599 1354899 1730498
6877A730498k93824l72907R62275L24451K55778J18027k03844m49479q99464m75849
$$ 1730498 1436674 1063767 2026042 2350493 2606271 2724298 2520454 2070975 1171511 695662
6867F95662J51469M46470l43315L20163J95337O05982n46324j0864R8583L29973
$$ 695662 847131 1293601 950286 1270449 1465786 2071768 1525444 1514580 1613163 1943136
6857A943136k64116p20453Q60495l11399p64061n9997O53929Q58945j73103R1913
$$ 1943136 1679020 958567 1819062 1507663 743602 683605 1337534 2196479 2023376 2115289
6847B115289N2193M42890J04154o53092j49152j05407n03603K62079O23462l86167
$$ 2115289 2167482 2610372 2714526 2061434 1912282 1806875 1303272 1565351 2188813 1802646
6837A802646L59351J096588o16741q79982J184370n15164p25820l48173o02629
$$ 1802646 2161997 3258585 2641844 1761862 2946232 2431068 1705248 1357075 754446
6828G54446n55342J060789O9128O56393J373530l05862o76419O7151n97486o69078
$$ 754446 199104 1259893 1329021 1985414 3358944 3053082 2376663 2443814 1846328 1177250
6818A177250k08196k32558m26431R28479N85976m11909M69313O27853l91381j42080
$$ 1177250 969054 736496 310065 1238544 1824520 1412611 1881924 2509777 2118396 1976316
6808A976316j090406m55890K28091K08409p02318N97822J197279m18579N77313
$$ 1976316 885910 430020 658111 866520 164202 762024 1959303 1540724 2118037
6799B118037j73349j67569K81270K75797p74182m17241K51563R2317L88756m6703
$$ 2118037 1944688 1777119 2058389 2334186 1560004 1142763 1394326 1486643 1875399 1828696
6789A828696p11880O88255L95638l20931J28096Q56192l67639l11535k10718L73691
$$ 1828696 1116816 1805071 2200709 1879778 2007874 2864066 2496427 2184892 1974174 2347865
6779B347865k22876k16281j79614j36554K48386o71304J76609J040634j2935q60193
$$ 2347865 2124989 1908708 1729094 1592540 1840926 1169622 1346231 2386865 2373930 1513737
6769A513737R21141M1253q54680l73756L21909n17478P80354K13405m75418Q90285
$$ 1513737 2434878 2476131 1621451 1247695 1569604 1052126 1832480 2045885 1570467 2460752
6759B460752N23162k78919r0729p8890l46525j25843m68305j48831L51611K10966
$$ 2460752 2983914 2704995 2614266 2535376 2188851 2063008 1594703 1445872 1797483 2008449
6749B008449k76395m3750k7919m36042Q99485M52541o75544K90679K75709q34368
$$ 2008449 1732054 1688304 1660385 1224343 2123828 2576369 1900825 2191504 2467213 1632845
6739A632845L1351J09067L0107M94156p52037k03385O23125j92205n35280M73666
$$ 1632845 1664196 1773263 1803370 2297526 1545489 1342104 1965229 1773024 1237744 1711410
6729A711410L85200p5304n89128J12815q4802L59718k15702j59567M97209P92413
$$ 1711410 2096610 2021306 1432178 1544993 1460191 1819909 1604207 1444640 1941849 2734262
6719B734262o57222J34077J612o06153k28619l90542k73133j16505L36795J207635
$$ 2734262 2077040 2211117 2212729 1606576 1377957 987415 714282 597777 934572 2142207
6709B142207J003047M9455k9063o75294l52608r35833m679M47336m08450J14471
$$ 2142207 3145254 3194709 3165646 2490352 2137744 1201911 1197232 1644568 1236118 1350589
6699A350589N56857R71957N6268J58658M7827M69899n94742o96714q34670m25549
$$ 1350589 1907446 2879403 2935671 3094329 3142156 3612055 3017313 2320599 1485929 1060380
6689A060380N12426j34488P66696N12858R3720j59035l52883K6774l46880j087975
$$ 1060380 1572806 1438318 2205014 2717872 2811592 2652557 2299674 2326448 1979568 891593
6679H91593k18911J57008p8289k00938N90276M17745O5002N9015L21130L2081
$$ 891593 672682 829690 751401 550463 1140739 1558484 1623486 1682501 2003631 2035712
6669B035712n72269q79934M86004N2137J37469j42523P150O91086m9895N19141
$$ 2035712 1463443 583509 1069513 1121650 1259119 1116596 1123746 1814832 1764937 2284078
6659B284078J44773p42382l16795O1545K63848M47230o51609p81666P99884K02732
$$ 2284078 2428851 1686469 1369674 1431219 1695067 2142297 1490688 709022 1508906 1711638
6649A711638O8124k91651m12501o8070K43588M83766j44154k40519k92510o86719
$$ 1711638 1779762 1488111 1075610 1007540 1251128 1734894 1590740 1350221 1057711 370992
6639C70992Q11239q4621k87233M56675K2749k1119j26057M18638k94032l43620
$$ 370992 1182231 1097610 810377 1267052 1289801 1268682 1142625 1561263 1267231 923611
6629I23611m24858K1133P62879j26287k32050Q06273k6192j1786N9027l22097
$$ 923611 498753 519886 1282765 1156478 924428 1730701 1704509 1692723 1751750 1429653
6619A429653o64275N4208J23441j24977M72390P5125m46004J93603O6251o89969
$$ 1429653 765378 819586 943027 818050 1290440 1365565 919561 1113164 1179415 489446
6609D89446L3877L73614P7961K2562p3462P54486o9494m00331J49381N47166J26471
$$ 489446 523323 896937 974898 997460 923998 1678484 1608990 1208659 1358040 1905206 2031677
6598B031677p23322j76851M77252K3757n64505k89822n1579o6026N72022L49015
$$ 2031677 1308355 1131504 1608756 1632513 1068008 778186 726607 660581 1232603 1581618
6588A581618M67197k77656l68775m03644k6390o27349Q33766R57071o06839n34543
$$ 1581618 2048815 1771159 1402384 998740 972350 345001 1178767 2135838 1528999 994456
6578I94456r878K12293k4119R7355N016M10777K48611o33950m08056P89676m4821
$$ 994456 984578 1196871 1172752 1270107 1275123 1685900 1934511 1300561 892505 1682181 1637360
6567A637360j02503J10069N70501L10680n09376o73681p223L66898l81125r2171
$$ 1637360 1534857 1644926 2215427 2526107 2016731 1343050 1335827 1702725 1321600 1229429
6557A229429M35022l33348K66908l26958L8324L5683N27079O34439j37734J08103
$$ 1229429 1664451 1331103 1598011 1271053 1309377 1345060 1872139 2506578 2368844 2476947
6547B476947j03355l70813R1863j64689m72243m5039N02437m17305J15657J46898
$$ 2476947 2373592 2002779 2094642 1929953 1457710 1412671 1915108 1497803 1613460 1760358
6537A760358k77430l56514j15724K98940N08404k43187n87736K90856N43473n35739
$$ 1760358 1482928 1126414 1010690 1309630 1818034 1574847 987111 1277967 1821440 1285701
6527A285701n71568M43176N86574j59766N9253m59663L225L81747L38400N3955
$$ 1285701 714133 1157309 1743883 1584117 1643370 1183707 1186932 1568679 1907079 1961034
6517A961034k94533L74806K93677o58622j97142l6694O54905L46405n33437O54537
$$ 1961034 1666501 2041307 2334984 1676362 1479220 1442526 2097431 2443836 1910399 2564936
6507B564936Q63383l73160j049930J90787o01496J3091O08473l64275L13747J631544
$$ 2564936 3428319 3055159 2005229 2196016 1594520 1607611 2216084 1851809 2165556 3797100
6497C797100n69402j089070O42127j25538r40180n801o11401m91382R49821Q4034
$$ 3797100 3227698 2138628 2780755 2655217 1715037 1709236 1097835 606453 1556274 1640308
6487A640308j79856R86016N35732j86420Q05203J74679j436511n53990o66814
$$ 1640308 1460452 2446468 2982200 2795780 3600983 3775662 2339151 1785161 1118347
6478A118347r28018N45238K118096k20710J18272N36399J27768M0215m10744j148098
$$ 1118347 190329 735567 2853663 2632953 2751225 3287624 3415392 3455607 3044863 1896765
6468A896765L2372N29527o81236k93144P89408M55772O84094J129969k97828K47138
$$ 1896765 1929137 2458664 1777428 1484284 2273692 2729464 3413558 4543527 4245699 4492837
6458D492837R074j483810k79223P03182p87794K81522J745830n71309J56716R51357
$$ 4492837 4501911 3018101 2738878 3442060 2654266 2935788 4681618 4110309 4267025 5218382
6448E218382k04787l92707M67148p25362n80999M40459l63660j30199J740910
$$ 5218382 5013595 4620888 5088036 4362674 3781675 4222134 3858474 3728275 5469185
6439E469185m93309q51744J573674N91066k16817Q34364k13398j091748j43322
$$ 5469185 4975876 4124132 5697806 6288872 6072055 6906419 6693021 5601273 5457951
6430E457951l95673J56470O41344N79674k42287J317016O09460r88617J93916
$$ 5457951 5062278 5218748 5860092 6439766 6197479 7514495 8123955 7135338 7329254
6421G329254P10180j00154l04073m63085M21864J013537j94407l85497J367460
$$ 7329254 8039434 7939280 7635207 7172122 7593986 8607523 8413116 8027619 9395079
6412I395079L59024m08495n2056N68243k16768K17053J03983J46664K5237K57100
$$ 9395079 9754103 9345608 9293552 9861795 9645027 9862080 9966063 10112727 10137964 10395064
6402A0395064k83127Q12086M68276r57576K41288O07323l97736J84372O93855
$$ 10395064 10111937 10924023 11392299 10434723 10676011 11283334 10885598 11069970 11763825
6393A1763825k57700m4882Q1906k9134m8916M6219m52404J99981N19481n48724
$$ 11763825 11506125 11461243 11543149 11514015 11465099 11511318 11058914 11258895 11778376 11229652
6383A1229652n40844J580650J64674o29646L53292M45848k42686m07764o93388
$$ 11229652 10688808 12269458 12434132 11804486 12157778 12603626 12360940 11953176 11259788
6374A1259788j74286R92384n1787l71342J050130L06761j049321M4573J07620
$$ 11259788 11085502 12077886 12026099 11654757 12704887 13011648 11962327 12006900 12114520
6365A2114520j40989n9424j166421j70939N88877q86721J6666J091347n72445
$$ 12114520 11973531 11914107 10747686 10576747 11165624 10278903 10295569 11386916 10814471
6356A0814471K69969L49716m24611K11868j91676j012525q36063K22957p58693
$$ 10814471 11084440 11434156 11009545 11221413 11029737 10017212 9181149 9404106 8645413
6347H645413R01074Q13973q39370m09582J33392k96420m53474m2355k04438O5736
$$ 8645413 9546487 10360460 9521090 9111508 9244900 8948480 8495006 8452651 8248213 8313949
6337H313949j511j256300L35564P87913r83208m88268K50579j12171q49121R0063
$$ 8313949 8312438 7056138 7391702 8179615 7196407 6708139 6958718 6846547 5997426 6087489
6327F087489j41479n00790N83673M61378q2488K85337l10847n61909J45892O427
$$ 6087489 5946010 5445220 6028893 6490271 6407783 6693120 6382273 5820364 5966256 5972683
6317E972683j04054m35664l79512M0501J48870r92658L62286l6636j179865m29432
$$ 5972683 5868629 5432965 5053453 5093954 5242824 4250166 4612452 4575816 3395951 2966519
6307B966519R09107P06699M8308K09336M53006j51369o67352O9100r73831k99844
$$ 2966519 3875626 4582325 4630633 4839969 5292975 5141606 4474254 4543354 3569523 3269679
6297C269679p2436j72735M50342K53619o3623O04649j46674k26781j16924K27709
$$ 3269679 3197243 3024508 3474850 3728469 3664846 4269495 4122821 3896040 3779116 4006825
6287D006825p91728j914789j60284O93182O05482J159986k65731N73709O75911
$$ 4006825 3215097 1300308 1140024 1833206 2438688 3598674 3332943 3906652 4582563
6278D582563o08305j153354Q68031J45054j008527O23720j73755n33050K52629
$$ 4582563 3974258 2820904 3688935 3833989 2825462 3449182 3275427 2742377 2995006
6269B995006K93458m86404O18910M89063k03995J38547J17828o96477J89053n20772
$$ 2995006 3288464 2802060 3420970 3910033 3706038 3844585 3962413 3265936 3454989 2934217
6259B934217l80049P23992J22146k99030O2892q7732O90602P24640q32350n08767
$$ 2934217 2554168 3278160 3400306 3101276 3164168 3076436 3767038 4491678 3659328 3150561
6249C150561P58768m40971j559562J4406N43822m72818l44461L18070O25525J114924
$$ 3150561 3909329 3468358 1908796 1923202 2467024 1994206 1649745 1967815 2593340 3708264
6239C708264l7142j003803O6898N43437j085378m07549M10304J26457O68765N58865
$$ 3708264 3671122 2667319 2734217 3277654 2192276 1784727 2195031 2321488 2990253 3549118
6229C549118r2112j91348K12242N24255r05275k35324l69090l42855K245N4673
$$ 3549118 3457006 3265658 3477900 4002155 3096880 2861556 2492466 2149611 2151856 2206529
6219B206529j49029J253024N21861n06305j2709O78340k11693p84012k56494K50970
$$ 2206529 2057500 3310524 3832385 3326080 3313371 3991711 3780018 2996006 2739512 2990482
6209B990482R16246R6961J35696o52911P68294n33051j045803J055106J007681
$$ 2990482 3906728 4003689 4139385 3486474 4254768 3721717 2675914 3731020 4738701
6200D738701p54522o21634Q50969k80639p99735P03213N13586k72526J43068J235909
$$ 4738701 3984179 3362545 4213514 3932875 3133140 3836353 4349939 4077413 4220481 5456390
6190E456390J66083p99456n98104K41876L15287q22893p12665l364M45035j08884
$$ 5456390 5622473 4823017 4224913 4466789 4782076 3959183 3246518 3243154 3688189 3579305
6180C579305J05527P90935Q76146M14084O5177L95344q07095q21254o63884J24232
$$ 3579305 3684832 4475767 5351913 5765997 5831174 6226518 5419423 4598169 3934285 4058517
6170D058517N1750N47386P83038k10452N27895J37046k73973J35047m17036j044612
$$ 4058517 4110267 4657653 5440691 5230239 5758134 5895180 5621207 5756254 5339218 4294606
6160D294606K7856K24911j06008k52071j59609O71231N2996p4549O82836J80185
$$ 4294606 4322462 4547373 4441365 4189294 4029685 4700916 4753912 4679363 5362199 5542384
6150E542384p64184n8130k48700M88229R27436m85956K11581L42104j79323j216166
$$ 5542384 4778200 4720070 4471370 4959599 5887035 5401079 5612660 5954764 5775441 4559275
6140D559275M05749M75558o37734o0524K79278O63696l03962m0376k50812J94510
$$ 4559275 4965024 5440582 4802848 4742324 5021602 5685298 5381336 5340960 5090148 5284658
6130E284658l29826k64950N86802K87323p72375K9553J608188J001311j017678
$$ 5284658 4954832 4689882 5276684 5564007 4791632 4821185 6429373 7430684 6413006
6121F413006l13353K92736J95194j094232j89924O2947j38635N49769n1121N33309
$$ 6413006 6099653 6392389 6587583 5493351 5303427 5366374 5227739 5777508 5726387 6259696
6111F259696L90908Q888k88524L78249k73635o91414p3269P16566m70987J14705
$$ 6259696 6650604 6659492 6370968 6749217 6475582 5784168 5710899 6427465 5956478 6071183
6101F071183M42838k1443j50862l2570K72267M47332j67359j65674L94363J001795
$$ 6071183 6514021 6492578 6341716 6309146 6581413 7028745 6861386 6695712 7090075 8091870
6091H091870j34458J11925J39921L65156k8204J03676J195014N45208n18580k16047
$$ 8091870 7957412 8069337 8209258 8574414 8546210 8649886 9844900 10390108 9871528 9655481
6081I655481k34954N16006J65980J021554J66140q30560Q21082J93695J23338
$$ 9655481 9420527 9936533 10102513 11124067 11290207 10459647 11280729 11474424 11597762
6072A1597762n23983K31155j07416Q3462L84132j262159q554J038715p45023j96466
$$ 11597762 11073779 11304934 11197518 11280980 11665112 10402953 10394399 11433114 10688091 10491625
6062A0491625J191315j09239j079141m2714J16118K2077j1633n57160k0964J731260
$$ 10491625 11682940 11573701 10494560 10451846 10567964 10590041 10578408 10021248 10000284 11731544
6052A1731544K5861j076003J10451L45100o90214j31972k80011K97931l97614
$$ 11731544 11757405 10681402 10791853 11136953 10446739 10314767 10034756 10332687 9935073
6043I935073P59295R2700m27590L21985m28740K11411j21403n21163P18879J188792
$$ 9935073 10694368 10787068 10359478 10681463 10252723 10464134 10342731 9821568 10540447 11729239
6033A1729239r53947k6471R48989R98978M5504l77594M62439J06202k57057o06934
$$ 11729239 10775292 10748821 11697810 12696788 12742292 12364698 12827137 12933339 12676282 12069348
6023A2069348O50676J643411L56832J6142R11342J18569n63062m59035q74382
$$ 12069348 12720024 14363435 14720267 14736409 15647751 15766320 15203258 14744223 13869841
6014A3869841J59217l29520j013488J07350R45418Q542j78445P13968k9710o14658
$$ 13869841 14029058 13699538 12686050 12793400 13738818 13747360 13568915 14282883 14253173 13638515
6004A3638515M92242k78415j756661k99254M797j62843K54054p11866j49316J826771
$$ 13638515 14130757 13852342 12095681 11796427 11801224 11638381 11892435 11180569 11031253 12858024
5994A2858024K45551j587156L3898R67049n71004m09412K34688r58741K64808
$$ 12858024 13103575 11516419 11550317 12517366 11946362 11536950 11771638 10812897 11077705
5985A1077705n77238p26975P33192M08701j180432N1251P22275p24867m26000
$$ 11077705 10500467 9773492 10506684 10915385 9734953 9786204 10508479 9783612 9357612
5976I357612J31l24298l71228q31788K92956j17184m6132j37361K07124R7384
$$ 9357612 9357743 9033445 8662217 7830429 8123385 8006201 7960069 7822708 8029832 8127216
5966H127216p76601k96238L22431q1416l89358l24306J11232O69173k88611m99356
$$ 8127216 7350615 7054377 7376808 7295392 6906034 6581728 6692960 7362133 7073522 6574166
5956F574166L58558Q79723k25090p79940K54138k22901j025154j2575J82473L71741
$$ 6574166 6932724 7812447 7587357 6807417 7061555 6838654 5813500 5800925 5983398 6355139
5946F355139r1337L12440O27204N96677r1859K55103r8626r98422j531232N2088
$$ 6355139 6263802 6576242 7203446 7800123 7708264 7963367 7864741 6866319 5335087 5387175
5936E387175n2774j012600J60441R08891O9866m41828k18298J118541M96672o05322
$$ 5387175 5334401 4321801 4482242 5391133 5460999 5019171 4800873 5919414 6416086 5810764
5926E810764j040774O76222M98908j350439m75522O77749P89313M66155J10742
$$ 5810764 4769990 5446212 5945120 4594681 4119159 4796908 5586221 6052376 6163118
5917F163118K10130J305805J36811p29307J86547l48915j163471K50320m62803
$$ 6163118 6373248 7679053 7815864 7086557 7273104 6924189 5760718 6011038 5548235
5908E548235J67023O63166l6535R1831K14434j10505K75979M31768j255647j522625
$$ 5548235 5715258 6378424 6341889 6433720 6648154 6537649 6813628 7245396 5989749 4467124
5898D467124J149167J57123r78294J90511M99516K97401J11859l80360k20200
$$ 4467124 5616291 5773414 4795120 4985631 5485147 5782548 5894407 5514047 5293847
5889E293847Q02577o75004p79075M35340Q47416j2735m81098j32043L65951J061538
$$ 5293847 6096424 5421420 4642345 5077685 5925101 5912366 5431268 5299225 5665176 6726714
5879F726714N29245k46111K11614j406k21472l6816p78226q0717L05890R495N0105
$$ 6726714 7255959 7009848 7221462 7220056 6998584 6961768 6183542 6102825 6408715 6418210 6468315
5868F468315K1980M17051P6057K44759m60197k53519O29420Q3424j023375K59074
$$ 6468315 6490295 6907346 6983403 7228162 6767965 6514446 7143866 7227290 6203915 6462989
5858F462989K73987l62239M38118P74107R46900R18289m79003l06065Q47305K51251
$$ 6462989 6736976 6374737 6812855 7586962 8533862 9452151 8973148 8667083 9514388 9765639
5848I765639j034650m17410Q78372k7839K76370P85280O17107j9755L23998p9167
$$ 9765639 8730989 8313579 9191951 9164112 9440482 10225762 10842869 10823114 11147112 11067945
5838A1067945l90565M27794R18599m83971l92975j72235j36022R76824O45252
$$ 11067945 10677380 11105174 12023773 11539802 11146827 10974592 10838570 11815394 12460646
5829A2460646p23676J6934R00318J56722J92612L10675N84261o74278q006p12629
$$ 12460646 11736970 11753904 12654222 12810944 13003556 13314231 13898492 13224214 13216208 12503579
5819A2503579N79997O79418n60386O5028K05397O3958o05384N5230O3727R1581
$$ 12503579 13083576 13762994 13202608 13267636 13473033 13536991 12931607 12986837 13050564 13142145
5809A3142145n71226l42910J68320M48911P3585M96171Q06503m49404k28536J90421
$$ 13142145 12570919 12228009 12396329 12845240 12918825 13414996 14221499 13772095 13543559 13733980
5799A3733980m01241l22152j22753K40576L12916j64821J03619P0561P34918J65277
$$ 13733980 13332739 13010587 12887834 13128410 13441326 13276505 13380124 13450685 14185603 14350880
5789A4350880r39822M07453j49598m75155N73465q2949j76069j088J20846J15936
$$ 14350880 13411058 13818511 13668913 13193758 13767223 13684274 13508205 13507117 13627963 13743899
5779A3743899J464p27718m10790K74849n84420q9558J02916K96190M8596K59805
$$ 13743899 13745363 13017645 12606855 12881704 12297284 12207726 12310642 12606832 12655428 12915233
5769A2915233l0674n80916p26829o77339K1390P94557r48744j22571R21600L83038
$$ 12915233 12884559 12303643 11576814 10899475 10920865 11715422 10766678 10644107 11565707 11948745
5759A1948745m67590n94388O5266L8864o26426q00168j27600N28017j22455j58092
$$ 11948745 11481155 10886767 10952033 10990897 10364471 9564303 9436703 9964720 9842265 9684173
5749I684173O84411M52764L53485n49022n60581r61838k59723K25499l70154k59593
$$ 9684173 10368584 10821348 11174833 10625811 10065230 9103392 8843669 9069168 8699014 8439421
5739H439421K61231M89274O86172N6449l35533m1547K59404j129149q07569P85295
$$ 8439421 8700652 9189926 9876098 9932547 9597014 9555467 9814871 8685722 7878153 8663448
5729H663448m25067j192109N02247R49972j8188l89481l89073M8349K6921l19217
$$ 8663448 8238381 7046272 7548519 8498491 8480303 8090822 7701749 7750098 7777019 7457802
5719G457802r96826L99955N43768j48295Q62394R60838L75689P41612J86146k29404
$$ 7457802 6460976 6860931 7404699 7256404 8118798 9079636 9455325 10196937 10383083 10153679
5709A0153679q07803m00009q65824o98783m82398n35976P51622j21811r08412
$$ 10153679 9345876 8945867 8080043 7381260 6898862 6362886 7114508 6992697 6084285
5700F084285k55108M85094J62537l32140l32982O4876J227316K33487j07183P54353
$$ 6084285 5829177 6314271 6476808 6144668 5811686 5876562 7103878 7337365 7230182 7984535
5690G984535O40107o06155p83172p7245n88798r96598o53149m38690j55636L61301
$$ 7984535 8624642 8018487 7235315 7158070 6569272 5572674 4919525 4480835 4325199 4686500
5680D686500n73936o4828Q73989J31099q79270L83223j65370k67179O45407p16046
$$ 4686500 4112564 4047736 4921725 5052824 4173554 4556777 4391407 4124228 4769635 4053589
5670D053589j001532P53318O39530N36907k05548l44528q56560r9795l49770p34815
$$ 4053589 3052057 3805375 4444905 4981812 4776264 4431736 3575176 3475381 3125611 2390796
5660B390796L51145J56205l92808J111738M14303q5600N94594j74993l93669K55125
$$ 2390796 2741941 2898146 2505338 3617076 4031379 3945779 4540373 4365380 3971711 4226836
5650D226836r05393j75757P19984M10840p16919N30426J263899l94387l43538
$$ 4226836 3321443 3145686 3865670 4276510 3559591 4090017 5353916 4959529 4615991
5641D615991L20560m13288M081o68570q13971J188464N75616j142655J45944J320289
$$ 4615991 4936551 4523263 4527344 3858774 3044803 4233267 4808883 3666228 3812172 5132461
5631E132461r66597n62658L77233M28478l83093J49644r38760j92044R9806n19695
$$ 5132461 4165864 3603206 3980439 4408917 4025824 4175468 3236708 3044664 3144470 2624775
5621B624775K99498J66051j26137j20857R76553N1781n40355N97280r21526o17096
$$ 2624775 2924273 3090324 2964187 2843330 3819883 3871664 3331309 3928589 3007063 2389967
5611B389967M23370p70974j6007J97879m61923J45211J543303L75794n61103o3873
$$ 2389967 2813337 2042363 2026356 2224235 1762312 1907523 3450826 3826620 3265517 3201644
5601C201644m65035K88513O7703k23781J3980P45972j96299n82758Q38611N33512
$$ 3201644 2736609 3025122 3092825 2869044 2883024 3628996 3432697 2849939 3688550 4222062
5591D222062p71585M40500O52429n51723p63941j32460n42697M15535q83426j46473
$$ 4222062 3450477 3890977 4543406 3991683 3227742 3095282 2552585 2968120 2084694 1938221
5581A938221J298248O98617m32030k57893Q85310q72064o89144K13196k76373
$$ 1938221 3236469 3935086 3503056 3245163 4130473 3258409 2569265 2782461 2506088
5572B506088l40904J11319j36812k6131K50994Q7934O64475Q19837j082424o23274
$$ 2506088 2165184 2276503 2139691 2113560 2364554 2452488 3116963 3936800 2854376 2231102
5562B231102N1544p8827n2614m00974M90315j1843J78149R0282N29832Q58523
$$ 2231102 2282646 2203819 2151205 1750231 2240546 2228703 2406852 2497134 3026966 3885489
5552C885489n73739m92686O93370n46420k76158L05197l94021L23400Q91403l8969
$$ 3885489 3311750 2819064 3512434 2966014 2689856 2995053 2601032 2924432 3815835 3776866
5542C776866r965q74660p8973O04595K07373m64480p44928K98704K20809p32666
$$ 3776866 3766901 2892241 2813268 3417863 3625236 3160756 2415828 2714532 2935341 2202675
5532B202675L45735P13174j62662m46088l3006M819K58799m99682n42072m4368
$$ 2202675 2548410 3261584 3098922 2652834 2619828 2624647 2883446 2383764 1841692 1797324
5522A797324J27886J9959j91547M94997p20855N20185L97383L95424J44429K99913
$$ 1797324 1925210 1945169 1753622 2248619 1527764 2047949 2445332 2840756 2985185 3285098
5512C285098L32423P21925q37357r58601P1433L59742m2481n99921l4658Q33657
$$ 3285098 3617521 4339446 3502089 2543488 2614921 2974663 2932182 2332261 2297603 3131260
5502C131260m1965j017445P60877J510592K5296j022191K33460M37426r54557
$$ 3131260 3089295 2071850 2832727 4343319 4368615 3346424 3579884 4017310 3062753
5493C062753l12732L52508M71419m68551o1154Q24630N36575j19630q67420o94156
$$ 3062753 2750021 3102529 3573948 3105397 3044243 3868873 4405448 4285818 3418398 2724242
5483B724242o73918k73753J18913K17747L0875L8046N05891J215630m90927p55281
$$ 2724242 2050324 1776571 1895484 2113231 2144106 2182152 2688043 3903673 3412746 2657465
5473B657465M69174J58595r28530n33700L77517k01971N95603Q6727j0412O23597
$$ 2657465 3126639 3285234 2356704 1823004 2200521 1998550 2594153 2680880 2670468 3294065
5463C294065j14886q05322N90536N41323p13393o76232J148284J57570l74616
$$ 3294065 3179179 2373857 2964393 3505716 2792323 2116091 3264375 3421945 3047329
5454C047329J97629k04734K7837L72653L0361O3819o5524M49016J89691J27850
$$ 3047329 3244958 3040224 3068061 3440714 3471075 3534894 3469370 3918386 4108077 4235927
5444D235927n32801j37825j12205K84641N83352j85744J43807J334073J127046
$$ 4235927 3703126 3565301 3453096 3737737 4321089 4135345 4279152 5613225 6740271
5435F740271l88132J408661J317302J34231K43612M63829O3129j451496j749770
$$ 6740271 6352139 7760800 9078102 9212333 9455945 9919774 9982903 8531407 6781637
5426F781637k75893N77989k88685p06951O36207N22367j10550n21362M96016M6805
$$ 6781637 6505744 7083733 6795048 6088097 6724304 7246671 7136121 6614759 7110775 7157580
5416G157580m06869M59895K72426Q06182J192587Q81931K97562K73338N04004
$$ 7157580 6750711 7210606 7483032 8289214 9481801 10363732 10661294 10934632 11438636
5407A1438636k06923j064542j097921q43604k90292m4408l28960k45352J6037
$$ 11438636 11231713 10167171 9069250 8225646 7935354 7890946 7561986 7316634 7332671
5398G332671O29022N41987N18923p7058K29542n03835l46479n65316m46361K42415
$$ 7332671 7961693 8503680 9022603 8945545 9175087 8671252 8324773 7759457 7313096 7555511
5388G555511L74889P26086J260431Q91573p50906j20412L14526j232177K58865
$$ 7555511 7930400 8656486 9916917 10808490 10057584 9937172 10251698 9019521 9278386
5379I278386J84749J07932l54017N20082K0586P91027J016660J84886k03105K59010
$$ 9278386 9463135 9571067 9217050 9737132 9757718 10548745 11565405 11750291 11547186 11806196
5369A1806196P4659j083645J73196J43300o50295j52184N35644L46691M86678
$$ 11806196 11880855 10797210 10970406 11113706 10463411 10311227 10846871 11193562 11680240
5360A1680240l19697q6146N59720P19563j209935l97322Q15964m02202r12751
$$ 11680240 11360543 11274397 11834117 12553680 11343745 10946423 11762387 11360185 10447434
5351A0447434J05066J315730L28514J01174o39176J29290k1045q8896M66535J16166
$$ 10447434 10552500 11868230 12196744 12297918 11658742 11788032 11766987 11678091 12144626 12260792
5341A2260792n40495m04304k39710n81851O04163Q76781M81812Q9452o02248k00037
$$ 12260792 11720297 11315993 11076283 10494432 11098595 11975376 12457188 12546640 11944392 11744355
5331A1744355J006828j089701r38452M45509L39042o29119j46994K91101O59341
$$ 11744355 12751183 11661482 10723030 11168539 11507581 10878462 10731468 11022569 11681910
5322A1681910L23159K08752o60136O50769R7506p78602R6106m69740n15556j17123
$$ 11681910 12005069 12213821 11553685 12204454 12301960 11523358 11619464 11149724 10634168 10517045
5312A0517045L02163P5147j33027L61415O2560o28929O71391o59755m39738n10342
$$ 10517045 10819208 10894355 10761328 11122743 11185303 10556374 11227765 10568010 10128272 9617930
5302I617930q38190L34514P23636m4779l71460M40214j35052l65663p79617l59283
$$ 9617930 8779740 9114254 9837890 9793111 9421651 9861865 9726813 9361150 8581533 8222250
5292H222250o0318M5042r51904j66438J3979J76569n78808j99911M82530q5096
$$ 8222250 8161932 8206974 7255070 7088632 7102611 7279180 6700372 6500461 6982991 6897895
5282F897895l54954o11010O82866p23964q58833m18922j16580J75150J49967K005
$$ 6897895 6542941 5931931 6614797 5890833 5032000 4613078 4496498 4671648 4821615 4823620
5272D823620o1055J77971k111M85803n46615o9896K85670l35697L38217L38784
$$ 4823620 4762565 4940536 4938425 5424228 4877613 4807717 5093387 4757690 5095907 5434691
5262E434691j04083k00631L55095l93453j188866J49782L69637n09600o52596
$$ 5434691 5330608 5129977 5485072 5091619 3902753 4052535 4422172 3912572 3259976
5253C259976L53979K63761k8464L42364p09385J10883j04977n29820m33355J54869
$$ 3259976 3613955 3877716 3849252 4191616 3482231 3593114 3488137 2958317 2524962 2679831
5243B679831k32012m95997P31027N31780m54635L89881P92067j126846m07727
$$ 2679831 2447819 1951822 2682849 3214629 2759994 3149875 3941942 2815096 2407369
5234B407369O87908l85882l60698J39335n33734M92097R30114r2885j248274M77133
$$ 2407369 3095277 2709395 2348697 2488032 1954298 2446395 3376509 3283624 2035350 2512483
5224B512483P26850q27528m73896j7289M93710K81521k17358M83194N55200l98908
$$ 2512483 3239333 2411805 1937909 1920620 2414330 2695851 2478493 2961687 3516887 3117979
5214C117979m51656L7271K47876l6306p69685l92100L35353P25720k06685o61987
$$ 3117979 2666323 2703594 2951470 2915164 2145479 1753379 2088732 2814452 2607767 1945780
5204A945780J67226K42792K40746l71698l57722L2558P36916q53678n97591P23054
$$ 1945780 2113006 2355798 2596544 2224846 1867124 1899682 2636598 1782920 1185329 1908383
5194A908383K23413J87398k16606j074782L29173J589781J82393j312466J36313
$$ 1908383 2131796 2319194 2102588 1027806 1356979 2946760 3129153 1816687 1953000
5185A953000N05290q54145J097968J4564q65435N31410l42412q16646L53450P90843
$$ 1953000 2458290 1604145 2702113 2716677 1851242 2382652 2040240 1223594 1577044 2367887
5175B367887J22665l16695M31844K07352K7046O19158j006424n52195J58887m98381
$$ 2367887 2490552 2173857 2605701 2813053 2840099 3459257 2452833 1900638 2059525 1561144
5165A561144o77500Q66830P90219m44857k84783L03193k53680Q94420p0067n27235
$$ 1561144 883644 1750474 2540693 2095836 1811053 2114246 1860566 2754986 2684919 2157684
5155B157684n5061j24875l78830k63069l69038P70687N24273l31829r3764J03976
$$ 2157684 2102623 1977748 1598918 1335849 966811 1737498 2261771 1929942 1836178 1940154
5145A940154P0605k43768Q7972j044715n87818M25216K37167L01805L82144L76447
$$ 1940154 2010759 1766991 1854963 810248 222430 647646 884813 1186618 1568762 1945209
5135A945209R4570K93084O58586n26513m62734p8811m56667q5552J82418k01720
$$ 1945209 2039779 2332863 2991449 2464936 2002202 1923391 1466724 1381172 1563590 1361870
5125A361870R48045K83957j077898k13197P05975m8475N9975O18639q69679m83171
$$ 1361870 2309915 2593872 1515974 1302777 2008752 1960277 2020252 2638891 1769212 1286041
5115A286041P07179Q3259o09288n1486M83704l52837J44539J23884j00926L72267
$$ 1286041 1993220 2076479 1467191 1415705 1899409 1546572 1691111 1814995 1714069 2086336
5105B086336K52671q06091r58027Q13269J93309k20493K24973m74227K7692N45893
$$ 2086336 2339007 1532916 574889 1388158 1581467 1360974 1585947 1111720 1139412 1685305
5095A685305P64327o08235J76539k04453l43627l98896n786q64092N56077N98377
$$ 1685305 2449632 1841397 2017936 1813483 1469856 1070960 1065174 201082 757159 1355536
5085A355536N07754n2773O91951N90638k27642o00424r9147J9749q20179J29249
$$ 1355536 1863290 1810517 2502468 3093106 2865464 2265040 2165893 2185642 1365463 1494712
5075A494712M01445M88670J99717O18089J5243L42886K85058j60897j268522j59763
$$ 1494712 1896157 2384827 2584544 3202633 3217876 3560762 3845820 3684923 2416401 2256638
5065B256638k65411q96010P7918K17264L568J039867J64654n78896M92743L78644
$$ 2256638 1991227 1095217 1173135 1390399 1393967 2433834 2598488 2019592 2512335 2890979
5055B890979j065664l5136K50720n55330L9784N42729k68045l267J820108l73280
$$ 2890979 1825315 1790179 2040899 1485569 1525353 2068082 1800037 1796770 3616878 3243598
5045C243598J2435O29111K2208q06735r51615k75883p21193P13919j98728L2844
$$ 3243598 3256033 3885144 3907352 3100617 2149002 1873119 1151926 1865845 1667117 1699961
5035A699961P81696J145492P8530J21122K49927m55194j87241l00649j017604
$$ 1699961 2481657 3627149 3705679 3826801 4076728 3621534 3434293 3133644 2116040
5026B116040O5915O70825N48168L05671M85466N14653R61711k89367n59342p73573
$$ 2116040 2181955 2852780 3400948 3706619 4192085 4706738 5668449 5379082 4819740 4046167
5016D046167m32171L54012n40362N71865J226665J646815M45146J290689K611138
$$ 4046167 3613996 3968008 3427646 3999511 5226176 6872991 7318137 8608826 11219964
5007A1219964M45514l55370P07269k42291j051195n56876r63693j195947m87808
$$ 11219964 11665478 11310108 12017377 11775086 10723891 10167015 9203322 8007375 7519567
4998G519567r7464n40501K6678N76354q88015m54244L07922q034N432J73607o79717
$$ 7519567 7422103 6881602 6908280 7484634 6596619 6142375 6450297 6442263 6447695 6621302 5941585
4987E941585N74896R01452M3619M87632K15682o5893J15478M10822l11963L4434
$$ 5941585 6516481 7417933 7461552 7949184 8164866 8098973 8214451 8625273 8313310 8347744
4977H347744J26629J34195r02418N70042Q58604o2546J33816K55485l6270k70561
$$ 8347744 8474373 8608568 7706150 8276192 9134796 9072250 9206066 9461551 9425281 9154720
4967I154720j69887m04174o44875M02280Q64716m87411m04167O68665J308697
$$ 9154720 8984833 8580659 7935784 8338064 9202780 8715369 8311202 8979867 10288564
4958A0288564j2716N7266J91800n66887k56859L00538l60736l8568J401829J98480
$$ 10288564 10275848 10333114 10524914 9958027 9701168 10001706 9640970 9602402 11004231 11202711
4948A1202711p5638R6723K42420k45610p3847k63982q61100P50648K04648j52855
$$ 11202711 11127073 11223796 11466216 11220606 11146759 10882777 10021677 10772325 10976973 10824118
4938A0824118P55760K44912n18345N44434K63042l22093p9568K17074k40908l63050
$$ 10824118 11579878 11824790 11306445 11850879 12113921 11791828 11712260 11929334 11688426 11325376
4928A1325376K98372N49270l40204O467m79055J70997k30537n2990m83318r3719
$$ 11325376 11623748 12173018 11832814 11839281 11360226 11531223 11300686 11247696 10764378 10670659
4918A0670659N33712N95181J56748k52456K1355p56662m60478J53343j55415J08613
$$ 10670659 11204371 11799552 11956300 11703844 11725199 10968537 10508059 10661402 10505987 10614600
4908A0614600j97766k97591M34610M96610l07860j41026M92445n81713o84136
$$ 10614600 10416834 10119243 10553853 11050463 10742603 10601577 11094022 10512309 9828173
4899I828173O38290K5103m26935J26761L06869n50028j60743n0622m25777M97583
$$ 9828173 10466463 10491566 10064631 10191392 10498261 9948233 9787490 9736868 9311091 9808674
4889I808674j1938l82974Q13133N47128p14283l61198p22159m22971J16381K41612
$$ 9808674 9796736 9413762 10226895 10774023 10059740 9698542 8976383 8553412 8669793 8911405
4879H911405R6340P17171p3605o65606L5110l09722l79123L6095j062439n09347
$$ 8911405 9007745 9724916 9651311 8985705 9020815 8711093 8331970 8368065 7305626 6796279
4869F796279M40535J24307m14624K99936q24804J35890J52596q67352k44564Q55278
$$ 6796279 7236814 7361121 6946497 7246433 6421629 6557519 6710115 5842763 5598199 6453477
4859F453477l69056r39162J070424K5365k93059k42700k6573m57498K65494J74612
$$ 6453477 6084421 5145259 6215683 6241048 5947989 5705289 5678716 5221218 5486712 5661324
4849E661324p24517N68833O35223m66339k73085O2050j03855J013875P7837j513898
$$ 5661324 4936807 5505640 6140863 5674524 5401439 5463489 5359634 6373509 6451346 4937448
4839D937448j34163L99201j071831j30234P97972k60092O36009L54700q31086
$$ 4937448 4803285 5202486 4130655 4000421 4798393 4538301 5174310 5529010 4697924
4830D697924n36186k89993r03829m57237O65366J83088J087710L30749p78194
$$ 4697924 4161738 3871745 2967916 2510679 3176045 3359133 4446843 4777592 3999398
4821C999398j43417l58275j057156j14879O82225r33635j041586J016856J78304
$$ 3999398 3855981 3497706 2440550 2325671 3007896 2074261 1032675 2049531 2227835
4812B227835N72588J081417l39367k80283R34545j051809j062835O78863o55532
$$ 2227835 2800423 3881840 3542473 3262190 4196735 3144926 2082091 2760954 2105422
4803B105422k9500J021859j35720K10648J110858M4090r52693L94659m62159m70243
$$ 2105422 2075922 3097781 2962061 3172709 4283567 4327657 3374964 3769623 3307464 2837221
4793B837221O0156p3473j98352Q46362M98388n82774N01750O35529m37894p48273
$$ 2837221 2897377 2823904 2625552 3471914 3970302 3387528 3889278 4524807 4086913 3338640
4783C338640r42365k50090P999j69853m50565K23720P78083p04001R01410p3734
$$ 3338640 2396275 2146185 2154184 1984331 1533766 1757486 2535569 1831568 2732978 2659244
4773B659244J51026K16217n25883q99807O3790J7402p70175J06223O21129l15075
$$ 2659244 2810270 3026487 2500604 1600797 1664587 1681989 911814 1018037 1639166 1324091
4763A324091J038222J052219r13915J0712O76580l03846q07409p31428n30007
$$ 1324091 2362313 3414532 2500617 2511329 3187909 2884063 2076654 1345226 815219
4754H15219J01369R45805r1513N67641J056182o95491n15312J290839p74414r54229
$$ 815219 916588 1862393 1770880 2338521 3394703 2699212 2183900 3474739 2700325 1746096
4744A746096J57432j02074l43899K65825M88509O7868L82690o30k17720K69479
$$ 1746096 1903528 1801454 1457555 1723380 2211889 2279757 2662447 2661817 2444097 2713576
4734B713576k13234q45393M04776O16265P9436O13556N29004K05668J84595L9408
$$ 2713576 2500342 1654949 2059725 2675990 2755426 3368982 3897986 4103654 4288249 4327657
4724D327657o41664l95346l27598j342240l91388P09156L32776l90130L305J87826
$$ 4327657 3685993 3290647 2963049 1620809 1229421 1938577 2271353 1881223 1884528 2072354
4714B072354J94229J85466k61239j44626P1137m10719l47343K73931j73854m0464
$$ 2072354 2266583 2452049 2190810 2046184 2117321 1706602 1359259 1633190 1459336 1418872
4704A418872R79683M12789j31050L18948j22263o73155L92962n97933r12480Q36673
$$ 1418872 2398555 2811344 2680294 2999242 2876979 2203824 2596786 1998853 1086373 1923046
4694A923046n41590o61720J204638M56446r3155J4878k11735K92935l8597l09748
$$ 1923046 1381456 719736 1924374 2380820 2287665 2302543 2090808 2383743 2345146 2035398
4684B035398p21232J0098k30128L0671M77042K34977L2830o80403Q52516l89958
$$ 2035398 1314166 1324264 1094136 1124807 1601849 1836826 1869656 1189253 2041769 1651811
4674A651811o39797M40553Q518l61201j54079K50252r8372P90260N47431J13570
$$ 1651811 1012014 1452567 1461085 1099884 945805 1196057 1097685 1887945 2435376 2548946
4664B548946K79970j30086o74396p59241P9460M13713o17211k24086R87076N28642
$$ 2548946 2828916 2698830 2024434 1265193 1344653 1758366 1141155 917069 1904145 2432787
4654B432787L65281l95403M10280j1113q85910n67557L8753O06785M73084l82783
$$ 2432787 2798068 2402665 2812945 2801832 1915922 1348365 1387118 1993903 2466987 2084204
4644B084204j59075J93504J094997r7353o68582j01120j29085k74836l60254l79990
$$ 2084204 1925129 2118633 3213630 3116277 2447695 2346575 2217490 1942654 1582400 1202410
4634A202410N21349P31387m83463j86466L50131l22844M52217k06440p94376M01714
$$ 1202410 1723759 2455146 1971683 1785217 2135348 1812504 2264721 2058281 1263905 1665619
4624A665619M39773o35638m39574P26248M70114N8943J36013r38805M98801N80358
$$ 1665619 2105392 1469754 1030180 1756428 2226542 2285485 2421498 1482693 1981494 2561852
4614B561852r44415j15137K1038l9397R2296O56909j81258P1884O22194L3431
$$ 2561852 1617437 1502300 1523338 1483941 1576237 2233146 2051888 2123772 2745966 2779397
4604B779397l47710K61413R3590o60191l72292J084693N59047K40021K8443m38457
$$ 2779397 2431687 2693100 2786690 2126499 1754207 2838900 3397947 3637968 3666411 3227954
4594C227954J42686L4676r72608o07277L28554k92901K44174j82029j22556O41653
$$ 3227954 3370640 3405316 2432708 1825431 2153985 1861084 2105258 1923229 1800673 2442326
4584B442326J13905m00907o31130P20517k28013n71227K50466l17047M95014J028045
$$ 2442326 2556231 2155324 1524194 2244711 2016698 1445471 1695937 1378890 1873904 2901949
4574B901949L94466o97509l50318O29118o1723j181632j93765L21002L836K14517
$$ 2901949 3296415 2598906 2248588 2877706 2815983 1634351 1440586 1761588 1765424 1979941
4564A979941M23628M56689L28526r86566Q6022N16695O909k43439q97238k18202
$$ 1979941 2403569 2860258 3188784 2202218 2288240 2804935 2811844 2568405 1671167 1452965
4554A452965P52097J47668j45288L03532k80860O71326k55824r31127j40485M89204
$$ 1452965 2205062 2352730 2207442 2510974 2230114 2901440 2645616 1714489 1574004 2063208
4544B063208q28009J94127n8333l29706J090629J015048j002264j80225J044822
$$ 2063208 1235199 1429326 1370993 1041287 2131916 3146964 2144700 1964475 3009297
4535C009297p09957r55814j90229K93247P61328j76766m42467M65296Q92182K26667
$$ 3009297 2299340 1343526 1153297 1446544 2207872 2031106 1588639 2053935 2946117 3172784
4525C172784j21439n97626m41682k53364j9115n36559Q1581N41114L55718O29614
$$ 3172784 3051345 2453719 2012037 1758673 1739558 1202999 1284580 1825694 2181412 2811026
4515B811026K58322J16783K94884p08539q35882J36328o34537l51817J84043r7006
$$ 2811026 3069348 3186131 3481015 2772476 1936594 2072922 1438385 1086568 1270611 1173605
4505A173605R08063J544446L00033o70854M04582l57092o53046p72041o57541
$$ 1173605 2081668 3626114 3926147 3255293 3659875 3302783 2649737 1877696 1220155
4496A220155L18042p0740J83907K73624R60707N59145m53387k92272n7740j31276
$$ 1220155 1538197 1467457 1651364 1924988 2885695 3444840 2991453 2699181 2641441 2510165
4486B510165J58670j196215o21084Q76799Q71818k98959m08858N21870O37885
$$ 2510165 2668835 1472620 851536 1728335 2600153 2301194 1892336 2414206 3052091
4477C052091p68484m92856o13222k55182K71418L30065K10261K40312K63971O11584
$$ 3052091 2283607 1790751 1177529 922347 1193765 1523830 1734091 1974403 2238374 2849958
4467B849958K47531m33851L789J86455q85015l70866R48732L87296o20119j75732
$$ 2849958 3097489 2663638 2667427 2853882 1968867 1598001 2546733 2934029 2313910 2138178
4457B138178M42368k17300L81822J212648n01770k9013K35085r78702o18281Q18557
$$ 2138178 2580546 2363246 2745068 3957716 3455946 3426933 3662018 2683316 2065035 2883592
4447B883592l05293j65624L91127j40609P54117J46296n29445r5285L41487n52928
$$ 2883592 2578299 2412675 2803802 2663193 3417310 3563606 3034161 2938876 3280363 2727435
4437B727435L13476N98744l99855M3495M69466l11353l60739P3335O06930L67635
$$ 2727435 3040911 3639655 3239800 3283295 3752761 3441408 3080669 3154004 3760934 4128569
4427D128569j93241n38635J36291J37990l42177J37729Q6495o16R85548o73415
$$ 4128569 3935328 3396693 3532984 3670974 3328797 3466526 3553021 3552405 4537953 3864538
4417C864538q19199J005748M28814r07373m8187J97934M61044O49716n57767n40452
$$ 3864538 3045339 4051087 4479901 3572528 3524341 3722275 4183319 4833035 4275268 3734816
4407C734816J102814J71481j091891L92728P8808n96445j7568L1770n19116J019299
$$ 3734816 4837630 5009111 3917220 4309948 4388756 3792311 3774743 3806513 3287397 4306696
4397D306696L86495k53956O90869l58478J83520Q3304m13490P1945j84299N36078
$$ 4306696 4693191 4439235 5130104 4771626 4955146 5038450 4624960 4696905 4512606 5048684
4387E048684J87999J681M28674O03226j85611j053762j29727N55592J85113q08127
$$ 5048684 5236683 5238364 5667038 6270264 6084653 5030891 4901164 5456756 5641869 4833742
4377D833742O830M47600Q13932K96224r58234N60446J219080n01107q64625M04381
$$ 4833742 4840572 5288172 6102104 6398328 5440094 6000540 7219620 6718513 5853888 6258269
4367F258269M60819O08329o04004o26192J496109Q93209l85827N37168k28948
$$ 6258269 6719088 7327417 6723413 6097221 7593330 8486539 8100712 8637880 8408932
4358H408932J118239J362509M69273K184530L182497K362090K283202M28016m95153
$$ 8408932 9527171 10889680 11358953 13543483 16725980 19088070 21371272 21799288 21304135
4349B1304135j127145j553148k870539j948506o3004p64133j809426q41366l16491
$$ 21304135 20176990 18623842 15753303 13804797 13741793 12977660 11168234 10326868 10010377
4340A0010377P05492N97513j74540J119178J224124l40446L34556M91300Q89853
$$ 10010377 10715869 11313382 11138842 12258020 13482144 13141698 13476254 13967554 14857407
4331A4857407Q13916N06099m3300P45363R75123R30181J466047J391028J838693
$$ 14857407 15671323 16177422 16134122 16879485 17854608 18784789 20250836 21641864 23480557
4322B3480557J975711K144422Q05748K881478L159144M161153P198649P990641
$$ 23480557 25456268 27600690 28406438 31287916 34447060 38608213 45806862 53797503
4314E3797503J1061398J6092052K6658330N3052903Q2674462P4893230J489204
$$ 53797503 64858901 80950953 107609283 160662186 243336648 318229878 319719082
4307C19719082l1143332l7704577n0203553m5923260l7098748k3020859j3176252
$$ 319719082 288575750 250871173 200667620 154744360 117645612 94624753 81448501
4300H1448501o834392n049129m590909m874803n113305n244972m315998l910806
$$ 81448501 74614109 69564980 64974071 60099268 54985963 49740991 45424993 41514187
4292D1514187k530295l098858j824414j718907j205401r99375p94797k99072Q10630
$$ 41514187 38983892 35885034 34060620 32341713 31136312 30136937 29342140 29043068 29853698
4283B9853698L87542Q75187J011244Q61584J372522J439178J998597J584346J641599
$$ 29853698 30241240 31116427 32127671 32989255 34361777 35800955 37799552 39383898 41025497
4274D1025497J919510J77323K95679J105998J350924L9199n47884o78447j473183
$$ 41025497 42945007 43122330 43418009 44524007 45874931 45914130 45366246 44687799 43214616
4265D3214616k595100k804890k614982j981573j326667o92040p87094J4344k73172
$$ 43214616 40619516 37814626 35199644 33218071 31891404 31199364 30412270 30426614 30153442
4256C0153442r87134m19484n41522q81633j833978p96019O7981k45697j713851
$$ 30153442 29166308 28746824 28205302 27323669 25489691 24693672 24761653 24515956 22802105
4247B2802105j472065M5393p5620j479878J53619j9858j255602p76441m97081
$$ 22802105 21330040 21375433 21299813 19819935 19973554 19953696 18698094 17921653 17424572
4238A7424572n22657j306914j89920r50677j126485J18091K14720l60604j053197
$$ 17424572 16901915 15595001 15405081 14454404 13327919 13446010 13660730 13300126 12246929
4229A2246929j009331O80138k68562m56164p90771K38000m02455j17355l94994
$$ 12246929 11237598 11917736 11649174 11193010 10402239 10640239 10237784 10120429 9725435
4220I725435m35714M60454J24763n25100o29789K48645l10267j133446q05720
$$ 9725435 9289721 9750175 9874938 9349838 8720049 8968694 8658427 7524981 6719261
4211F719261O29990Q08900p36924m30724P32511K49553q20386q12338M1512L1559
$$ 6719261 7349251 8158151 7421227 6990503 7723014 7972567 7152181 6339843 6381355 6412914
4201F412914J74650K3598j52468p5487M45394m10392k53417M01430N21908O74451
$$ 6412914 6587564 6611162 6458694 6383207 6828601 6418209 6164792 6566222 7088130 7762581
4191G762581j095109j102917J92595J13231l92219Q7078O88561L85931p5909j043984
$$ 7762581 6667472 5564555 5757150 5870381 5478162 5565240 6253801 6639732 6563823 5519839
4181E519839j068084J65765J444702l32304j59977P89742K61673q45693m53039
$$ 5519839 4451755 4617520 6062222 5729918 5569941 6359683 6621356 5775663 5322624
4172E322624J42795J49473Q85287o59588l74213N21678Q48111m95827r39867k19077
$$ 5322624 5465419 5614892 6500179 5840591 5466378 5988056 6836167 6340340 5400473 5181396
4162E181396J28723J002595j095507r13041N33922M26028l75555M55343J180091
$$ 5181396 5310119 6312714 5217207 4304166 4838088 5264116 4888561 5343904 6523995
4153F523995m75851n20127J00928r55932N48304L52137j113266o1369Q56957j58267
$$ 6523995 6048144 5528017 5628945 4673013 5221317 5573454 4460188 4398819 5255776 5097509
4143E097509j16726O54503p5076R6970m1114n27127k11543J25172o41074m69728
$$ 5097509 4980783 5635286 5560210 5657180 5616066 5088939 4877396 5002568 4361494 3891766
4133C891766K98770k70343J21745R80034O5548p6326R58360M23233n22806j57268
$$ 3891766 4190536 3920193 4041938 5021972 5087520 5011194 5969554 6392787 5869981 5712713
4123E712713o2686J01684N5179m95119O010L97744k60933M86947Q24859K831p88031
$$ 5712713 5650027 5751711 5806890 5311771 5317781 5715525 5454592 5941539 6766398 6769229 5981198
4112E981198N7831j11520p81818L778p22957j9253Q54649L48105K35609N98370
$$ 5981198 6039029 5927509 5145691 5149469 4426512 4407259 5261908 5610013 5845622 6443992
4102F443992l1127n92445j14906n72498o13648N88230Q696l56829J075419L55025
$$ 6443992 6412865 5820420 5705514 5133016 4519368 5107598 5116294 4759465 5834884 6189909
4092F189909p80123P97852J33478j30776N97024j52251p68935p33198L12882N84262
$$ 6189909 5409786 6207638 6341116 6210340 6807364 6655113 5886178 5152980 5465862 6050124
4082F050124k96680R40133Q08781j84400j40242m4624j86415m55743r83403P0965
$$ 6050124 5753444 6693577 7502358 7317958 7177716 7133092 6946677 6490934 5507531 5578496
4072E578496J063267R1891l9034J41974P98893J74723k15869J75604k36163J35422
$$ 5578496 6641763 6733654 6694620 6836594 7635487 7810210 7594341 7769945 7533782 7669204
4062G669204K17263o58446l98450M60465K1048N22190J120840J38400M68718M01383
$$ 7669204 7886467 7228021 6829571 7290036 7311084 7833274 8954114 9092514 9561232 9962615
4052I962615Q3946L95853J173063J292191K169717K722168J104320J154118J736512
$$ 9962615 10046561 10442414 11615477 12907668 15077385 17799553 18903873 20057991 21794503
4043B1794503n56551R3190J042741p43906j394195r67487j733726k230916j743329
$$ 21794503 21237952 21331142 22373883 21629977 20235782 19268295 17534569 15303653 13560324
4034A3560324j390733l18409j139j211476q59653K05027o8055p85579q52949K89948
$$ 13560324 12169591 11851182 11850043 10638567 9778914 9983941 9915886 9130307 8277358 8567306
4024H567306Q65212N11588o17207K94904Q42415p04199k67055L79470O81791j30226
$$ 8567306 9432518 9944106 9326899 9621803 10464218 9760019 9492964 9872434 10554225 10423999
4014A0423999j521438M30750q0310p40296P0846R62574k58017j44652O21003p73390
$$ 10423999 8902561 9333311 9253001 8512705 8583551 9546125 9288108 9143456 9764459 8991069
4004H991069m32864m93103k18240M80043l71282j31438J228442P11125n24937
$$ 8991069 8558205 8065102 7846862 8326905 7955623 7824185 9052627 9763752 9238815
3995I238815K97582j27577n51078M06093k07649q85073J087065L00022j001762
$$ 9238815 9536397 9408820 8857742 9263835 9056186 8171113 9258178 9558200 8556438
3986H556438M31151P18154J6110J53772Q64872l89969m3752p74287L20908L81748
$$ 8556438 8987589 9705743 9721853 9875625 10740497 10350528 10306776 9532489 9853397 10235145
3976A0235145r2459J54387P78534L39110p18791P93721P97093r22606K83084M51997
$$ 10235145 10142686 10297073 11075607 11414717 10695926 11489647 12286740 11364134 11647218 12099215
3966A2099215j63438L79538p3393l31331O57155J077090k63733l09795O14232
$$ 12099215 11935777 12315315 12241922 11910591 12567746 13644836 13381103 13071308 13685540
3957A3685540N47642k05085n82499N52501O31637K75252j0276M30297j13497L84564
$$ 13685540 14233182 14028097 13445598 13998099 14629736 14904988 14894712 15325009 15211512 15596076
3947A5596076L52904O2956n76213j40430P70264J001929R732n10851J193701J5828
$$ 15596076 15948980 16011936 15435723 15295293 16065557 17067486 17077218 16566367 17760068 17775896
3937A7775896k72056k32776j73367L6281K76689K44399K60583L52756j61166l57636
$$ 17775896 17503840 17271064 17097697 17133978 17410667 17655066 17915649 18268405 18107239 17749603
3927A7749603O58566P54495L23984m53245p19511l18118Q6064j63509l57562J259656
$$ 17749603 18408169 19162664 19486648 19033403 18313892 17995774 18081838 17918329 17560767 18820423
3917A8820423O39283k68203L07047K9612o77894L77347R74071k46755m9265O49809
$$ 18820423 19459706 19191503 19498550 19528162 18850268 19227615 20201686 19954931 19905666 20555475
3907B0555475M16620Q0311m60706N48660J026328M32499j77467Q56999k94485
$$ 20555475 20972095 21052406 20591700 21140360 22166688 22599187 22421720 23278719 22984234
3898B2984234L74792M67022K99133P43246P874R03954N81416J20700M72919Q81315
$$ 22984234 23359026 23826048 24125181 24868427 24876301 25780255 26361671 26482371 26955290 27836605
3888B7836605J64962Q17446J163699J431144O12527K294414L565699N497309O467754
$$ 27836605 28001567 28819013 29982712 31413856 32026383 34320797 37886496 43383805 49851559
3879D9851559M201297j172989l055003m260469m878624n424972m178138k455411
$$ 49851559 54052856 52879867 49824864 45564395 40685771 35260799 31082661 28627250
3871B8627250j992006j979627p60680k02355j269288p61668j70935m78109n20613
$$ 28627250 26635244 24655617 23894937 23692582 22423294 21661626 21490691 21012582 20491969
3862B0491969j07534o06840k53586l51816l84374P49975m34426m46483L28714
$$ 20491969 20384435 19777595 19524009 19172193 18787819 19537794 19103368 18656885 18985599
3853A8985599M80678m18268m59534M84888K67533R014n41661m70946P48987J027409
$$ 18985599 19466277 19048009 18588475 19073363 19340896 19349910 18808249 18337303 19086290 20113699
3843B0113699n73462l6593J158139R32897J36874k10301N70918O30519l80714
$$ 20113699 19540237 19503644 20661783 21594680 21731554 21521253 22092171 22722690 22341976
3834B2341976j94966K42946J57580o1643N78131J0225O33339J197630L91508m17863
$$ 22341976 22147010 22389956 22547536 22485893 23064024 23074249 23707588 24905218 25296726 24878863
3824B4878863l05935j02394L72738j71932p83642j05395L75317K39489o61500
$$ 24878863 24572928 24470534 24843272 24671340 23887698 23782303 24157620 24397109 23735609
3815B3735609j92023N17026N65263n74487r09521j41756m8302n12322o55691n5261
$$ 23735609 23543586 24060612 24625875 24051388 23141867 23000111 22951809 22439487 21783796 21728535
3805B1728535P57162n57559j046115O36426K82475m75126q59919q7666L30231
$$ 21728535 22485697 21928138 20882023 21518449 21800924 21325798 20465879 20378213 20708444
3796B0708444k24243p13231P7789L35877j60616J54655K32839q85253M92586P51268
$$ 20708444 20484201 19770970 19848759 20184636 20024020 20178675 20411514 19526261 20018847 20770115
3786B0770115k61071L08640K47090K86654O34526q85423o38677J67960J071893
$$ 20770115 20509044 20817684 21064774 21351428 21985954 21100531 20461854 20629814 21701707
3777B1701707l61673o32646M49658J234790L20868J75171r7246N49348N31965
$$ 21701707 21340034 20707388 21157046 22391836 22712704 22887875 22790629 23339977 23871942
3768B3871942o99972j034613O98622N15644j29296J299940J186498j86014j67449
$$ 23871942 23171970 22137357 22835979 23351623 23222327 24522267 25708765 25522751 25355302
3759B5355302m3673q32532O26044L79776k39726m91334L80015O94770k5881K11672
$$ 25355302 25311629 24479097 25105141 25484917 25245191 24753857 25133872 25828642 25802761 26014433
3749B6014433q3607o17333P22257k70713j541265N8030L65681n67093k14470N11231
$$ 26014433 25930826 25313493 26035750 25765037 24223772 24281802 24647483 24080390 23865920 24377151
3739B4377151K01071L54136O88641p58611j78534Q01003j147343n81268P69802
$$ 24377151 24578222 24932358 25620999 24862388 24683854 25484857 24337514 23756246 24526048
3730B4526048K81734K16100M71514O34564Q13161N78306k97020k01366l80256
$$ 24526048 24807782 25023882 25495396 26129960 26943121 27521427 27224407 27023041 26642785
3721B6642785K70576l76362l22956q25479J450848J216051p9738K73563Q18645
$$ 26642785 26913361 26536999 26214043 25388564 26839412 28055463 27975725 28249288 29067933
3712B9067933L44029M86914o04781l57406J031215P7844q5122M25835Q63844l5305
$$ 29067933 29411962 29898876 29294095 28936689 29967904 30045748 29960626 30386461 31250305 31215000
3702C1215000M91833k2154J85298O11189j14511q72479j64567k9475n19570R7141
$$ 31215000 31706833 31684679 31869977 32481166 32366655 31494176 31329609 31300134 30780564 30877705
3692C0877705P02952l0254J120088Q03085l30913l91018k63562M39288j90421
$$ 30877705 31580657 31550403 32670491 33473576 33142663 32751645 32488083 32927371 32736950
3683C2736950j114818O19776J319118K03734n74724N49391J023198J49100m49102
$$ 32736950 31622132 32241908 33561026 33764760 33190036 33739427 34762625 34911725 34462623
3674C4462623p91202J94209L15863p6418O0141J28630k31088J016108j3600n73958
$$ 34462623 33671421 33865630 34181493 34105075 34165216 34293846 34062758 35078866 35065266 34491308
3664C4491308N01603M36337j495857j7022M41429m21755L29915k49449o47658
$$ 34491308 34992911 35429248 33933391 33916369 34357798 33936043 34265958 34016509 33368851
3655C3368851P56064K24870O793m06922n67761M85111L98314q77885l28364P74184
$$ 33368851 34124915 34349785 34356578 33949656 33381895 33867006 34265320 33387435 33059071 33833255
3645C3833255m10640m65067M59322R10205K87647l99975r40407k96477k7023q20826
$$ 33833255 33422615 32957548 33416870 34327075 34614722 34214747 33274340 32977863 32950840 32130014
3635C2130014p42786M2051j39006o53653o99579l60319l05445k62374q44258k93960
$$ 32130014 31387228 31429279 31290273 30636620 29937041 29576722 29271277 29008903 28164645 27870685
3625B7870685k64361r44987j54829j2305j731194l73855J89077k41195N26513
$$ 27870685 27606324 26661337 26506508 26494203 24763009 24389154 24578231 24337036 24863549
3616B4863549r08518l77139K39528n98335q58709K77160n6175m63970M47507P42902
$$ 24863549 23955031 23577892 23817420 23219085 22360376 22637536 22581361 22117391 22564898 23307800
3606B3307800k68547j1433M45537n32895M69935R66111m87817l7564o489k27821
$$ 23307800 23039253 23027820 23473357 22940462 23410397 24376508 23888691 23851127 23844638 23616817
3596B3616817O97009O49541k09761R09216J460910l26481L9207L74336O71200
$$ 23616817 24313826 24963367 24753606 25662822 27123732 26797251 26836458 27210794 27881994
3587B7881994L1255M94298K33741N58691J72892j58030J73104L98430N79165K87580
$$ 27881994 27913249 28407547 28641288 29199979 29372871 29214841 29387945 29786375 30365540 30653120
3577C0653120k1486J121030J134976M3237n83120j74860n87493K24171R79627
$$ 30653120 30631634 31752664 32887640 32930877 32347757 32172897 31585404 31809575 32789202
3568C2789202J7075p4664O68202L64165n58319k2859L43262q9664p48788k39342
$$ 32789202 32806277 32731613 33399815 33763980 33205661 33182802 33526064 33436400 32687612 32448270
3558C2448270m81181l01422L84131q334j3033P90764L66143j57789n95247n99691
$$ 32448270 31967089 31665667 32049798 32041464 32028431 32819195 33185338 33027549 32432302 31832611
3548C1832611L25498L15971k21778m08652O45586O15385o03174N75262J303035
$$ 31832611 32158109 32474080 32252302 31843650 32489236 33104621 32501447 33076709 34379744
3539C4379744P44032P76283J182594O24224q2260J209892j02651J74053K408261
$$ 34379744 35123776 35900059 37082653 37706877 37624617 38834509 38731858 38905911 41314172
3530D1314172J821016J133588R26244J477989K458447J706198N50129J989840
$$ 41314172 43135188 44268776 45195020 46673009 49131456 50837654 51387783 53377623
3522E3377623K312258K087740K020466J936237K401442L521112L026647L227983
$$ 53377623 55689881 57777621 59798087 61734324 64135766 67656878 70683525 73911508
3514G3911508M528355M412105M817909M198537L474821L860062M543037L271536
$$ 73911508 78439863 82851968 87669877 91868414 95343235 99203297 103746334 107017870
3506A07017870K963135M053011L124000K326126J907935J499639P25941N08009
$$ 107017870 109981005 114034016 117158016 119484142 121392077 122891716 123617657 124125666
3498A24125666J019710r51602j246228n24202j415758k557611k511582k044133
$$ 124125666 125145376 124193774 122947546 122423344 121007586 118449975 115938393 113894260
3490A13894260k608797k491764l823346m170710l831941m467767n715364n752474
$$ 113894260 111285463 108793699 104970353 100799643 96967702 92499935 86784571 81032097
3482H1032097m256230l606714l842539m033285k135420r79410k063551j775361
$$ 81032097 76775867 73169153 69326614 65293329 63157909 62178499 60114948 58339587
3474E8339587r03123J26251m11447k022462j981612j236353k246353j807060k959030
$$ 58339587 57436464 57562715 57151268 55128806 53147194 51910841 49664488 47857428 44898398
3465D4898398k201410j836331j806429k177770k364814k091623j553440r05219
$$ 44898398 42696988 40860657 39054228 36876458 34511644 32420021 30866581 29961362
3457B9961362j787339j164284J71558p41988p98092p73601n29890P8087r92394
$$ 29961362 28174023 27009739 27181297 26439309 25641217 24867616 24337726 24415813 23423419
3448B3423419r77823l72972N65402j155630j356238N32025r1081O1253J66428
$$ 23423419 22445596 22072624 22638026 21482396 20126158 20658183 20567102 20628355 20794783
3439B0794783k63200k5025J2467p05170r16180j84801r47297L05999O63275j58542
$$ 20794783 20531583 20506558 20519025 19813855 18897675 18712874 17765577 18071576 18734851 18576309
3429A8576309p83316K0902N30306m48415l03568L03379j19667p65022m04757K26989
$$ 18576309 17792993 17813895 18344201 17895786 17592218 17895597 17775930 17010908 16606151 16833140
3419A6833140K69631l39697K4488Q77811N87073N64100j328405m24684M83884
$$ 16833140 17102771 16763074 16787562 17665373 18252446 18816546 17488141 17063457 17547341
3410A7547341o3567m31352j20460M14312Q99132j4784j43427m3287J02043K1025
$$ 17547341 17483774 17052422 16931962 17346274 18245406 18230622 18087195 18043908 18145951 18166976
3400A8166976j75016N39489J052589l60524m43785r2378p51347o06840j94142
$$ 18166976 17991960 18531449 19584038 19223514 18779729 18687351 17936004 17329164 17135022
3391A7135022m49473q47097J13282N11825k62669j29390O58888O35813m70230
$$ 17135022 16685549 15838452 15951734 16463559 16200890 16071500 16730388 17366201 16895971
3382A6895971o70516m61212m11659R00298n50790n7873k0138M83730M42234K94789
$$ 16895971 16225455 15764243 15352584 16252882 15702092 15644219 15624081 16107811 16550045 16844834
3372A6844834M94347M53680P00713j91549l04553N52705J339682K87084n35799
$$ 16844834 17339181 17792861 18493574 18302025 17997472 18550177 19889859 20176943 19641144
3363A9641144O22327P72491N98826N68077P48935J101010J330445P68573m27930
$$ 19641144 20263471 21035962 21634788 22202865 22951800 24052810 25383255 26151828 25723898
3354B5723898J662112K117527K64056J322647J981262K686196K638833K381733
$$ 25723898 27386010 29503537 29767593 31090240 33071502 35757698 38396531 40778264
3346D0778264R27099J277903J986836J293522J476292P90298L26809O86426L98215
$$ 40778264 41705363 42983266 44970102 46263624 47739916 48530214 48857023 49543449 49941664
3337D9941664j08072O61180P86353l48963r67347m53623k13520J72975r80461
$$ 49941664 49833592 50494772 51281125 50932162 49964815 49511192 49297672 49470647 48490186
3328D8490186q69415J4724J60033j03463j256793m35578j83513j727731k554840
$$ 48490186 47620771 47635495 47795528 47692065 46435272 45999694 45816181 44088450 41533610
3319D1533610j666036j459462k450923k011263j850168k048673j711425j960168
$$ 41533610 39867574 38408112 35957189 33945926 32095758 30047085 28335660 26375492
3311B6375492r18728k89310j426309j282519p17522j564296j355435L36371j261854
$$ 26375492 25456764 25167454 23741145 22458626 21741104 20176808 18821373 19157744 17895890
3302A7895890k159554n26895l23728J014n6243o25597J70799R56763j124541j470755
$$ 17895890 15736336 15209441 14885713 14886727 14830484 14204887 14375686 15332449 14207908 12737153
3292A2737153L17298m50157q54800j124153j666J135658O23028n39244R053P32307
$$ 12737153 13054451 12604294 11749494 10625341 10623675 11759333 12382361 11843117 11852170 12584477
3282A2584477j1403j019524r77811M0328O0194K36624O6049J22034L82770L82785
$$ 12584477 12573074 11553550 10575739 10616067 10676261 10912885 10978934 11100968 11483738 11866523
3272A1866523K74235j96008K66522q238o8180q25732j70692o1277m53296O42806
$$ 11866523 12140758 11944750 12211272 12203034 12134854 11309122 11138430 11077153 10623857 11266663
3262A1266663j95038q61290Q36861P80033p40199n39587p71495m75084q61774
$$ 11266663 11071625 10210335 11047196 11827229 11087030 10547443 9775948 9300864 8439090
3253H439090l16664K67410M30248j00630j121412j91402L02012j42362Q6467l59676
$$ 8439090 8122426 8389836 8820084 8719454 7598042 7406640 7708652 7566290 7652757 7293081
3243G293081N52724j03620p06797Q0032k28693k77029O02318K3492o02248N57312
$$ 7293081 7845805 7742185 7035388 7115420 6886727 6609698 7212016 7235508 6633260 7190572
3233G190572N48045l13858m59437l81827J95644Q40830n04188r18376R2621O34964
$$ 7190572 7738617 7424759 6965322 6583495 6779139 7619969 7115781 6197405 6290026 6924990
3223F924990K77412J31688M30865j43483K43585n18974r27928R8564q200l76110
$$ 6924990 7202402 7334090 7764955 7621472 7865057 7346083 6418155 6516719 6508519 6132409
3213F132409j33266k3329N91473J115519K72063p41944k15816K19493m3965K71812
$$ 6132409 5999143 5975814 6567287 7682806 7954869 7212925 6997109 7216602 7172637 7444449
3203G444449m49130K70516k43224o88248n949P68589N36815M06928j94799n46777
$$ 7444449 6995319 7265835 7022611 6334363 6328414 7097003 7633818 8040746 7845947 7299170
3193G299170n5800N11307r69438l66756N80089P3982L66296P01580K12333k30769
$$ 7299170 7243370 7754677 6785239 6418483 6998572 7072554 7438850 8140430 8352763 8121994
3183H121994L76377q89343j99971Q43171m33148J47511O14192k37807L93531k4920
$$ 8121994 8498371 7609028 7409057 8252228 7819080 7966591 8580783 8342976 8736507 8711587
3173H711587n09382M54443M75922m26748r72964M8076L60908N12129j193J81730
$$ 8711587 8202205 8656648 9132570 8705822 7732858 7780934 8141842 8653971 8652778 8834508
3163H834508J030062O54901j43942r69499N44064J262751O50168o53013J2202
$$ 8834508 9864570 10519471 10375529 9406030 9950094 11212845 11863013 11210000 11222202
3154A1222202R3620j78162j11780n9106P06429J281074M17425n26722k63048L03844
$$ 11222202 11315822 11137660 11025880 10966774 11673203 12954277 13371702 12844980 12581932 12885776
3144A2885776k84461k16153m02851l2713Q48449P34546j60468M92269R63846k19113
$$ 12885776 12601315 12385162 11982311 11949598 12798047 13532593 13372125 13864394 14828240 14609127
3134A4609127J54872K423k12337J437857j36288q61109J309532J440728m94369
$$ 14609127 14763999 14766422 14554085 15991942 15855654 14994545 16304077 17744805 17250436
3125A7250436P03191P84424n89338J12792n80166l56450L97859J037645P3348
$$ 17250436 17953627 18738051 18148713 18261505 17681339 17324889 17722748 18760393 18833741
3116A8833741Q52699J583671J106447J334040L49987n10924J36462Q37202M44736
$$ 18833741 19686440 21270111 22376558 23710598 24060585 23549661 23686123 24523325 24968061
3107B4968061J139923J453019Q55049Q11902P13735K81797Q90868J426079Q80295
$$ 24968061 26107984 27561003 28416052 29227954 29941689 30223486 31114354 32540433 33420728
3098C3420728j77283l6117L81825K85677l75114L0855P46760J023331M73978J161261
$$ 33420728 33243445 33207328 33589153 33874830 33499716 33530571 34277331 35300662 35774640 36935901
3088C6935901J337021Q16895R33351J767080K235907J315247J587734J484214
$$ 36935901 38272922 39089817 40023168 41790248 44026155 45341402 46929136 48413350
3080D8413350J729970J904423L701728L226777L789396N444790M730682N677719
$$ 48413350 50143320 52047743 55749471 58976248 62765644 68210434 72941116 78618835
3072G8618835P009086O362568Q148548R783866R981764J0676279J2239869J2311788
$$ 78618835 85627921 91990489 100139037 109922903 119904667 130580946 142820815 155132603
3064A55132603J1994341J0144492N870995L942986M277030j13641j039944J014318
$$ 155132603 167126944 177271436 183142431 187085417 191362447 191248806 190208862 191223180
3056A91223180K68509Q95504J879006K09232k24226j648531m626617q318104j0204571
$$ 191223180 191491689 192387193 194266199 194475431 194251205 192602674 187976057 179657953 169453382
3047A69453382j1959963j2962670j1123595j2446292j1206788r003127r099100
$$ 169453382 157493419 144530749 133407154 120960862 109754074 100750947 91651847
3040I1651847q194463o410099n465125n293742m258850m099707l495003l442149
$$ 91651847 83457384 77047285 71582160 66288418 62029568 57929861 54434858 50992709
3032E0992709l431016k895256k662440j634058k424024j667345r65754n54317
$$ 50992709 47561693 44666437 42003997 40369939 37945915 36278570 35312816 34758499
3024C4758499r46845j783988j615635o58419j341557j239607j544956j258805
$$ 34758499 33811654 32027666 30412031 29753612 28412055 27172448 25627492 24368687
3016B4368687j187487r90958o2856k82396o53498J67140O6436j159375q55923
$$ 24368687 23181200 22190242 22127386 21844990 21191492 21358632 21425068 20265693 19409770
3007A9409770r11592j337982j135560l51810k97791J45527K64141J66643j57377
$$ 19409770 18498178 17160196 16024636 15672826 15375035 15520562 15784703 15951346 15793969
2998A5793969k91749o17922l00854O2225k35307L57815l3240q74404O83203R06541
$$ 15793969 15502220 14884298 14583444 14645669 14410362 14768177 14734937 13860533 14543736 15450277
2988A5450277R04995K25469K75985J21850n61837o38247j110953J3158q43809
$$ 15450277 16355272 16580741 16856726 16978576 16416739 15778492 14667539 14680697 13836888
2979A3836888j011206L382n89934n89514N68437j268375o69373P14290m02547
$$ 13836888 12825682 12829064 12239130 11649616 12218053 10949678 10280305 10994595 10592048
2970A0592048q86885n16616o59132J43322p9634r13799J82301K16666j96601K09443
$$ 10592048 9705163 9188547 8529415 8672737 8593103 7679304 7861605 8078271 7881670 8091113
2960H091113N12122j92417J41979k80348j098950O60279K4906q95653L74118R33300
$$ 8091113 8603235 8410818 8552797 8272449 7173499 7833778 7858684 6963031 7337149 8270449
2950H270449m05039R68161M47771M9500N08910l4007l40533o74812p58290o27668
$$ 8270449 7865410 8833571 9281342 9330842 9839752 9805745 9465212 8790400 8032110 7404442
2940G404442L77042q85906n16915j18976L46659R1692L07797l40378n57652n79579
$$ 7404442 7781484 6895578 6378663 6259687 6606346 6698038 7005835 6665457 6107805 5528226
2930E528226j74076j408560J3588Q90397l33737L48775l7502K40354k17220k34906
$$ 5528226 5354150 3945590 3959178 4849575 4515838 4864613 4827111 5067465 4850245 4615339
2920D615339m44064k15312k20526J57536q75131k05974K5706k64450N11006L61938
$$ 4615339 4171275 3955963 3735437 3892973 3017842 2811868 2837574 2573124 3084130 3446068
2910C446068n02458O84450R20704n03838n00167K61305o84860j15678K58109k5590
$$ 3446068 2943610 3628060 4548764 4044926 3544759 3806064 3121204 3005526 3263635 3238045
2900C238045k44486L40443J25119N3543M01735o74331n61101L11566l97143k53526
$$ 3238045 2993559 3334002 3459121 3512664 3914399 3240068 2678967 2990533 2593390 2339864
2890B339864N37787q9766n21902N90945J8320o79490J256440o04922O9888O63846
$$ 2339864 2877651 2787885 2265983 2856928 2875248 2195758 3452198 2847276 2917164 3581010
2880C581010l26530j392384K24253J46759q72046K17533N94573j90500P38083
$$ 3581010 3254480 1862096 2086349 2233108 1361062 1578595 2173168 1982668 2720751
2871B720751K78979p15691N18513Q2379r03848J54502k68832n21409K06454J66793
$$ 2720751 2999730 2284039 2802552 2884931 1981083 2135585 1866753 1345344 1551798 1718591
2861A718591N28800P0277M8202n99423L30072L71110j24742m36712j21280J79816
$$ 1718591 2247391 2317668 2365870 1766447 2096519 2467629 2342887 1906175 1784895 1964711
2851A964711k20237k76052m90171O35839N91291l92034L20610N59534j78987j95980
$$ 1964711 1744474 1468422 978251 1614090 2205381 1813347 2133957 2693491 2514504 2318524
2841B318524l73700q36777J59375J61240r7526J79879Q83874L68916m65331M60313
$$ 2318524 1944824 1108047 1267422 1428662 1331136 1511015 2394889 2763805 2298474 2758787
2831B758787o62291N43024K98365o03396o74225J95967l93318j53000R03718k33967
$$ 2758787 2096496 2639520 2937885 2334489 1660264 1856231 1462913 1309913 2213631 1979664
2821A979664k98459P04446p94183n23631L35041Q01531n57050j559k2965J65784
$$ 1979664 1681205 2385651 1591468 1067837 1402878 2204409 1647359 1645800 1622835 1788619
2811A788619K23792j34462j82409J60227N22470p91038l56400P4437n60551N0999
$$ 1788619 2012411 1877949 1695540 1855767 2378237 1587199 1230799 1305236 744685 795684
2801G95684K10138K61742N27805K92773n1989J57898L38309q57884n45698L75702
$$ 795684 1005822 1267564 1795369 2088142 2036153 2194051 2532360 1674476 1128778 1504480
2791A504480k99419L9120P06146j59039O83694l06084M08341K94626m1442j153351
$$ 1504480 1205061 1244181 1950327 1791288 2474982 2168898 2577239 2871865 2830423 1677072
2781A677072m26974K65710o6039K21089N06794m72416M39658K90643M538M83304
$$ 1677072 1250098 1515808 1449769 1670858 2177652 1705236 2144894 2435537 2440075 2923379
2771B923379K11355j244095r907L05045k84392o0346K41760K1219J54139Q1774
$$ 2923379 3134734 1890639 1880732 2185777 1901385 1841039 2082799 2104018 2258157 2339931
2761B339931p60657L66712K67418m80191P39278J20390q55544L55983n8685q40722
$$ 2339931 1579274 1945986 2213404 1733213 2472491 2592881 1737337 2093320 2034635 1193913
2751A193913M53988O06799r35778k47719P32513o11842M7535M33201m65960k33379
$$ 1193913 1647901 2254700 1318922 1071203 1803716 1191874 1239409 1672610 1206650 973271
2741I73271K41190k88394N77700M21340p36734K54290Q20660q43853l0220k10231
$$ 973271 1214461 926067 1503767 1925107 1188373 1442663 2263323 1419470 1389250 1179019
2731A179019p13052Q4608R0789O9362j27465M73906J68623K29761O56077k56959
$$ 1179019 465967 550575 641364 710726 583261 1057167 1225790 1455551 2111628 1854669
2721A854669o24115L09283n31191j2956j7066j7388l5594M15005J63770m24402
$$ 1854669 1230554 1539837 1008646 995690 978624 961236 925642 1340647 1504417 1080015
2711A080015J12017N27079k03525k89668j77879n76927O3563Q41183j93561k50245
$$ 1080015 1192032 1719111 1515586 1225918 1048039 471112 534675 1375858 1182297 932052
2701I32052M55563L74593j84847K04988J13348p37186l56473l43352j67545K03863
$$ 932052 1387615 1762208 1577361 1782349 1895697 1158511 802038 458686 291141 495004
2691D95004J82760J27201k15351j56420Q74599N74576n62032L21987p0763r78818
$$ 495004 677764 804965 589614 433194 1307793 1882369 1320337 1642324 1571561 592743
2681E92743J12786M24129q94112J316158J03995l22140M07703K77757o31735J56201
$$ 592743 705529 1129658 235546 1551704 1655699 1333559 1741262 2019019 1387284 1543485
2671A543485K89474j384262L64754k56571n10406N32863M58855o13461N34510
$$ 1543485 1832959 448697 813451 556880 46474 579337 1038192 424731 959241
2662I59241J485768o64535n29478J35272o13925M45669l4075q77201J06143M84794
$$ 959241 2445009 1780474 1250996 1386268 772343 1218012 1183937 306736 412879 897673
2652H97673J61443P23944Q413o12725K11021j0097j019191k06709P95800l32093
$$ 897673 1059116 1783060 1791473 1178748 1389769 1379672 360481 153772 949572 617479
2642F17479l42754K07854P62041J196410o10199n87530k6703R2073n72047m79353
$$ 617479 274725 482579 1244620 2441030 1830831 1243301 1216598 1308671 736624 257271
2632B57271J65161O8184O76529J31732j59477K77860k46668n25079L69581m93662
$$ 257271 422432 490616 1167145 1298877 1139400 1417260 1170592 645513 1015094 521432
2622E21432K92386r0290k54382L46530O04537L57325K42275n1575l54509j30612
$$ 521432 813818 723528 469146 815676 1420213 1777538 2019813 1968238 1613729 1483117
2612A483117n92754m50881J18088L45742j33887O09285J06920M03218J164148
$$ 1483117 890363 439482 557570 903312 769425 1378710 1485630 1888848 3052996
2603C052996p59130n00500k89912k20885P27767M50833o3470N19908J109321r82091
$$ 3052996 2293866 1793366 1503454 1282569 2010336 2461169 2397699 2917607 4026928 3044837
2593C044837l92710J88634r30069n57877K61974o52908O7466N58568r57383N71688
$$ 3044837 2652127 2840761 1910692 1352815 1614789 961881 1029347 1587915 630532 1202220
2583A202220O22972o20430J45748J53995m85794K04337Q6874p03255J53351K78752
$$ 1202220 1825192 1204762 1350510 1504505 1018711 1223048 1309922 606667 760018 1038770
2573A038770m98623L55710K12586j17498L71720q97m32858m24874L0311l09550
$$ 1038770 540147 895857 1108443 990945 1362665 1361768 928910 504036 534347 224797
2563B24797O18184L54050p4662k23714o21184J16299L68197L50157J0376L70989
$$ 224797 842981 1197031 1122369 898655 277471 393770 761967 1112124 1122500 1493489
2553A493489j95331o93509J92797n36097k99206K22282L644K54238Q86385k40609
$$ 1493489 1298158 604649 797446 261349 -37857 184425 188069 442307 1328692 1088083
2543A088083J61029Q94039k35921o13013J14571m2979q49788k27997m23177K45987
$$ 1088083 1249112 2143151 1907230 1294217 1408788 1365809 516021 288024 -135153 110834
2533A10834J018557l42827K8021J013167l41888l22758j59085j042495l69734
$$ 110834 1129391 786564 814585 1827752 1485864 1163106 1004021 -38474 -408208
2524d08208J189996k59803J35729J191171j59473K4259k12748n55993L20235K95019
$$ -408208 781788 521985 657714 1848885 1689412 1713671 1500923 944930 1265165 1560184
2514A560184o29172N62368K50697L88322j7110r62409l6662O36683k16404J18135
$$ 1560184 931012 1493380 1744077 2132399 2115289 1152880 1116218 1752901 1536497 1654632
2504A654632J77253J25875K81128l85506n35118K1022M39176j56321m1064q730
$$ 1654632 1831885 1957760 2238888 1853382 1318264 1339286 1778462 1622141 1581077 1572347
2494A572347l97284K95614K83895l90863L7603j32551p56815K56277o15637l940
$$ 1572347 1175063 1470677 1754572 1363709 1401312 1268761 511946 768223 152586 148646
2484A48646J101924n0506k68558R79521K93887p8054n940m07936q97395N45457
$$ 148646 1250570 1200064 931506 1911027 2204914 2126860 2120920 1712984 815589 1361046
2474A361046N5176q63110P77910N05059o10740J022602L71906q27946P59293m44176
$$ 1361046 1416222 553112 1331022 1836081 1225341 2247943 2619849 1791903 2551196 2107020
2464B107020j224998O26245J24760p03469J014957j21433P8493R19108J43845
$$ 2107020 882022 1508267 1633027 929558 1944515 1823082 1901575 2820683 2964528
2455B964528p21454O02444N22759p62611n32496p3326n58965M95584l76746m18110
$$ 2964528 2243074 2845518 3368277 2605666 2073170 1999844 1440879 1936463 1559717 1141607
2445A141607J222801N316r72827N81683J109544j10551j014913m03014j03035
$$ 1141607 2364408 2369724 1396897 1978580 3088124 2977573 1962660 1559646 1456611
2436A456611j82803n4386K43552M41294J214934n18170o18274L17561o32842M5768
$$ 1456611 1273808 1219422 1462974 1904268 3119202 2601032 1982758 2300319 1667477 1713245
2426A713245Q62385l9355k68069K02502Q87973o94099j31030N95324K72778O36752
$$ 1713245 2575630 2536275 2268206 2470708 3358681 2664582 2533552 3128876 3401654 4038406
2416D038406L91766n30051J67294J30339n92463p45611M17463J58180J97077J334271
$$ 4038406 4430172 3900121 4067415 4197754 3605291 2859680 3277143 3435323 3632400 4966671
2406D966671Q6899p83657N31089k41425q70197j90119q1003m53981L22916N63270
$$ 4966671 5053570 4269913 4801002 4559577 3689380 3499261 3418258 2964277 3287193 3850463
2396C850463K98548K60777l9839L10437P67328m49483m38298J22288k52480L27467
$$ 3850463 4149011 4409788 4369949 4680386 5447714 4998231 4559933 4682221 4429741 4757208
2386D757208O19765l25105N74997O22596M81861k58709n81930K32843L74206N16543
$$ 4757208 5376973 5051868 5626865 6249461 6731322 6472613 5890683 6123526 6497732 7014275
2376G014275j216850m0762O11992j71160L68561L95731J11335O49213P96036m76709
$$ 7014275 5797425 5756663 6368655 6197495 6566056 6961787 7073122 7722335 8518371 8041662
2366H041662L12257P68211J98398l35533K79919L87972P00212J814295R1822P43979
$$ 8041662 8353919 9122130 9320528 8984995 9264914 9652886 10353098 12167393 12259215 13003194
2356A3003194K005927P99600L69910M45258P22173J363531J539813J730544L398319
$$ 13003194 15009121 15808721 16178631 16623889 17346062 18709593 20249406 21979950 25378269
2347B5378269N442307N163086K769241M78138J094005J158565K068322K260483
$$ 25378269 30820576 35983662 38752903 39231041 40325046 41483611 43551933 45812416
2339D5812416O130692Q284740J3242874J6187456K2854626L6528260P8839221
$$ 45812416 51943108 60227848 73470722 89658178 112512804 149041064 227880285
2332B27880285J29760812J43536898K5089948n2419959n8246714q3518688q0607277
$$ 227880285 357641097 501177995 526267943 473847984 415601270 332082582 251475305
2325B51475305o7646653m6338788l2745178k2293656j5976067r547308p173053
$$ 251475305 183828652 137489864 104744686 82451030 66474963 56927655 49754602
2318D9754602l322727k316421R30195k297681m147276l218691l560015m257226
$$ 49754602 46431875 44115454 45045649 42747968 38600692 35382001 31821986 27564760
2310B7564760k563921k266646n79259k114266j493406j037233j39672p64798q04358
$$ 27564760 25000839 22734193 22154934 20040668 18547262 17510029 17370357 16605559 15801201
2301A5801201j312572J3132k60703j82399o84758l31276j96907l93295q75285
$$ 15801201 14488629 14501761 14241058 14058659 13373901 13042625 12845718 12452423 11577138
2292A1577138k63670p83677k09061Q2768j094373q55002J029187r24080o65077
$$ 11577138 11313468 10529791 10320730 10403498 9309125 8454123 9483310 8559230 7894153
2283G894153K73399L80734j46193j06226r59190l64589L05420n51899r34639k7856
$$ 7894153 8167552 8548286 8402093 8295867 7336677 6972088 7277508 6725609 5790970 5763114
2273E763114n35549n66035J074153L93922j55967k87406J71434o99790n46657
$$ 5763114 5227565 4661530 5735683 6129605 5973638 5686232 5857666 5157876 4611219
2264D611219j67444K05649K9220n15667l20848r6203M14488K36309N05377k30621
$$ 4611219 4443775 4649424 4678644 4162977 3842129 3745926 4160414 4396723 4902100 4671479
2254D671479q79766n10138K91098m63392l59463o22892L24170L41504N23803J179785
$$ 4671479 3791713 3281575 3572673 3109281 2749818 2126926 2451096 2792600 3316403 4496188
2244D496188m1536m30152k8033r69644r80010O44980o31056o95913M21342P26747
$$ 4496188 4454652 4024500 3996467 3026823 2046813 2691793 2060737 1364824 1786166 2512913
2234B512913l76119P81212r3115J65177K57731l87750o68590L12460N1605n45933
$$ 2512913 2136794 2918006 2824891 2990068 3247799 2860049 2191459 2503919 2555524 2009591
2224B009591m86730K77924j61364J018217r6349N76093O81291o06377j171458
$$ 2009591 1522861 1800785 1639421 2657638 2561289 3137382 3818673 3212296 2040838
2215B040838n34796o6862j35648K2044l48337J64354Q12168j55800L68816M53768
$$ 2040838 1506042 1439180 1303532 1325576 977239 1141593 1953761 1797961 2166777 2620545
2205B620545l57223j68488n06691q30565r35909M26932k0674j27311J601681J76340
$$ 2620545 2263322 2094834 1588143 757578 -178331 248601 227927 100616 1702297 1878637
2195A878637N23171P13484r5882q95367n14459l19378p53405J89513K25732L85906
$$ 1878637 2401808 3115292 3019410 2124043 1609584 1290206 536801 726314 952046 1337952
2185A337952J1641K62155R36523n06240J98136J09225p65925l10315j87792n07098
$$ 1337952 1349593 1611748 2548271 2042031 2240167 2349392 1583467 1273152 1085360 578262
2175E78262l06715L86392N92917L64288K48072Q3399K8098J39673l93917l69145
$$ 578262 271547 657939 1250856 1615144 1863216 1946615 1974713 2114386 1720469 1351324
2165A351324k08962n94683k56153K4354N18770L48958K56737K11664J03221j59652
$$ 1351324 1142362 547679 291526 315880 834650 1183608 1440345 1652009 1755230 1595578
2155A595578m74621L92409m59809j266949j66670Q31236n50112P63389O73204
$$ 1595578 1120957 1513366 1053557 -213392 -380062 451174 -98938 664451 1337655
2146A337655J58233L16727J7962o54868Q6966J15598r77491K58275O91468o50744
$$ 1337655 1495888 1812615 1830577 1175709 1262675 1378273 400782 659057 1350525 699781
2136F99781j25304K06161J27420P03393K19793j006089Q25744k44682j014364
$$ 699781 574477 780638 908058 1611451 1831244 825155 1650899 1406217 391853
2127C91853l10117P5281N66793K89030j00154N4893N63199J68109j45096p7626
$$ 391853 81736 157017 723810 1012840 912686 967579 1530778 1698887 1553791 1476165
2117A476165q38943k89036K02842j012062L19633R87732l22864O76999O89760
$$ 1476165 637222 348186 551028 -461034 -141401 846331 523467 1200466 1890226
2108A890226j039774J65078N35681j463466q61519J736566j77833j168411M84020
$$ 1890226 850452 1015530 1551211 87745 -773774 962792 784959 -383452 100568
2099A00568L40019N42886P27297j73295k38078K48600l72340k81662J94247m40148
$$ 100568 440587 983473 1710770 1537475 1299397 1547997 1175657 893995 1088242 648094
2089F48094k90242L4439j9345J98561J83910q2687O60697k36367M1629K4820L29206
$$ 648094 357852 392291 372946 571507 755417 672730 1333427 1097060 1138689 1163509 1492715
2078A492715n17252N38753K08464m67002N64382m83129m45766O28461k97714p73445
$$ 1492715 975463 1514216 1722680 1255678 1820060 1336931 891165 1519626 1221912 448467
2068D48467Q31433J87911n39089M33814J89754K4756J119571K13417k2395P84989
$$ 448467 1279900 1467811 928722 1362536 1552290 1577046 2696617 2910034 2887639 3672628
2058C672628p44651j541251J95761n00131k55047K70587j22393J44796P2293p4036
$$ 3672628 2927977 1386726 1582487 1082356 827309 1097896 975503 1120299 1192592 1118556
2048A118556j00280l12233p57576P23623J317913j142579O3513L96009j73390
$$ 1118556 1018276 706043 -51533 672090 1990003 847424 910937 1306946 1133556
2039A133556o22940K51328K9711M46296o22685k98278O29951J55978m49439J21294
$$ 1133556 510616 761944 791655 1237951 615266 316988 946939 1102917 653478 774772
2029G74772k35367r4584O7776l68710M79625K88848J37230L8165L09760j084127
$$ 774772 539405 444821 512597 143887 623512 912360 1049590 1087755 1397515 313388
2019C13388k13604P42394l96756n25748K45535q57529M89416N16622m68650P76850
$$ 313388 99784 842178 445422 -80326 165209 -692320 -202904 313718 -154932 621918
2009F21918J348516m64544p49216L68111l96598j70862Q6305r38131N46174Q31136
$$ 621918 1970434 1505890 756674 1124785 728187 557325 643630 -294501 251673 1082809
1999A082809k04308p0762M45319o14443K4319K67734n09359k29242k94748l62349
$$ 1082809 878501 807739 1253058 638615 662934 930668 421309 192067 -102681 -465030
1989d65030K6608L34728J53488J134160N26319q44967R868Q23276q36113n13759
$$ -465030 -438422 -103694 49794 1183954 1710273 865306 875174 1698450 862337 348578
1979C48578l52878j82467J110721L03563j261120Q43484J236995q09778l1122
$$ 348578 -4300 -186767 923954 1227517 -33603 809881 2046876 1237098 1205976
1970A205976p2392k54632p8568k22380m64833k87329k68656K93622M77500J246303
$$ 1205976 1133584 878952 800384 578004 113171 -174158 -442814 -149192 328308 1574611
1960A574611Q8500L1698l70300m05202l76310j4954l1249o53905q95629P77042
$$ 1574611 1663111 1694809 1324509 919307 542997 528043 496794 -157111 -1052740 -275698
1950b75698K40713l01399P86082Q37977Q8667n48268m96094j46739L43078m14593
$$ -275698 -34985 -336384 449698 1287675 1376342 828074 331980 185241 528319 113726
1940A13726o85661P01728J334695q14857K18072O85760L43703K39461j182580
$$ 113726 -571935 129793 1464488 649631 867703 1553463 1897166 2136627 954047
1931I54047j406694P33810Q27098p10032J56037N85031J15325J53211k57153j75972
$$ 954047 -452647 281163 1108261 398229 554266 1139297 1254622 1407833 1150680 974708
1921I74708J3311J35016q07819k97118k03909J48996K14693j45106J12993R99168
$$ 974708 988019 1123035 315216 18098 -185811 -36815 177878 32772 145765 1144933
1911A144933L78061o57406l946j25088o86149J32895L02787L61390M67835K19253
$$ 1144933 1522994 865588 861642 736554 50405 183300 486087 847477 1315312 1534565
1901A534565j042771k48703K77544k24868j1069K60082M53797j08267j00892N0005
$$ 1534565 491794 243091 520635 295767 284698 544780 998577 890310 789418 839423
1891H39423j4636n31843O3074L12880j91120L52242N67512p56589J95706k07536
$$ 839423 824787 292944 356018 668898 477778 830020 1397532 640943 836649 629113
1881F29113m79694O00961L5998q25447L6109K55996k50147L76666L32644P07386
$$ 629113 149419 750380 786378 -39069 -2960 253036 2889 379555 712199 1419585
1871A419585M41049m43792m91326q369k83306n27439K68325m15122k2540N03110
$$ 1419585 1860634 1416842 925516 917147 633841 106402 374727 -40395 -62935 440175
1861D40175P8745M47696n96775n76590K00680K52613j54843j79016L94012k45854
$$ 440175 518920 966616 369841 -206749 -6069 246544 91701 -87315 306697 60843
1851F0843n22259K31133L18151J70730J232220k15774m05985O18125o04129m67655
$$ 60843 -461416 -230283 87868 258598 1490818 1275044 869059 1487184 883055 415400
1841D15400L12703P14732q39430j10204j0436k58325p5801j59235K31548N47436
$$ 415400 728103 1442835 603405 493201 482765 224440 148639 -10596 220952 768388
1831G68388J97552J87117n23540m83966m09054J9283N39920k77412j7617J314926
$$ 768388 965940 1153057 629517 145551 -263503 -244220 295700 18288 671 1315597
1821A315597N83923r03125l12103L63361o99621q83778L59296j40770P3495L79958
$$ 1315597 1899520 996395 684292 1047653 348032 -535746 -176450 -317220 -243725 136233
1811A36233l66421k09155J568677K4261j346680L58238J013458n02632n06109
$$ 136233 -230188 -439343 1129334 1153595 -193085 165153 1178611 675979 169870
1802A69870o08820m86507Q03271N99397M01087M05123J29869j77282k86304k76503
$$ 169870 -438950 -925457 -122186 477211 878298 1283421 1413290 1236008 949704 673201
1792F73201k75702j18620N1267L81338m98296M74520K25035p82323Q0400J89272
$$ 673201 397499 278879 330146 711484 213188 687708 912743 130420 210820 400092
1782D00092R70893k84451j199342M75136P6660k90281k78427N9196L85203P45672
$$ 400092 1370985 1086534 -112808 362328 438988 148707 -129720 -70524 314679 1060351
1772A060351L54635m85397r4855J3874o28494k21347J88259j72272o6220l01346
$$ 1060351 1414986 929589 834734 848608 220114 -1233 187026 14754 -51466 -352812
1762c52812m2385O15851K25018M14206m29806j50902M37138k89312m50414r8038
$$ -352812 -395197 220654 445672 859878 430072 279170 716308 426996 -23418 -121456
1752a21456l02575K52296q112K54406O6534N78425k59304n85365L40375L48470
$$ -121456 -424031 -171735 -179847 74559 141093 719518 460214 -125151 215224 563694
1742E63694n15470r6606j95871n10255J865531J77749r80618o2961N16375n37051
$$ 563694 48224 -48382 -244253 -754508 1111023 1288772 308154 245193 761568 224517
1732B24517K56533J29530m78200L06970L27295o67063J163104M67366n20712L60060
$$ 224517 481050 610580 132380 439350 766645 99582 1262686 1730052 1209340 1569400
1722A569400o13874p76005p75625J13849P95858L66755m46638L61172Q06788j463078
$$ 1569400 955526 179521 -596104 -482255 313603 680358 233720 594892 1401680 -61398
1712f1398K61423R22176r21650l47636M40667k04384M30957J84514o00260J39601
$$ -61398 200025 1122201 200551 -147085 293582 89198 520155 704669 104409 244010
1702B44010J188317j21667p65048O38821K13173n52728m09915k30066N7868j32139
$$ 244010 1432327 1310660 545612 1184433 1397606 844878 434963 204897 262765 130626
1692A30626M16685L90359m40556o5654N71487K42846k89512K8671p29925K1047
$$ 130626 547311 937670 497114 431460 1002947 1245793 956281 984952 255027 276074
1682B76074j5563o41168o9275J119358n13K4342m125n63674M17525Q4339n67051
$$ 276074 260511 -380657 -449932 669426 668913 693255 689130 125456 542981 627320 60269
1671F0269j63223P79456o00400m28823O60535k14931n99474k15885M87923P41170
$$ 60269 -102954 676502 76102 -352721 307814 92883 -506591 -722476 -234553 506617
1661E06617M01940q93977J74271l39449P5120J09317j37435k28477K84317R02249
$$ 506617 908557 14580 188851 -150598 -75478 33839 -103596 -332073 -47756 854493
1651H54493k90142J89986N7259j35801r165j7588j06317Q12813j40308j038343
$$ 854493 564351 754337 811596 675795 666630 649042 542725 1355538 1215230 176887
1641A76887L03952M36712K0785J89751j03357k55773M03788k77311j094709J18618
$$ 176887 480839 917551 938336 1128087 1024730 768957 1172745 895434 -199275 -80657
1631h0657N71654l42007k83848L90983J03616N28894L18054j5890n26648j48966
$$ -80657 490997 148990 -134858 256125 359741 888635 1206689 1190799 664151 515185
1621E15185j77827M9856n35521J3825M03757o34439n77578Q01017K92363O57086
$$ 515185 337358 387214 -148307 -134482 269275 -365164 -942742 -141725 150638 807724
1611H07724N19155m49703j60521k61596j178707k88369R84869K55353o99844L62972
$$ 807724 1326879 877176 716655 455059 -723648 -1012017 -27148 228205 -471639 -108667
1601a08667P39283K9695Q70615l81190n50669M90717m07214p97378j53129P2487
$$ -108667 630616 660311 1530926 1149736 599067 1089784 682570 -114808 -267937 -195450
1591a95450M06970N62551J75756J59261L21131K97859k51761j402054k90374J24704
$$ -195450 211520 774071 949827 1109088 1430219 1728078 1476317 74263 -216111 -91407
1581i1407k63906o30495O50715j7164N71064K77660l40123M91976N82963r6300
$$ -91407 -355313 -985808 -335093 -352257 218807 496467 156344 648320 1231283 1134983
1571A134983r45225j20338J80442m94380j67454M59841M81482M62025J44836j86248
$$ 1134983 189758 69420 249862 -244518 -411972 47869 529351 991376 1136212 949964
1561I49964M95111n03884o21095l53793J85612O97946r3620n10218M99935J61201
$$ 949964 1445075 941191 320096 -33697 151915 849861 756241 246023 745958 907159
1551I07159o61882J107149k50099r05663O07106j10266j065945K34374j43246
$$ 907159 245277 1352426 1102327 196664 803770 693504 -372441 -138067 -281313
1542b81313k44486J192149P6613j04744M59240K3388j323737k19232O20820j007196
$$ -281313 -525799 666350 742963 638219 1097459 1120847 -202890 -422122 198698 -808498
$$ [...]
##END NTUPLES=NMR SPECTRUM
##END=
