##TITLE=1H_DE-80H_X3
 200.13MHz, d2o
 8 sc
 
 19ns.26.2.2025
##JCAMPDX= 6.0         $$ Bruker NMR JCAMP-DX V2.0
##DATA TYPE= NMR SPECTRUM
##DATA CLASS= NTUPLES
##ORIGIN= UXNMR, Bruker Analytische Messtechnik GmbH
##OWNER= pz
$$ XWIN-NMR		Version 3.5
$$ Mon Dec 22 11:00:45 2025 Russian Standard Time (UT+4h)  Yarkov@DPX200
##.OBSERVE FREQUENCY= 200.1313
##.OBSERVE NUCLEUS= ^1H
##.ACQUISITION MODE= SIMULTANEOUS
##.ACQUISITION SCHEME= undefined
##.AVERAGES= 8
##.DIGITISER RES= 18
##SPECTROMETER/DATA SYSTEM= spect
##.PULSE SEQUENCE= zg30
##.SOLVENT NAME= CDCl3
##.SHIFT REFERENCE= (INTERNAL, CDCl3, 0, 15.4825)
##AUDIT TRAIL= $$ (NUMBER, WHEN, WHO, WHERE, WHAT)
$$ ##TITLE= Audit trail, XWIN-NMR		Version 3.5
$$ ##JCAMPDX= 5.01
$$ ##ORIGIN= Bruker BioSpin GmbH
$$ ##OWNER= Yarkov
$$ C:/Bruker/XWIN-NMR/data/yarkov2/nmr/H-C/1/pdata/1/auditp.txt
$$ ##AUDIT TRAIL=  $$ (NUMBER, WHEN, WHO, WHERE, WHAT)
(   1,<2025-12-22 10:59:37.32 +0400>,<Yarkov>,<DPX200>,
      <created by zg, POWCHK disabled, PULCHK disabled
       configuration hash MD5:
       00 E9 B6 7A A2 85 ED C7 34 08 36 98 17 FE 4E 26
       data hash MD5: 16K
       E1 3F 48 45 36 C5 6E E6 8C 7D CC 61 DA 1E D5 98>)
(   2,<2025-12-22 10:59:41.28 +0400>,<Yarkov>,<DPX200>,
      <Start of raw data processing
       efp BC_mod = 2 LB = 0.25 FT_mod = 6 PKNL = 1 PHC0 = -5311.355 PHC1 = 10.82193 SI = 16K 
       data hash MD5: 16K
       DA DB 16 F8 BC BE F7 AF 14 E9 7B CD 9F 0C 2E 00>)
(   3,<2025-12-22 11:00:07.50 +0400>,<Yarkov>,<DPX200>,
      <pk PHC0 = 11.4 PHC1 = 0 
       data hash MD5: 16K
       05 F7 C1 DE 38 E6 B3 AF E1 9B C1 0D 9C 8D 97 A0>)
$$ ##END=
$$ 
$$ hash MD5
$$ 64 DE 01 81 EC D6 21 C8 9C DB 81 7D E4 AE 58 8F
##$RELAX= 
##$RELAX= 
##$RELAX= 
##$RELAX= 
##$RELAX= 
##$RELAX= 
$$ Bruker specific parameters
$$ --------------------------
##$DU= <C:/Bruker/XWIN-NMR>
##$EXPNO= 1
##$NAME= <H-C>
##$PROCNO= 1
##$TYPE= <nmr>
##$USER= <yarkov2>
##$AMP= (0..31)
100 100 100 100 100 100 100 100 100 100 100 100 100 100 100 100 100 100 
100 100 100 100 100 100 100 100 100 100 100 100 100 100 
##$AQSEQ= 0
##$AQ_mod= 1
##$AUNM= <au_zg>
##$AUTOPOS= <>
##$BF1= 200.13
##$BF2= 200.13
##$BF3= 200.13
##$BF4= 200.13
##$BF5= 200.13
##$BF6= 200.13
##$BF7= 200.13
##$BF8= 200.13
##$BYTORDA= 1
##$CFDGTYP= 0
##$CFRGTYP= 5
##$CHEMSTR= <none>
##$CNST= (0..31)
1 1 145 1 1 1 1 1 1 1 1 1 1 1 1 1 1 1 1 1 1 1 1 1 1 1 1 1 1 1 1 1 
##$CPDPRG= <>
##$CPDPRG1= <>
##$CPDPRG2= <>
##$CPDPRG3= <>
##$CPDPRG4= <mlev>
##$CPDPRG5= <mlev>
##$CPDPRG6= <mlev>
##$CPDPRG7= <mlev>
##$CPDPRG8= <mlev>
##$CPDPRGB= <>
##$CPDPRGT= <>
##$D= (0..31)
0 0.7 0 0 0 0 0 0 0 0 0 0.03 0 0 0 0 0 0 0 0 0 0 0 0 0 0 0 0 0 0 0 0 
##$DATE= 1766386776
##$DBL= (0..7)
120 120 120 120 120 120 120 120 
##$DBP= (0..7)
150 150 150 150 150 150 150 150 
##$DBP07= 0
##$DBPNAM0= <>
##$DBPNAM1= <>
##$DBPNAM2= <>
##$DBPNAM3= <>
##$DBPNAM4= <>
##$DBPNAM5= <>
##$DBPNAM6= <>
##$DBPNAM7= <>
##$DBPOAL= (0..7)
0.5 0.5 0.5 0.5 0.5 0.5 0.5 0.5 
##$DBPOFFS= (0..7)
0 0 0 0 0 0 0 0 
$$ [...]
##$SUBNAM2= <"">
##$SUBNAM3= <"">
##$SUBNAM4= <"">
##$SUBNAM5= <"">
##$SUBNAM6= <"">
##$SUBNAM7= <"">
##$SUBNAM8= <"">
##$SUBNAM9= <"">
##$SW= 18.0517328524113
##$SWIBOX= (0..15)
0 0 2 0 0 0 0 0 0 0 0 0 0 0 0 0 
##$SW_h= 3612.71676300578
##$TD= 16384
##$TD0= 1
##$TE= 0
##$TE2= 300
##$TE3= 300
##$TEG= 300
##$TL= (0..7)
0 120 120 120 120 120 120 120 
##$TP= (0..7)
150 150 150 150 150 150 150 150 
##$TP07= 0
##$TPNAME0= <>
##$TPNAME1= <>
##$TPNAME2= <>
##$TPNAME3= <>
##$TPNAME4= <>
##$TPNAME5= <>
##$TPNAME6= <>
##$TPNAME7= <>
##$TPOAL= (0..7)
0.5 0.5 0.5 0.5 0.5 0.5 0.5 0.5 
##$TPOFFS= (0..7)
0 0 0 0 0 0 0 0 
##$TUNHIN= 0
##$TUNHOUT= 0
##$TUNXOUT= 0
##$USERA1= <user>
##$USERA2= <user>
##$USERA3= <user>
##$USERA4= <user>
##$USERA5= <user>
##$V9= 5
##$VALIST= <valist>
##$VCLIST= <CCCCCCCCCCCCCCC>
##$VD= 0
##$VDLIST= <DDDDDDDDDDDDDDD>
##$VPLIST= <PPPPPPPPPPPPPPP>
##$VTLIST= <TTTTTTTTTTTTTTT>
##$WBST= 1024
##$WBSW= 4
##$XGAIN= (0..3)
0 0 0 0 
##$XL= 0
##$YL= 0
##$YMAX_a= 36375
##$YMIN_a= -37220
##$ZGOPTNS= <>
##$ZL1= 120
##$ZL2= 120
##$ZL3= 120
##$ZL4= 120
##$ABSF1= 0
##$ABSF2= 0
##$ABSG= 0
##$ABSL= 0
##$ALPHA= 0
##$AQORDER= 0
##$ASSFAC= 0
##$ASSFACI= 0
##$ASSFACX= 0
##$ASSWID= 0
##$AUNMP= <proc_1d>
##$AZFE= 0.1
##$AZFW= 0.1
##$BCFW= 0
##$BC_mod= 2
##$BYTORDP= 0
##$COROFFS= 0
##$CY= -3
##$DATMOD= 1
##$DC= 0
##$DFILT= <>
##$DTYPP= 0
##$F1P= 0
##$F2P= 0
##$FCOR= 1
##$FTSIZE= 16384
##$FT_mod= 6
##$GAMMA= 0
##$GB= 0
##$INTBC= 1
##$INTSCL= 3.241238e-09
##$ISEN= 128
##$LB= 0.25
##$LEV0= 0
##$LPBIN= 0
##$MAXI= 10000
##$MC2= 0
##$MEAN= 0
##$ME_mod= 0
##$MI= 1.114404
##$NCOEF= 0
##$NC_proc= -9
##$NLEV= 6
##$NOISF1= 3.799351
##$NOISF2= 2.8
##$NSP= 0
##$NTH_PI= 0
##$NZP= 0
##$OFFSET= 15.48246
##$PC= 1
##$PHC0= -5299.955
##$PHC1= 10.82193
##$PH_mod= 1
##$PKNL= yes
##$PPARMOD= 0
##$PSCAL= 0
##$PSIGN= 0
##$REVERSE= no
##$SF= 200.130007854293
##$SI= 16384
##$SIGF1= 3
##$SIGF2= 2
##$SINO= 0.751879
##$SIOLD= 32768
##$SREGLST= <19F.Aceton>
##$SSB= 0
##$STSI= 16384
##$STSR= 0
##$SW_p= 3612.71676300578
##$SYMM= 0
##$S_DEV= 0
##$TDeff= 16384
##$TDoff= 0
##$TI= <>
##$TILT= no
##$TM1= 0
##$TM2= 0
##$TOPLEV= 0
##$USERP1= <user>
##$USERP2= <user>
##$USERP3= <user>
##$USERP4= <user>
##$USERP5= <user>
##$WDW= 1
##$XDIM= 16384
##$YMAX_p= 510039438
##$YMIN_p= -14544623
$$ End of Bruker specific parameters
$$ ---------------------------------
##NTUPLES= NMR SPECTRUM
##VAR_NAME=  FREQUENCY,     SPECTRUM/REAL,   SPECTRUM/IMAG
##SYMBOL=    X,             R,               I
##VAR_TYPE=  INDEPENDENT,   DEPENDENT,       DEPENDENT
##VAR_FORM=  AFFN,          ASDF,            ASDF
##VAR_DIM=   16384,         16384,           16384
##UNITS=     HZ,            ARBITRARY UNITS, ARBITRARY UNITS
##FACTOR=    0.220516191357247, 1,           1
##FIRST=     3098.50484580117, 0,            0
##LAST=      -514.211917204615, 0,           0
##MIN=       -514.211917204615, -14544623,   0
##MAX=       3098.50484580117, 510039438,    0
$$ Real data points
##PAGE= N=1
##DATA TABLE= (X++(R..R)), XYDATA
$$ [...]
$$ plain form
5162 1083530 733190 776927 1164968 1267076 1196028 1182125 1135944 1702838 1387192 1616884
5152 1616884 1658704 1376304 1151051 1294443 1242860 2320336 1539769 1895292 1253922 1500577
5142 1500577 2140991 1920689 1670766 1260593 1178347 958157 664169 954666 1025796 1226357
5132 1226357 1047599 833122 453733 545335 389641 130964 627412 737576 725660 280494
5122 280494 267271 518946 292296 263350 672711 865567 686821 518608 606008 586515
5112 586515 1519380 1595923 1592672 1148535 592570 206550 -186930 -203035 557152 1107712
5102 1107712 1061705 939408 589088 564016 159918 -352953 -12945 298571 838462 20738
5092 20738 -214184 -280919 263487 -255600 -31966 367899 1383875 535010 207186 287407
$$ packed form
5162A083530l50340M3737L88041J02108p1048j3903m6181N66894l15646K29692
5152A616884M1820k82400k25253J43392n1583J077476p80567L55523o41370K46655
5142A500577O40414k20302k49923m10173q2246k20190k93988K90497P1130K00561
5132A226357j78758k14477l79389R1602j55694k58677M96448J10164j1916m45166
5122B80494j3223K51675k26650k8946M09361J92856j78746j68213Q7400j9493
5112E86515R32865P6543l251m44137n55965l86020l93480j6105P60187N50560
5102A107712m6007j22297l50320k5072m04098n12871L40008L11516N39891q17724
5092B0738k34922o6735N44406n19087K23634L99865J015976q48865l27824Q0221
$$ plain form
5082 287407 -168981 27183 219484 465043 610566 392546 -290972 -669518 407004 434579
5072 434579 865206 261327 369100 233441 916087 1017295 547079 1129501 1198491 1047636
5062 1047636 713921 1018867 923888 -67346 -84341 971531 1748261 1112002 497183 -89527
5052 -89527 938345 1084703 1140357 1477657 2186152 2519616 1999858 1417965 1200887 1492996
5042 1492996 1572415 1649356 2533322 3253264 2783260 2431532 2206926 3725035 4058764 4436143
5032 4436143 5121532 5326300 5824349 6451502 6599970 6336190 7607873 9647341 10341937
5023 10341937 11741608 13000571 13661379 14262863 15192392 15320812 14735965 14842608 13820079
5014 13820079 13507136 13831244 13715975 14651370 15851356 16500873 16439134 16100761 16108923 16177232
$$ packed form
5082B87407m56388J96164J92301K45559J45523k18020o83518l78546J076522K7575
5072D34579M30627o03879J07773j35659O82646J01208m70216N82422O8990j50855
5062A047636l33715L04946r4979r91234j6995J055872P76730o36259o14819n86710
5052h9527J027872J46358N5654L37300P08495L33464n19758n81893k17078K92109
5042A492996P9419P6941Q83966P19942m70004l51728k24606J518109L33729L77379
5032D436143O85389K04768M98049O27153J48468k63780J271683K039468O94596
5023A0341937J399671J258963O60808O01484R29529J28420n84847J06643j022529
5014A3820079l12943L24108j15269R35395J199986O49517o1739l38373Q162O8309
$$ plain form
5004 16177232 15769570 14187434 12506198 11710950 10044812 8874074 7262757 7761974 7138155
4995 7138155 6609473 6264427 6945195 6523869 6203124 5408659 5933431 6193197 5792515 5201866
4985 5201866 4354148 5002481 5433450 5015548 4989052 5141628 5557403 5792588 6009283 6705423
4975 6705423 7436457 8349686 9046662 9210148 10605318 12367487 14006788 15396477 17695397
4966 17695397 19869597 20402345 21323033 21213857 21319256 19967222 18444584 17777884 16833836
4957 16833836 16814099 16352436 17639554 18462725 19888663 21138580 21475891 21314053 21172263
4948 21172263 19877362 18339129 16857387 14862699 12914836 11491097 10075337 8590436
4940 8590436 8725907 8414991 7731476 7118675 6285565 5867461 5218273 4705156 5527017 6023708
$$ packed form
5004A6177232m07662j582136j681236p95248j666138j170738j611317M99217o23819
4995G138155n28682l45046O80768m21326l20745p94465N24772K59766m00682n90649
4985E201866q47718O48333M30969m17902k6496J52576M15775K35185K16695O96140
4975F705423P31034R13229O96976J63486J395170J762169J639301J389689K298920
4966A7695397K174200N32748R20688j09176J05399j352034j522638o66700r44048
4957A6833836j9737m61663J287118Q23171J425938J249917L37311j61838j41790
4948B1172263j294901j538233j481742j994688j947863j423739j415760j484901
4940H590436J35471l10916o83515o12801q33110m18104o49188n13117Q21861M96691
$$ plain form
4930 6023708 6135030 5505511 4739757 4387477 3921640 3468066 3538893 4074452 4697337 4157590
4920 4157590 4026657 3310122 3567156 3055390 2862123 3888499 4433813 4180099 2664769
4911 2664769 2182300 2319172 2618485 2402051 2375517 2706541 3095404 1947220 1567045 1430643
4901 1430643 2189242 2460715 2508500 2727054 2261332 1954307 883295 1033766 1006992 1789417
4891 1789417 2360753 2737869 2574239 2098632 711816 435719 1076727 2007354 1941652 2071278
4881 2071278 1338067 1471145 716607 764026 702618 1138329 1851570 1510420 1617999 1803768
4871 1803768 1624128 1486485 1005808 1723349 2133938 2142683 1621165 1446286 1961776 1911225
4861 1911225 2031473 1431858 1253793 1026300 763070 562957 952882 1312801 1055956 1144582
$$ packed form
4930F023708J11322o29519p65754l52280m65837m53574P0827N35559O22885n39747
4920D157590j30933p16535K57034n11766j93267J026376N45314k53714j515330
4911B664769m82469J36872K99313k16434k6534L31024L88863j148184l80175j36402
4901A430643P58599K71473M7785K18554m65722l07025j071012J50471k6774P82425
4891A789417N71336L77116j63630m75607j386816k76097O41008R30627o5702J29626
4881B071278p33211J33078p54538M7419o1408M35711P13241l41150J07579J85769
4871A803768j79640j37643m80677P17541M10589Q745n21518j74879N15490n0551
4861A911225J20248n99615j78065k27493k63230k00113L89925L59919k56845Q8626
$$ plain form
4851 1144582 1384636 2265493 2318514 2801197 2455286 2847635 2339905 2043316 1620736 1753823
4841 1753823 2259510 2464135 1600359 1755974 2451864 3025014 2309738 1895258 2092717 1679753
4831 1679753 2213465 2142227 2621924 2894053 2941322 2648893 2701161 3037671 2619989 2085078
4821 2085078 3026697 2842401 2938729 1549917 2238636 2565423 2234855 2263572 2669179 2727512
4811 2727512 2287412 2108795 1525693 1460030 2165762 1328025 1230177 1663943 1309064 2218718
4801 2218718 2154053 2487056 1987484 1749959 1616949 1436119 1637163 2278805 2212110 1721879
4791 1721879 1885485 2014745 1989862 2484615 2707536 2539582 3093326 2025148 1879954 1016559
4781 1016559 2254963 2846538 3041346 2647878 2693148 2708903 2724143 2874449 3930420 3704101
$$ packed form
4851A144582K40054Q80857N3021M82683l45911L92349n07730k96589m22580J33087
4841A753823N05687K04625q63776J55615O95890N73150p15276m14480J97459m12964
4831A679753N33712p1238M79697K72129M7269k92429N2268L36510m17682n34911
4821B085078R41619j84296R6328j388812O88719L26787l30568K8717M05607N8333
4811B727512m40100j78617n83102o5663P05732q37737r7848M33766l54879R09654
4801B218718o4665L33003m99572k37525j33010j80830K01044O41642o6695m90231
4791A721879J63606J29260k4883M94753K22921j67954N53744j068178j45194q63395
4781A016559J238404N91575J94808l93468M5270J5755J5240J50306J055971k26319
$$ plain form
4771 3704101 3860762 3907697 3129079 2471623 2504461 2375508 2666014 3012372 3650108 2942886
4761 2942886 2673004 3058795 2055638 2018218 2453383 3176493 3691938 4172294 3189246 2626551
4751 2626551 3168660 3970884 4173025 3718017 3823019 4360687 3511356 3375689 2905285 3155517
4741 3155517 3774231 2763309 3739622 4227027 4306947 4128260 4299457 4320293 4851218 4444464
4731 4444464 3642140 3895360 4761698 4075360 4725077 5387329 5452879 4987906 5244395 5569174
4721 5569174 5621729 6017626 5897491 7412452 8627568 10019125 10628497 12191252 14315337
4712 14315337 16749865 16851682 17235840 17421987 17404693 16307546 15243100 13848394 12367352
4703 12367352 10758507 9831288 9310591 9018956 9023956 7842058 6952418 6932365 7171864 7112201
$$ packed form
4771C704101J56661M6935p78618o57456L2838j28953K90506L46358O37736p07222
4761B942886k69882L85791j003157l7420M35165P23110N15445M80356r83048n62695
4751B626551N42109Q02224K02141m55008J05002N37668q49331j35667m70404K50232
4741C155517O18714j010922R76313M87405P9920j78687J71197K0836N30925m06754
4731D444464q02324K53220Q66338o86338O49717O62252O5550m64973K56489L24779
4721E569174N2555L95897j20135J514961J215116J391557O09372J562755K124085
4712A4315337K434528J01817L84158J86147j7294j097147j064446j394706j481042
4703A2367352j608845r27219n20697k91635N000j181898q89640k0053K39499n9663
$$ plain form
4693 7112201 6968705 6961813 6882898 7320326 7856506 7836603 8535699 9080733 10153806 10620000
4683 10620000 11973777 13789834 14760076 16015382 17011698 18138273 17798192 17448451 16579606
4674 16579606 15845382 14237629 12600172 11229762 10358587 8947478 9597335 8887615 8748409
4665 8748409 8737031 8648062 7892922 7969006 9050511 10406761 11537865 13419788 14152971
4656 14152971 15234929 15797267 15381383 15548344 15007042 14085520 12311237 11687568 9878187
4647 9878187 8826892 7669057 7806393 7174214 7034193 6886921 6857124 6090246 5512733
4638 5512733 6071020 6031859 6874822 7028471 6807588 6080490 5991046 6685624 6926680 7214303
4628 7214303 9144769 10153130 11444215 11992114 13089433 14170375 14725385 14947261 13741794
$$ packed form
4693G112201j43496o892p8915M37428N36180j9903O99096N45034J073073M66194
4683A0620000J353777J816057R70242J255306R96316J126575l40081l49741q68845
4674A6579606p34224j607753j637457j370410q71175j411109O49857p09720j39206
4665H748409j1378q8969p55140P6084J081505J356250J131104J881923P33183
4656A4152971J081958N62338m15884J66961n41302r21522j774283o23669j809381
4647I878187j051295j157835J37336o32179j40021j47272k9797p66878n77513
4638E512733N58287l9161Q42963J53649k20883p27098q9444O94578K41056K87623
4628G214303J930466J008361J291085N47899J097319J080942N55010K21876j205467
$$ plain form
4619 13741794 12637390 11829796 10404419 9071147 7968570 7643862 6707480 6499120 6292401
4610 6292401 5299180 4887444 4950679 4900042 4914679 5049767 5510995 5346547 3968201 4434190
4600 4434190 3806289 4273422 4046337 4548843 4683783 4391236 3783727 3442770 3029359 3630238
4590 3630238 3788775 3648832 3448332 3425141 3549547 2562349 3291655 3824198 4244859 3684509
4580 3684509 3304227 3244411 3173751 3709630 3483842 3549824 3859308 3853880 3757952 3160752 3626396
4569 3626396 3742394 2822674 3320875 3211644 3726795 3184007 2770129 2838415 2669328 2799798
4559 2799798 3217624 3401094 4134987 3430218 3416338 3263590 3866581 3868648 3392677 3452326
4549 3452326 4153424 3817088 3774318 3954398 3811876 4330263 4986556 4536087 4162177 4297087
$$ packed form
4619A3741794j104404q07594j425377j333272j102577l24708r36382k08360k06719
4610F292401r93221m11736O3235n0637J4637J35088M61228j64448j378346M65989
4600D434190o27901M67133k27085N02506J34940k92547o07509l40957m13411O00879
4590C630238J58537j39943k00500k3191J24406r87198P29306N32543M20661n60350
4580C684509l80282n9816p0660N35879k25788O5982L09484n428r5928n97200M65644
4569C626396J15998r19720M98201j09231N15151n42788m13878O8286j69087J30470
4559B799798M17826J83470P33893p04769j3880j52748O02991K067m75971N9649
4549C452326P01098l36336m2770J80080j42522N18387O56293m50469l73910J34910
$$ plain form
4539 4297087 4003863 3883584 4017157 4892137 5003576 4651896 4912651 4606373 3783209 3673900
4529 3673900 3428377 4693875 4800852 5191735 4705227 4418063 4138944 4051978 4134093 4219196
4519 4219196 5388628 5212803 5042481 4821047 5584623 5504023 5996457 6464148 7929304
4510 7929304 7428231 6974314 6455991 5661436 5973228 6711948 7180212 7109834 8043375 8626081
4500 8626081 8625168 7840381 7547077 7473506 8048944 8317147 8593049 8388251 8611572 8902662
4490 8902662 8720997 8618119 9591491 9876622 10287395 10350863 9808419 9343242 9839013 10405463
4480 10405463 11340563 12337777 12898821 12099219 12451015 12237824 12399767 12722585 13689515
4471 13689515 14716238 14260695 14972354 14577321 14974330 15060947 16293290 17219880 17033572
$$ packed form
4539D297087k93224j20279J33573Q74980J11439l51680K60755l06278q23164j09309
4529C673900k45523J265498J06977L90883m86508k87164k79119q6966Q2115Q5103
4519D219196J169432j75825j70322k21434P63576q0600M92434M67691J465156
4510G929304n01073m53917n18323p94555L11792P38720M68264p0378R33541N82706
4500H626081r13p84787k93304p3571N75438K68203K75902k04798K23321K91090
4490H902662j81665j02878R73372K85131M10773O3468n42444m65177M95771N66450
4480A0405463R35100R97214N61044p99602L51796k13191J61943L22818R66930
4471A3689515J026723m55543P11659l95033L97009Q6617J232343R26590j86308
$$ plain form
4462 17033572 17936375 18332161 17897437 18364110 18966253 19562778 20661785 20989715 22081865
4453 22081865 21669692 22239717 22078814 23115763 24198905 25251438 25486979 26196838 27036292
4444 27036292 28137342 28663468 29105963 29880646 30657048 30653010 31321338 31961742 32114964 32615767
4434 32615767 33087781 34274985 35594160 35956449 35527557 35495999 35434850 36210167 36030271
4425 36030271 36841603 37808099 38693813 37880859 38027760 39146789 39952348 39695359 39548835
4416 39548835 39282164 40239621 40207778 39842982 40780679 40415714 41033846 41016242 41219936 40924465
4406 40924465 41312975 41060652 41024762 41553174 41794930 41305105 41458343 41534435 41656654 41981105
4396 41981105 42281336 41753657 42133092 42796749 42951126 43247064 43846293 44916220 45014170
$$ packed form
4462A7033572R02803L95786m34724M66673O02143N96525J099007L27930J092150
4453B2081865m12173N70025j60903J036949J083142J052533K35541P09859Q39454
4444B7036292J101050N26126M42495P74683P76402m038O68328O40404J53222N00803
4434C2615767M72014J187204J319175L62289m28892l1558o1149P75317j79896
4425C6030271Q11332R66496Q85714q12954J46901J119029Q05559k56989j46524
4416C9548835k66671R57457l1843l64796R37697l64965O18132j7604K03694k95471
4406D0924465L88510k52323l5890N28412K41756m89825J53238P6092J22219L24451
4396D1981105L00231n27679L79435O63657J54377K95938N99229J069927R7950
$$ plain form
4387 45014170 45566792 45079198 44114871 42796884 42493399 42320397 42750878 42807350 43159676
4378 43159676 42795945 43611871 43739973 43369242 43381697 43980652 44407146 44367852 45004857 44728677
4368 44728677 45468325 44829823 44755330 44933934 45187551 45258951 45022729 45267224 45376307 45122346
4358 45122346 44725144 44993820 46254482 46200127 45920944 45822566 46016746 45935541 45492472 46105402
4348 46105402 45613630 45817079 46282688 45991580 45341354 44788420 43925829 44312488 44245838 45023127
4338 45023127 44287302 44172399 43439438 43478493 42353581 41477536 41935865 41666985 42152901
4329 42152901 41398830 40295986 40625648 40116708 39737766 39508881 39058596 39350450 38384467
4320 38384467 37892703 36881496 36548759 36412357 35907635 36208774 37558232 39308698 43365913
$$ packed form
4387D5014170N52622m87594r64327j317987l03485j73002M30481N6472L52326
4378D3159676l63731Q15926J28102l70731J2455N98955M26494l9294O37005k76180
4368D4728677P39648o38502p4493J78604K53617P1400k36222K44495J09083k53961
4358D5122346l97202K68676J260662n4355k79183r8378J94180q1205m43069O12930
4348D6105402m91772K03449M65609k91108o50226n52934q62591L86659o6650P77289
4338D5023127p35825j14903p32961L9055j124912q76045M58329k68880M85916
4329D2152901p54071j102844L29662n08940l78942k28885m50285K91854r65983
4320C8384467m91764j011207l32737j36402n04722L01139J349458J750466M057215
$$ plain form
4311 43365913 50843767 58897747 61188524 59840344 57512238 48686648 42552120 37054821
4303 37054821 32957712 30059251 29090895 27693347 25959315 24891634 24164135 23183603 22231129
4294 22231129 21396185 21227252 20690923 20256382 19845672 19141707 19134122 18209256 18513516 18142812
4284 18142812 18687523 18289398 17820275 17364849 17171394 16785932 17354377 17383660 17412448 17233093
4274 17233093 18130024 17894486 17497212 18154751 18684481 18841522 19190122 19001029 19585655
4265 19585655 19457195 19557745 19215619 20291933 21658252 22717633 23275877 22945156 24349821
4256 24349821 24384160 24810641 25437440 25368025 25198518 24771035 24989006 24730601 25059282 25716797
4246 25716797 26639860 27547238 28046279 28868735 28862823 28255997 28550787 27025098 26134541 25224655
$$ packed form
4311D3365913P477854Q053980K290777j348180k328106q825590o134528n497299
4303C7054821m097109k898461r68356j397548j734032j067681p27499r80532r52474
4294B2231129q34944j68933n36329m34541m10710p03965p585r24866L04260l70704
4284A8142812N44711l98125m69123m55426j93455l85462N68445K9283K8788j79355
4274A7233093Q96931k35538l97274O57539N29730J57041L48600j89093N84626
4265A9585655j28460J00550l42126J076314J366319J059381N58244l30721J404665
4256B4349821L4339M26481O26799o9415j69507m27483K17971k58405L28681O57515
4246B5716797R23063R07378M99041Q22456n912o06826K94790j525689q90557r09886
$$ plain form
4236 25224655 25727761 25326674 24269980 23995972 24059355 24642346 25366319 24873557 24801425 24210558
4226 24210558 23648346 22446859 21190005 20852254 19464061 19678898 18810192 19044439 17607916
4217 17607916 17131912 16594731 16239638 15861500 15515847 14996296 14337681 13653451 13010651
4208 13010651 11405766 10977990 11141903 10189523 9794179 8629345 9491769 9267665 8935867
4199 8935867 9485264 8676775 7950488 7992063 7619977 8580818 8910718 8627592 7565899 6976601
4189 6976601 7449769 7233699 6762791 6018314 5669568 5078590 4914138 4924316 5264730 5895404
4179 5895404 5455579 5346714 5682630 5329053 4612996 3923913 4289839 4313494 4295868 4172428
4169 4172428 4185069 4427686 3905081 4082378 4285433 4031798 4144637 4356612 3622560 3939659
$$ packed form
4236B5224655N03106m01087j056694k74008O3383N82991P23973m92762p2132n90867
4226B4210558n62212j201487j256854l37751j388193K14837q68706K34247j436523
4217A7607916m76004n37181l55093l78138l45653n19551o58615o84230o42800
4208A3010651j604885m27776J63913r52380l95344j164834Q62424k24104l31798
4199H935867N49397q08489p26287M1575l72086R60841L29900k83126j061693n89298
4189F976601M73168k16070m70908p44477l48746n90978j64452J0178L40414O30674
4179E895404m39825j08865L35916l53577p16057o89083L65926K3655j7626j23440
4169D172428J2641K42617n22605J77297K03055k53635J12839K11975p34052L17099
$$ plain form
4159 3939659 3605571 4326595 3972435 4287022 4454060 4339201 3783511 3035013 3328347 3169879
4149 3169879 3552506 4220003 3268167 3485693 3421271 3235205 3418433 3548379 4489859 3704640
4139 3704640 3619727 2646611 2993973 3467725 3917506 4008311 4325380 3528328 3044624 2339765
4129 2339765 2992024 2631719 2718075 2874571 3384217 3535119 2192764 1837468 1499292 1997527
4119 1997527 2338031 2710626 2730813 2324072 2373484 2414296 2103290 1766705 1858608 2644657
4109 2644657 2666725 2597467 3082791 2387384 2727103 2838670 3332780 3396735 3399569 3089025
4099 3089025 2697635 2273791 1971334 2129701 2376757 2897578 3378518 2560033 1938448 1373556
4089 1373556 1158156 2139624 2843623 2918882 2927140 2028378 1594418 1670184 1892851 2344501
$$ packed form
4159C939659l34088P21024l54160L14587J67038j14859n55690p48498K93334j58468
4149C169879L82627O67497r51836K17526o4422j86066J83228J29946R41480p85219
4139C704640q4913r73116L47362M73752M49781R0805L17069p97052m83704p04859
4129B339765O52259l60305Q6356J56496N09646J50902j342355l55296l38176M98235
4119A997527L40504L72595K0187m06741M9412M0812l11006l36585R1903P86049
4109B644657K2068o9258M85324o95407L39719J11567M94110O3955K834l10544
4099C089025l91390m23844l02457J58367K47056N20821M80940q18485o21585n64892
4089A373556k15400R81468P03999P5259Q258q98762m33960P5766K22667M51650
$$ plain form
4079 2344501 2640434 2858521 2362679 1725219 1126141 1346978 1300119 1606803 1709702 1931696
4069 1931696 1564725 1605722 1656605 1364928 1357319 1695555 2392350 1901566 2134834 1958530
4059 1958530 1723944 1620982 1090601 607739 798604 1017052 632316 -31581 544100 1144925
4049 1144925 1234718 1551281 1841245 1909032 1001115 346195 480520 1041661 1643003 1882103
4039 1882103 1641959 1498082 986484 577740 539871 1439508 1835404 1155417 1008332 1571151
4029 1571151 780297 849399 365895 1438495 1209443 1140693 1390666 833780 1002311 615077
4019 615077 839707 1145969 1744448 1777751 1168386 678696 515342 687782 942083 841451
4009 841451 931637 1341176 1126900 -210161 -387214 -1356 230576 784558 1234950 1413683
$$ packed form
4079B344501K95933K18087m95842o37460n99078K20837m6859L06684J02899K21994
4069A931696l66971M0997N0883k91677p609L38236O96795m90784K33268j76304
4059A958530k34586j02962n30381m82862J90865K18448l84736o63897N75681O00825
4049A144925Q9793L16563K89964O7787r07917o54920J34325N61141O01342K39100
4039A882103k40144j43877n11598m08744l7869Q99637L95896o79987j47085N62819
4029A571151p90854O9102m83504J072600k29052o8750K49973n56886J68531l87234
4019F15077K24630L06262N98479L3303o09365m89690j63354J72440K54301j00632
4009H41451R0186M09539k14276j337061j77053L85858K31932N53982M50392J78733
$$ plain form
3999 1413683 1813059 1050951 656438 903865 1036095 1795972 1665153 1746416 1079829 1459483
3989 1459483 772988 739674 982218 1655287 1397377 931873 531334 637016 600835 636759
3979 636759 544113 1206804 1818045 1906309 1118267 500773 1116824 599345 1132286 929720
3969 929720 1916083 1599104 1072441 1026646 732079 904703 821984 1185608 557561 1200022
3959 1200022 1547395 1395555 1211693 1433104 718151 951459 1718421 1541139 677758 -68294
3949 -68294 50325 571348 807755 1328611 1254242 1622022 1192952 653148 -201513 401527
3939 401527 1499190 1264086 1127509 840381 361485 434818 788620 907952 1526666 1083552
3929 1083552 1287242 255613 632962 547374 992795 917749 1654643 1743668 1130710 760214
$$ packed form
3999A413683L99376p62108l94513K47427J32230P59877j30819Q1263o66587L79654
3989A459483o86495l3314K42544O73069k57910m65504m00539J05682l6181L5924
3979F36759r2646O62691O11241Q8264p88042o17494O16051n17479N32941k02566
3969I29720R86363l16979n26663m5795k94567J72624q2719L63624o28047O42461
3959A200022L47373j51840j83862K21411p14953K33308P66962j77282q63381p46052
3949f8294J18619N21023K36407N20856p4369L67780m29070n39804q54661O03040
3939D01527J097663k35104j36577k87128m78896P3333L53802J19332O18714m43114
3929A083552K03690j031629L77349q5588M45421p5046P36894Q9025o12958l70496
$$ plain form
3919 760214 835446 800099 476992 410077 1062860 1162175 1469830 889178 793932 550514 1027113
3908 1027113 1241495 1773018 2187385 1825637 1081028 601699 575200 1183331 1431809 1752951
3898 1752951 2013645 758806 1498382 968084 747569 1187082 1426913 2110527 1564555
3889 1564555 1030291 363332 511897 1638518 1490776 1977771 2218902 2206893 1860281 734898
3879 734898 1011079 1538709 1433748 1429714 1714690 1290709 525451 838103 1113526 1306911
3869 1306911 1486723 1421781 1207133 960482 1068916 772538 620798 1504913 1976757 1453292
3859 1453292 1618226 1504871 1652629 1144720 625920 969640 613196 877532 714039 726883
3849 726883 673320 1685572 800652 100645 874873 732954 990269 918681 1352334 675314
$$ packed form
3919G60214P5232l5347l23107o6915O52783R9315L07655n80652r5246k43418M76599
3908A027113K14382N31523M14367l61748p44609m79329k6499O08131K48478L21142
3898A752951K60694j254839P39576n30298k20515M39513K39831O83614n45972
3889A564555n34264o66959J48565J126621j47742M86995K41131j2009l46612j125383
3879G34898K76181N27630j04961m034K84976m23981p65258L12652K75423J93385
3869A306911J79812o4942k14648k46651J08434k96378j51740Q84115M71844n23465
3859A453292J64934j13355J47758n07909n18800L43720l56444K64336j63493J2844
3849G26883n3563J012252q84920p00007P74228j41919K57315p1588M33653o77020
$$ plain form
3839 675314 1027458 776596 487386 604478 1374612 1202022 1206183 339144 498139 156575
3829 156575 -151042 846963 603309 603856 -34131 839925 510972 527047 776099 1266185
3819 1266185 1563275 970380 833151 120363 162878 1027613 971529 906106 1399796 1772300
3809 1772300 1501831 1064596 1050668 567977 296089 1481999 1303479 1160132 128388
3800 128388 -115450 809804 657317 1901379 874534 1281980 1859273 1966842 1130542
3791 1130542 1360370 1702593 1498968 1634438 1913522 1605963 1365622 1276120 1067827 1775026
3781 1775026 1443654 1816436 368311 701304 1525996 1303407 907843 1333168 2137595
3772 2137595 2535736 2155963 2071520 1336820 1983694 1610194 1807469 1705884 1813501 2164314
$$ packed form
3839F75314L52144k50862k89210J17092P70134j72590M161q67039J58995l41564
3829A56575l07617R98005k43654N47o37987Q74056l28953J6075K49052M90086
3819A266185K97090n92895j37229p12788M2515Q64735n6084o5423M93690L72504
3809A772300k70469m37235j3928m82691k71888J185910j78520j43347j031744
3800A28388k43838R25254j52487J244062j026845M07446N77293J07569q36300
3791A130542K29828L42223k03625J35470K79084l07559k40341q9502k08293P07199
3781A775026l31372L72782j448125L32993Q24692k22589l95564M25325Q04427
3772B137595L98141l79773q4443p34700O46874l73500J97275j01585J07617L50813
$$ plain form
3762 2164314 2346632 1982003 2163046 1747210 1860603 2113491 1787894 1658082 2163705 2721829
3752 2721829 1966853 2328079 1863123 1827523 2339869 2464701 2560431 1591691 1872700 2084990
3742 2084990 1354183 1463884 1993342 2469121 1907847 1574187 2110142 1650843 1987951 1952885
3732 1952885 1715145 2131022 2323803 1795591 1329408 1404330 1131852 1179266 1756868 1690843
3722 1690843 2277408 1065440 1248927 1098882 1246548 895625 1267770 2032175 2174775
3713 2174775 2506126 2097441 1733606 1731655 2471088 2361195 3052748 3689254 4230187 3567444
3703 3567444 2880558 2907478 2613518 2475217 2755286 2767449 3331194 3723443 3488460 2602603
3693 2602603 3184426 4283072 4721204 4918915 6017013 5894272 5963216 5039734 5151492
$$ packed form
3762B164314J82318l64629J81043m15836J13393K52888l25597j29812N05623N58124
3752B721829p54976L61226m64956l5600N12346J24832R5730r68740K81009K12290
3742B084990p30807J09701N29458M75779n61274l33660N35955m59299L37108l5066
3732A952885k37740M15877J92781n28212m66183P4922k72478M7414N77602o6025
3722A690843N86565j211968J83487j50045J47666l50923L72145P64405J42600
3713B174775L31351m08685l63835j951P39433j09893O91553O36506N40933o62743
3703C567444o86886K6920k93960j38301K80069J2163N63745L92249k34983q85857
3693B602603N81823J098646M38132J97711J098098j22741O8944r23482J11758
$$ plain form
3684 5151492 4999364 5988432 6410473 6384966 6428703 6340248 6545363 5618201 5971072 6256761
3674 6256761 6185624 6460424 7138570 6953913 6041046 6882289 6779176 6667292 6073924 6320613
3664 6320613 5731223 6800917 7513153 7124122 6776686 7423081 6232223 5669387 5495597
3655 5495597 6705729 7280794 6746910 6758738 6709780 6944382 6933796 7846065 8423079 8504664
3645 8504664 8683780 8787487 9724870 11020176 11640762 12309378 13419549 15670389 16885362
3636 16885362 17709172 19024818 21039279 22166401 23323845 24921191 26250190 27043873
3628 27043873 28622940 29441967 30902840 32932824 34584114 35832677 37626450 39434697
3620 39434697 39954278 41272365 42961932 44263833 44623980 45635543 46337381 46637809 46578196
$$ packed form
3684E151492j52128R89068M22041k5507M3737q8455K05115r27162L52871K85689
3674F256761p1137K74800O78146j84657r12867Q41243j03113j11884n93368K46689
3664F320613n89390J069694P12236l89031l47436O46395j190858n62836j73790
3655E495597J210132N75065n33884J1828m8958K34602j0586R12269N77014Q1585
3645H504664J79116J03707R37383J295306O20586O68616J110171K250840J214973
3636A6885362Q23810J315646K014461J127122J157444J597346J328999P93683
3628B7043873J579067Q19027J460873K029984J651290J248563J793773J808247
3620C9434697N19581J318087J689567J301901L60147J011563P01838L00428n9613
$$ plain form
3611 46578196 46020720 45981111 45938806 45935409 44862918 42997056 41997916 40699836 38619416
3602 38619416 38104772 38187195 37297325 36159928 36457295 35703532 34056241 33007676 31492609
3593 31492609 30138615 28356495 26392090 24863215 22588346 21717896 20472227 18845446
3585 18845446 17961025 18098721 17080344 16265649 16024489 16185746 15067719 15059480 15074755 14928106
3575 14928106 13940894 13386463 13195253 12572865 12874457 13002262 12833011 12578011 12223798
3566 12223798 12036371 12876689 12730452 12894259 12891501 13539151 14276040 14165782 14233343 13661457
3556 13661457 13521118 13503477 13880936 14334226 13181024 13636601 13369298 12571885 12436677
3547 12436677 13132251 13645518 13148057 13867548 14045671 13676702 13689353 14007691 13734040 12997216
$$ packed form
3611D6578196n57476l9609m2305l397j072491j865862r99140j298080k080420
3602C8619416n14644Q2423q89870j137397K97367p53763j647291j048565j515067
3593C1492609j353994j782120j964405j528875k274869q70450j245669j626781
3585A8845446q84421J37696j018377q14695k41160J61257j118027q239J5275j46649
3575A4928106r87212n54431j91210o22388L01592J27805j69251k55000l54213
3566A2223798j87427Q40318j46237J63807k758O47650P36889j10258O7561n71886
3556A3661457j40339j7641L77459M53290j153202M55577k67303p97413j35208
3547A2436677O95574N13267m97461P19491J78123l68969J2651L18338k73651p36824
$$ plain form
3537 12997216 14518093 13965699 12470018 12413481 12009636 12346869 11849957 12857739 12641335
3528 12641335 12918550 12409256 12062311 12189413 11983401 12574908 12891407 13351729 13594590
3519 13594590 13791741 13697283 13785651 14383966 15022777 15456393 16862373 17258534 17137933 17682622
3509 17682622 17650814 18804050 19359800 21273494 21982373 23808195 25777144 26933623 28352846
3500 28352846 30386868 32982873 35527225 37467523 41355204 44052687 46886016 50444006
3492 50444006 54724151 59298302 64196544 70945457 76699398 83526222 91984207 99740060
3484 99740060 108098453 116468269 122804152 127957711 131821349 134740767 135384960 135561479
3476 135561479 134557069 134508195 134721207 135791414 136645894 137638722 139543578 141203582 141210316
$$ packed form
3537A2997216J520877n52394j495681n6537m03845L37233m96912J007782k16404
3528A2641335K77215n09294l46945J27102k06012N91507L16499M60322K42861
3519A3594590J97151r4458Q8368N98315O38811M33616J405980L96161j20601N44689
3509A7682622l1808J153236N55750J913694P08879J825822J968949J156479J419223
3500B8352846K034022K596005K544352J940298L887681K697483K833329L557990
3492E0444006M280145M574151M898242O748913N753941O826824Q457985P755853
3484I9740060Q358393Q369816O335883N153559L863638K919418O44193J76519
3476A35561479j004410m8874K13012J070207Q54480R92828J904856J660004O734
$$ plain form
3467 141210316 140140184 138570667 135094259 129744103 123920284 116405501 107601474 99054283
3459 99054283 91648725 84166060 77355600 72001629 68560568 63914412 60673085 59251050
3451 59251050 57967147 57148769 57735337 59423868 61543911 63074898 64241680 63922060 63337439
3442 63337439 62353885 61858666 61556020 61333318 61010571 59947399 58686293 59170888 57985415
3433 57985415 57675010 57257039 57489034 56439972 56091491 55569075 54798125 54826765 56237929
3424 56237929 57052089 58343069 60883919 63984221 68639400 74173133 79181215 82482937
3416 82482937 86173735 87418584 89032932 90018766 91376131 92245248 92185643 91739967 90894308
3407 90894308 89493593 86690684 84266150 81733296 78560492 75259017 71539510 68581701
$$ packed form
3467A41210316j070132j569517l476408n350156n823819p514783q804027q547191
3459I9054283p405558p482665o810460n353971l441061m646156l241327j422035
3451E9251050j283903q18378N86568J688531K120043J530987J166782l19620n84621
3442F3337439r83554m95219l02646k22702l22747j063172j261106M84595j185473
3433E7985415l10405m17971K31995j049062l48481n22416p70950K8640J411164
3424E6237929Q14160J290980K540850L100302M655179N533733N008082L301722
3416H2482937L690798J244849J614348R85834J357365Q69117n9605m45676q45659
3407I0894308j400715k802909k424534k532854l172804l301475l719507k957809
$$ plain form
3399 68581701 65056093 61913991 59687140 57691722 55638187 53472334 51974551 50765508
3391 50765508 51247784 51850835 51412712 52837191 53608079 54639577 55900386 56883304 58261561
3382 58261561 58643182 59763208 60228372 59672371 59178499 57647095 56652365 55062181 54525684
3373 54525684 51999123 48809196 47786450 45704339 43052370 40476293 37822187 35890221
3365 35890221 34118930 33299848 31566828 30353366 29555827 29072071 28145684 27311232 26924544
3356 26924544 27083374 26444698 26845228 26392966 25987274 25823451 25623435 25703503 25289515 25654083
3346 25654083 25507732 24641451 25120470 25392969 25312239 25457432 25524349 25940651 26165278 27606943
3336 27606943 28661386 29141563 30969575 32760907 34903836 38088621 39905207 42170220
$$ packed form
3399F8581701l525608l142102k226851j995418k053535k165853j497783j209043
3391E0765508M82276O03051m38123J424479P70888J031498J260809R82918J378257
3382E8261561L81621J120026M65164n56001m93872j531404r94730j590184n36497
3373E4525684k526561l189927j022746k082111k651969k576077k654106j931966
3365C5890221j771291q19082j733020j213462p97539m83756r26387q34452l86688
3356B6924544J58830o38676M00530m52262m05692j63823k00016Q0068m13988L64568
3346B5654083j46351q66281M79019K72499q0730J45193O6917M16302K24627J441665
3336B7606943J054443M80177J828012J791332K142929L184785J816586K265013
$$ plain form
3328 42170220 44644550 47568461 50141702 52190176 54600618 56348669 57834529 58479375
3320 58479375 58298918 57799675 56432325 55311851 54011943 51698502 50496033 48179125
3312 48179125 45955455 43999884 41702651 39941697 39645826 40299361 40103190 40671418 41878542
3303 41878542 43577792 44615874 47014338 48518211 50077017 50394101 50733047 50479666 48996154
3294 48996154 47665185 45468121 43927961 42000572 38420777 36005840 33661130 31397960
3286 31397960 28736020 26351300 25021213 23273224 22358557 20473276 19905619 19231544 17811300
3277 17811300 16753040 15998158 16395431 16168615 14755301 15269900 14375267 15363093 14163733
3268 14163733 13917296 13454354 13266747 12745833 12342867 12801618 12753477 13107773 12916762 13015724
$$ packed form
3328D2170220K474330K923911K573241K048474K410442J748051J485860O44846
3320E8479375j80457m99243j367350j120474j299908k313441j202469k316908
3312D8179125k223670j955571k297233j760954k95871O53535j96171N68228J207124
3303D1878542J699250J038082K398464J503873J558806L17084L38946k53381j483512
3294D8996154j330969k197064j540160j927389l579795k414937k344710k263170
3286C1397960k661940k384720j330087j747989r14667j885281n67657o74075j420244
3277A7811300j058260p54882L97273k26816j413314N14599q94633R87826j199360
3268A4163733k46437m62942j87607n20914m02966M58751m8141L54296j91011R8962
$$ plain form
3258 13015724 12957458 12918337 12587727 13098840 12777684 13065712 12736385 11909731 12039336 12944526
3248 12944526 13263792 14256943 14648926 15001463 14818189 15042915 15867901 16442307 16408963 15907678
3238 15907678 15456929 15171824 15451526 14594327 13964632 12967588 12920162 12497653 11711801 10869427
3228 10869427 10770774 10234375 10102220 10081582 9648239 9953329 9233407 9221958 8697067 9167047
3218 9167047 9347980 9073414 8814883 8510137 8186607 8233662 7582173 8166065 8178577 8892123
3208 8892123 9137062 8904107 7580276 7644153 7237767 7574552 7929035 8405751 8740389 8314585
3198 8314585 8097072 8377615 8417622 7658740 7799386 8572184 8501448 8175845 8083151 7872915
3188 7872915 7762885 7353688 7468254 7603181 7463589 7361828 7651784 7662840 7667156 7767844
$$ packed form
3258A3015724n8266l9121l30610N11113l21156K88028l29327q26654J29605R05190
3248A2944526L19266R93151L91983L52537j83274K24726Q24986N74406l3344n01285
3238A5907678m50749k85105K79702q57199o29695r97044m7426m22509p85852q42374
3228A0869427r8653n36399j32155k0638m33343L05090p19922j1449n24891M69980
3218I167047J80933k74566k58531l04746l23530M7055o51489N83892J2512P13546
3208H892123K44939k32955j323831O3877m06386L36785L54483M76716L34638m25804
3198H314585k17513K80543M0007p58882J40646P72798p0736l25603r2694k10236
3188G872915j10030m09197J14566J34927j39592j01761K89956J1056M316J00688
$$ plain form
3178 7767844 7585841 7857452 7936933 7970609 7207050 7264593 7512637 7955291 7506087 7306262
3168 7306262 6895545 7310151 7212112 7726883 7735503 8058718 7569557 7817106 7148872 8033649
3158 8033649 7800567 7773382 8918957 8701754 9156329 8778782 9619057 9126459 8828756 8302640
3148 8302640 8780840 8412420 9635116 9131192 9144507 8576611 9285845 9294933 9696218 10049491
3138 10049491 10456120 10708407 10749577 11184063 12030869 12126829 11994838 11470887 11371942 11832225
3128 11832225 10931979 11322365 11595298 11558285 11586938 11694584 11677124 11817593 12237348 12318809
3118 12318809 11584026 12313922 12541426 11946049 12940360 12582193 13277277 13190921 12963724 13635263
3108 13635263 13689078 14194570 14548413 14644262 16055512 16228024 16657018 16153624 16463817 16968353
$$ packed form
3178G767844j82003K71611P9481L3676p63559N7543K48044M42654m49204j99825
3168G306262m10717M14606r8039N14771Q620L23215m89161K47549o68234Q84777
3158H033649k33082k7185J145575k17203M54575l77547Q40275m92598k97703n26116
3148H302640M78200l68420J222696n03924J3315n67896P09234R088M01285L53273
3138A0049491M06629K52287M1170M34486Q46806R5960j31991n23951r8945M60283
3128A1832225r00246L90386K72933l7013K8653J07646j7460J40469M19755Q1461
3118A2318809p34783P29896K27504n95377R94311l58167O95084q6356k27197O71539
3108A3635263N3815N05492L53843R5849J411250J72512M28994n03394L10193N04536
$$ plain form
3098 16968353 17835949 18149314 18881888 19988849 20286962 21256360 22177240 22082117 23688886
3089 23688886 25342520 27263025 29323408 30683250 32464371 33662778 35730591 38576666
3081 38576666 42545257 46368838 51130360 56212002 61778058 68520677 76676809 86095414
3073 86095414 98901668 113657637 131582371 155321829 185733704 224298462 269931152
3066 269931152 317864996 357455124 380100818 381218707 361769235 325714948 283232513
3059 283232513 241177689 204419496 173776536 149189623 129817753 114224499 101328372
3052 101328372 90703085 81720754 74331406 68087337 63084380 57997440 54155077 50398118
3044 50398118 46959154 45140962 42398536 40435907 38283382 37378714 36162064 34648321
$$ packed form
3098A6968353Q67596L13365P32574J106961K98113R69398R20880r5123J606769
3089B3688886J653634J920505K060383J359842J781121J198407K067813K846075
3081C8576666L968591L823581M761522N081642N566056O742619Q156132R418605
3073H6095414J2806254J4755969J7924734K3739458L0411875L8564758M5632690
3066B69931152M7933844L9590128K2645694J117889j9449472l6054287m2482435
3059B83232513m2054824l6758193l0642960k4586913j9371870j5593254j2896127
3052A01328372j0625287q982331p389348o244069n002957n086940l842363l756959
3044E0398118l438964j818192k742426j962629k152525r04668j216650j513743
$$ plain form
3036 34648321 32651488 31827740 30812058 29638198 28513192 28551192 27789506 26321061 25654435
3027 25654435 24476813 23436710 23301915 22548327 22789093 22892453 22049811 21256342 19930379
3018 19930379 19468117 19970765 19793283 19063219 18559345 18952284 18311958 16743623 16656115
3009 16656115 16658045 16876087 16255156 15864255 15503060 15175138 14481632 13587120 13629345 13281756
2999 13281756 13680101 13705573 14204192 14046931 13297187 12311463 12934634 12560021 12815087 12377620
2989 12377620 12963750 12592104 11426164 11580188 10950227 11274317 11538498 10367498 10657885
2980 10657885 10639067 10486680 10307993 9950021 10281050 10250215 10135011 10221459 9596149 9507363
2970 9507363 9073937 9420002 9473467 9864144 10965930 9664452 10074017 10475763 10503211 10912824
$$ packed form
3036C4648321j996833q23748j015682j173860j125006L8000p61686j468445o66626
3027B5654435j177622j040103j34795p53588K40766J03360q42642p93469j325963
3018A9930379m62262N02648j77482p30064n03874L92939o40326j568335q7508
3009A6656115J930K18042o20931l90901l61195l27922o93506q94512M2225l47589
2999A3281756L98345K5472M98619j57261p49744r85724O23171l74613K55066m37467
2989A2377620N86130l71646j165940J54024o29961L24090K64181j171000K90387
2980A0657885j8818j52387j78687l57972L31029l0835j15204Q6448o25310q8786
2970I507363m33426L46065N3465L90677J101786j301478M09565M01746K7448M09613
$$ plain form
2960 10912824 11028450 12049633 13024769 13184660 13200489 12357597 12190257 12811813 11991181
2951 11991181 12357346 11168561 10910939 10132847 9789973 10006256 9884993 11022543 10857115
2942 10857115 10836438 10669804 10017214 10470477 9565911 9507641 9246154 8461965 7807980 7121687
2932 7121687 7348932 6890389 6294211 5885837 6399522 6498176 5884958 4841009 5513045 5292308
2922 5292308 5564570 4636944 5410106 5685495 5495553 4829013 4632606 4884673 5336038 5198759
2912 5198759 5342995 5027556 4881176 4052059 3390429 3750665 3949935 4054499 3486977 4115025
2902 4115025 4194576 3737891 3252620 3417755 3760165 3905866 3924696 3102920 3203789 3087595
2892 3087595 3176346 3483447 3505713 3948472 3769402 3606208 3320645 2636693 2821909 2652447
$$ packed form
2960A0912824J15626J021183R75136J59891J5829q42892j67340O21556q20632
2951A1991181L66165j188785k57622p78092l42874K16283j21263J137550j65428
2942A0857115k0677j66634o52590M53263r04566n8270k61487p84189o53985o86293
2932G121687K27245m58543n96178m08374N13685R8654o13218j043949O72036k20737
2922E292308K72262r27626P73162K75389j89942o66540j96407K52067M51365j37279
2912E198759J44236l15439j46380q29117o61630L60236J99270J04564n67522O28048
2902D115025P9551m56685m85271J65135L42410J45701J8830q21776J00869j16194
2892C087595Q8751L07101K2266M42759j79070j63194k85563o83952J85216j69462
$$ plain form
2882 2652447 3259759 3049401 3453676 3768340 3438204 3141310 3485337 3211582 3189163 2776276
2872 2776276 3712313 3222573 3192570 2905839 2264206 3120050 2504838 2451008 3015356 2707007
2862 2707007 2222401 1997001 2448892 2648205 2729471 3301400 3007159 3081240 1974583 2429151
2852 2429151 2300341 1669302 2453677 2796545 2900991 2639192 2533167 3914333 3109122
2843 3109122 3550591 3625604 3362774 3527555 2374032 3086152 2083013 2399477 2386062 2336415
2833 2336415 3167373 2799862 2505243 2122988 1834775 2517015 1328854 1898101 2160032
2824 2160032 2156149 2638340 1475089 2125873 1865255 2817453 2622242 1774048 1703072 1985387
2814 1985387 1660912 1466839 1325605 2851226 2095783 2219583 1922944 1513829 1739346
$$ packed form
2882B652447O07312k10358M04275L14664l30136k96894L44027k73755k2419m12887
2872B776276R36037m89740l0003k86731o41633Q55844o15212n3830N64348l08349
2862B707007m84606k25400M51891J99313Q1266N71929k94241P4081j106657M54568
2852B429151j28810o31039P84375L42868J04446k61799j06025J381166q05211
2843C109122M41469P5013k62830J64781j153523P12120j003139L16464j3415m9647
2833B336415Q30958l67511k94619l82255k88213O82240j188161N69247K61931
2824B160032l883M82191j163251O50784k60618R52198j95211q48194p0976K82315
2814A985387l24475j94073j41234J525621p55443J23800k96639m09115K25517
$$ plain form
2805 1739346 1544696 2541232 1952167 1931240 2252757 1631926 2090662 1604918 1227633 1457873
2795 1457873 1455209 2096335 1374087 1591062 1548912 1712359 2300362 2656630 2558963 2510229
2785 2510229 2690930 2572763 2248361 2806356 3921658 3087297 2890574 3427152 3018829
2776 3018829 2449779 2410342 1779959 1452677 1757237 2419237 1400167 1420383 1450202 1740280
2766 1740280 1785190 1887450 1662475 1656100 1311163 1805594 854575 1115067 1939092 1787729
2756 1787729 2387151 1419348 1394221 782898 1151590 1121662 1681951 1574027 2042603 1732658
2746 1732658 1448967 1260665 1548777 1417850 1609217 2359599 1627394 1552052 1446675 1785147
2736 1785147 1043777 964396 1448215 1421790 1208372 698689 500142 1013423 660218 1795887
$$ packed form
2805A739346j94650R96536n89065k0927L21517o20831M58736m85744l77285K30240
2795A457873k664O41126p22248K16975m2150J63447N88003L56268r7667m8734
2785B510229J80701j18167l24402N57995J115302q34361j96723N36578m08323
2776C018829n69050l9437o30383l27282L04560O62000j019070K0216K9819K90078
2766A740280M4910J02260k24975o375l44937M94431r51019K60492Q24025j51363
2756A787729N99422r67803k5127o11323L68692k9928N60289j07924M68576l09945
2746A732658k83691j88302K88112j30927J91367P50382p32205p5342j05377L38472
2736A785147p41370p9381M83819k6425k13418n09683j98547N13281l53205J135669
$$ plain form
2726 1795887 1654781 1688635 2181039 1132792 1337246 1670234 2289477 1816131 1519388 1837725
2716 1837725 1287465 1090374 948371 1295368 1343438 1181986 2047022 1560550 1580670 1703701
2706 1703701 1802477 2259321 1848619 2119079 1527491 1256185 1681911 1556180 1415520 1769939
2696 1769939 1752713 1707022 1701898 1458696 1112337 1660230 2157738 2183363 1975605 2115994
2686 2115994 2328054 1516274 1016895 1022692 1383458 1237045 481949 1288643 1120955 1267740
2676 1267740 1598392 944434 598569 816677 1427424 869497 1057581 1313147 1538160 1514263
2666 1514263 1778490 1393384 2009852 1952718 1538865 888749 1600273 2038048 1930649 1614135
2656 1614135 1804520 1462707 1116699 1664662 1627887 1258297 1410273 1857013 1596768 1395954
$$ packed form
2726A795887j41106L3854M92404j048247K04454L32988O19243m73346k96743L18337
2716A837725n50260j97091j42003L46997M8070j61452Q65036m86472K0120J23031
2706A703701R8776M56844m10702K70460n91588k71306M25726j25731j40660L54419
2696A769939j7226m5691n124k43202l46359N47893M97508K5625k07758J40389
2686B115994K12060q11780m99379N797L60766j46413p55096Q06694j67688J46785
2676A267740L30652o53958l45865K18108O10747n57927J88084K55566K25013k3897
2666A514263K64227l85106O16468n7134m13853o50116P11524M37775j07399l16514
2656A614135J90385l41813l46008N47963l6775l69590J51976M46740k60245k00814
$$ plain form
2646 1395954 1808012 1596052 1170306 1498751 1614474 1139484 1313608 1638495 1746932 1757975
2636 1757975 1282130 799831 670089 1133759 1555935 1161337 1709825 838936 623910 143066
2626 143066 878239 1582951 1883736 1455184 2238090 2097769 1619209 1648584 1200863 933312
2616 933312 1483606 1403311 1228482 1350019 1221190 1267628 1599595 2434077 2451537 1661942
2606 1661942 1593762 2155564 2092025 1748302 2016679 2385302 3494308 4352441 3733712 3704745
2596 3704745 2644865 3131182 1787250 1808716 1973525 1855335 1817183 995736 1446930 1377492
2586 1377492 1226480 1591090 1301583 1122236 797070 1026252 1149024 423470 1352935 991529
2576 991529 1127077 1056502 943384 1405765 657835 1103669 451243 509008 197730 313474
$$ packed form
2646A395954M12058k11960m25746L28445J15723m74990J74124L24887J08437J1043
2636A757975m75845m82299j29742M63670M22176l94598N48488q70889k15026m80844
2626A43066P35173P04712L00785m28552P82906j40321m78560K9375m47721k67551
2616I33312N50294q0295j74829J21537j28829M6438L31967Q34482J7460p89595
2606A661942o8180N61802o3539l43723K68377L68623J109006Q58133o18729k8967
2596C704745j059880M86317j343932K1466J64809j18190l8152q21447M51194o9438
2586A377492j51012L64610k89507j79347l25166K29182J22772p25554R29465l61406
2576I91529J35548p0575j13118M62381p47930M45834o52426N7765l11278J15744
$$ plain form
2566 313474 904146 94521 494639 506672 71183 1442198 625632 793327 1002817 1481205
2556 1481205 785360 -43439 418593 399546 388136 997812 412521 426285 523842 1477786
2546 1477786 868016 750873 1257823 1473883 2103058 1471295 1102793 1285800 937706 1483979
2536 1483979 685895 1137972 1800931 1016271 1136531 1220223 1584695 1614481 1170026 2098600
2526 2098600 1590650 1353298 1706198 1369355 1511860 837558 991833 1025750 1707709 1411679
2516 1411679 225277 931723 1057943 1555613 1376432 1397368 1537392 1306413 1517617 1955261
2506 1955261 2039410 2665351 2258374 2013680 1512162 1513230 1335531 839075 1506343 1171023
2496 1171023 2063536 1112197 1410519 1508601 1604798 927040 962135 1133717 1570436 2348492
$$ packed form
2566C13474N90672q09625M00118J2033m35489J371015q16566J67695K09490M78388
2556A481205o95845q28799M62032j9047j1410O09676n85291J3764R7557R53944
2546A477786o09770j17143N06950K16060O29175o31763l68502J83007l48094N46273
2536A483979p98084M52077O62959p84660J20260Q3692L64472K9786m44455R28574
2526B098600n07950k37352L52900l36843J42505o74302J54275L3917O81959k96030
2516A411679j186402P06446J26220M97670j79181K0936J40024k30979K11204M37644
2506A955261Q4149O25941m06977k44694n01518J068j77699m96456O67268l35320
2496A171023Q92513r51339K98322R8082R6197o77758L5095J71582M36719P78056
$$ plain form
2486 2348492 1748900 1312698 2439296 1505814 1281687 1328349 1679433 1404125 1281003 1958421
2476 1958421 1540974 1506873 1899501 1946080 1444454 1205942 1488095 1776915 1251857 1997996
2466 1997996 1976483 2687523 2154132 2506137 2942694 2047428 2587543 1715587 1760501 1750439
2456 1750439 1831733 2171206 1858765 2270226 2348915 2323577 2720129 2087527 2022199 2309006
2446 2309006 2310768 3095432 2641614 2974708 2948503 2462842 2797566 2792248 3360981 2391571
2436 2391571 2723559 2858718 2878932 2869224 2721927 2860453 2441549 2391049 3810953 3106269
2426 3106269 3239855 3008390 3106696 3585171 3042362 3684367 2846121 3164810 3900356 3156393
2416 3156393 3817397 3075619 3413781 3102796 3390834 3864252 4131354 4124513 3141247 3466158
$$ packed form
2486B348492n99592m36202J126598r33482k24127M6662L51084k75308j23122O77418
2476A958421m17447l4101L92628M6579n01626k38512K82153K88820n25058P46139
2466A997996k1513P11040n33391L52005M36557q95266N40115q71956M4914j0062
2456A750439Q1294L39473l12441M11461P8689k5338L96552o32602o5328K86807
2446B309006J762P84664m53818L33094k6205m85661L34724n318N68733r69410
2436B391571L31988J35159K0214r708j47297J38526m18904n0500J419904p04684
2426C106269J33586k31465R8306M78475n42809O42005q38246L18689P35546p43963
2416C156393O61004p41778L38162l10985K88038M73418K67102o841r83266L24911
$$ plain form
2406 3466158 4465547 3969103 4169723 3489980 4142667 3955583 4063598 3810961 3513972 4192034
2396 4192034 4511834 4397608 4760533 5068277 5058253 4608141 5027522 5309570 5426716 5135320
2386 5135320 4963498 5323559 5480275 5783949 5463298 5834921 6661939 6297916 5745565 6163587
2376 6163587 6231994 6343271 5966808 6094021 6182751 7046932 7102172 7780414 8564592 8350702
2366 8350702 8452451 8614134 8440784 9648004 10275407 9686594 10154981 11554189 12216228
2357 12216228 13173221 13204470 14893507 15800088 17297146 18869778 22201112 25352298 30623925
2348 30623925 34119107 37081609 39161017 40641957 39328080 42356488 45186407 51101564
2340 51101564 57747153 70215783 85050044 110872091 151404752 241912687 387122921
$$ packed form
2406C466158R99389m96444K00620o79743O52687j87084J08015k52637k96989O78062
2396D192034L19800j14226L62925L07744j0024m50112M19381K82048J17146k91396
2386E135320j71822L60061J56716L03674l20651L71623Q27018l64023n52351M18022
2376F163587O8407J11277l76463J27213Q8730Q64181N5240O78242P84178k13890
2366H350702J01749J61683j73350J207220O27403n88813M68387J399208O62039
2357A2216228R56993L1249J689037R06581J497058J572632L331334L151186N271627
2348C0623925L495182K962502K079408J480940j313877L028408K829919N915157
2340E1101564O645589J2468630J4834261K5822047M0532661R0507935J45210234
$$ plain form
2333 387122921 496981226 510039438 499645423 434373137 317375904 239912510 180581602
2326 180581602 139958085 108952357 86365651 68123581 58544923 51239500 48185392
2319 48185392 46170339 45875586 42910344 40413852 36759462 31735503 29152795 27889254
2311 27889254 25479491 22876384 20976482 20517519 19617987 19387412 18443467 17456639 16880438
2302 16880438 16635625 15818793 14531770 14624661 14086125 12934861 12780497 12558388 12642793
2293 12642793 11384613 11192101 10537428 10130002 10612401 10167246 11067075 10434166 10710227
2284 10710227 10502543 9393422 9893941 10122867 9087934 8357105 8556383 8730146 8081604
2275 8081604 8433925 8331162 7586897 7897202 7038886 6922691 6081505 6654578 6588311 5812545
$$ packed form
2333C87122921J09858305J3058212j0394015o5272286j16997233p7463394n9330908
2326A80581602m0623517l1005728k2586706j8242070r578658p305423l054108
2319D8185392k015053k94753k965242k496492l654390n023959k582708j263541
2311B7889254k409763k603107j899902m58963q99532k30575r43945r86828n76201
2302A6880438k44813q16832j287023R2891n38536j151264j54364k22109Q4405
2293A2642793j258180j92512o54673m07426M82399m45155Q99829o32909K76061
2284A0710227k07684j109121N00519K28926j034933p30829J99278J73763o48542
2275H081604L52321j02763p44265L10305q58316j16195q41186N73073o6267p75766
$$ plain form
2265 5812545 6527006 6552436 6337014 5701087 6183565 6118854 5835834 5978567 5895507 5432967
2255 5432967 5946318 5610428 5107850 4679587 4629121 4572826 3905612 4659544 4667409 4563312
2245 4563312 4529921 3965102 4060027 4031954 4903124 4915570 4446405 4447990 3912839 3231118 3429529
2234 3429529 3841966 4514436 4232775 4428448 4277044 3158703 3048466 2731241 2920048
2225 2920048 2768816 4094829 3687990 3066063 3226298 3220536 3260304 2868599 3255644 3301229
2215 3301229 2604052 2792645 2673603 2384794 2415772 2649671 2851518 3087053 3411914 2976549
2205 2976549 1887283 2319433 2619178 2025789 1588218 3139430 3289137 2716731 2796383
2196 2796383 2855203 2690696 2367265 3039001 2762227 2911490 2854656 1863374 1781184 2026527
$$ packed form
2265E812545P14461K5430k15422o35927M82478o4711k83020J42733q3060m62540
2255E432967N13351l35890n02578m28263n0466n6295o67214P53932P865j04097
2245D563312l3391n64819R4925k8073Q71170J2446m69165J585n35151o81721J98411
2234C429529M12437O72470k81661J95673j51404j118341j10237l17225J88807
2225B920048j51232J326013m06839o21927J60235n762L9768l91705L87045M5585
2215C301229o97177J88593j19042k88809L0978K33899K01847K35535L24861m35365
2205B976549j089266M32150K99745n93389m37571J551212J49707n72406P9652
2196B796383N8820j64507l23431O71736k76774J49263n6834r91282q2190K45343
$$ plain form
2186 2026527 2535594 1579365 1884612 2436272 2418996 1992399 1445862 2295212 3023221 2770072
2176 2770072 2688945 1648139 1738008 2014138 1017819 2019645 1958593 2462355 1064594 614910
2166 614910 1529264 1336550 980278 1676632 2413584 2055548 1386030 1311654 -347384 706731
2156 706731 2240822 2079799 1936500 2036393 1449999 773433 651126 2051684 2103976 2239066
2146 2239066 1761156 1469392 1298667 828414 924089 950309 1508862 2239580 1470373 1481372
2136 1481372 1915044 1847239 1264469 773785 2307721 2223263 2110320 2178887 1163054 1285145
2126 1285145 505575 1374142 1265754 2086169 2520707 525132 99993 436014 1515344
2117 1515344 1961885 2499744 2898286 2232307 1545220 1343801 694223 1048257 1900744 2724573
$$ packed form
2186B026527N09067r56229L05247N51660j7276m26597n46537Q49350P28009k53149
2176B770072q1127j040806Q9869K76130r96319J001826o1052N03762j397761m49684
2166F14910R14354j92714l56272O96354P36952l58036o69518p4376j659038J054115
2156G06731J534091j61023j43299R9893n86394o76566j22307J400558N2292J35090
2146B239066m77910k91764j70725m70253R5675K6220N58553P30718p69207J0999
2136A481372M33672o7805n82770m90684J533936q4458j12943O8567j015833J22091
2126A285145p79570Q68567j08388Q20415M34538j995575m25139L36021J079330
2117A515344M46541N37859L98542o65979o87087k01419o49578L54034Q52487Q23829
$$ plain form
2107 2724573 1625747 1499390 2305322 1102660 690071 1122831 2385780 2120162 2358760
2098 2358760 2603953 1733071 1778239 1083351 1032040 1020905 1322355 1389071 1305069 1043137
2088 1043137 1364717 751339 693832 738804 1532261 1997627 1314960 1315795 1205719 1241088 1267172
2077 1267172 881814 936462 1646753 1930350 1191101 938448 1577670 762459 1148644 1614430
2067 1614430 2158776 2709189 2873094 3501633 3524376 4007292 4060306 3588847 3065493 2832691
2057 2832691 2067749 1741613 1405524 2124544 1034701 826187 1494181 2013796 1607922
2048 1607922 2211320 2208260 1315684 1572536 1774216 1395533 1502498 1990793 1930754 1477405
2038 1477405 1175089 1233412 1345309 922736 743425 1787567 1674774 1641928 1839167 1308895
$$ packed form
2107B724573j098826j26357Q05932j202662m12589M32760J262949k65618K38598
2098B358760K45193q70882M5168o94888n1311j1135L01450O6716q4002k61932
2088A043137L21580o13378n7507M4972P93457M65366o82667Q35j10076L5369K6084
2077A267172l85358N4648P10291K83597p39249k52653O39222q15211L86185M65786
2067A614430N44346N50413J63905O28539K2743M82916N3014m71459n23354k32802
2057B832691p64942l26136l36089P19020j089843k08514O67994N19615m05874
2048A607922O03398l060q92576K56852K01680l78683J06965M88295o0039m53349
2038A477405l02316N8323J11897m22573j79311J044142j12793l2846J97239n30272
$$ plain form
2028 1308895 1694412 1701140 1702636 1640293 1877051 1506322 715615 1115301 659482 1220335
2018 1220335 860541 800273 1499012 1763078 1357796 417136 382747 670427 1191551 635064
2008 635064 778343 1531529 1009236 403292 806639 1427669 1320963 1433487 2233098 1637062
1998 1637062 1357752 1044169 892455 632142 973536 1377589 1028802 779277 182351 415444
1988 415444 270423 817563 468291 604360 788239 919581 1508562 1757691 1391206 997798
1978 997798 544969 1521382 1578054 830295 993418 1273752 1445281 463001 1120154 1534757
1968 1534757 2293942 1810784 1187675 652505 214787 603659 882375 1566371 1755294 1397357
1958 1397357 1091696 358068 671346 845716 987578 1393525 735319 1181165 668875 508848
$$ packed form
2028A308895L85517O728J496o2343K36758l70729p90707L99686m55819N60853
2018A220335l59794o0268O98739K64066m05282r40660l4389K87680N21124n56487
2008F35064J43279P53186n22293o05944M03347O21030j06706J12524P99611n96036
1998A637062k79310l13583j51714k60313L41394M04053l48787k49525n96926K33093
1988D15444j45021N47140l49272J36069J83879J31342N88981K49129l66485l93408
1978I97798m52829R76413N6672p47759J63123K80334J71529r82280O57153M14603
1968A534757P59185m83158o23109n35170m37718L88872K78716O83996J88923l57937
1958A397357l05661p33628L13278J74370J41862M05947o58206M45846n12290j60027
$$ plain form
1948 508848 45306 1047303 1679730 867989 371614 604530 357425 109164 79886 1402600
1938 1402600 1179518 2121045 1402012 668275 733976 100403 204515 98068 1028041 1831096
1928 1831096 1063754 1413279 727651 1122835 979261 1102239 1604501 1591763 1665955 623940
1918 623940 376731 647730 1096685 274621 678834 666668 1300827 1258725 733524 850419
1908 850419 1309213 984471 768329 1082645 1189937 1380405 723539 1485399 1449636 2016507
1898 2016507 1269618 979829 433808 785906 221791 549939 1123180 841097 1853809
1889 1853809 1091494 411194 295601 720218 935191 843429 713829 1528799 617643 777511
1879 777511 522314 1054438 1401002 1523894 1156514 1064189 1023317 783746 58242 701185
$$ packed form
1948E08848m63542J001997O32427q11741m96375K32916k47105k48261k9278J322714
1938A402600k23082R41527p19033p33737O5701o33573J04112j06447R29973Q03055
1928A831096p67342L49525o85628L95184j43574J22978N02262j2738P4192j042015
1918F23940k47209K70999M48955q22064M04213j2166O34159m2102n25201J16895
1908H50419M58794l24742k16142L14316J07292J90468o56866P61860l5763N66871
1898B016507p46889k89789n46021L52098n64115L28148N73241k82083J012712
1889A853809p62315o80300j15593M24617K14973r1762j29600Q14970r11156J59868
1879G77511k55197N32124L46564J22892l67380r2325m0872k39571p25504O42943
$$ plain form
1869 701185 1079895 1801610 1189304 836095 1142691 928609 75391 1085706 987048 848619
1859 848619 948152 684705 645585 211310 944475 496889 708574 1006371 1277034 1222505
1849 1222505 502050 758546 504727 377537 824079 731907 1406110 1327662 1175777 1047202
1839 1047202 555199 802803 -31829 766971 629974 922024 966742 990563 1266064 799993
1829 799993 82639 852597 827130 1240189 544385 937729 258763 384562 869197 -29441
1819 -29441 913601 738152 581668 589597 770908 842152 974137 690224 1053557 613787
1809 613787 1674394 702745 443811 89783 307940 445570 636646 791398 1043856 522103
1799 522103 641847 1202679 1016054 650825 429510 737494 404742 860237 260056 516671
$$ packed form
1869G01185L78710P21715o12306l53209L06596k14082q53218J010315r8658j38429
1859H48619R9533k63447l9120m34275P33165m47586K11685K97797K70663n4529
1849A222505p20455K56496k53819j27190M46542r2172O74203p8448j51885j28575
1839A047202m92003K47604q34632P98800j36997K92050M4718K3821K75501m66071
1829G99993p17354P69958k5467M13059o95804L93344o78966J25799M84635q98638
1819b9441R43042j75449j56484P929J81311P1244J31985k83913L63333m39770
1809F13787J060607r71649k58934l54028K18157J37630J91076J54752K52458n21753
1799E22103J19744N60832j86625l65229k21315L07984l32752M55495o00181K56615
$$ plain form
1789 516671 919659 759685 1714907 1058485 607746 483522 493278 890995 429910 631351
1779 631351 696081 581741 1034695 673746 911476 437890 552161 558959 1367788 1453350
1769 1453350 906580 1221994 1803137 1191208 1271290 826405 1126477 670092 755611 1004741
1759 1004741 1380425 1566917 1149427 987454 184338 443610 760433 975467 518207 623713
1749 623713 621129 748554 772390 1085239 1020283 1342129 828905 1229218 1013255 711791
1739 711791 1027072 858334 1277626 743893 690206 925969 1215886 1400909 1490586 1314575
1729 1314575 738075 986333 1390559 600687 823277 834116 1276858 1068314 1020085 417488
1719 417488 372132 198832 252562 -89890 169267 355153 -278533 -43368 1221355 1581796
$$ packed form
1789E16671M02988j59974R55222o56422m50739j24224R756L97717m61085K01441
1779F31351O4730j14340M52954l60949K37730m73586J14271O798Q08829Q5562
1769A453350n46770L15414N81143o11929Q0082m44885L00072m56385Q5519K49130
1759A004741L75684J86492m17490j61973q03116K59272L16823K15034m57260J05506
1749F23713k584J27425K3836L12849o4956L21846n13224M00313k15963l01464
1739G11791L15281j68738M19292n33733n3687K35763K89917J85023Q9677j76011
1729A314575n76500K48258M04226p89872K22590J0839M42742k08544m8229o02597
1719D17488m5356j73300N3730l42452K59157J85886o33686K35165J264723L60441
$$ plain form
1709 1581796 860061 904149 1014223 1339691 1252231 822423 699277 1160345 1316271 1209486
1699 1209486 631647 1055058 904489 2040750 1321484 971348 1517831 924014 222470
1690 222470 754577 992752 960590 1203035 1473806 1779583 1415850 1584974 1027131 1373673
1680 1373673 600278 1406849 1472438 1168930 1614748 478322 654810 677624 833983 1057913
1670 1057913 935162 1443986 1709744 1268827 1042325 588494 1508181 1569579 1649867 735338
1660 735338 733695 1045511 969850 684856 904037 799983 1488624 573715 79828 -679306
1650 -679306 201766 334557 843106 551675 938076 252732 -262022 571053 208128 711201
1640 711201 1011953 1509508 1345969 813880 141922 334069 492187 719992 741443 772284
$$ packed form
1709A581796p21735M4088J10074L25468q7460m29808j23146M61068J55926j06785
1699A209486n77839M23411j50569J136261p19266l50136N46483n93817p01544
1690B22470N32107K38175l2162K42445K70771L05777l63733J69124n57843L46542
1680A373673p73395Q06571O5589l03508M45818j136426J76488K2814J56359K23930
1670A057913j22751N08824K65758m40917k26502m53831R19687O1398Q0288r14529
1660G35338j643L11816p5661k84994K19181j04054O88641r14909m93887p59134
1650f79306Q81072J32791N08549k91431L86401o85344n14754Q33075l62925N03073
1640G11201L00752M97555j63539n32089o71958J92147J58118K27805K1451L0841
$$ plain form
1630 772284 449302 43578 -187065 -799653 -371637 408143 780910 243892 144019 28162
1620 28162 -450741 -318379 235257 949448 1179655 894211 807671 304065 375334 756034
1610 756034 568718 496401 917042 285878 238356 380428 81899 293999 792613 915076
1600 915076 317133 676922 -122666 122154 108719 623122 469238 940778 828921 1348648
1590 1348648 869404 519524 -726 925299 917749 917043 473148 389020 744616 653314 563537
1579 563537 238987 1006190 1021158 108767 -212591 92090 1179166 1141320 812254 804819
1569 804819 1065052 245950 303695 1082712 906853 1090801 1482399 954045 559658 387616
1559 387616 146695 141034 753848 1054478 613543 704350 745631 573014 598694 134741 905618
$$ packed form
1630G72284l22982m05724k30643o12588M28016P79780L72767n37018r9873j15857
1620B8162m78903J32362N53636P14191K30207k85444q6540n03606P1269L80700
1610G56034j87316p2317M20641o31164m7522J42072k98529K12100M98614J22463
1600I15076n97943L59789p99588K44820j3435N14403j53884M71540j11857N19727
1590A348648m79244l49880n20250R26025p550p06m43895q4128L55596r1302q9777
1579E63537l24550P67203J4968r12391l21358L04681J087076l7846l29066p435
1569H04819K60233q19102N7745P79017j75859J83948L91598n28354l94387j72042
1559C87616k40921n661O12814L00630m40935R0807M1281j72617K5680m63953P70877
$$ plain form
1548 905618 870198 1519851 1157242 727516 64365 -236903 723513 509081 1535304 1587468
1538 1587468 1045565 851946 232122 230312 270788 532456 1285095 1236551 1318511 928492
1528 928492 220903 784271 1006748 1236747 1384309 1103244 1649961 1319949 1038162 398570
1518 398570 702187 988091 1018616 844375 775835 824639 954076 795965 712618 733750 657960
1507 657960 179090 633419 1146129 681469 796283 1072244 1539305 1535708 1384180 1073162
1497 1073162 473486 914946 820228 565059 1254396 1191306 1187030 768669 650886 1194593
1487 1194593 723404 1157586 791317 1307764 971519 961310 1038578 575067 668225 773334
1477 773334 479695 1131909 1386487 1236880 395143 1079108 1248496 785011 1029006 1103720
$$ packed form
1548I05618l5420O49653l62609m29726o63151l01268R60416k14432J026223N2164
1538A587468n41903j93619o19824j810M0476K61668P52639m8544Q1960l90019
1528I28492p07589N63368K22477K29999J47562k81065N46717l30012k81787o39592
1518C98570L03617K85904L0525j74241o8540M8804J29437j58111q3347K1132p5790
1507F57960m78870M54329N12710m64660J14814K75961M67061l597j51528l11018
1497A073162n99676M41460r4718k55169O89337o3090m276m18361j17783N43707
1487A194593m71189M34182l66269N16447l36245j0209P7268m63511R3158J05109
1477G73334k93639O52214K54578j49607q41737O83965J69388m63485K43995P4714
$$ plain form
1467 1103720 1072502 908992 467624 991767 858922 1286094 1299443 1233467 1114244 1215346
1457 1215346 1485304 559846 340905 116449 490715 725607 1285608 320342 120863 824478
1447 824478 1205179 833288 786458 611968 148991 224942 366247 519187 441551 -16150
1437 -16150 190993 378298 -153987 627064 82313 335108 314441 476531 198398 812157
1427 812157 1341462 730041 111723 469182 871826 532784 402874 116312 -152593 -212173
1417 -212173 258206 -58005 592037 722094 741805 -66590 643624 -335131 45181 267556
1407 267556 961212 1567253 658845 831487 647845 -252066 55409 266899 552795 725017
1397 725017 951828 1259176 461473 769624 -663985 -755236 -472922 282301 535022 -52085
$$ packed form
1467A103720l1218j63510m41368N24143j32845M27172J3349o5976j19223J01102
1457A215346K69958r25458k18941k24456L74266K34892N60001r65266j99479P03615
1447H24478L80701l71891m6830j74490m62977P5951J41305J52940p7636m57701
1437a6150K07143J87305n32285P81051n44751K52795k0667J62090k78133O13759
1427H12157N29305o11421o18318L57459M02644l39042j29910k86562k68905n9580
1417b12173M70379l16211O50042J30057J9711q08395P10214r78755L80312K22375
1407B67556O93656O06041r08408J72642j83642q99911L07475K11490K85896J72222
1397G25017K26811L07348p97703L08151j433609r1251K82314P55223K52721n87107
$$ plain form
1387 -52085 493714 -433916 -413273 170117 -147612 434662 -57328 1197630 752274 -31773
1377 -31773 453405 197266 887473 852359 1016218 435741 -245119 -677889 -783756 -377635
1367 -377635 407100 708851 1450031 433375 794914 -179075 166418 601964 820382 961541
1357 961541 718680 696040 272891 33971 219780 746865 704416 1841915 1141181 773721
1347 773721 -168925 108783 -361092 -50855 494641 1004683 690368 790427 579249 299468
1337 299468 -375956 429515 706691 970429 1691140 566422 591083 -285989 884643 990820
1327 990820 1165890 1611232 2022772 1490312 941451 -333156 -138802 -161786 868240 462264
1317 462264 144595 547089 262077 184895 -337204 592742 633334 744173 1116179 595015
$$ packed form
1387e2085N45799r27630K0643N83390l17729N82274m91990J254958m45356p84047
1377c1773M85178k56139O90207l5114J63859n80477o80860m32770j05867M06121
1367c77635P84735L01751P41180j016656L61539r73989L45493M35546K18418J41159
1357I61541k42861k2640m23149k38920J85809N27085m2449J137499p00734l67460
1347G73721r42646K77708m69875L10237N45496N10042l14315J00059k11178k79781
1337B99468o75424Q05471K77176K63738P20711j124718K4661q77072J170632J06177
1327I90820J75070M45342M11540n32460n48861j274607J94354k2984J030026m05976
1317D62264l17669M02494k85012p7182n22099R29946M0592J10839L72006n21164
$$ plain form
1307 595015 692465 417869 528418 832676 707032 1427713 -109900 -23656 3274 268115
1297 268115 358266 567296 1608295 1223771 1120071 1034894 453927 945256 1279949 1617264
1287 1617264 1291687 1535333 1678473 738759 721265 748467 1872519 540322 541354 1233249
1277 1233249 861192 973272 780884 911503 920013 1093403 696982 -252846 780755 419833
1267 419833 701848 1495099 641881 1135390 339381 709488 661880 876731 1577943 1232330
1257 1232330 1054567 774298 256485 704675 191429 446169 1116576 915634 899071 1177589
1247 1177589 741651 165842 280368 334360 974514 1148561 1397351 880413 872449 928577
1237 928577 817590 413576 1329780 1323978 905037 635401 674989 771029 646823 774769
$$ packed form
1307E95015R7450k74596J10549L04258j25644P20681j537613Q6244K6930K64841
1297B68115R0151K09030J040999l84524j03700q5177n80967M91329L34693L37315
1287A617264l25577K43646J43140r39714j7494K7202J124052j332197J032O91895
1277A233249l72057J12080j92388J30619Q510J73390l96421r49828J033601l60922
1267D19833K82015P93251q53218M93509p96009L70107m7608K14851P01212l45613
1257A232330j77763k80269n17813M48190n13246K54740O70407k00942j6563K78518
1247A177589m35938n75809J14526N3992O40154J74047K48790n16938p964N6128
1237I28577j10987m04014R16204n802m18941k69636L9588R6040j24206J27946
$$ plain form
1227 774769 1146128 1147085 810809 866300 332058 703051 586952 593865 603588 1274443 973657
1216 973657 68619 147534 328758 292742 872425 1094962 545682 491093 475224 263587
1206 263587 390924 105870 4566 -69463 686347 1362900 1480834 622674 735982 603436
1196 603436 552081 613848 835889 77721 385991 752276 358282 438188 461888 548122 387689
1185 387689 1058301 958512 381389 668168 757813 942686 328573 225907 141858 689936
1175 689936 360368 625323 365143 112538 45225 503660 462505 519554 527542 149923 373773
1164 373773 605390 954351 194499 548372 669223 400838 1079968 867594 1350143 478660
1154 478660 702281 930373 104815 160701 -78727 52157 -35812 619082 1024678 132974
$$ packed form
1227G74769L71359R57l36276N5491n34242L70993j16099O913R723O70855l00786
1216I73657r05038P8915J81224l6016N79683K22537n49280n4589j5869k11637
1206B63587J27337k85054j01304p4029P55810O76553J17934q58160J13308j32546
1196F03436n1355O1767K22041p58168L08270L66285l93994P9906K3700Q6234j60433
1185C87689O70612r9789n77123K86779Q9645J84873o14113j02666q4049N48078
1175F89936l29568K64955k60180k52605o7313M58435m1155N7049P988l77619K23850
1164C73773K31617L48961p59852L53873J20851k68385O79130k12374M82549q71483
1154D78660K23621K28092q25558N5886k39428J30884q7969O54894M05596q91704
$$ plain form
1144 132974 40297 571109 913438 1619133 693485 850106 119473 427309 -166155 318102
1134 318102 846008 1283465 1116489 521292 336833 398948 621188 428179 40597 1014710
1124 1014710 1282129 1368571 976316 248127 853854 581047 675093 1118357 791106 983701
1114 983701 642447 657255 273686 367324 1051510 880747 790670 574735 70044 505462
1104 505462 -513601 628513 165405 583285 29179 -391878 -587660 -820081 304632
1095 304632 634061 162962 759996 465456 765225 289864 -218968 -619024 -1162038 771651
1085 771651 169190 280071 352403 -474793 -424774 -252903 801943 628397 166004 1450175
1075 1450175 1232116 1186418 696047 1839789 1439504 1159094 1639200 679123 666848 395218
$$ packed form
1144A32974r2677N30812L42329P05695r25648J56621p30633L07836n93464M84257
1134C18102N27906M37457j66976n95197j84459O2115K22240j93009l87582R74113
1124A014710K67419Q6442l92255p28189O05727k72807R4046M43264l27251J92595
1114I83701l41254J4808l83569R3638O84186j70763r0077k15935n04691M35418
1104E05462j019063J142114m63108M17880n54106m21057j95782k32421J124713
1095C04632L29429m71099N97034k94540K99769m75361n08832m00056n43014J933689
1085G71651o02461J10881P2332q27196N0019J71871J054846j73546m62393J284171
1075A450175k18059m5698m90371J143742m00285k80410M80106r60077j2275k71630
$$ plain form
1065 395218 254618 682865 762325 1065199 589985 474385 1035029 386915 694878 1030197
1055 1030197 1743919 1505214 502175 942143 433458 460417 1572429 1619625 1494405 1043787
1045 1043787 471149 -187068 364974 1924253 1313151 1111561 841154 1609801 660877
1036 660877 202476 457464 561466 730650 1112670 736813 1116228 283127 1193681 470326
1026 470326 726714 1311114 563588 1139183 -513042 -344351 -847866 -365862 501880 809023
1016 809023 1287192 1531753 974528 403986 571336 1196715 314640 1471189 1741344 600634
1006 600634 476201 250649 1228378 267697 1067303 911181 317439 559147 246419 210730
996 210730 264016 486495 1042901 293377 1112241 594549 -93874 -560047 131318 1260546
$$ packed form
1065C95218j40600M28247P9460L02874m75214j15600N60644o48114L07963L35319
1055A030197P13722k38705j003039M39968n08685K6959J112012M7196j25220m50618
1045A043787n72638o58217N52042J559279o11102k01590k70407P68647r48924
1036F60877m58401K54988J04002J69184L82020l75857L79415q33101R10554p23355
1026D70326K56388N84400p47526N75595j652225J68691n03515M82004Q67742L07143
1016H09023M78169K44561n57225n70542J67350O25379q82075J156549K70155j140710
1006F00634j24433k25552R77729r60681P99606j56122n93742K41708l12728l5689
996B10730N3286K22479N56406p49524Q18864n17692o88423m66173O91365J129228
$$ plain form
986 1260546 727837 1285553 591312 -283190 -342022 -341341 462499 394879 898006 1007912 -18723
975 -18723 664871 -120126 854348 793531 781815 890676 946406 1264657 774705 14405 251061
964 251061 950147 1168905 1518703 1290281 1122153 -414735 291328 439952 658079 274589
954 274589 847253 1061479 408288 445016 626016 708035 1523496 1331292 1040061 122666
944 122666 633586 741926 303302 749991 726909 441748 523800 608549 233004 -119575
934 -119575 -503683 204500 292278 988450 125888 513152 517080 590793 185816 -22910 699536
923 699536 483605 186565 -7392 -28620 -429064 -606733 547001 1380478 623387 947565
913 947565 179745 358957 66075 622409 1046324 410195 802754 926576 1165424 764792
$$ packed form
986A260546n32709N57716o94241q74502n8832O81Q03840o7620N03127J09906j026635
975a8723O83594p84997R74474o0817j1716J08861N5730L18251m89952p60300K36656
964B51061O99086K18758L49798k28422j68128j536888P06063J48624K18127l83490
954B74589N72664K14226o53191L6728J81000Q2019Q15461j92204k91231r17395
944A22666N10920J08340m38624M46689k3082k85161Q2052Q4749l75545l52579
934a19575l84108P08183Q7778O96172q62562L87264L928P3713m04977k08726P22446
923F99536k15931k97040j93957k1228m00444j77669J153734Q33477p57091L24178
913I47565p67820J79212k92882N56334M23915o36129L92559J23822K38848m00632
$$ plain form
903 764792 1029685 663108 877344 1056782 921131 714802 620854 733559 128177 -150302
893 -150302 703785 571324 464009 -9762 538699 -70372 787666 722405 146468 -741256
883 -741256 19960 159689 209405 147438 1528874 455385 484331 1097081 485689 709423
873 709423 1021776 1471306 571397 1281774 1054960 328553 114761 -243696 202252 263065
863 263065 734826 1113471 994411 776573 728713 216023 618992 1166931 1433601 575206
853 575206 1249752 693939 -378373 92241 548593 534670 406173 742725 927025 258368
843 258368 367680 318705 492054 407701 1360376 1358775 764067 1465799 1316135 1150420 883234
832 883234 1570026 1274161 1104616 1061315 1127413 558400 330583 344101 1157546 71813
$$ packed form
903G64792K64893l66577K14236J79438j35651k06329r3948J12705o05382k78479
893a50302Q54087j32461j07315m73771N48461o09071Q58038o5261n75937q87724
883g41256P61216J39729M9716o1967J381436j073489K8946O12750o11392K23734
873G09423L12353M49530q99909P10377k26814p26407k13792l58457M45948O0813
863B63065M71761L78645j19060k17838m7860n12690M02969N47939K66670q58395
853E75206O74546n55813j072312M70614M56352j3923j28497L36552J84300o68657
843B58368J09312m8975J73349q4353R52675j601n94708P01732j49664j65715k67186
832H83234O86792k95865j69545m3301O6098n69013k27817J3518Q13445j085733
$$ plain form
822 71813 425835 191584 381271 836399 517262 769655 252851 886362 1191766 512991
812 512991 1178299 506074 526862 554260 796976 596950 335669 1025789 877278 203142
802 203142 140410 -602292 103118 279463 899131 1110022 243694 398634 105490 43120
792 43120 449910 31006 1077962 936518 1225613 579020 474207 592998 -101718 307359
782 307359 66984 -10943 802473 -129768 199382 -563873 271379 764241 940540 1130104
772 1130104 342948 966351 610698 310227 521881 642028 626580 152925 -81950 303680
762 303680 -1260 836445 844447 606252 122996 -28946 48372 -404485 -150039 174233
752 174233 690537 862939 1475445 1064296 905653 819057 302971 40491 190495 -175335
$$ packed form
822G1813L54022k34251J89687M55128l19137K52393n16804O33511L05404o78775
812E12991O65308o72225K0788K7398K42716k00026k61281O90120j48511o74136
802B03142o2732p42702P05410J76345O19668K10891q66328J54940k93144o2370
792D3120M06790m18904J046956j41444K89095o46593j04813J18791o94716M09077
782C07359k40375p7927Q13416r32241L29150p63255Q35252M92862J76299J89564
772A130104p87156O23403l55653l00471K11654J20147j5448m73655k34875L85630
762C03680l04940Q37705Q002k38195m83256j51942P7318m52857K54446L24272
752A74233N16304J72402O12506m11149j58643q6596n16086k62480J50004l65830
$$ plain form
742 -175335 35046 3199 242854 497705 873481 575461 1111874 1341173 338005 327146
732 327146 699475 635580 406012 1059545 1089867 1064122 137105 267022 602918 644711 -94696
721 -94696 624033 1049036 379101 -229359 -644109 -514337 -450173 -164461 1017268 864274
711 864274 940946 551773 355191 989144 710134 1158843 799074 678849 890987 468558
701 468558 404258 111496 727551 867644 676580 322743 -330969 72701 -61357 20156
691 20156 394971 121753 142527 126031 811123 342556 268085 609071 -39409 6472 -224896
680 -224896 -403645 380305 -576472 390406 363062 219944 113659 387209 479697 314712
670 314712 106743 302793 -90273 127575 -326350 247080 620697 813981 529240 691443
$$ packed form
742a75335K10381l1847K39655K54851L75776k98020N36413K29299j003168j0859
732C27146L72329o3895k29568O53533L0322k5745r27017J29917L35896M1793p39407
721i4696P18729M25003o69935o08460m14750J29772O4164K85712J181729j52994
711H64274P6672l89173j96582O33953k79010M48709l59769j20225K12138m22429
701D68558o4300k92762O16055J40093j91064l53837o53712M03670j34058Q1513
691B0156L74815k73218K0774j6496O85092m68567p4471L40986o48480M5881k31368
680b24896j78749P83950r56777R66878k7344j43118j06285K73550R2488j64985
670C14712k07969J96050l93066K17848m53925N73430L73617J93284k84741J62203
$$ plain form
660 691443 471328 581165 569784 558280 90719 639752 429561 -57567 340175 270474
650 270474 549931 -388942 -278821 886303 1179583 1065692 1295276 1109834 838471 363563
640 363563 199033 631791 293412 974411 584526 1172855 505246 900255 668828 201345
630 201345 1110484 687929 1266485 1028450 1212153 848292 897024 1450789 1548943 1450143
620 1450143 1060352 732110 710332 484427 576231 759196 525669 192003 -208203 -131784
610 -131784 212471 -522229 116767 654674 1393591 1127667 1723513 1483352 1919180 255699
600 255699 -272967 -499173 230628 895828 1114695 567038 -455946 187062 342681 245664
590 245664 385399 453901 389554 -291756 303691 495349 620149 454120 358894 815888
$$ packed form
660F91443k20115J09837j1381j1504m67561N49033k10191m87128L97742o9701
650B70474K79457r38873J10121J165124K93280j13891K29584j85442k71363m74908
640C63563j64530M32758l38379O80999l89885N88329o67609L95009k31427m67483
630B01345R09139m22555N78556k38035J83703l63861M8732N53765R8154r8800
620A450143l89791l28242k1778k25905R1804J82965k33527l33666m00206P6419
610a31784L44255p34700O38996N37907P38917k65924N95846k40161M35828j663481
600B55699n28666k26206P29801O65200K18867n47657j022984O43008J55619r7017
590B45664J39735O8502o4347o81310N95447J91658J24800j66029r5226M56994
$$ plain form
580 815888 986185 733306 395031 95914 711240 38663 365371 81224 -163767 280073
570 280073 109967 -41985 337061 252930 564506 581300 362974 36056 1150505 635485
560 635485 836815 691558 875773 819974 373034 941967 587763 1417631 1041869 1551899
550 1551899 889433 325414 45142 -32108 -81953 493610 27843 713500 754935 1010886
540 1010886 697806 153902 797282 459053 1721947 1506087 1088925 1463394 1019547 660550
530 660550 9601 316797 109538 -146476 460967 289836 673352 -60832 -3633 1279223
520 1279223 500071 687495 821824 824123 1161710 948528 1024080 -52782 245030 719019
510 719019 -128153 467436 117371 234038 403319 -133168 12523 430819 746761 1033537
$$ packed form
580H15888J70297k52879l38275k99117O15326o72577L26708k84147k44991M43840
570B80073j70106j51952L79046q4131L11576J6794k18326l26918J114449n15020
560F35485K01330j45257J84215n5799m46940N68933l54204Q29868l75762N10030
550A551899o62466n64019k80272p7250m9845N75563m65767O85657M1435K55951
540A010886l13080n43904O43380l38229J262894k15860m17162L74469m43847l58997
530F60550o50949L07196k07259k56014O07443j71131L83516p34184N7199J282856
520A279223p79152J87424J34329K299L37587k13182P5552j076862K97812M73989
510G19019q47172N95589l50065J16667J69281n36487J45691M18296L15942K86776
$$ plain form
500 1033537 119443 584281 475579 579959 78580 418927 437643 -208179 430923 797058
490 797058 1463674 206746 11657 190413 -7230 -82719 101341 -400101 534208 -87001
480 -87001 -499837 -822821 -592573 285628 148910 -305544 68138 393019 313280 293073
470 293073 199470 -555344 -40004 49971 -249404 68157 31093 436081 -14773 703121
460 703121 517697 558862 -18462 -35046 -548389 167795 22713 522613 141868 440784
450 440784 353475 -66570 -25530 310419 985459 442395 769564 2691 145394 243630
440 243630 212006 94033 -373839 -198896 299510 1329 288825 929919 325958 250519
430 250519 488393 846658 -174584 259958 328261 799139 -44577 868312 870103 382243
$$ packed form
500A033537r14094M64838j08702J04380n01379L40347J8716o45822O39102L66135
490G97058O66616j256928j95089J78756j97643p5489J84060n01442R34309o21209
480h7001m12836l22984K30248Q78201j36718m54454L73682L24881p9739k0207
470B93073r3603p54814N15340Q9975k99375L17561l7064M04988m50854P17894
460G03121j85424M1165n77324j6584n13343P16184j45082M99900l80745K98916
450D40784q7309m20045M1040L35949O75040n43064L27169p66873J42703R8236
440B43630l1624j17973m67872J74943M98406k98181K87496O41094o03961p5439
430B50519K37874L58265j021242M34542O8303M70878q43716R12889J791m87860
$$ plain form
420 382243 180228 574314 219165 656551 191155 584967 413480 344890 148101 295290
410 295290 906559 992123 895646 932038 751472 1044888 789098 1243615 1013498 238287
400 238287 464991 303843 499699 105221 1457683 1333019 1618482 1000649 1119095 304428
390 304428 606235 595848 1253875 1586282 2132575 2014414 1044831 1151366 1125904 787564
380 787564 118760 325107 326775 280124 275119 496226 527219 530934 621101 -14126 30587 810691
368 810691 1009729 1033705 996195 1629162 1517816 845034 518924 279980 630715 571223
358 571223 1295038 566726 1370740 572396 485564 -584480 -198468 343879 855278 812890
348 812890 822783 90400 364468 -1977 1386621 1497555 1546497 550816 -33234 526852
$$ packed form
420C82243k02015L94086l55149M37386m65396L93812j71487o8590j96789J47189
410B95290O11269Q5564r6477L6392j80566K93416k55790M54517k30117p75211
400B38287K26704j61148J95856l94478J352462j24664K85463o17833J18446q14667
390C04428L01807j0387O58027L32407N46293j18161r69583J06535k5462l38340
380G87564o68804K06347J668m6651n005K21107L0993L715R0167o35227M4713P80104
368H10691J99038K3976l7510O32967j11346o72782l26110k38944L50735n9492
358E71223P23815p28312Q04014p98344q6832j070044L86012N42347N11399m2388
348H12890R893p32383K74068l66445J388598J10934M8942r95681n84050N60086
$$ plain form
338 526852 -128891 -104141 -75939 235683 -88967 254859 -229980 -318509 -295744 -94668 -331901
327 -331901 624580 933398 927746 961034 1168525 800843 967898 76785 60516 665523 270056
316 270056 146716 14506 346894 46832 -292877 -253659 251755 9830 140795 285719
306 285719 1075399 656074 1417940 474645 477552 643060 877986 756625 957624 1570904
296 1570904 1095754 717113 -92083 39293 264762 -24635 85579 659672 122557 854106
286 854106 360449 1030164 510653 1199545 252911 391084 227466 66673 -38882 447168
276 447168 876411 556215 739824 145541 -286426 -643009 85429 222486 310179 -70015
266 -70015 -95794 -758256 -79131 44407 363552 282174 612521 407132 234790 479762
$$ packed form
338E26852o55743K4750K8202L11622l24650L43826m84839q8529K2765K01076k37233
327c31901R56481L08818n652L3288K07491l67682J67055q91113j6269O05007l95467
316B70056j23340j32210L32388l00062l39709L9218N05414k41925J30965J44924
306B85719P89680m19325P61866r43295K907J65508K34926j21361K00999O13280
296A570904m75150l78641q09196J31376K25469k89397J10214N74093n37115P31549
286H54106m93657O69715n19511O88892r46634J38173j63618j60793j05555M86050
276D47168M29243l20196J83609n94283m31967l56583P28438J37057Q7693l80194
266g0015k5779o62462O79125J23538L19145q1378L30347k05389j72342K44972
$$ plain form
256 479762 -474498 -271504 -447036 -574574 657383 398366 8828 -34982 -263528 139451
246 139451 -535699 343355 -360183 642666 505087 557221 56226 65661 272824 1139389
236 1139389 705483 1125844 1028250 601439 39691 -146118 -133870 -432438 267062 617008
226 617008 1312994 541325 -7338 25569 42611 -259998 171272 507695 670740 467375
216 467375 83493 314738 645197 897315 936327 295032 349664 673516 579049 -59445
206 -59445 396833 481957 -248416 48301 -216965 198766 5837 -376032 -159005 983791
196 983791 771204 1172236 817071 901972 472903 932258 521540 319771 667256 287609
186 287609 733165 508429 710830 -228969 395111 658074 630912 417909 612217 -15404
$$ packed form
256D79762r54260K02994j75532j27538J231957k59017l89538m3810k28546M02979
246A39451o75150Q79054p03538J002849j37579N2134n00995R435K07163Q66565
236A139389m33906M20361r7594m26811n61748j85809J2248k98568O99500L49946
226F17008O95986p71669n48663L2907J7042l02609M31270L36423J63045k03365
216D67375l83882K31245L30459K52118L9012o41295N4632L23852r4467o38494
206e9445M56278Q5124p30373K96717k65266M15731j92929l81869K17027J142796
196I83791k12587M01032l55165Q4901m29069M59355m10718k01769L47485l79647
186B87609M45556k24736K02401r39799O24080K62963k7162k13003J94308o27621
$$ plain form
176 -15404 550330 430797 844396 2728 340268 682156 440938 467345 323135 733436
166 733436 514667 741802 39898 285774 -74183 125977 33391 312711 416031 966291
156 966291 538618 507782 592844 741154 955692 839335 427106 331268 -126262 -71552 61467
145 61467 546888 1153104 233500 -53019 88282 331365 -602864 -29472 487544 775563
135 775563 113546 608676 -112241 -149928 -132691 559401 352663 679214 614023 -268095
125 -268095 -260635 -391711 -229195 234514 554299 1066215 976120 251615 -332629 -374898 -455855
114 -455855 74634 1092986 800539 1043272 1206056 1113533 692607 436268 447930 698468
104 698468 629635 72012 190057 320251 -75341 -322866 469678 535086 511615 93090
$$ packed form
176a5404N65734j19533M13599q41668L37540L41888k41218K6407j44210M10301
166G33436k18769K27135p01904K45876l59957K00160r2586K79320J03320N50260
156I66291m27673l0836Q5062J48310K14538j16357m12229r5838m57530N4710J33019
145F1467M85421O06216r19604k86519J41301K43083r34229N73392N17016K88019
135G75563o62017M95130p20917l7687J7237O92092k06738L26551o5191q82118
125b68095P460j31076J62516M63709L19785N11916r0095p24505n84244m2269q0957
114d55855N30489J018352k92447K42733J62784r2523m20926k56339J1662K50538
104F98468o8833n57623J18045J30194l95592k47525P92544O5408k3471m18525
$$ plain form
94 93090 390556 -302679 372430 -167455 746361 696211 621002 642800 664438 494504 151305
83 151305 408916 428765 284953 488383 242900 -458887 -220565 -163875 85119 -243105
73 -243105 -370569 -534610 -233442 -406012 -163296 84495 579186 309004 733325 532537
63 532537 664896 106207 -417079 -76663 224951 -441607 -359003 -121103 -425019 -340722
53 -340722 -574993 -350911 -649017 -470867 -545272 -233570 -180537 -75825 257526 9259
43 9259 156618 267527 -139934 -429332 241361 232274 415640 -120043 -7025 -27178 48435
32 48435 -442374 -156410 -193996 126255 376643 27368 -1423 323466 293064 272020 440044
21 440044 238086 366582 189822 -160604 187992 351635 620885 152071 -141878 95526
$$ packed form
94I3090K97466o93235O75109n39885R13816n0150p5209K1798K1638j69934l43199
83A51305K57611J9849j43812K03430k45483p01787K38322N6690K48994l28224
73b43105j27464j64041L01168j72570K42716K47791M94691k70182M24321k00788
63E32537J32359n58689n23286L40416L01614o66558Q2604K37900l03916Q4297
53c40722k34271K24082k98106J78150p4405L11702N3033J04712L33351k48267
43I259J47359J10909m07461k89398O70693r087J83366n35683J13018k0153P5613
32D8435m90809K85964l7586L20251K50388l49275k8791L24889l0402k1044J68024
21D40044k01958J28496j76760l50426L48596J63643K69250m68814k93949K37404
$$ plain form
11 95526 1290 -402177 -236550 369845 576785 560610 232814 347836 177804 -21855 61818
0 61818
$$ packed form
11I5526r4236m03467J65627O06395K06940j6175l27796J15022j70032j99659Q3673
0F1818
$$ Imaginary data points
##PAGE= N=2
##DATA TABLE= (X++(I..I)), XYDATA
$$ plain form
16383 -1781515 -1546476 -1804187 -2601142 -2117240 -2293040 -1719745 -1520792 -1467630 -1653079 -2110779
16373 -2110779 -1782589 -1897047 -1668403 -2020998 -1983596 -1427987 -1582222 -1797757 -1720659 -1725315
16363 -1725315 -1156472 -1280654 -1326999 -1589817 -1406245 -1632402 -1873727 -1418638 -852426 -1113640
16353 -1113640 -1270020 -1417458 -1338610 -1497254 -710406 -852008 -381277 -380423 -732304 -1020570
16343 -1020570 -962857 -544248 -554441 -482640 -982398 -900213 -1142897 -1187147 -1185255 -1158533 -874131
16332 -874131 -380506 -127897 -201890 -475153 -343291 -618328 -621954 -728999 -562693 325381
16322 325381 -350571 -684092 -689511 -861900 -416821 -417567 -684288 -348558 -290451 -191500 -464257
16311 -464257 -68072 -13219 508065 244264 499823 271063 265566 434683 576441 407495
$$ packed form
16383a781515K35039k57711p96955M83902j75800N73295J98953N3162j85449m57700
16373b110779L28190j14458K28644l52595L7402N55609j54235k15535P7098m656
16363a725315N68843j24182m6345k62818J83572k26157k41325M55089N66212k61214
16353a113640j56380j47438P8848j58644P86848j41602M70731Q54l51881k88266
16343a020570N7713M18609j0193P1801m99758Q2185k42684m4250J892K6722K84402
16332h74131M93625K52609p3993k73263J31862k75037l626j07045J66306Q88074
16322C25381o75952l33521n419j72389M45079p46k66721L35730N8107R8951k72757
16311d64257L96185N4853N21284k63801K55559k28760n497J69117J41758j68946
$$ plain form
16301 407495 352525 163912 -435176 157395 106235 233410 84038 -102813 -398130 -291383
16291 -291383 -106957 -31545 22106 -83640 665477 601892 438218 536892 -162478 395334
16281 395334 983254 694290 620956 295040 478279 489075 325028 326288 327449 338595 964457
16270 964457 490051 589632 350103 787466 309552 822399 1085789 1550872 1067738 1131974
16260 1131974 1300894 475264 747889 523198 1012888 1086455 1149767 1047025 462306 143005
16250 143005 187205 143399 424213 488484 1027605 856954 554769 235405 263822 1179521
16240 1179521 1375206 1788585 1797458 1279674 1783144 1356019 1453671 1319093 1443069 1242192
16230 1242192 1543609 1227617 1230503 1335740 1004108 1512509 1375849 1594006 1309591 1411703
$$ packed form
16301D07495n4970j88613n99088N92571n1160J27175j49372j86851k95317J06747
16291b91383J84426P5412N3651j05746P49117o3585j63674R8674o99370N57812
16281C95334N87920k88964p3334l25916J83239J0796j64047J260J161J1146O25862
16270I64457m74406R9581k39529M37363m77914N12847K63390M65083m83134O4236
16260A131974J68920q25630K72625k24691M89690P3567O3312j02742n84719l19301
16250A43005M4200m3806K80814O4271N39121j70651l02185l19364K8417R15699
16240A179521J95685M13379Q873n17784N03470m27125R7652j34578J23976k00877
16230A242192L01417l15992K886J05237l31632N08401j36660K18157k84415J02112
$$ plain form
16220 1411703 1707527 1746965 1695990 1770246 1766929 1684974 2060789 1261012 980675 1238984
16210 1238984 1178487 1266513 1516216 1250171 1339521 965009 1372418 1146113 1125148 946679
16200 946679 1291940 1552684 1960537 1881326 1273696 1620626 2246346 1687665 2280619 1844401
16190 1844401 2841650 1332913 1211374 1236041 767375 782926 982685 1783191 1350092 1811147
16180 1811147 1164660 755342 942007 1663808 2057713 2275132 2011154 2630986 1514952
16171 1514952 1014319 1278613 1930251 1421009 497221 854297 859307 1301600 1145004 607426
16161 607426 1090818 1809160 1745359 1825103 1609258 1207358 629286 1169523 1275618 1934957
16151 1934957 1640666 2456501 1668177 1374129 683397 582290 811387 1076864 1164023 809470
$$ packed form
16220A411703K95824L9438n0975P4256l317q1955L75815p99777k80337K58309
16210A238984o0497Q8026K49703k66045Q9350l74512M07409k26305k0965j78469
16200I46679L45261K60744M07853p9211o07630L46930O25720n58681N92954m36218
16190A844401R97249j508737j21539K4667m68666J5551J99759Q00506m33099M61055
16180A811147o46487m09318J86665P21801L93905K17419k63978O19832j116034
16171A514952n00633K64294O51638n09242r23788L57076N010M42293j56596n37578
16161F07426M83392P18342o3801P9744k15845m01900n78072N40237J06095O59339
16151A934957k94291Q15835p88324k94048o90732j01107K29097K65477Q7159l54553
$$ plain form
16141 809470 495989 1239789 1166822 1222144 1536541 1757343 2070590 1331011 1964426 1854028
16131 1854028 2559255 1812728 1532572 1476127 1271332 1992765 2034697 2166396 2130402 1577980
16121 1577980 2147792 1551765 1499592 834836 1494628 1909856 2052785 2188022 1632139 1793588
16111 1793588 1552372 2071593 2831701 2183791 1746172 1793280 2149811 2115312 1968123 2399676
16101 2399676 1668535 1419446 1496470 1829971 1404506 1359538 2065839 1653353 3067743 2648108
16091 2648108 2761369 1749396 2165964 2412719 2180367 1911056 2313208 1826645 2694930
16082 2694930 2121099 2002879 1352987 2080646 2246377 1977196 1577673 1579105 1794859 1105243
16072 1105243 2029912 2183527 2094098 2100426 2491406 2805324 2680891 2479972 2534179 1899437
$$ packed form
16141H09470l13481P43800p2967N5322L14397K20802L13247p39579O33415j10398
16131A854028P05227p46527k80156n6445k04795P21433M1932J31699l5994n52422
16121A577980N69812n96027n2173o64756O59792M15228J42929J35237n55883J61449
16111A793588k41216N19221P60108o47910m37619M7108L56531l4499j47189M31553
16101B399676p31141k49089P7024L33501m25465m4968P06301m12486J414390m19635
16091B648108J13261j011973M16568K46755k32352k69311M02152m86563Q68285
16082B694930n73831j18220o49892P27659J65731k69181l99523J432K15754o89616
16072A105243R24669J53615q9429O328L90980L13918j24433k00919N4207o34742
$$ plain form
16062 1899437 2034025 2406983 2401061 1913740 1972008 2443320 2069838 2018907 1628330 1942044
16052 1942044 2077783 2254700 1532286 2427292 2701340 3023779 2500491 2321210 2363907 2244835
16042 2244835 2338397 2031179 1352010 2276899 1703923 2255595 1601074 2353689 2074383 1449766
16032 1449766 1922587 1983257 2786104 1929982 2070726 2131741 2267529 2674664 2867857 1638466
16022 1638466 2584874 1687120 2805503 1297080 2421768 1758417 1998773 2453275 2266834
16013 2266834 2137238 1734303 2416022 2914992 2649763 2737685 2573490 2507557 2486373 2127419
16003 2127419 2689102 2541830 3339924 2753071 2275230 1884889 1808304 2265920 2007626 2299654
15993 2299654 1738648 1741557 1151881 923132 1264053 2463031 2405884 2298870 1861746 2733721
$$ packed form
16062A899437J34588L72958n922m87321N8268M71312l73482n0931l90577L13714
16052A942044J35739J76917p22414Q95006K74048L22439n23288j79281M2697j19072
16042B244835R3562l07218o79169R24889n72976N51672o54521P52615k79306o24617
16032A449766M72821O0670Q02847q56122J40744O1015J35788M07135J93193j229391
16022A638466R46408q97754J118383j508423J124688o63351K40356M54502j86441
16013B266834j29596m02935O81719M98970k65229Q7922j64195o5933k1184l58954
16003B127419N61683j47272P98094n86853m77841l90341p6585M57616k58294K92028
15993B299654n61006K909n89676k28749L40921J198978n7147j07014m37124Q71975
$$ plain form
15983 2733721 2198744 2422374 1358765 2105310 2096460 2649957 1532807 1888309 1244283
15974 1244283 2154549 1311878 1848306 2193446 1752026 1596269 1137112 1810885 1081686
15965 1081686 1319835 1471239 2266471 2463746 2368067 2171186 2762957 1827391 2125252 1002842
15955 1002842 1946828 1827017 1756862 871285 1148813 1112497 985525 1003723 1371862 1718409
15945 1718409 1750799 1854665 1991727 1352756 887280 1719226 1747809 2631383 2087624 3263508
15935 3263508 2134370 2635279 1974743 1004266 1019881 1352695 1680084 1720329 1700126 1683675
15925 1683675 1862909 1405516 1620359 1338143 2506089 1811647 2395800 1572520 2635883
15916 2635883 1639068 2248257 1943479 2322900 2509211 3481451 2201432 2002717 674272
$$ packed form
15983B733721n34977K23630j063609P46545q850N53497j117150L55502o44026
15974A244283R10266q42671N36428L45140m41420j55757m59157O73773p29199
15965A081686K38149J51404P95232J97275r5679j96881N91771r35566K97861j122410
15955A002842R43986j19811p0155q85577K77528l6316j26972J8198L68139L46547
15945A718409L2390J03866J37062o38971m65476Q31946K8583Q83574n43759J175884
15935C263508j129138N00909o60536r70477J5615L32814L27389M0245k0203j6451
15925A683675J79234m57393K14843k82216J167946o94442N84153q23280J063363
15916B635883r96815O09189l04778L79421J86311R72240j280019j98715j328445
$$ plain form
15907 674272 1549515 1911949 2373344 2800044 2016789 2490303 1834717 1939059 1652223 2528602
15897 2528602 2747151 3285272 2309007 2385342 2047987 2663587 1436321 2114158 2491099
15888 2491099 3277477 2567559 2286624 2308384 1788187 1914399 2009914 2605326 2498713 2212323
15878 2212323 1570444 1801908 2041346 1970045 1403991 3348712 2240085 2240725 1791040 2060953
15868 2060953 1611786 1969134 2315642 2548102 2065054 2492831 1922471 1653133 1410922
15859 1410922 1898906 2528525 2737749 3141228 1589551 2240253 1482924 2438313 2546268
15850 2546268 2914433 2204891 2076351 1790760 1957864 1246710 1855463 1571029 2490595
15841 2490595 2085375 1682843 1810872 1817997 2853032 2186576 2670979 2900746 2473947 2270620
$$ packed form
15907F74272Q75243L62434M61395M26700p83255M73514o55586J04342k86836Q76379
15897B528602K18549N38121r76265P6335l37355O15600j227266O77837L76941
15888B491099P86378p09918k80935K1760n20197J26212R5515N95412j06613k86390
15878B212323o41879K31464K39438p1301n66054J944721j108627O40m49685K69913
15868B060953m49167L57348L46508K32460m83048M27777n70360k69338k42211
15859A410922M87984O29619K09224M03479j551677O50702p57329R55389J07955
15850B546268L68165p09542j28540k85591J67104p11154O08753k84434R19566
15841B490595m05220m02532J28029P125J035035o66456M84403K29767m26799k03327
$$ plain form
15831 2270620 2042348 1820342 2482942 1844157 2457922 2551356 3120260 1606570 2073130
15822 2073130 1297957 1506846 1430200 1634904 1848256 1842984 1917982 1774129 1772821 1651300
15812 1651300 2449398 1796352 2092292 1926964 2197337 1300146 2056005 2636068 2332911
15803 2332911 1469969 2162746 1826534 2070704 1353082 1380959 2607151 1744883 2097765
$$ packed form
15831B270620k28272k22006O62600o38785O13765R3434N68904j513690M66560
15822B073130p75173K08889p6646K04704K13352n272P4998j43853j308j21521
15812A651300P98098o53046K95940j65328K70373q97191P55859N80063l03157
15803B332911q62942O92777l36212K44170p17622K7877J226192q62268L52882
$$ [...]
##END NTUPLES=NMR SPECTRUM
##END=
