##TITLE=1H_DE-80H_X3
 200.13MHz, d2o
 8 sc
 
 19ns.26.2.2025
##JCAMPDX= 6.0         $$ Bruker NMR JCAMP-DX V2.0
##DATA TYPE= NMR SPECTRUM
##DATA CLASS= NTUPLES
##ORIGIN= UXNMR, Bruker Analytische Messtechnik GmbH
##OWNER= pz
$$ XWIN-NMR		Version 3.5
$$ Mon Dec 22 10:19:47 2025 Russian Standard Time (UT+4h)  Yarkov@DPX200
##.OBSERVE FREQUENCY= 200.1313
##.OBSERVE NUCLEUS= ^1H
##.ACQUISITION MODE= SIMULTANEOUS
##.ACQUISITION SCHEME= undefined
##.AVERAGES= 8
##.DIGITISER RES= 18
##SPECTROMETER/DATA SYSTEM= spect
##.PULSE SEQUENCE= zg30
##.SOLVENT NAME= CDCl3
##.SHIFT REFERENCE= (INTERNAL, CDCl3, 0, 15.5265)
##AUDIT TRAIL= $$ (NUMBER, WHEN, WHO, WHERE, WHAT)
$$ ##TITLE= Audit trail, XWIN-NMR		Version 3.5
$$ ##JCAMPDX= 5.01
$$ ##ORIGIN= Bruker BioSpin GmbH
$$ ##OWNER= Yarkov
$$ C:/Bruker/XWIN-NMR/data/yarkov2/nmr/H-C/1/pdata/1/auditp.txt
$$ ##AUDIT TRAIL=  $$ (NUMBER, WHEN, WHO, WHERE, WHAT)
(   1,<2025-12-22 10:18:54.04 +0400>,<Yarkov>,<DPX200>,
      <created by zg, POWCHK disabled, PULCHK disabled
       configuration hash MD5:
       00 E9 B6 7A A2 85 ED C7 34 08 36 98 17 FE 4E 26
       data hash MD5: 16K
       12 ED 70 25 A9 68 10 7B 6E AD 18 14 7C 54 96 8C>)
(   2,<2025-12-22 10:18:58.59 +0400>,<Yarkov>,<DPX200>,
      <Start of raw data processing
       efp BC_mod = 2 LB = 0.25 FT_mod = 6 PKNL = 1 PHC0 = -5306.755 PHC1 = 10.82193 SI = 16K 
       data hash MD5: 16K
       EA DF DD C4 4E BE F2 3C 46 8B 48 BD 94 7A 37 C4>)
(   3,<2025-12-22 10:19:12.10 +0400>,<Yarkov>,<DPX200>,
      <pk PHC0 = 8.4 PHC1 = 0 
       data hash MD5: 16K
       EF EE F2 FA BF 70 FF CB AE 56 4F D7 84 17 2F 34>)
$$ ##END=
$$ 
$$ hash MD5
$$ 6B 97 E8 AA 94 4E FB 19 A5 3F 4B 66 28 0A 50 88
##$RELAX= 
##$RELAX= 
##$RELAX= 
##$RELAX= 
##$RELAX= 
##$RELAX= 
$$ Bruker specific parameters
$$ --------------------------
##$DU= <C:/Bruker/XWIN-NMR>
##$EXPNO= 1
##$NAME= <H-C>
##$PROCNO= 1
##$TYPE= <nmr>
##$USER= <yarkov2>
##$AMP= (0..31)
100 100 100 100 100 100 100 100 100 100 100 100 100 100 100 100 100 100 
100 100 100 100 100 100 100 100 100 100 100 100 100 100 
##$AQSEQ= 0
##$AQ_mod= 1
##$AUNM= <au_zg>
##$AUTOPOS= <>
##$BF1= 200.13
##$BF2= 200.13
##$BF3= 200.13
##$BF4= 200.13
##$BF5= 200.13
##$BF6= 200.13
##$BF7= 200.13
##$BF8= 200.13
##$BYTORDA= 1
##$CFDGTYP= 0
##$CFRGTYP= 5
##$CHEMSTR= <none>
##$CNST= (0..31)
1 1 145 1 1 1 1 1 1 1 1 1 1 1 1 1 1 1 1 1 1 1 1 1 1 1 1 1 1 1 1 1 
##$CPDPRG= <>
##$CPDPRG1= <>
##$CPDPRG2= <>
##$CPDPRG3= <>
##$CPDPRG4= <mlev>
##$CPDPRG5= <mlev>
##$CPDPRG6= <mlev>
##$CPDPRG7= <mlev>
##$CPDPRG8= <mlev>
##$CPDPRGB= <>
##$CPDPRGT= <>
##$D= (0..31)
0 0.7 0 0 0 0 0 0 0 0 0 0.03 0 0 0 0 0 0 0 0 0 0 0 0 0 0 0 0 0 0 0 0 
##$DATE= 1766384333
##$DBL= (0..7)
120 120 120 120 120 120 120 120 
##$DBP= (0..7)
150 150 150 150 150 150 150 150 
##$DBP07= 0
##$DBPNAM0= <>
##$DBPNAM1= <>
##$DBPNAM2= <>
##$DBPNAM3= <>
##$DBPNAM4= <>
##$DBPNAM5= <>
##$DBPNAM6= <>
##$DBPNAM7= <>
##$DBPOAL= (0..7)
0.5 0.5 0.5 0.5 0.5 0.5 0.5 0.5 
##$DBPOFFS= (0..7)
0 0 0 0 0 0 0 0 
$$ [...]
##$SUBNAM2= <"">
##$SUBNAM3= <"">
##$SUBNAM4= <"">
##$SUBNAM5= <"">
##$SUBNAM6= <"">
##$SUBNAM7= <"">
##$SUBNAM8= <"">
##$SUBNAM9= <"">
##$SW= 18.0517328524113
##$SWIBOX= (0..15)
0 0 2 0 0 0 0 0 0 0 0 0 0 0 0 0 
##$SW_h= 3612.71676300578
##$TD= 16384
##$TD0= 1
##$TE= 0
##$TE2= 300
##$TE3= 300
##$TEG= 300
##$TL= (0..7)
0 120 120 120 120 120 120 120 
##$TP= (0..7)
150 150 150 150 150 150 150 150 
##$TP07= 0
##$TPNAME0= <>
##$TPNAME1= <>
##$TPNAME2= <>
##$TPNAME3= <>
##$TPNAME4= <>
##$TPNAME5= <>
##$TPNAME6= <>
##$TPNAME7= <>
##$TPOAL= (0..7)
0.5 0.5 0.5 0.5 0.5 0.5 0.5 0.5 
##$TPOFFS= (0..7)
0 0 0 0 0 0 0 0 
##$TUNHIN= 0
##$TUNHOUT= 0
##$TUNXOUT= 0
##$USERA1= <user>
##$USERA2= <user>
##$USERA3= <user>
##$USERA4= <user>
##$USERA5= <user>
##$V9= 5
##$VALIST= <valist>
##$VCLIST= <CCCCCCCCCCCCCCC>
##$VD= 0
##$VDLIST= <DDDDDDDDDDDDDDD>
##$VPLIST= <PPPPPPPPPPPPPPP>
##$VTLIST= <TTTTTTTTTTTTTTT>
##$WBST= 1024
##$WBSW= 4
##$XGAIN= (0..3)
0 0 0 0 
##$XL= 0
##$YL= 0
##$YMAX_a= 232448
##$YMIN_a= -234661
##$ZGOPTNS= <>
##$ZL1= 120
##$ZL2= 120
##$ZL3= 120
##$ZL4= 120
##$ABSF1= 0
##$ABSF2= 0
##$ABSG= 0
##$ABSL= 0
##$ALPHA= 0
##$AQORDER= 0
##$ASSFAC= 0
##$ASSFACI= 0
##$ASSFACX= 0
##$ASSWID= 0
##$AUNMP= <proc_1d>
##$AZFE= 0.1
##$AZFW= 0.1
##$BCFW= 0
##$BC_mod= 2
##$BYTORDP= 0
##$COROFFS= 0
##$CY= -3
##$DATMOD= 1
##$DC= 0
##$DFILT= <>
##$DTYPP= 0
##$F1P= 0
##$F2P= 0
##$FCOR= 1
##$FTSIZE= 16384
##$FT_mod= 6
##$GAMMA= 0
##$GB= 0
##$INTBC= 1
##$INTSCL= 3.241238e-09
##$ISEN= 128
##$LB= 0.25
##$LEV0= 0
##$LPBIN= 0
##$MAXI= 10000
##$MC2= 0
##$MEAN= 0
##$ME_mod= 0
##$MI= 1.114404
##$NCOEF= 0
##$NC_proc= -4
##$NLEV= 6
##$NOISF1= 3.799351
##$NOISF2= 2.8
##$NSP= 0
##$NTH_PI= 0
##$NZP= 0
##$OFFSET= 15.52653
##$PC= 1
##$PHC0= -5298.355
##$PHC1= 10.82193
##$PH_mod= 1
##$PKNL= yes
##$PPARMOD= 0
##$PSCAL= 0
##$PSIGN= 0
##$REVERSE= no
##$SF= 200.129999033625
##$SI= 16384
##$SIGF1= 3
##$SIGF2= 2
##$SINO= 0.751879
##$SIOLD= 32768
##$SREGLST= <19F.Aceton>
##$SSB= 0
##$STSI= 16384
##$STSR= 0
##$SW_p= 3612.71676300578
##$SYMM= 0
##$S_DEV= 0
##$TDeff= 16384
##$TDoff= 0
##$TI= <>
##$TILT= no
##$TM1= 0
##$TM2= 0
##$TOPLEV= 0
##$USERP1= <user>
##$USERP2= <user>
##$USERP3= <user>
##$USERP4= <user>
##$USERP5= <user>
##$WDW= 1
##$XDIM= 16384
##$YMAX_p= 524146892
##$YMIN_p= -132668
$$ End of Bruker specific parameters
$$ ---------------------------------
##NTUPLES= NMR SPECTRUM
##VAR_NAME=  FREQUENCY,     SPECTRUM/REAL,   SPECTRUM/IMAG
##SYMBOL=    X,             R,               I
##VAR_TYPE=  INDEPENDENT,   DEPENDENT,       DEPENDENT
##VAR_FORM=  AFFN,          ASDF,            ASDF
##VAR_DIM=   16384,         16384,           16384
##UNITS=     HZ,            ARBITRARY UNITS, ARBITRARY UNITS
##FACTOR=    0.220516191357247, 1,           1
##FIRST=     3107.32448709173, 0,            0
##LAST=      -505.392275914055, 0,           0
##MIN=       -505.392275914055, -132668,     0
##MAX=       3107.32448709173, 524146892,    0
$$ Real data points
##PAGE= N=1
##DATA TABLE= (X++(R..R)), XYDATA
$$ [...]
10056 -78408 -80225 -87321 -82295 -85564 -70873 -84708 -67425 -58744 -71562 -71564 -74436 -73754 -78880 -93648
10042 -93648 -88848 -67646 -63058 -66835 -72948 -72331 -66885 -57142 -83274 -73474 -64067 -78772 -75605 -81639
10028 -81639 -85580 -72601 -69314 -68493 -71453 -56154 -49183 -68542 -85284 -83605 -93425 -78952 -75045
10015 -75045 -75080 -85279 -81635 -76240 -70864 -69720 -73787 -79760 -69260 -62932 -74982 -77432 -61720 -60798
10001 -60798 -66423 -69719 -62904 -53495 -51883 -72140 -67851 -64800 -65080 -66429 -77792 -65967 -57323 -53786
9987 -53786 -46973 -55922 -58504 -69260 -79324 -71009 -67986 -54459 -63068 -60146 -66629 -65883 -70672 -74668
9973 -74668 -72729 -62020 -74903 -88933 -75858 -64676 -73403 -57911 -55344 -51702 -62036 -52205 -55017
9960 -55017 -79064 -86829 -73593 -67155 -78327 -63028 -68805 -75460 -68471 -73394 -62871 -70495 -75294
9947 -75294 -80009 -85971 -75761 -75871 -77333 -75754 -85135 -74516 -72378 -81238 -84785 -72138 -72534 -71786 -75881
9932 -75881 -83247 -69604 -63494 -73310 -86923 -87493 -86577 -70198 -59303 -60099 -63430 -78673 -67669 -77150
9918 -77150 -90973 -85695 -76117 -80353 -54459 -51984 -61783 -66044 -68431 -56858 -62292 -72632 -77148 -86594
9904 -86594 -82242 -77292 -90010 -84050 -73902 -76240 -63160 -81604 -74289 -73992 -76854 -71104 -75356 -71806
9890 -71806 -56934 -59802 -79454 -84974 -70578 -73042 -80819 -74560 -70792 -72245 -79228 -72263 -71543 -66268
9876 -66268 -70812 -73149 -83466 -89929 -68979 -63937 -75210 -77894 -69701 -75926 -80976 -73857 -85464 -83949
9862 -83949 -69580 -65045 -73766 -74580 -67560 -55610 -56700 -67275 -66239 -57306 -81574 -93618 -94304 -76894
9848 -76894 -66167 -62885 -58129 -60453 -66178 -59411 -78019 -84521 -80056 -83407 -85702 -64750 -64595 -63324
9834 -63324 -66061 -74068 -73570 -78668 -73101 -69399 -85341 -83144 -82762 -84121 -73864 -62952 -59578 -57805
9820 -57805 -70354 -58026 -65147 -58655 -62102 -88007 -82068 -67804 -69415 -102240 -128409 -108309 -93976
9807 -93976 -67081 -76010 -69102 -70895 -73052 -68818 -70607 -75323 -68849 -54635 -54566 -63739 -69233 -69249 -59911
9792 -59911 -57743 -72750 -94235 -78170 -68406 -70004 -61461 -69207 -84563 -90624 -71987 -80257 -83885
9779 -83885 -92032 -80436 -76076 -80658 -84306 -74287 -65801 -62510 -57489 -68547 -77778 -79336 -77592 -86258
9765 -86258 -86300 -79371 -93580 -86304 -72912 -73557 -81210 -72916 -67011 -67387 -69791 -64250 -72785 -84467 -89714
9750 -89714 -84140 -85493 -86658 -75125 -56244 -50773 -63447 -82387 -83996 -87974 -67933 -78221 -84807
9737 -84807 -94860 -77129 -49592 -72692 -84970 -89239 -86405 -66815 -51598 -50807 -61140 -56088 -70161
9724 -70161 -66637 -59675 -61877 -79732 -79916 -79758 -94930 -83968 -78002 -75456 -90235 -88966 -89036 -84242 -74192
9709 -74192 -68048 -51031 -59762 -65369 -75359 -68623 -75683 -81560 -99236 -85661 -71193 -71372 -72106 -82376
9695 -82376 -80451 -85682 -98614 -91018 -86697 -76206 -70739 -82813 -85118 -85080 -82175 -90381 -83282 -71129
9681 -71129 -60612 -68459 -81473 -79645 -83599 -88710 -85601 -87365 -80818 -70718 -70532 -80128 -81191 -74028
9667 -74028 -80097 -68258 -65033 -68844 -75801 -69419 -63430 -86522 -70909 -58077 -63257 -66697 -73190 -66607
9653 -66607 -75018 -81570 -70888 -66870 -64715 -58409 -55076 -47261 -30537 -7469 22261 13329 1457
9640 1457 -11485 -33558 -52257 -52693 -58813 -56433 -55250 -73343 -93601 -79460 -49579 -56308 -61506
9627 -61506 -65918 -43396 -48244 -54716 -48456 -43833 -49732 -56421 -63730 -56558 -55888 -58474 -63344 -67459 -48527
9612 -48527 -57942 -55383 -74060 -78467 -78327 -63873 -66180 -56878 -66033 -68524 -70191 -53812 -54605 -66859
9598 -66859 -66143 -61792 -71533 -72118 -56338 -73068 -66833 -63422 -48163 -49390 -68192 -70201 -71793 -58348
9584 -58348 -65659 -71925 -70442 -61543 -64882 -64344 -76822 -93561 -77695 -62162 -63804 -48671 -44208 -50908
9570 -50908 -46429 -60408 -70287 -55041 -65946 -72901 -65181 -65703 -65490 -55986 -61504 -60016 -37838 -37543
9556 -37543 -48140 -42733 -54289 -46463 -53895 -59868 -60403 -59047 -60006 -71698 -67071 -55991 -54483 -47761
9542 -47761 -39619 -49201 -58048 -71528 -67920 -61041 -45003 -54500 -71442 -75303 -86563 -73848 -73806 -70741
9528 -70741 -66189 -73978 -85207 -76960 -84676 -85214 -79375 -87999 -77963 -64677 -56395 -49294 -68465 -80366
9514 -80366 -57576 -65921 -72510 -73127 -75623 -65582 -58418 -74368 -53064 -43197 -49578 -52562 -59718 -62841
9500 -62841 -56498 -78597 -78978 -84635 -82657 -88823 -81070 -70162 -74761 -71707 -82119 -77875 -60208 -52204
9486 -52204 -53390 -80804 -74666 -64213 -54926 -65532 -83590 -67456 -57402 -57905 -59114 -68310 -61732
9473 -61732 -50133 -38578 -59605 -68423 -61351 -62540 -82074 -73369 -74277 -60134 -55052 -49121 -58952 -58428
9459 -58428 -53320 -61897 -58005 -69616 -70251 -66904 -69864 -75600 -59827 -65809 -70631 -72008 -48231 -50042
9445 -50042 -65573 -65287 -70087 -73973 -66980 -55089 -58435 -51677 -64789 -70766 -63115 -49850 -53881 -41846
9431 -41846 -25348 -43325 -33107 -28931 -7963 38159 73536 79310 80804 61634 37709 31983 7822
9418 7822 -1511 2609 17032 10141 -7990 -19963 -27628 -40842 -47833 -53058 -57047 -38297 -48052 -57928
9404 -57928 -48207 -41927 -35129 -25134 -41019 -43209 -38950 -53901 -50101 -36520 -38272 -56395 -56054 -48585
9390 -48585 -45073 -61052 -45430 -31062 -46448 -53494 -47482 -47186 -44399 -46682 -33866 -35162 -65565
9377 -65565 -69574 -63954 -56489 -56355 -59518 -64815 -59399 -59886 -48330 -44445 -25569 -27669 -20595 -30535 -11403
9362 -11403 25296 61182 48447 29002 31432 13300 -4427 11640 5570 -3453 -25773 -34146 -22849
9349 -22849 -5084 3172 -5047 -18397 -12102 -21057 -25213 -11462 957 -4141 9496 21816 14763
9336 14763 -7619 -17563 -17280 -25494 -26831 -38939 -27835 -28199 -29427 -41893 -53445 -33179 -10123
9323 -10123 -15541 -33591 -20862 -27691 -19105 -29308 -26657 -20081 -16779 -16788 -22098 -8195 2638 -4509
9309 -4509 -6977 -11402 -28760 -23893 -14800 -12160 -8689 -309 4809 6027 14830 22530 16464 -236
9295 -236 1906 12839 22662 24222 10491 24437 25318 29738 48597 51172 41527 54104 34797 25963
9281 25963 50364 57813 42966 42450 51467 68912 79079 92111 81204 62581 55384 50805 59810
9268 59810 84030 93376 115538 111982 98365 87118 50698 54440 53232 59909 70173 63014 58362
9255 58362 61792 71132 63139 65770 64580 70905 63674 62387 56334 71710 78792 92038 89765 83860
9241 83860 62905 89877 87352 76105 85536 70262 71147 80938 88293 87993 91735 108781 97513 108145
9227 108145 101846 104199 124249 143564 167360 194007 214979 224786 228490 215704 201450 191691 186247
9214 186247 206701 251218 270628 283752 309148 306388 304227 300526 286745 299635 311280 300346
9202 300346 298292 281141 291475 316776 330088 348225 363101 381358 403440 456514 492297 511974
9190 511974 525404 531280 528349 523615 519966 521392 557084 611907 675461 726890 794420 839265 849666
9177 849666 869739 893249 932459 979445 1042423 1143380 1256003 1348093 1377622 1376034 1355176
9166 1355176 1325660 1314156 1308951 1325678 1356866 1414529 1412321 1390937 1347177 1283259 1234884 1253450
9154 1253450 1308715 1333742 1288816 1167799 1037680 926443 853942 840829 847442 942709 1033173
9143 1033173 1066417 1025138 930959 796877 665482 580294 514953 470195 447811 423698 414065
9132 414065 418270 415261 398611 368744 339436 322116 294286 284444 272424 276067 291655 291078 292946
9119 292946 289719 262893 255634 211311 199484 197885 189396 195433 206605 206425 199854 195103 206020
9106 206020 194882 184326 179428 173693 159579 154668 160883 168542 167780 172072 179927 169913 157861
9093 157861 155205 158177 161748 162298 165314 147684 161957 176130 183038 187471 206425 227018 243955
9080 243955 249534 255334 268043 267062 253465 261546 285656 280262 291718 284122 287878 284048 274162 279078
9066 279078 280787 287852 285764 299449 305175 301453 322218 318257 334109 342320 345127 372053 382721
9053 382721 370595 366966 357679 341081 327046 313927 305642 313066 321232 344334 356661 388539 428698
9040 428698 456816 476393 491306 492921 521982 558514 672273 749496 781409 763064 724767 665549
9028 665549 602768 534626 478190 437978 446054 437937 426396 420873 413041 397085 380526 375360 370364
9015 370364 359676 356977 359288 359400 358359 361410 372775 358179 327488 325544 321415 322633 321664 325273
9001 325273 341740 367367 395254 416530 466532 490168 478083 464540 439797 414486 377314 363628
8989 363628 389963 415213 447662 457157 458809 460533 448757 428727 395126 393605 412829 418839 418377
8976 418377 427986 427679 434061 457241 465603 476415 500946 500567 523898 548970 585946 596683 615386
8963 615386 637560 661381 684644 701089 731258 795762 885946 957516 1028024 1083743 1145540 1213131
8951 1213131 1238962 1270312 1283735 1316153 1362249 1394935 1444163 1480812 1531070 1546923 1524002
8940 1524002 1532129 1529353 1504637 1512096 1541256 1559109 1585544 1630477 1709670 1803655 1968424 2181124
8928 2181124 2678231 3558818 4872301 5772608 5490185 4916749 4101397 3417876 3033960
8919 3033960 2905380 2918809 3036502 3165277 3304258 3549083 3963402 4557841 5084131 5313766
8909 5313766 5353035 5323567 5303374 5367453 5601283 6014671 6630759 7411013 8060984 8114623
8899 8114623 7664731 7013811 6325893 5768623 5424424 5216728 5093700 5069115 5101131 5146936
8889 5146936 5198576 5297391 5438098 5631960 5812030 5963787 6079360 6264199 6514422 6790296
8879 6790296 7205766 7910867 9053137 10486978 11555232 11909627 11882926 11904747 12435372
8870 12435372 14024013 16802410 19426188 20144563 19242453 17335094 14797767 12480216
8862 12480216 10713192 9521338 8905950 8793806 9043288 9494658 9941652 10266806 10333809
8853 10333809 10161089 10020700 10183168 10774955 11737098 12569598 13019826 13331038 13627561
8844 13627561 13786049 13750789 13897431 14161744 14216996 13979110 13298862 12109632 10730237
8835 10730237 9296444 8031706 7011749 6247877 5726537 5400634 5303282 5437276 5802559
8826 5802559 6268872 6453699 6217031 5708226 5093253 4535297 4105730 3825214 3677834 3659054
8816 3659054 3716575 3745336 3672984 3533647 3407828 3348960 3425452 3685229 4009426 4148025
8806 4148025 3992993 3637729 3246102 2890775 2635272 2497038 2483173 2590695 2782834 2847377
8796 2847377 2777422 2607740 2400788 2199215 2030130 1898462 1818463 1750114 1683904 1635975
8786 1635975 1613356 1588273 1557692 1528237 1501061 1470650 1456276 1456647 1433908 1436972 1456599 1460534
8774 1460534 1471482 1499991 1561658 1637218 1774844 1930002 2017166 1985489 1870506 1739738 1614017
8763 1614017 1533728 1513917 1561824 1632312 1726334 1816993 1805726 1695084 1579898 1470186 1373313
8752 1373313 1314997 1269077 1237456 1218981 1197282 1185852 1193406 1194373 1168189 1166087 1163541 1168618 1150804
8739 1150804 1150066 1173807 1207558 1261747 1310529 1381598 1472307 1626864 1828715 2053315 2151370
8728 2151370 2097181 1977235 1805936 1662045 1584599 1582621 1664280 1823995 1990508 2088078 2069416
8717 2069416 1914206 1718434 1526818 1371574 1266618 1209793 1199903 1190682 1219070 1237694 1250705
8706 1250705 1255510 1256488 1247327 1247392 1248484 1276405 1318896 1374787 1453499 1550447 1644106 1769415 1887013
8693 1887013 2042222 2299458 2706466 3154568 3342913 3297593 3220619 3141228 3142388 3196364 3341771
8682 3341771 3668071 4272436 4851096 4977705 4729205 4272385 3755716 3335292 3037149 2829198
8672 2829198 2672879 2576770 2521664 2573687 2665323 2716423 2733036 2767249 2772121 2751149 2716281
8661 2716281 2688153 2705095 2795068 2995501 3364864 3890069 4531162 5112471 5608143 5968650
8651 5968650 6257479 6887104 8213089 10144545 11701471 11918141 10947726 9399024 7717203
8642 7717203 6243095 5072753 4218468 3630613 3265627 3003397 2806270 2629598 2460434
8633 2460434 2329987 2227631 2149047 2084291 2042010 2015892 1999806 1984204 1961378 1952027 1951167 1954793
8621 1954793 1978534 2028475 2077527 2126441 2166623 2210361 2258452 2320770 2357626 2400694 2407587 2369808
8609 2369808 2341811 2265251 2145852 2053217 1955168 1845054 1751073 1671330 1617652 1575490 1553559
8598 1553559 1551389 1544779 1551297 1565724 1564357 1551145 1548610 1584272 1683731 1797609 1911109 1984013
8586 1984013 1990170 2001856 2017302 2020575 2046336 2084414 2143733 2245799 2383387 2420693 2393991
8575 2393991 2325570 2189702 2027915 1877892 1725934 1607913 1522155 1452316 1394878 1367410
8565 1367410 1353640 1341205 1352594 1373921 1393432 1398998 1356403 1322704 1291964 1246541 1238238 1260327
8553 1260327 1290160 1326157 1354706 1376578 1406975 1439480 1433139 1445964 1433639 1421522 1403462 1358072
8541 1358072 1344773 1348832 1384603 1422315 1432820 1412699 1363888 1338494 1313513 1247531 1180854 1148918
8529 1148918 1117869 1090048 1067524 1043831 1015047 999294 988718 991746 998544 975387 970752 983128
8517 983128 984100 997619 1007146 1026718 1044836 1078808 1136240 1176750 1225764 1266490 1328367 1411268
8505 1411268 1495173 1612181 1712426 1864604 2074777 2352285 2770390 3340710 4071413 4918473
8495 4918473 5694840 6289613 6655444 6764983 6590218 6146579 5541664 4873909 4354126 4008475
8485 4008475 3853073 3796157 3713642 3510968 3224493 2904615 2597347 2346117 2163824 2052781
8475 2052781 1961094 1899811 1886249 1870326 1880503 1895560 1926273 1966037 2008458 2065166 2166318
8464 2166318 2311786 2523433 2806673 3179133 3637857 4153766 4647660 5040176 5285400 5417598
8454 5417598 5533493 5763670 6120916 6491724 6746766 6846225 6758746 6450449 5954256 5345675
8444 5345675 4750666 4238182 3845387 3537909 3274346 3036658 2839097 2647604 2479685 2365730
8434 2365730 2271118 2211727 2198461 2238559 2302062 2401175 2545476 2769067 3026812 3327319 3589108
8423 3589108 3742684 3738191 3576857 3327415 3038314 2784294 2628859 2537015 2487950 2483858 2486653
8412 2486653 2462587 2467283 2475227 2534379 2614934 2720685 2810135 2855413 2809073 2704523 2546089
8401 2546089 2379920 2220474 2049678 1906520 1773264 1655148 1548243 1482422 1433213 1401606
8391 1401606 1401483 1418110 1474554 1558909 1645069 1789092 1946620 2152930 2387463 2600508 2676760
8380 2676760 2610679 2428457 2172032 1907852 1673585 1489339 1351783 1234028 1150437 1089497
8370 1089497 1042266 1009523 1012445 1023218 1029830 1058173 1106111 1186983 1303264 1479970 1706050
8359 1706050 1926111 2093446 2132481 2030668 1859140 1646798 1420652 1279667 1145514 1056198
8349 1056198 1009170 964763 908276 900666 893767 903398 913621 903818 908812 930497 954193 978932
8337 978932 1024782 1072297 1108203 1173991 1251890 1343975 1449953 1548760 1652675 1807191 1940461
8326 1940461 2078064 2207586 2332761 2453686 2579220 2722300 2826036 2874157 2841671 2691595
8316 2691595 2439023 2149262 1868683 1617348 1418569 1253410 1124241 1032874 963620 904961
8306 904961 853535 802468 758853 731580 703917 674241 638890 635731 633699 624277 613417 600513
8294 600513 591163 594818 583434 573912 583424 571789 571809 554539 541453 531045 511859 493913 460737
8281 460737 447712 445387 437915 430549 425919 440173 439007 449884 462718 479256 541783 633993 699387
8268 699387 701489 712035 694226 690543 664270 644088 591525 539450 483611 454696 454603 457015 475919
8255 475919 495088 511449 498267 469493 452129 429255 424663 431885 424923 413370 386861 355268
8243 355268 348329 342437 327138 316482 340417 343111 358691 391360 452686 514343 563247 567937
8231 567937 550847 489811 450651 430565 439825 446709 442441 429243 424673 413609 399461 388907
8219 388907 380925 382879 370896 345547 346220 351131 357211 335574 305899 280697 262417 250784 242034
8206 242034 244053 248170 256409 225937 253043 240776 242432 236169 240577 218526 258272 207610 250675
8193 250675 138647 653712 853536 571474 532448 436453 412424 368915 367838 315603 316448
8182 316448 288764 301854 300772 318058 292589 314783 295319 306744 311886 323425 328912 345540
8170 345540 353556 376882 370635 389596 394578 406750 419404 430273 434694 457411 453980 464327 486249
8157 486249 493590 479895 493470 473120 455161 424479 401864 370218 371386 353932 351113 371369
8145 371369 374535 366536 384933 409995 432477 462881 495059 538017 625631 700548 754525 787238
8133 787238 818882 888684 1016889 1249814 1590824 2008112 2371720 2800001 3256105 3443761
8123 3443761 3234976 2841127 2415388 2131184 2012637 1976220 1890100 1714401 1471043 1215148
8113 1215148 1012320 865767 760884 708501 665878 647054 629352 592052 540456 527791 536036
8102 536036 562545 570331 591949 647989 692081 743031 852847 981834 1154910 1407093 1647956
8091 1647956 1784153 1786224 1713703 1726333 1884042 2300452 2758795 2917049 2830976 2629874
8081 2629874 2293682 1927790 1566375 1232823 966384 786826 668317 607786 533526 501768
8071 501768 467590 434672 403628 397429 385443 377822 349523 335944 338043 326145 314948 318292
8059 318292 306410 300482 292330 293103 280487 273390 274640 268711 272684 276386 278237 297935 298186 300084
8045 300084 305821 305051 302383 298191 317476 327989 341331 338774 335209 338284 350114 365047 359587
8032 359587 343800 332436 316256 327628 310940 304055 300511 272255 256538 256744 242129 231122
8020 231122 234363 224945 231370 240856 268718 295189 292793 296201 274307 256712 226819 208650 218464
8007 218464 233917 221905 208257 210198 210572 188093 187787 192180 192071 193878 179262 160410 174716
7994 174716 188055 199646 192842 193253 179878 170008 156055 150148 143062 165121 156188 148129 135156
7981 135156 130505 119465 110186 119875 144731 164679 200424 210323 212916 184794 153334 145529 142449
7968 142449 122723 123403 115571 124844 133435 136770 116883 119851 126657 131118 138859 148883 141476 133404
7954 133404 129436 119731 108418 105734 111669 90325 89833 98727 89957 87321 74768 79209 90198 78979
7940 78979 72617 70605 75552 72381 67569 74025 65921 66979 75684 65302 61075 41327 51350 64453
7926 64453 66459 60264 61737 56094 74189 68649 57392 53543 65275 75477 74732 61711 66462 62406
7912 62406 51513 45719 51814 61635 53204 42326 42768 59199 70361 52123 49447 48131 56392 48066
7898 48066 52387 71802 74727 71336 68875 77948 73185 60439 60671 75365 71724 70732 87793 112150
7884 112150 123421 127859 159263 170746 172979 159717 143071 143766 147620 129705 119770 127432 119016
7871 119016 124732 125501 116665 122433 107899 98237 94408 103521 117558 114034 110214 112328 117416 135567
7857 135567 141508 164197 168394 191673 231790 286139 331037 361132 376774 388438 358720 368247
7845 368247 377915 404334 507367 625284 657755 641081 551579 442315 370212 308881 243576
7834 243576 222124 220736 206713 203317 185805 175035 163198 158905 127794 124975 127613 124239 130935
7821 130935 139303 140623 115634 123184 130538 152300 169586 187987 221726 253207 309437 347133
7809 347133 359028 326218 265444 260333 316578 359013 440120 512083 530560 506393 443393 351578
7797 351578 283337 232515 199267 172395 162850 161986 147044 129816 124205 127786 117671 111668 97159
7784 97159 117526 136826 126021 109902 94867 86117 75760 63298 55096 55115 53315 71947 65963
7771 65963 60488 63069 49009 48425 70140 69887 68351 68371 74512 78954 68232 91038 105027 82270
7757 82270 77536 63189 56534 51594 79474 69545 54073 75185 72786 68165 78576 73004 69142
7744 69142 54780 52636 58031 61095 39917 37516 34204 38786 35712 41236 27530 34083 42008 40675
7730 40675 55355 64845 51596 36056 14272 21600 21591 25772 41292 35309 52107 48318 40401 48583
7716 48583 48358 34167 23535 19635 28003 22296 9955 1829 9608 16526 17322 25441 16546 21108
7702 21108 15646 2875 -3814 6742 18348 40282 37015 26528 33746 36300 28870 16248 -1518
7689 -1518 2058 26030 20707 6658 17892 9990 11269 6407 11400 19046 25471 26166 13971 6149
7675 6149 11804 9594 2162 8317 -91 9204 2697 9024 18757 28300 27962 39408 16529 28341
7661 28341 8810 12617 7825 6665 16208 16420 30485 22062 -4211 2410 11163 185 4881 1313
7647 1313 7363 26288 25486 26262 31804 37963 31392 42002 48052 64126 87423 93135 81021 70803
7633 70803 37558 17754 20679 9827 -5162 12723 20921 15061 6984 7001 13925 28836 18199
7620 18199 -3496 -23119 -17031 -14026 -4 4002 2081 4184 -4596 -3174 -3464 4560 7426 19875
7606 19875 23891 15252 14817 10600 13934 27052 24100 42674 78650 90174 81007 63454 59487 38812
7592 38812 22134 14906 6265 13217 2300 -10308 2854 255 -2033 900 -1206 6372 -3738
7579 -3738 -11578 -2544 -698 12312 4644 -4412 -7944 -565 6399 12002 6917 13594 8435 13779 4527
7564 4527 -4250 2341 -12849 -10345 -13667 -109 10530 9032 -6322 -14426 -5763 -13531 -19290 -5866
7550 -5866 -6330 -1573 -1285 -2255 -295 -5130 1654 12307 7125 -2308 -17295 -16632 -21682 -7744 177
7535 177 16350 1963 -13930 -11100 24859 16698 5373 -3669 739 -7738 -18598 -24066 -3576
7522 -3576 -5254 -11380 -17924 -32161 -30463 -29721 -3668 1855 -13860 -24327 -15375 -30422 -30064 -30519
7508 -30519 -22432 -33804 -38270 -14884 -10504 -1874 -11821 -21889 -14658 371 -9355 5742 2769
7495 2769 -3272 -4154 -1995 -22492 -5457 -11166 -4144 -6404 -8908 -1343 -3076 -13131 -10574 -2782
7481 -2782 -2373 -27126 -44256 -31568 -15583 -19398 -14741 -13115 -38988 -31925 -27970 -5085 -13983 -7878
7467 -7878 -29229 -27686 -31867 -44418 -36875 -32125 -28324 -19966 -8891 -10873 -17654 -43038 -33760 -17046
7453 -17046 -10310 -30596 -30829 -19012 -10859 -17436 -30967 -22940 -8311 -8455 -16441 -25386 -30111 -29891
7439 -29891 -21865 -12264 -676 -1529 -18742 -29748 -33785 -38346 -42615 -32656 -31199 -33313 -45904 -36007
7425 -36007 -23843 -25671 -28693 -16563 -36849 -37364 -28491 -24322 -23584 -26826 -26997 -19855 -1570 -4189
7411 -4189 -30228 -25140 -16038 -12700 -12181 -24809 -21199 -15350 -17241 -12644 -25006 -39044 -30246 -31348
7397 -31348 -38867 -30874 -24651 -16167 -33776 -39195 -41973 -34865 -37477 -38356 -27865 -24581 -24679 -23259 -23581
7382 -23581 -22964 -30779 -21641 -40275 -23114 -19187 -20950 -19726 -12450 -5092 -8307 -11256 -5999 -8837
7368 -8837 -16418 -34580 -29229 -29468 -29934 -31464 -28570 -21727 -17160 -34937 -35203 -36816 -22586 -13483 -18783
7353 -18783 -21166 -15919 -16081 -17525 -4686 -18883 -13055 -3400 -7366 4450 33472 37978 70403 96847
7339 96847 72403 51103 21433 21747 2640 -3494 -2206 -11278 -14824 -30846 -21194 -11049 -7579
7326 -7579 -16195 -24734 -35292 -37227 -32599 -27911 -21656 -14123 -14898 -21088 -30579 -19170 -23266 -14091 -18165
7311 -18165 -25605 -16368 -4945 -11089 -5142 -27611 -17564 -18116 -25984 -25147 -13494 -8900 -5215 -17013
7297 -17013 -36115 -36268 -23046 -21647 -27118 -18473 -16727 -21793 -24721 -15994 -11525 -23949 -27547 -41748
7283 -41748 -6816 -15933 -5194 22795 52640 69152 66568 56259 53574 33846 11823 16061 7203
7270 7203 1650 -16575 -23399 -19833 -6507 -15508 -20888 -23051 -33020 -40417 -36509 -17353 -16499 -191
7256 -191 -10009 -18359 -27417 -29423 -30301 -14755 -24357 -24684 -33007 -35648 -28983 -25528 -19529 -19831 -29568 -29013
7240 -29013 -15688 -27526 -38831 -37281 -32840 -32947 -24839 -32571 -44929 -32206 -29940 -24383 -28884 -27308
7226 -27308 -44795 -43139 -31886 -20761 -13704 -27078 -26791 -29363 -32518 -38912 -48207 -42577 -30534 -30603
7212 -30603 -29768 -35625 -24702 -32274 -16255 -5942 -12784 -25714 -22550 -23172 -22293 -10892 -24554 -44825
7198 -44825 -29123 -28756 -33048 -33645 -31560 -30873 -24733 -18823 -29897 -34968 -25932 -33617 -23860 -22433 -27091
7183 -27091 -23355 -23118 -14781 -19317 -36292 -25535 -34300 -20093 -13435 -9182 -14052 -20873 -32427 -29672
7169 -29672 -40144 -39718 -27375 -25130 -37313 -36708 -33428 -45099 -32486 -29156 -21007 -34489 -33193 -22798
7155 -22798 -32190 -26383 -65935 -50435 -39540 -23870 -14652 -19758 -24945 -18968 -30392 -38039 -34152
7142 -34152 -23950 -8976 -33040 -26651 -17640 -33196 -42482 -35317 -24648 -34782 -28492 -22531 -28888
7129 -28888 -47249 -31091 -23705 -39617 -37367 -40165 -62385 -58012 -45454 -40430 -41644 -26183 -28868
7116 -28868 -26744 -27613 -38074 -18535 -18964 -6067 2446 -12807 -6964 -19548 -15449 -24180 -16050 -12276
7102 -12276 -32870 -41159 -35998 -37388 -22275 -18262 -22650 -26941 -37713 -39377 -35685 -17965 -32933
7089 -32933 -46348 -50679 -45833 -30250 -11434 -22854 -22723 -26685 -46121 -44394 -26309 -26196 -32469 -58286
7075 -58286 -47386 -44309 -31367 -34779 -24357 -27769 -18504 -30270 -34868 -38809 -46050 -49011 -38178
7062 -38178 -57002 -51691 -42326 -38115 -40406 -46104 -35719 -38617 -33706 -26877 -29991 -9213 -24744 -34561
7048 -34561 -48303 -46549 -45877 -31240 -32387 -34049 -28684 -43765 -48524 -45370 -35685 -28926 -25231 -27670
7034 -27670 -42636 -47482 -60414 -47533 -44108 -28546 -32442 -30119 -31218 -39665 -36607 -43169 -43264 -33893
7020 -33893 -36250 -40459 -26954 -15460 -17387 -41499 -57344 -56323 -51532 -39566 -44902 -53843 -56775
7007 -56775 -58569 -36784 -32896 -42121 -37005 -22017 -14082 -13173 -14320 -27218 -16369 -23400 -48112 -44320
6993 -44320 -45566 -34012 -33975 -32013 -43515 -46307 -38072 -30462 -45148 -30897 -21457 -30819 -17336 -22209
6979 -22209 -32970 -37631 -36432 -34736 -39299 -37671 -22791 3592 -1162 6518 1411 -5664 -11562 -23493
6965 -23493 -30262 -32158 -31311 -23486 -26525 -34472 -35136 -24098 -41934 -40898 -48049 -30842 -34324 -37167
6951 -37167 -40025 -50130 -42114 -39959 -31861 -29489 -28261 -24159 -37779 -38135 -12485 -16442 -38274 -51312
6937 -51312 -47696 -51836 -38129 -34215 -39121 -21034 -16088 -19338 -16382 -12779 -31810 -34958 -26106 -26096
6923 -26096 -42265 -51025 -47934 -26791 -18805 -23347 -43702 -40742 -39044 -32073 -24937 -23115 -49417 -63688
6909 -63688 -66379 -48326 -39074 -40484 -39494 -34089 -36458 -37196 -56196 -64977 -74601 -62127 -58864 -55103
6895 -55103 -39010 -27774 -22631 -30479 -22928 -22687 -31558 -52325 -38835 -44424 -53475 -52350 -43441 -41119
6881 -41119 -43665 -50041 -43413 -19892 -32199 -40594 -37942 -33132 -41849 -36007 -28763 -26627 -27415 -27288 -39874
6866 -39874 -48226 -51859 -32751 -4907 -6449 -18071 -35615 -33345 -40544 -44737 -37600 -35080 -30162 -29396
6852 -29396 -45665 -34274 -17485 -22257 -44189 -58395 -54000 -52124 -40284 -34130 -26735 -12292 -31199
6839 -31199 -38877 -49626 -38800 -50355 -43765 -35879 -35326 -49406 -57813 -45982 -47440 -35330 -28825
6826 -28825 -46092 -51495 -49885 -25395 -24198 -18207 -24339 -37521 -48087 -56346 -41238 -36652 -18198
6813 -18198 -10300 -40961 -50674 -54258 -46596 -49530 -19905 -33342 -38709 -49942 -59492 -50528 -31366
6800 -31366 -39209 -50122 -47389 -44269 -45362 -49509 -45594 -34680 -35285 -22942 -19667 -52601 -66512 -45305
6786 -45305 -23289 -34508 -39576 -53624 -55851 -39919 -38653 -45989 -57482 -51616 -48776 -41215 -46834
6773 -46834 -36600 -39550 -50165 -50454 -35072 -24853 -29175 -45777 -47122 -51845 -52682 -52218 -40489 -24410
6759 -24410 -39563 -60959 -52836 -55306 -37882 -29738 -31629 -17392 -8886 -17261 -39531 -28868 -42921
6746 -42921 -44966 -37133 -14343 -14500 -30448 -21083 -25897 -38832 -45886 -32712 -17005 -30569 -36316
6733 -36316 -39141 -43755 -24061 -22784 -40257 -15455 -22595 -35769 -34410 -37794 -70275 -72703 -61061
6720 -61061 -58409 -51910 -53647 -48711 -48860 -30143 -36845 -59218 -34146 -27191 -31303 -32011 -14037 -42791
6706 -42791 -48354 -33662 -23255 -53054 -51365 -53372 -46057 -58799 -62157 -61343 -62695 -43029 -28517
6693 -28517 -46075 -54379 -51384 -52159 -51803 -38749 -35513 -36670 -39124 -31637 -48944 -60080 -53587 -48405
6679 -48405 -61931 -54953 -55870 -54343 -53013 -39890 -33944 -43007 -52263 -46621 -35892 -26002 -21614 -38392
6665 -38392 -53622 -59392 -48135 -46986 -49394 -59377 -62244 -44657 -29662 -36399 -46521 -27793 -48494
6652 -48494 -64284 -62088 -53612 -40400 -29615 -31813 -46302 -45321 -52202 -45024 -36959 -42758 -46863 -30570
6638 -30570 -30167 -50903 -40397 -41512 -47576 -46401 -49329 -55589 -55137 -60640 -64525 -46549 -56322 -48211
6624 -48211 -51307 -55986 -55263 -59072 -43827 -32720 -35722 -36871 -36682 -32801 -49350 -39388 -29666 -35837
6610 -35837 -50002 -51459 -44460 -43494 -48076 -39879 -34108 -25077 -29973 -29523 -43424 -38566 -46631 -48485 -32193
6595 -32193 -30502 -32227 -32800 -38716 -39268 -23864 -29330 -33866 -28187 -31053 -33634 -30992 -38947 -35827 -33180
6580 -33180 -39960 -28491 -45117 -33757 -35305 -24514 -37144 -48153 -49799 -42732 -43971 -29688 -31390
6567 -31390 -10461 -15137 -23745 -22635 -18126 -12640 -4545 -8721 -6268 -15255 -7 -7586 -13004 -11864
6553 -11864 -12324 -25885 -21371 -16762 -11216 -12227 -4126 767 6795 16815 18142 13242 7641 9817
6539 9817 17241 7747 -4856 -5750 -9675 -19923 -33085 -22096 -6447 -3488 -8515 -15843 -15747 -21515
6525 -21515 -31462 -41917 -41061 -32515 -40691 -44833 -47314 -45655 -51529 -49496 -39396 -27618 -29619 -25756
6511 -25756 -34977 -49670 -46376 -34940 -42205 -34196 -34453 -29992 -23905 -30642 -30995 -16211 -24864 -46332
6497 -46332 -45660 -38542 -36138 -33404 -43466 -31921 -40390 -40749 -41516 -42798 -49180 -31665 -36535 -27570 -32422
6482 -32422 -42521 -64099 -51678 -41827 -38184 -48169 -40578 -37575 -31199 -22652 -28102 -40001 -37940 -26768
6468 -26768 -29660 -50901 -38386 -50027 -56156 -44232 -44903 -46907 -45106 -54642 -43208 -40342 -44763 -41385
6454 -41385 -29955 -41195 -33731 -33819 -37391 -29919 -34305 -40508 -37019 -32596 -26126 -36962 -54454 -55994
6440 -55994 -45709 -40649 -36189 -26914 -26166 -33502 -34381 -30961 -35974 -31715 -22425 -39506 -35790 -17706
6426 -17706 -15316 -12295 -5389 -1220 -22723 -25884 -20291 -36256 -27979 -25333 -15369 -17867 -22019 -27394
6412 -27394 -40432 -35791 -45552 -55747 -40882 -35695 -28133 -27669 -10484 -30592 -52097 -37349 -57216
6399 -57216 -52307 -42755 -38933 -28018 -33829 -23451 -22032 -31448 -26871 -30446 -26291 -35937 -42395 -42146
6385 -42146 -43075 -17600 -8347 -21498 -6738 -7452 -10409 -8372 -3242 -14394 -8956 -21145 -6604 -13882
6371 -13882 -11118 -11156 -2263 -12908 204 -5509 -18342 -14605 -21338 -6156 6855 -104 -9147 -14915
6357 -14915 -5155 4216 17685 1085 -2329 -13001 645 13286 5029 -1947 24131 25744 21284
6344 21284 21634 6626 23410 34143 33105 35204 33512 21665 25511 36399 17600 18186 11535 20945
6330 20945 13667 27052 20772 24225 18108 29431 32643 20904 18688 27003 32357 29809 11253 23443
6316 23443 14326 24422 30483 47554 46236 32659 37179 37415 55340 40903 24710 29542 39616
6303 39616 49918 38945 30733 26318 23337 10579 23086 31568 33935 47844 43605 33447 35702
6290 35702 39814 46789 53658 46903 58940 58763 47098 60880 75299 72680 84588 73086 82713
6277 82713 70938 72687 75967 98065 93172 99733 93733 91169 106018 112612 123216 129045 127351 131574
6263 131574 123848 129833 127683 156117 164617 163486 164638 142403 134956 147342 147204 142252 150437 149942
6249 149942 132918 149356 151123 139871 137504 140549 146775 150798 152190 169118 165579 183222 187901
6236 187901 203316 222422 233060 241398 262326 279585 279859 272834 280929 278435 273632 253953 265330
6223 265330 264912 242390 224806 227815 219233 207321 207954 236167 230479 232938 244997 256389 265609
6210 265609 287903 289693 310376 290244 273189 283718 277777 258246 258871 264109 257200 241313 259733
6197 259733 283393 287323 271271 254591 243192 223772 209582 208697 215080 213434 216598 234682 256523
6184 256523 258199 265678 278707 273109 258106 254212 254808 252232 251598 260302 263370 256996 261483 271605
6170 271605 282040 305011 298726 287837 286902 279701 270087 273045 282290 288803 276659 285998 283430 278326
6156 278326 285004 315761 315885 322342 338533 331905 328854 343046 325179 326178 314166 324361 335245
6143 335245 351286 347881 332042 329856 331150 342049 344244 346246 349417 366929 375661 377907 410524
6130 410524 440407 467563 484945 506377 508937 546338 552583 556761 578455 602468 601344 614272
6118 614272 622064 662015 695785 713958 773560 819148 825952 830221 820136 797565 795243 800174 798601
6105 798601 822220 852599 905391 933914 950026 958917 966930 942858 929334 903679 856721 828111
6093 828111 788919 746883 696096 653302 626974 590455 566676 538285 547232 550636 542146 534693
6081 534693 559453 554862 570447 549235 582893 596234 614045 635873 618062 596343 601148 612936
6069 612936 609338 617532 635793 666060 692399 726140 721884 715014 683820 661411 668527 682196 669854
6056 669854 679545 719294 736699 757608 773950 809429 861761 905019 944529 993278 1051620 1107013
6044 1107013 1193610 1252929 1287708 1309341 1314996 1261729 1208115 1156787 1134049 1111613 1119767 1153579
6032 1153579 1188142 1204139 1200291 1158762 1099439 1040393 978900 924176 878168 851267 840124 816569
6020 816569 825307 822710 833677 836768 837459 839267 829387 816202 797212 780712 789692 760434 752453
6007 752453 728850 722737 714676 717265 691340 670250 661537 663304 655243 665472 655788 665969 679154
5994 679154 704407 716969 746116 755641 777220 805399 848394 882464 924052 971699 1026642 1077297
5982 1077297 1105472 1111687 1110640 1094017 1079251 1070996 1057463 1034696 1025226 1020842 1009999 1037354
5970 1037354 1072847 1099312 1137109 1192765 1250793 1269068 1282467 1291997 1276235 1273146 1284297 1280914
5958 1280914 1285740 1326350 1393592 1429672 1454457 1446239 1426718 1370943 1299944 1223260 1166468 1121632
5946 1121632 1084097 1071371 1031845 1021553 1039586 1072726 1095211 1132016 1172895 1176802 1182851 1172515
5934 1172515 1143668 1136178 1159780 1202651 1242401 1325506 1393374 1481161 1620394 1777785 1926184
5923 1926184 2074372 2184550 2238518 2225390 2182417 2135658 2087407 2065694 2061760 2055836 2055192 2064928
5911 2064928 2091113 2112183 2123447 2124910 2148986 2163938 2182712 2193451 2241574 2274554 2316121 2365548
5899 2365548 2457464 2582858 2749146 2944110 3176850 3384423 3581832 3708145 3766438 3782290
5889 3782290 3795828 3797144 3816443 3795053 3775719 3722892 3623731 3484162 3307402 3121383 2981125
5878 2981125 2895370 2805382 2728186 2679820 2628463 2604455 2576131 2579951 2587551 2624529 2646682 2690769
5866 2690769 2749222 2841449 2958838 3103215 3257919 3441448 3583863 3701505 3738250 3694117
5856 3694117 3586081 3429636 3265157 3112582 2979495 2866224 2788334 2735546 2684620 2637657
5846 2637657 2596181 2547176 2514998 2493225 2451676 2424575 2404814 2384783 2367866 2343850 2324728
5835 2324728 2320316 2313508 2297415 2295630 2283828 2294183 2298203 2320736 2331947 2332076 2352847 2370981 2390893
5822 2390893 2401000 2394857 2376941 2350780 2300578 2256571 2205657 2146493 2131848 2123061 2108411 2121108
5810 2121108 2133490 2140640 2169490 2191779 2222956 2269964 2328085 2397453 2484999 2604992 2713572
5799 2713572 2818143 2937821 3012477 3050320 3021180 2970801 2879420 2789532 2689391 2609090 2505749
5788 2505749 2425303 2358822 2289601 2213069 2160147 2105349 2066691 2031938 1999015 1997043 2042759 2099561
5776 2099561 2177331 2250679 2327813 2345752 2343666 2297671 2272774 2231780 2206907 2157112 2122822 2098937
5764 2098937 2072714 2035720 2022729 1999197 1984539 1985526 2014809 2064506 2132920 2214991 2309366 2378660
5752 2378660 2457827 2527108 2608641 2672693 2743686 2793422 2852785 2868788 2838209 2778061 2717022
5741 2717022 2679827 2654017 2607350 2582217 2555865 2520113 2461470 2400017 2331883 2295644 2281881
5730 2281881 2272339 2293433 2337133 2396735 2436611 2448734 2448966 2464071 2461226 2500443 2537905 2569707
5718 2569707 2539816 2448213 2336342 2210727 2141837 2069604 2013721 1989341 1977236 1999028 2024677
5707 2024677 2051286 2065244 2043373 2000008 1950557 1882553 1828934 1784704 1753731 1706574 1669393
5696 1669393 1627865 1580348 1535078 1499973 1480947 1468345 1437932 1432479 1440434 1454400 1472050 1533151
5684 1533151 1576138 1576829 1555181 1529010 1466746 1415930 1384488 1352213 1330314 1344861 1354325 1370363
5672 1370363 1391604 1399664 1426287 1422840 1408711 1404414 1387114 1400359 1363835 1339099 1299697 1261450
5660 1261450 1255706 1280578 1270739 1270197 1296571 1350121 1412960 1497805 1559337 1639876 1642322 1603190
5648 1603190 1537555 1495384 1468837 1450397 1433063 1449773 1462079 1494084 1525082 1577793 1616324
5637 1616324 1661695 1689969 1729848 1751237 1794009 1846068 1874324 1836379 1783661 1693462 1611908
5626 1611908 1533933 1480031 1445317 1434383 1429689 1446980 1442994 1466035 1476930 1511309 1561289 1590326
5614 1590326 1644556 1696231 1729377 1733048 1736626 1722807 1685952 1675252 1658444 1659416 1672930 1673784 1661981
5601 1661981 1654566 1636573 1605818 1550416 1514343 1479812 1453979 1431354 1415902 1402422 1379841 1376303
5589 1376303 1359043 1351117 1330425 1326867 1319200 1317520 1314741 1316821 1310046 1333193 1321181 1344228 1346954
5576 1346954 1349939 1355934 1361585 1370923 1383038 1406366 1423546 1415398 1420590 1391915 1399225 1396534 1379784
5563 1379784 1374714 1343323 1303861 1282134 1245907 1252562 1227737 1221442 1207421 1224766 1216646 1238048
5551 1238048 1251279 1277952 1301372 1351586 1390783 1446449 1464289 1481804 1484398 1490832 1480106 1454301
5539 1454301 1396792 1363822 1332241 1300030 1265741 1266605 1256422 1257782 1255005 1243944 1222804 1252191
5527 1252191 1286663 1321974 1350361 1409008 1455226 1475725 1464293 1466910 1428675 1394259 1355349 1327245
5515 1327245 1327853 1336550 1326331 1348963 1361302 1351565 1338999 1342266 1356182 1375361 1391363 1392183 1390467
5502 1390467 1392830 1392343 1414101 1459112 1523941 1564389 1567453 1583639 1556980 1545525 1530425 1518975
5490 1518975 1489413 1497225 1507892 1563345 1634926 1668507 1677264 1671802 1669794 1646961 1631752 1623464
5478 1623464 1631953 1672966 1700814 1698736 1639436 1601382 1548160 1518523 1493649 1490620 1485288 1492347
5466 1492347 1524244 1566325 1620199 1673998 1717822 1781068 1820361 1853025 1850267 1840410 1797460 1749925
5454 1749925 1709083 1669071 1655450 1626365 1579601 1554208 1526037 1494190 1476204 1443289 1415942
5443 1415942 1402140 1368498 1335902 1328946 1318419 1297522 1302747 1272356 1265148 1268493 1279942 1277526
5431 1277526 1291612 1301949 1323337 1289432 1267109 1256788 1244130 1225342 1224684 1212362 1233434 1223456
5419 1223456 1235803 1245479 1270241 1267119 1266178 1258422 1269448 1251292 1248142 1243404 1263352 1283788 1302007
5406 1302007 1321421 1350015 1396092 1433153 1448971 1481423 1486894 1524807 1577558 1611914 1648436 1708558
5394 1708558 1747192 1803757 1842648 1906482 1963158 2032939 2105020 2179650 2253314 2350858 2469865
5383 2469865 2605170 2770618 2954234 3195800 3489088 3887783 4479318 5334747 6408365
5374 6408365 7462399 8039365 7894176 7207726 6255782 5332312 4546356 3962577 3601232
5365 3601232 3373986 3253894 3185020 3202859 3240888 3326701 3486348 3731005 4067516 4527213
5355 4527213 5105588 5719101 6256310 6543564 6512297 6221191 5768139 5245284 4724467 4251752
5345 4251752 3851956 3508919 3209805 2991058 2810108 2699706 2599664 2525770 2482307 2438216
5335 2438216 2361082 2310913 2262857 2227810 2195870 2201207 2182230 2156746 2112620 2083229 2065082 2063001
5323 2063001 2033993 2014872 1991280 1994415 2007962 2075770 2129265 2159696 2121321 2062872 1982189 1908991
5311 1908991 1817544 1750217 1710173 1679921 1639387 1629276 1621355 1617551 1597878 1584523 1543364 1549433
5299 1549433 1544585 1554565 1547510 1553281 1558119 1564215 1581811 1588957 1601257 1632282 1642454 1658024 1650924
5286 1650924 1660515 1662282 1678988 1640584 1594452 1542457 1498393 1472032 1459966 1420162 1405342 1394799
5274 1394799 1389406 1375835 1363139 1338049 1348826 1358577 1360919 1362730 1358570 1349643 1359974 1362923 1371420
5261 1371420 1398877 1414411 1453674 1456609 1448159 1436753 1413349 1425375 1446763 1452599 1481089 1509335
5249 1509335 1522098 1535944 1535235 1534925 1508326 1507584 1524899 1549669 1569317 1564760 1590985 1610353 1637141
5236 1637141 1624481 1606676 1577959 1576951 1582277 1602815 1609352 1634555 1651417 1667469 1653019 1651437
5224 1651437 1642188 1628648 1611272 1621101 1620394 1640816 1640793 1630927 1594685 1576618 1549776 1540241 1523431
5211 1523431 1518551 1478385 1462883 1475661 1500156 1488597 1483648 1459467 1421668 1355796 1320689 1287189
5199 1287189 1261610 1255086 1271816 1259543 1265195 1249613 1238781 1232501 1205783 1177536 1171912 1154537
5187 1154537 1170433 1172345 1187187 1187937 1175743 1156749 1144497 1113164 1096951 1044080 1030285 1016617
5175 1016617 995549 988513 993725 983280 997891 987077 978474 950570 934316 896382 896124 885232
5163 885232 870083 852491 870535 860992 865888 865938 862560 850877 845066 842787 836354 834049 819224 806490
5149 806490 810909 801448 783812 782630 796559 799962 792588 796329 785846 780544 767759 761032 790777
5136 790777 781261 764615 766858 752638 748586 721142 714590 715728 695047 687996 691131 690200 676581
5123 676581 667025 661410 655162 648719 617142 605762 603906 608435 591821 586883 581740 577114 574246 590623
5109 590623 575823 564707 557831 557961 553650 551154 528145 533049 530377 551081 542276 551582 566152
5096 566152 585751 595477 651458 665079 649559 600912 571264 528320 493985 474477 475326 443571
5084 443571 442007 428416 449218 453109 472431 463627 456935 430144 427416 420671 435171 441102 445266
5071 445266 454566 490961 519157 557453 555922 567269 530240 485048 444856 436270 411123 405077
5059 405077 386726 392643 386875 383444 391764 393224 369532 370499 351863 343862 336171 344078 334229 337721
5045 337721 343518 353323 337362 341246 325708 337698 326748 326392 319346 320317 324902 339275 337562 327314
5031 327314 326900 341614 356921 344846 342369 345852 331140 328237 311784 308905 307013 304326 298847
5018 298847 311394 321474 323714 337128 341401 345063 349831 352494 337951 341924 335646 338271 339292
5005 339292 340578 330899 320132 305718 309504 303115 318277 325679 324015 320878 346972 339440 340518
4992 340518 339209 351066 331971 333042 337263 342799 344354 366776 383602 393011 387371 400749 398128
4979 398128 425795 449951 509206 564643 678452 757922 807890 795964 764337 700619 666654
4968 666654 603877 601883 600910 619812 617770 652884 661346 706062 721982 758831 791147 865751 921535
4955 921535 1030980 1118730 1175424 1186102 1163090 1062709 975178 842758 733659 651849 613877
4944 613877 577140 577227 564375 561692 548618 554883 539090 554000 569375 622505 698219 752151 724569
4931 724569 669703 584876 523679 463842 432139 409667 425386 414251 407018 401925 393497 375586
4919 375586 380317 368010 379752 401470 423784 408668 402413 412642 424135 433119 450653 471257
4907 471257 469877 484247 512844 545388 576086 604468 614685 630059 672036 695404 720545 739549
4895 739549 729905 756216 738333 719950 695618 701805 674833 655654 636291 629315 602288 604762
4883 604762 599357 602046 562529 514946 451668 453232 415991 392567 363619 380887 345594 364885
4871 364885 337094 332719 330079 344346 346285 338489 318030 327524 317420 321874 288743 300336 276173
4858 276173 279273 277639 283772 264437 272353 245151 227946 223482 233369 237754 250272 252268 255852
4845 255852 239464 246047 220854 219295 223167 249403 240087 265654 257393 251435 240947 247166 227174
4832 227174 222882 206891 213590 220013 232140 208952 230354 219091 238053 217211 245041 251462
4820 251462 264334 232876 233297 242386 247988 251514 258900 251885 264213 254354 258942 274253 275506 262036
4806 262036 264143 273542 290244 297057 325874 381819 450911 526718 606284 625031 610204 553117
4794 553117 495337 438665 403368 382883 393082 423119 460238 542614 599958 615128 577253 524691
4782 524691 477412 464976 429323 433680 459590 506227 547766 557553 512491 463249 408371 378244
4770 378244 342198 340733 331138 357966 396563 466167 507759 498663 445204 404652 328320 291300
4758 291300 245825 234484 211831 228108 201583 206992 181972 174614 173580 185768 170422 166353
4746 166353 149558 180084 173678 188047 169649 195656 221463 267536 255766 286886 266040 280611
4734 280611 251708 245304 223984 220411 212753 235710 215360 230964 216830 240567 242462 271403
4722 271403 253269 270858 295178 307073 327104 369294 369079 373693 351137 342910 293389 274148
4710 274148 236221 247001 228629 236413 217115 236679 233463 246521 246910 262709 291790 330636
4698 330636 337987 332111 302828 308811 301212 301384 299029 308784 330164 366664 380777 440514 501012
4685 501012 535276 557959 579744 578049 574263 539779 500962 467405 436843 411630 380869 343353
4673 343353 336696 326042 312888 321720 321539 316300 316103 330890 334903 330245 299232 285353 274261
4660 274261 274184 265497 266131 260902 280743 304267 314633 289880 280828 252271 253105 237964 248607 229289
4646 229289 231517 199817 214913 210544 219693 184725 205333 212858 229045 196511 189143 194134 235415
4633 235415 206038 226947 209366 203345 194564 214373 195378 240205 238533 254245 241202 253970
4621 253970 225493 278804 268577 309589 282370 294513 267295 288521 283197 280739 246425 258624
4609 258624 241707 259789 243359 286090 287406 328143 320840 331744 310758 324833 287242 283329
4597 283329 269789 286769 272924 293355 274187 283524 265202 271439 260634 279252 267056 300780
4585 300780 282007 294396 286759 293460 270814 264130 229394 226641 217669 209538 227305 270069 317900
4572 317900 360760 378630 401967 408006 430680 407981 407688 403794 421586 442032 456189 488489
4560 488489 535829 567391 609637 658535 731235 866203 1045541 1291227 1573598 1943940 2173410
4549 2173410 2295689 2363037 2175156 1905236 1621216 1273349 1035575 844756 738706 647216
4539 647216 599472 565123 563015 541841 565660 562147 554535 498077 498102 476014 485727 457486 439733
4526 439733 398325 432806 405054 411064 392322 436192 442723 508678 520971 551799 521889 539326
4514 539326 526706 591052 595127 651610 629402 669641 637557 677004 661880 685133 680102 715370
4502 715370 663076 667207 619160 656338 616849 617667 590587 613391 540753 555570 530119 546482
4490 546482 514981 528424 456472 434475 381336 393731 374512 438283 450672 530440 565069 651712
4478 651712 683807 736660 706991 718617 699581 732864 721986 784814 746304 764019 759240 788093
4466 788093 791316 784116 757924 761518 716803 721622 688260 686357 662108 665155 699214 757417 776241
4453 776241 818563 819049 794929 760798 765455 772458 793966 789701 814588 838279 865483 913449 941815
4440 941815 949184 953810 981874 973403 968959 943106 908748 824267 719213 592992 494856 410221
4428 410221 482900 605817 801328 940010 1076090 1118338 1166949 1162790 1209932 1176826 1193785
4417 1193785 1145501 1114655 1009386 968360 851406 845747 795210 841964 811569 873681 875759
4406 875759 925591 905051 953040 908972 1005469 997140 1091607 1094693 1214108 1230740 1327962 1310272
4394 1310272 1352610 1299529 1319462 1228436 1240345 1178559 1233902 1203814 1295830 1292677 1373994 1308773
4382 1308773 1372449 1328386 1432887 1410976 1506911 1478807 1565282 1556350 1636691 1553302 1592662
4371 1592662 1467341 1446920 1347545 1390195 1407967 1607217 1738158 1902498 1888614 1971617 1934618
4360 1934618 1970659 1886536 1863527 1775577 1783530 1694599 1747258 1750838 1879228 1907857 2000829 2025174
4348 2025174 2148310 2181087 2258386 2213819 2210718 2167668 2232708 2217899 2319624 2423564 2683146
4337 2683146 2882183 3001831 2974210 2939025 2839030 2718065 2598270 2524099 2479904 2534844 2664310
4326 2664310 2801066 2827215 2746609 2738361 2759972 2840520 2889627 3021874 3073228 3174914 3315869
4315 3315869 3594307 3786052 4090451 4230757 4390108 4450028 4654202 4750994 5069641 5241587
4305 5241587 5438807 5386840 5451132 5297260 5430656 5411796 5780207 5859483 6147408 6415335
4295 6415335 7145411 7729002 8765589 9349517 10015270 10213192 10754882 10793267 11250631 11354633
4285 11354633 11954018 12105566 13113631 13782526 15355449 16488515 18347330 19554990 21803674
4276 21803674 23994631 27014386 28976958 33211964 37222163 43876179 50687042 61181544
4268 61181544 73675510 94438860 125070931 196637189 316899497 471693075 524146892
4261 524146892 465663503 390691024 281755976 190060082 128311773 91573135 68284788
4254 68284788 57261581 49415266 45294961 41612490 39305467 36789712 34490930 30733526
4246 30733526 28029764 25101370 23280174 21611633 20793563 19738148 18919536 17758132
4238 17758132 17004383 15875336 15100393 14144892 13446964 12635078 12380805 12209628 12381225
4229 12381225 12412223 12447260 12130579 11958047 11643056 11332141 10970964 10579869 10066424 9575290
4219 9575290 9117674 8895796 8690322 8558206 8428271 8233754 8014982 7847310 7704600 7549293
4209 7549293 7515447 7414343 7325039 7224015 7164441 7055025 7043935 6946953 6820814 6534597
4199 6534597 6369294 6199197 6172485 6077635 6046922 5857399 5757904 5549277 5430797 5243358
4189 5243358 5199235 5105828 5160990 5100668 5115641 4978849 4911674 4769029 4694580 4459845 4373558
4178 4373558 4176331 4168039 4077478 4121853 3999643 4048785 3998100 4080179 3994649 3992095 3857990
4167 3857990 3831226 3622320 3557244 3403914 3371759 3212731 3177524 3082030 3178006 3166023 3302676
4156 3302676 3248247 3277358 3105603 3014695 2800345 2714853 2575044 2610866 2529709 2549419 2455390
4145 2455390 2509167 2440892 2479396 2369216 2356493 2272315 2295369 2203936 2207956 2156115 2196104
4134 2196104 2111417 2097327 1976429 1952804 1862090 1890018 1857106 1900058 1902592 1965116 1949745
4123 1949745 2000280 1991647 2027133 1995380 1998599 1960989 1956320 1895274 1880137 1823816 1839911 1777465
4111 1777465 1710169 1592826 1490503 1392437 1316888 1228439 1193553 1163596 1167293 1126296 1099246
4100 1099246 1101968 1165375 1298587 1471551 1616620 1693250 1667334 1582021 1447595 1301617 1210390
4089 1210390 1102979 1047765 1025893 1021555 1015448 1020197 1015208 1074431 1133456 1177310 1143561 1139576
4077 1139576 1106986 1104807 1061583 1051326 1003989 1018174 976298 1012583 1016889 1050659 1021742 1048917
4065 1048917 1025826 1043219 984771 1000851 977698 997451 946744 983792 980376 1019676 959741 981270
4053 981270 953554 966970 932662 942425 872735 877848 847577 882623 871657 926251 932280 1011152
4041 1011152 1012444 1080947 1078198 1125523 1039121 1026752 964202 974871 939241 972437 929411 928052
4029 928052 892489 938679 910811 907381 871967 882581 875098 899986 875989 913758 890835 939591
4017 939591 936469 939292 929740 955242 932481 953249 948311 986286 959890 964421 913044 911366 930082
4004 930082 950907 949159 970175 961624 985906 981642 973696 948158 938054 943239 951629 925242 919945
3991 919945 911479 937643 946551 954959 961543 999420 999570 1017848 1048921 1101046 1179763 1278081 1397555
3978 1397555 1560484 1747928 1989085 2294474 2573358 2686324 2791261 2741541 2478425 2235106
3968 2235106 1904512 1601339 1344536 1172939 1042806 971171 905610 885201 852174 836481
3958 836481 805556 805609 747814 722441 662136 661218 652483 690549 702641 725205 712963 733229 690167
3945 690167 683544 661909 672614 619848 602207 569334 576347 547989 576696 557689 550499 535738
3933 535738 563993 531235 526541 500682 520943 494812 507248 492036 499698 466377 473903 454701
3921 454701 463673 441637 467359 451571 476054 449057 463204 441718 451306 426589 427374 401041
3909 401041 413907 378981 396389 372129 405726 396017 392303 369046 385924 365400 409327 384774
3897 384774 389120 379452 401628 383370 373597 346728 365544 383733 398763 389968 402898 405948 413910
3884 413910 390213 378816 369904 383483 356028 369358 348532 344018 341185 348134 371769 355079
3872 355079 333584 322163 327757 330319 331214 341185 349995 366640 361149 355079 349701 338424 340308 326616
3858 326616 342351 349589 352389 352298 374780 363724 374113 362633 374074 371390 370124 354785 339085
3845 339085 323373 330459 334570 359403 358998 359971 347970 341627 321835 349871 335739 345165 347516
3832 347516 361683 359680 373898 345221 354274 336150 335467 340552 357562 345443 369982 355009 366304
3819 366304 361774 375034 355374 369319 355269 367686 347627 354219 309174 265717 239849 277046
3807 277046 306496 344351 346107 373577 365723 372471 338866 350344 318997 318270 328006 350046 325072
3794 325072 351709 333685 344166 317874 342608 344747 354710 350681 359836 347467 373900 376802 401756
3781 401756 398679 406296 369018 391434 384269 380347 376825 376125 348347 349832 346243 355067 349141 351326
3767 351326 349641 359665 332801 339121 355225 343565 339225 340643 335807 342095 330394 339003 335111
3754 335111 317942 324023 306402 306744 304361 317189 336001 333803 326570 338294 333535 347898 366117
3741 366117 361509 344912 363766 357348 368339 378433 378731 357273 341467 327920 341545 346691 359483
3728 359483 352174 355160 357384 373648 380409 408431 394901 382426 368419 368985 373658 367487 366764 363346
3714 363346 347563 365958 364184 372642 366254 362297 356682 366447 340274 372752 367158 379801 373799
3701 373799 389528 380438 399030 399319 420941 428597 430025 438835 461756 438588 451676 429570 442922
3688 442922 430916 443619 429392 442195 434776 438009 423322 439817 427326 424147 416323 432552
3676 432552 444409 450156 445712 461610 447268 450996 437670 447309 434556 444034 436934 440606 435196
3663 435196 430244 416623 422792 412031 415251 397399 407235 408154 430660 415755 419624 402738 413300
3650 413300 417651 427828 425615 445373 436621 455023 443403 431058 430712 416674 403047 413866 426968
3637 426968 427748 420726 417644 438194 437329 444564 464132 462042 455798 461683 455747 468364 462491 484223
3623 484223 474283 486858 487185 500526 498541 498747 496995 497868 521884 537045 531134 531327 519862 532296
3609 532296 536740 542388 540226 542254 524778 554347 558143 565324 561795 569379 584489 600772 593010
3596 593010 606845 630793 637495 628831 656670 648580 662017 638895 645687 654872 661440 640000 644206
3583 644206 643000 666691 683870 701294 694002 709438 708941 742709 768081 763406 760118 771310 774469
3570 774469 793239 791138 804198 818701 858713 867664 878528 897247 918727 931665 948283 948922
3558 948922 988693 1011839 1025248 1015775 1053031 1069583 1096538 1109577 1132815 1134664 1165655 1191486
3546 1191486 1194187 1195746 1211171 1215733 1224813 1219353 1251133 1243196 1243194 1249641 1282084 1304405 1320571 1309101
3532 1309101 1315555 1319792 1340330 1350376 1367612 1366394 1371730 1374815 1386833 1400417 1413682 1429423
3520 1429423 1442967 1433634 1439123 1466128 1479723 1493697 1512004 1496177 1510847 1515851 1513961 1530908
3508 1530908 1538811 1526446 1521525 1536779 1526045 1528916 1544672 1551595 1538885 1548389 1542557 1545253 1539754
3495 1539754 1531410 1533664 1532219 1536015 1539607 1528072 1546228 1549750 1561314 1548368 1569864 1552266 1547982
3482 1547982 1576856 1596685 1618788 1617511 1632717 1676022 1684780 1697888 1665822 1638093 1615449 1601401
3470 1601401 1585560 1607264 1597657 1607451 1639676 1671769 1685006 1709196 1732670 1769321 1758481 1803977
3458 1803977 1850112 1887743 1907049 1944884 1963331 2026543 2067149 2111426 2143515 2204259 2244336
3447 2244336 2320341 2399478 2542348 2680911 2767253 2781174 2811163 2843517 2894490 2949253 3057526
3436 3057526 3171163 3331773 3512679 3702092 3917776 4196582 4501189 4896813 5266899 5507074
3426 5507074 5520694 5361993 5134574 4942926 4780288 4705645 4680517 4698094 4706703 4721617 4701217
3415 4701217 4692582 4684075 4700935 4702714 4670473 4637177 4604411 4559767 4522304 4473235 4430054 4365598
3403 4365598 4308597 4247211 4146932 4075921 3986036 3892120 3845421 3901689 4061560 4197453 4096658
3392 4096658 3896885 3642297 3365794 3171182 3045054 2946259 2880945 2851892 2831220 2803204
3382 2803204 2803065 2806795 2827953 2843667 2868432 2874922 2912182 2950651 2985211 3026000 3071901 3127920
3370 3127920 3205711 3352193 3583460 3874677 4121020 4159211 4141158 4090751 4069848 3978340 3860515
3359 3860515 3737546 3636501 3554620 3510313 3477903 3470511 3459234 3465145 3488522 3497932 3515563 3537518
3347 3537518 3561390 3594743 3608274 3649431 3692552 3753429 3804822 3887063 3947643 4035509 4166828
3336 4166828 4358113 4545259 4722412 4810732 4824603 4819022 4811862 4828065 4882590 4925277 5006454
3325 5006454 5080566 5173018 5244394 5329331 5398349 5484949 5541925 5593521 5626304 5690870 5749309
3314 5749309 5829389 5884232 5939087 6044701 6196856 6363734 6510210 6564075 6509704 6351026
3304 6351026 6140167 5912565 5684692 5505987 5354137 5210852 5112811 4981156 4873180 4773686
3294 4773686 4662659 4529323 4418594 4302288 4219961 4116628 4011852 3923040 3845636 3804718
3284 3804718 3764830 3768864 3794096 3877770 3942181 3908618 3793300 3598406 3408675 3202975 3055141
3273 3055141 2947713 2851777 2787489 2760691 2744295 2744750 2735238 2719551 2711997 2728140 2739819 2738458
3261 2738458 2739344 2733070 2746187 2725781 2723768 2711550 2701130 2687048 2710000 2704989 2692416 2660702
3249 2660702 2649943 2667104 2731625 2858423 3025252 3195402 3320032 3334476 3260163 3105756
3239 3105756 2962075 2793626 2711549 2640508 2600248 2566727 2525157 2495910 2478424 2436196 2399185
3228 2399185 2361399 2327507 2320060 2298134 2262343 2261312 2270341 2300282 2337161 2437822 2551010 2708330
3216 2708330 2855275 2941965 2876603 2769276 2577627 2403910 2225281 2104103 2003775 1930034
3206 1930034 1870447 1836662 1799444 1791199 1768634 1731363 1709163 1713291 1705208 1713427 1707964 1727539
3194 1727539 1728619 1746898 1776640 1826389 1836247 1853545 1862767 1889000 1917972 1940469 1986110 2030651
3182 2030651 2059211 2110840 2142212 2168907 2215804 2245008 2272942 2311002 2325793 2352811 2374846
3171 2374846 2399042 2426762 2446931 2488315 2536105 2584133 2633570 2683233 2724864 2773691 2798703
3160 2798703 2815393 2810632 2789281 2763752 2704322 2626704 2580466 2548170 2494389 2465286 2428788 2367682
3148 2367682 2347792 2318383 2308678 2304871 2308452 2304918 2327372 2349341 2376472 2397196 2443664 2487030
3136 2487030 2533871 2551830 2585763 2624402 2672809 2713348 2768288 2794628 2792538 2755083 2724267 2683596
3124 2683596 2650435 2599649 2546477 2483728 2440225 2394102 2352406 2298005 2251753 2201768 2161145
3113 2161145 2128156 2088346 2030145 2007235 1964269 1925443 1877852 1842295 1815410 1783010 1740158
3102 1740158 1735042 1732393 1749459 1734185 1722892 1703624 1678114 1664285 1660973 1638112 1644011 1656691
3090 1656691 1679052 1706380 1729902 1737663 1750039 1738654 1749966 1728640 1729273 1735570 1755214 1775659
3078 1775659 1802170 1799143 1808218 1807413 1829109 1854448 1884064 1897973 1932412 1965986 2054172 2149562
3066 2149562 2219563 2245350 2267209 2258570 2274638 2283967 2303149 2321227 2347951 2349839 2299595 2247187
3054 2247187 2202878 2163683 2120507 2099068 2104208 2121402 2145796 2160244 2166359 2160422 2131216 2103891
3042 2103891 2063013 2044125 2016587 2011637 1985088 1983509 1983785 1998433 2028109 2086075 2137476 2209849
3030 2209849 2331160 2473130 2614081 2765715 2893954 3012115 3133116 3308670 3498379 3700778
3020 3700778 3936394 4204117 4477036 4815254 5183724 5654897 6189185 6721886 7123189 7332416
3010 7332416 7287871 7045118 6641746 6188566 5711712 5230899 4767831 4317923 3888828 3525544
3000 3525544 3188180 2911186 2668300 2476844 2309793 2170978 2049221 1943955 1879312 1829173
2990 1829173 1767781 1721957 1683793 1626362 1555931 1506890 1455442 1422482 1385982 1362949 1337423
2979 1337423 1336569 1326108 1338683 1324912 1359894 1382544 1409635 1429243 1463198 1477557 1500919 1535913
2967 1535913 1572548 1611450 1643535 1669914 1719694 1764666 1797154 1825426 1827104 1801888 1759953 1698155
2955 1698155 1647143 1580232 1506506 1445657 1397410 1358843 1333583 1289152 1279766 1279998 1263700 1261576
2943 1261576 1268934 1272487 1286346 1284515 1282843 1282345 1284627 1276354 1303242 1335457 1355082 1388323 1436180
2930 1436180 1506184 1553917 1622817 1668599 1701779 1697653 1675902 1664260 1613415 1573620 1562239 1533524
2918 1533524 1513133 1493595 1495344 1465243 1449451 1447908 1437742 1426141 1423885 1424942 1433342 1400372
2906 1400372 1382406 1391353 1405490 1414736 1430159 1444553 1479527 1515712 1537462 1576402 1636474 1710489
2894 1710489 1812417 1882469 2005404 2146582 2301706 2483111 2677397 2888911 3086066 3261237
2884 3261237 3382157 3457154 3481449 3473832 3477236 3462628 3513347 3558786 3630003 3689228 3705877 3668067
2872 3668067 3605583 3507055 3411043 3324082 3259580 3227297 3257312 3324717 3463389 3660167 3900054
2861 3900054 4196250 4561941 4896126 5184804 5367285 5406393 5283786 5027864 4643481 4236674
2851 4236674 3815717 3412847 3067883 2784286 2530996 2336966 2164910 2017156 1884752 1766264
2841 1766264 1635064 1529538 1435144 1363502 1299480 1249114 1186371 1141921 1111316 1059784 1009865
2830 1009865 982829 951793 923366 899770 867491 839631 823550 794547 772988 769546 765233 735595
2818 735595 712935 699703 694078 693235 671660 655442 632386 602027 600643 598764 586440 579889 575879
2805 575879 568018 562612 552379 544077 534987 524698 516460 502419 496382 472219 478663 470671 461581
2792 461581 455339 452748 440014 422728 407547 419699 403724 415220 428271 426840 410935 411139 397386
2779 397386 412839 407934 386324 387438 373846 366887 373883 368657 354403 346353 356918 344579 335425
2766 335425 330231 341480 343202 340113 317640 322574 324523 346400 326603 318681 314300 318179 315906
2753 315906 325990 310631 318697 316612 304864 289859 295727 297337 303566 297639 298871 287805 290291
2740 290291 298780 302736 299955 314025 299200 308363 300190 283590 282753 299419 314566 295980 277335
2727 277335 269725 269493 268855 273428 278329 258212 258295 252221 257239 260615 257338 249301 241741 238939 222349
2712 222349 216359 225096 226195 234942 240907 237661 233954 220622 223684 221763 224795 218502 213406 222090
2698 222090 228371 235263 225298 233347 231378 220254 230289 237166 224776 226906 216899 225079 214114
2685 214114 206198 207086 194289 196262 198831 212914 216428 213893 202640 209771 198485 200636 178718
2672 178718 189502 201065 192832 184214 191042 190582 183605 179352 178021 180329 177021 196069 201018 183543
2658 183543 184676 194036 193191 198678 202854 195112 182872 173193 187771 154700 169799 178301 181311 179057
2644 179057 182500 176978 182726 169381 172344 179652 197118 174134 175729 161951 167589 168284 179002
2631 179002 186858 201693 171432 175138 157830 161697 168884 165662 169221 181295 157895 154335 156584
2618 156584 170259 172962 181841 180805 174917 166769 172807 171780 181537 174570 170620 168869 172691 169168
2604 169168 157517 159047 161801 176400 183156 164300 160627 174163 172998 182188 183256 177722 155043
2591 155043 168412 195077 178176 163721 168160 164537 171614 157107 159705 165133 166679 162819 176067
2578 176067 173605 166929 170851 181886 171784 166970 171200 180710 184266 175565 172789 169910 172712 184106
2564 184106 169286 177365 173870 172949 170220 170475 170880 168380 140020 133589 145263 133952 151684 154571
2550 154571 134906 149373 138557 149135 149288 134711 147975 157011 139274 128451 136026 143842 145526
2537 145526 144928 143104 147891 149485 155186 150233 149324 145515 160290 143857 148098 153349 162771 151913
2523 151913 145001 151111 143101 110059 123485 131333 146907 149210 148677 135947 139538 122444 119751
2510 119751 121839 131885 142718 137263 123101 144015 132653 125162 123297 141390 146789 141095 132322
2497 132322 143930 150246 156560 147867 137892 137683 136941 135780 145525 158631 140959 142764 141858 143759
2483 143759 144515 117886 109441 117875 125340 134206 137690 144552 136353 142797 123517 115646 144694 142651
2469 142651 145794 148981 138870 124698 135571 139657 137416 129068 122353 143551 131718 125697 132149
2456 132149 139812 144427 139053 132803 142584 134870 136100 141658 155993 145034 126013 128594 129974 104718
2442 104718 118607 128076 138691 140622 136697 123613 119984 126912 136061 134942 134208 139352 134550 132682
2428 132682 135067 129098 134859 131772 149493 161769 156490 139250 136535 125725 147390 149918 132630
2415 132630 117116 127100 126395 128165 114856 121242 122765 129688 124736 125422 124430 137754 135388 130382
2401 130382 145027 160273 134626 129378 130790 133002 151866 152838 142190 141808 152678 140850 134516
2388 134516 145056 145579 145325 147175 143429 136722 130575 127541 127305 130000 155844 161539 151865 146452 139443
2373 139443 130315 131716 151727 151198 136671 139384 145601 141305 133878 136552 147443 155352 153442 146095
2359 146095 139744 129921 130740 132996 145784 145478 167315 172169 169815 156740 148241 162182 154691 156010
2345 156010 156593 157556 149573 163958 161857 165413 163776 161761 175291 185723 190259 166709 163662 174660
2331 174660 185847 173465 166937 183927 192411 189281 203443 213030 226597 223293 221558 240131 241408
2318 241408 238462 252263 265123 287948 292783 301046 283169 308294 339855 392136 446348 516608
2306 516608 535543 537787 532308 528513 561603 624859 698834 807223 954660 1154752 1444952
2295 1444952 1921154 3025000 4854208 6950630 7106266 6075769 4840403 3335058 2288930
2286 2288930 1607595 1215650 944546 831711 725802 697912 646373 636372 632567 651144 600246
2275 600246 546816 484613 438851 404358 403969 385185 362363 338416 342883 314382 289945 270325
2263 270325 268325 245602 250225 273982 285061 257906 263458 253226 237895 236656 230841 228717 241205
2250 241205 230447 223182 224711 224218 208707 215838 225391 215291 187783 206699 214422 203427 207789
2237 207789 192845 199920 216545 204546 195979 185172 191527 195374 184222 190469 171074 182101 194858
2224 194858 182095 189092 179861 168414 177985 183925 172573 170598 165271 160281 167291 170519 159922
2211 159922 154703 152455 145052 141299 149899 151736 136804 145226 140808 134085 130678 151164 157033 154034
2197 154034 146129 140750 123228 129112 125344 121916 133361 144596 127666 112229 109143 127328 129392
2184 129392 120553 115602 129690 125048 124096 125160 128695 118424 140197 131133 124520 112293 124412
2171 124412 109371 107599 123025 138900 132118 139358 121057 122412 131596 118298 113508 105581 111123
2158 111123 127800 112254 119664 106285 115844 112870 128922 128065 134638 133619 121953 122078 110893
2145 110893 111031 117107 113460 104593 102910 109944 86601 89791 101798 111554 111175 128139 134754 119387
2131 119387 111406 113144 93863 114852 112374 111107 109611 108761 112388 95056 101177 118544 102163
2118 102163 99143 111742 117767 117484 98013 94818 90895 99609 107864 99254 101865 118077 111950 121576
2104 121576 117908 117047 115454 119526 112366 88913 81748 78754 92515 119124 123506 120385 100658 111254
2090 111254 102530 108765 109469 120540 102484 98256 90901 86386 93524 93324 84408 86506 80874 100154
2076 100154 93997 94481 105672 116620 114768 98424 93666 106170 94361 123315 124416 94864 108811
2063 108811 100701 80604 96348 97531 100596 94701 112921 113695 101296 103050 113275 97096 91920
2050 91920 87195 95808 94903 93218 104976 116772 92317 85553 84460 86176 75712 87429 95004 104189
2036 104189 87825 88179 94215 117169 131343 103231 102389 102344 93357 101613 94933 103876 106284 119489
2022 119489 117225 125195 124833 110122 112709 100769 105361 120775 107451 91409 93232 87872 93004
2009 93004 96639 99477 96524 99054 87352 83806 88882 97633 109374 121618 116049 96217 90384 88409
1995 88409 86966 87210 83528 74069 75427 74163 91546 93831 97342 106011 87207 91961 92556 105577
1981 105577 90593 80378 89460 92097 113283 106748 83852 87263 97569 97149 66386 74524 86457
1968 86457 97912 95954 112221 116514 103198 78889 77255 82334 79929 77511 84521 87352 101457
1955 101457 83225 87285 86300 78887 64654 77493 83971 97415 70843 63761 70373 80478 95113
1942 95113 98668 109980 90043 80942 95071 107020 103237 87659 88232 81178 105723 89755 78997
1929 78997 96381 95826 95061 100517 88509 93558 97178 94027 99897 93912 82799 91094 82734 82050 83291
1914 83291 96787 90137 60612 51369 56640 73633 78111 72129 84896 76686 84988 97051 86581
1901 86581 82108 78302 70582 79639 89647 98274 99920 94833 89264 87425 90926 89665 77477 73017
1887 73017 71941 82936 73314 72569 68201 67500 75754 79408 83433 94988 104813 83966 83536 95769
1873 95769 107801 98684 93412 76917 67904 84578 97456 96745 103996 100367 82326 82500 99394 105747
1859 105747 107206 104263 94176 76158 88904 78931 82000 95698 90569 93732 111484 98135 100711
1846 100711 91277 98904 101096 99455 92481 109200 83910 82027 87972 84230 80509 72198 59376 85290
1832 85290 88682 85659 87638 80493 73067 73765 80805 94096 93055 84899 82489 96122 81925 61202
1818 61202 64690 68415 71962 73159 74049 72069 64182 58716 68263 91796 85898 70835 73125 86241
1804 86241 85867 81897 74722 95016 84985 83803 85736 91881 93090 74693 94760 98677 86314 85849
1790 85849 80116 85055 75416 77648 90642 91803 73754 67028 80302 75209 84755 91932 73192 57301
1776 57301 68405 66389 65432 86347 79424 78631 84082 79732 84418 84008 85636 90942 78423 60606
1762 60606 85791 97517 100299 84590 80422 80168 82830 93809 90088 85264 80004 73548 68044 69504
1748 69504 62038 64813 81626 103389 98229 79963 89172 87532 78086 77547 82819 101221 102609 102532
1734 102532 91572 89456 94936 69132 85242 68965 63024 72555 77973 71321 89435 75581 58722
1721 58722 62359 74493 85681 81915 82925 89633 72145 62841 66667 81785 79878 78527 85051 85742
1707 85742 68806 97062 85822 76243 66799 59101 75932 67235 70284 72783 66931 64927 67160 67826
1693 67826 64840 61058 69288 74569 66477 70324 79074 77739 89457 88589 69235 84719 82435 84551
1679 84551 81388 76443 82649 73644 75388 82751 71903 70108 96286 96357 108357 105778 82883 100589
1665 100589 84854 64260 57240 73351 70835 67311 60640 63533 65591 58195 46135 47919 54400
1652 54400 72587 71730 62176 79694 86962 79338 88046 78970 72325 56002 59128 66147 43862 59347
1638 59347 58343 64578 79757 99020 94365 84437 83919 76438 76874 84351 74607 76311 93030 71355
1624 71355 72646 69301 70255 68172 72536 75188 59102 56864 71020 70797 67082 76584 70902 65042 50691
1609 50691 48241 58273 72989 64784 66963 59131 75967 66895 74159 85848 108142 104812 92001
1596 92001 80875 92784 90655 86325 77596 76689 72194 75703 76354 75262 67800 67155 65244 76736 54319
1581 54319 61784 74664 87739 76503 73600 73425 78803 83304 98339 95161 88397 76731 69846 68920
1567 68920 66168 66383 74864 70929 56436 60896 66028 77801 77076 80215 82664 77595 72394 83953
1553 83953 99354 104921 88924 63461 79897 70114 61309 73082 71253 82385 88966 101950 89634
1540 89634 71517 58926 59186 88784 104646 87853 73038 70944 65023 61434 57755 58262 49644 41276
1526 41276 63032 62779 79354 83649 68090 65432 90754 85557 62979 72292 82802 80788 76002
1513 76002 84869 89552 77337 73436 79871 87194 97835 88109 66231 67142 76604 71136 69582 79419
1499 79419 72188 76582 76579 55760 80809 89700 59097 58192 55897 71527 84605 88880 79755 71452
1485 71452 82681 92028 79971 70509 70685 68797 80107 86064 78993 79251 81855 91886 75715 77537
1471 77537 76693 76312 86395 74467 53186 55623 51781 58931 66421 66419 75205 81441 66687 73092 87314
1456 87314 74524 70531 78591 57538 63359 79482 84850 77160 86380 68645 70816 83802 70545
1443 70545 72273 88350 67140 75838 70808 71195 60860 62263 65983 75243 91919 85821 81658 71280
1429 71280 58549 63847 66321 64448 64459 66532 58809 61821 51720 63909 70284 68787 58444 53632
1415 53632 59187 59665 53843 63433 61139 59063 68889 56944 37758 50507 55986 65517 86164 76218
1401 76218 79956 72113 80208 75514 59247 74089 88043 92362 80681 79613 71094 57910 60306
1388 60306 57090 70400 61103 63345 69541 89159 72676 87453 80144 78723 75405 67292 70032 63451
1374 63451 64109 83931 88988 96735 70963 83234 90322 61661 56439 67673 79634 82997 72977
1361 72977 74068 83194 85882 60013 64583 60494 63458 68787 62944 66083 59816 51517 57885 65805
1347 65805 64812 53092 66125 56458 59070 58720 56737 66607 70408 49906 49417 65374 65796 64064 81818
1332 81818 81990 76195 70138 40517 37082 51603 42087 65169 65367 66672 63725 54788 55397 66257
1318 66257 58501 57146 58025 65425 64424 60666 54744 50605 71135 74536 80788 73754 58282 78338
1304 78338 77614 72690 73365 57972 62309 51993 59084 45128 38890 62683 64297 72479 75597 65803
1290 65803 59339 60980 55690 65795 71383 73151 69161 68421 55091 57205 66489 70122 66339 71819
1276 71819 94218 88663 68274 68121 53789 45004 56958 55895 68686 71577 70311 41214 46178
1263 46178 59829 60523 57342 78292 70754 54361 50717 61192 60957 69546 60124 62034 59997 78611
1249 78611 57183 58639 55561 55467 50307 53353 58126 58855 48183 44304 59453 74920 75852 65413
1235 65413 75698 66622 61913 59211 60688 61081 45149 63447 67964 82624 82596 84226 73615 69916
1221 69916 71025 60030 42263 56884 63044 74246 75457 84035 84032 60717 55026 62893 44537 49044
1207 49044 51713 53012 55605 63841 50437 52878 54124 48802 44640 56234 51803 60514 74444 76404
1193 76404 71425 58084 56590 67316 54975 53631 62253 67511 54618 40387 53802 58020 64973
1180 64973 66834 67805 61455 66886 73520 80011 77530 77525 72909 55887 57598 63788 66189 81006 62546
1165 62546 59635 63826 62772 58273 64736 65345 79825 84229 64312 44811 65380 50973 55100 46488
1151 46488 51621 52979 71650 81046 74579 81966 88258 68455 72015 68635 78979 84293 79114 84650
1137 84650 87060 70515 66939 79960 77541 70683 67336 52440 56159 58755 52669 40505 49757 45789
1123 45789 44045 62898 69514 44527 55358 64790 78269 67228 64186 67295 71056 59319 50769
1110 50769 46675 44176 58956 54526 46984 53039 50593 67107 77416 74446 62497 54941 38382
1097 38382 44859 57708 62607 56818 62739 52541 60886 69340 77878 73585 72049 53049 54764 51130
1083 51130 49475 50121 40432 51295 37335 45978 54920 61048 56960 75931 84041 76556 60686 68725
1069 68725 45428 32870 40864 38790 54073 57371 62324 65691 72218 53360 35906 49426 52179
1056 52179 54448 54017 53409 58830 77711 66365 60527 64285 52275 54687 69809 65237 72190 53200
1042 53200 47802 61324 73393 59936 58074 41679 63464 70280 54915 59373 62106 73196 66387
1029 66387 46314 66003 61621 69183 58467 56914 67489 71213 65013 63147 60895 60874 57618 63012
1015 63012 72264 93157 84210 61752 58501 63993 57137 59374 41759 52343 50384 57707 61887 45918
1001 45918 44092 50182 47696 51501 53697 68350 66342 55150 57742 61497 53527 41552 46179 59532
987 59532 66230 65018 66052 54731 55931 62182 52543 71379 67474 42995 44445 39747 46647 59204
973 59204 49721 45216 61326 66882 57331 55705 65913 67293 48385 50791 64491 66458 64453 52894
959 52894 62178 62934 54735 56599 48243 45593 48196 53788 68792 58841 33969 33956 50729 46643 63565
944 63565 71977 66232 51702 52119 53007 48939 35869 38587 38631 34854 37317 53632 62521 44981 43044
929 43044 46055 44189 47773 31182 34667 45765 52157 47854 53967 55462 67871 49581 49013 44734
915 44734 46004 48401 48533 58328 46185 36841 54803 54146 53949 71091 70370 53818 40984 44510 45141
900 45141 38845 47753 57818 70851 48408 55024 55799 44304 48408 62535 66871 45716 50423 65237
886 65237 64932 55286 54834 59110 65277 59931 57988 66814 65717 63846 70123 75443 61709 39092 42035
871 42035 37835 32687 44090 36056 46268 58346 44491 43569 52965 49655 44476 50965 50093 50174 71099
856 71099 78831 69913 68065 59424 58481 63144 46129 52741 49206 46544 45037 45724 59524 65692 58818
841 58818 61337 55587 42180 47343 67248 73285 66474 66601 83913 72718 74294 65517 55536 59646
827 59646 56939 55375 53078 48719 68793 77400 85352 80233 69063 70549 67467 50956 40957 51736
813 51736 65541 68442 59939 44363 47156 52832 52695 58254 51570 47270 50263 46829 45331 62139
799 62139 47446 62912 55826 57822 62660 61795 57050 61167 65694 76224 53007 50391 60894 60054
785 60054 47912 42606 50202 47506 36613 48526 45472 54792 67544 69911 60358 52115 40781 36256
771 36256 34803 45055 36368 46732 53661 59136 69730 60737 37204 41778 41213 57638 53517 25713
757 25713 32138 39884 41322 44275 37221 41520 51336 57571 40701 41896 43542 53253 56103 63081 48824
742 48824 51821 41110 43042 46701 50673 63329 67808 61818 62069 67226 59181 53840 40663 49959
728 49959 62359 68861 62916 63691 62134 44276 52663 54926 63253 60000 58134 56137 40862 45145
714 45145 58620 48473 51587 60463 44832 60939 51877 39416 35283 41453 44178 59168 46831
701 46831 42802 35670 53224 63154 48197 38411 43342 54239 53741 60259 72095 64379 76953 65057
687 65057 61158 69149 63771 50866 54280 58756 76479 72106 64710 63312 51650 57642 57629 48169 46199
672 46199 44933 58143 52204 54504 46431 35523 49631 63362 62305 56018 51702 42927 48275 50032
658 50032 42153 31392 18991 34490 33688 41622 41379 25813 27910 46087 40445 42914 36658 46859
644 46859 47557 55433 50340 61548 67883 76548 58348 57736 69003 66331 50865 52340 41211 36620
630 36620 55914 59315 53298 54905 40403 36600 34989 34958 33255 34556 34335 30031 34498 39737 40797
615 40797 67771 73954 56833 57593 59608 53228 67213 76315 59046 39976 46408 50332 41065 39060
601 39060 38345 68252 74284 60821 52472 56196 54074 48826 42871 35256 31227 33269 33889 54387 44496
586 44496 35725 39892 42372 21479 42885 38274 34801 55738 61101 63628 64493 65563 59025 41621
572 41621 38589 48448 58500 60712 57775 36620 46093 23150 33074 40680 54620 47354 35735 41487
558 41487 56673 66428 61165 31004 50587 60762 43158 36511 56621 50860 48948 33057 35790
545 35790 44124 59448 61058 78114 56620 51488 63631 52351 37866 30865 43161 42940 41939
532 41939 56210 51470 47270 53082 56341 43570 44586 59138 55165 41751 47488 50807 31413 31725
518 31725 36832 46006 63667 63730 44110 41743 44578 52857 49304 47317 43026 28381 1578 20925
504 20925 36606 42803 44007 41433 46841 58819 48613 33811 34359 44421 46634 63447 66906 53783
490 53783 54116 51463 50375 50841 50037 62353 44674 50769 45228 48245 59951 66299 58198 50468 28236
475 28236 32311 45219 49687 39246 47903 69901 60021 54768 46683 33721 44535 68910 53553
462 53553 36689 49213 53703 64336 59623 39308 25553 44655 39073 34661 36178 30014 32231
449 32231 26471 29596 58128 63921 48710 41733 56083 49232 49386 43383 52947 45502 34340 41895
435 41895 46600 57053 39285 46652 60154 53981 41371 20889 32180 45180 50074 50835 31919
422 31919 38887 33544 36367 43767 37638 43832 53168 49592 44045 38823 26784 45165 33738 28451
408 28451 41738 43503 43184 38526 38445 45995 55814 64880 62225 56513 54298 45830 54219 59461 46057
393 46057 67164 68444 65848 68403 63181 55520 43300 55781 55742 55593 51936 37732 40679 49615 52661
378 52661 40846 36523 41430 28630 41919 57388 38043 34241 43612 57945 59809 53515 51980
365 51980 49555 59622 50893 47691 44813 31523 16166 17001 32198 43310 31604 36634 35512 57858
351 57858 51392 44714 42457 53723 63635 57679 43082 42788 38838 31559 39712 47136 50190 42613 36200
336 36200 36264 45363 52025 56144 41193 34493 28579 24580 20584 35395 46702 46532 48640 31807 39601
321 39601 64650 63780 36420 38079 37956 39149 21663 18142 31549 35975 37112 44798 47964 39242
307 39242 46177 31887 44584 38795 30618 51425 38706 34966 48463 46787 52425 43863 39899 46614
293 46614 35436 39178 46804 51633 52300 42309 51243 59090 46275 43585 47004 59922 39073 54114
279 54114 54695 57310 43135 26340 40510 58252 31676 42189 51459 47641 57159 55620 68050
266 68050 54595 40211 38320 46552 39785 31910 30095 43209 51650 50304 53102 31257 34583 35899
252 35899 17149 27084 34264 43387 54079 51685 30758 53995 40907 32141 29358 29782 36607 18018
238 18018 13346 27545 37181 33149 32509 40060 49342 57632 41807 19635 29481 37574 41431 25083
224 25083 28535 32763 38785 35860 33966 29570 13456 35537 51871 43849 31300 36137 29480 38220
210 38220 30074 33533 42442 51100 53492 42629 32397 22907 28507 19015 15302 28393 29220 37880
196 37880 33488 24087 22026 28885 43135 41962 30130 36060 35538 41026 33911 31863 32215 33964 36103
181 36103 24791 32535 46455 45782 26874 15504 30434 29541 41514 41609 23330 16115 14670 21485
167 21485 20199 15534 24680 16161 35565 21960 15260 26192 31633 26415 31626 25252 27286 26964
153 26964 21851 29787 25731 19802 23268 36668 24302 16735 18202 19329 19763 16468 22554 31196 30512
138 30512 17194 -3551 -5791 5094 10498 17941 22336 15707 10560 -10265 7403 26085 31763
125 31763 30713 24298 24878 17615 10876 14345 604 -2262 8980 7994 2292 2138 3501 -1308 2063
110 2063 9815 1031 -3025 6541 12166 3417 11933 7620 -14648 3084 10637 -232 -1215 9030
96 9030 15068 701 -8327 -9905 -5942 -3110 1178 6317 5893 -1361 -1839 -3125 -2763 -9219 -9027 -7797
80 -7797 -10612 -21260 -20744 -9286 -7492 749 2786 -2012 216 -7725 -2168 -11673 -7933 -9989 -13383
65 -13383 -13157 -6724 2047 3330 -7690 -15804 -15121 -15936 -16490 -14717 -13893 -22695 -24894 -18280 -25113 -12530
49 -12530 -12214 -26319 -25614 -25509 -28840 -23074 -29921 -28034 -41119 -25090 -15332 -31612 -39538 -40372 -32116
34 -32116 -32063 -35874 -40030 -41252 -32099 -33382 -31934 -41204 -40252 -37428 -25609 -44248 -38981 -44564 -40226
19 -40226 -32929 -37905 -41861 -40307 -33549 -45625 -45133 -41678 -44385 -35735 -36521 -38979 -28917 -34077 -38819
4 -38819 -46155 -44081 -53844 -61241
0 -61241
$$ Imaginary data points
##PAGE= N=2
##DATA TABLE= (X++(I..I)), XYDATA
16383 -222121 -230772 -218554 -212352 -217643 -215880 -218178 -198666 -187040 -197243 -189999 -172606 -177660 -184183
16370 -184183 -166482 -161785 -159272 -154856 -164953 -151766 -139458 -145397 -145671 -140302 -134246 -137843 -144724
16357 -144724 -131483 -120887 -114632 -110871 -109333 -101365 -101759 -96174 -85106 -83043 -87665 -81240 -74758 -75864
16343 -75864 -82027 -77169 -67340 -62017 -51197 -45193 -40571 -41655 -45410 -43706 -34617 -32329 -28658 -24870
16329 -24870 -23289 -21465 -32765 -24456 -8574 -603 -2347 -13950 6731 8492 3469 10806 15320
16316 15320 18876 10242 24362 39427 44527 38166 34532 38983 44650 47623 53943 64573 60354 64402
16302 64402 76404 72251 63988 69982 74129 77528 72098 94033 88385 79703 91033 89833 97475 111504
16288 111504 108821 117786 120507 111581 126601 132838 140946 129472 116636 133771 130882 128845 138251
16275 138251 145605 151567 155730 156059 158687 158886 150479 155915 180367 167913 167611 166601 166468 176869
16261 176869 178856 184690 180747 175532 187229 180373 210458 213296 208875 210709 216680 217386 221208 216584
16247 216584 223534 225588 230589 227821 234148 229883 237629 230935 238303 237118 257462 257796 239102 242592
16233 242592 249755 233566 244193 250308 247741 252928 237500 230993 240667 253970 272756 272590 271982
16220 271982 269843 267512 258044 264732 258718 271557 291956 301537 296206 278440 284511 286039 291814
16207 291814 286101 306239 294348 294470 297686 292080 277210 297072 301927 309769 302729 304069 313203
16194 313203 317477 303467 303486 308622 314607 321426 320401 317375 325912 324986 311755 310159 313991 313726 297855
16179 297855 301009 314919 309178 330098 344726 352378 341632 337716 326775 328515 328320 331891 325985
16166 325985 325034 335769 343917 338349 355029 360068 366481 371143 365258 355008 343003 348762 366846
16153 366846 367380 364158 366544 362678 347625 354710 351215 360792 345225 339328 350909 352087 349796 364411
16139 364411 367387 355264 365886 365791 377613 376871 376407 363748 349579 351459 359385 364569 357289 371030
16125 371030 368655 373656 375918 392838 379781 364638 365258 369082 367749 370568 374117 374386 370074 377718
16111 377718 385708 375993 364667 376933 378069 358764 359638 374119 382582 371516 365659 385029 400635
16098 400635 398160 383860 388088 387805 380540 389447 392809 391963 396307 388149 383481 390060 379162 395083
16084 395083 391033 381916 368138 382660 387395 378941 368460 383323 366117 370677 389114 389240 386177
16071 386177 401386 402729 404883 400641 382425 391682 378706 382923 390548 388104 398392 393390 404265
16058 404265 407644 412264 398007 397477 392520 379962 377164 381985 382394 398599 397052 404877 401642 395404
16044 395404 395537 389999 407159 403407 382491 383908 378651 388146 371427 388745 390586 404921 392157
16031 392157 391926 392459 391940 411134 407905 401439 398688 395087 390260 397633 396302 390523 383060 374421 380708
16016 380708 387128 394965 396099 402158 396240 382089 397236 400935 400578 403061 399313 406484 390930 395179
16002 395179 402762 391413 393123 400470 398444 398815 398970 379565 383965 389380 379567 367230 375023 372827
15988 372827 380167 386211 378033 378568 383728 400826 387573 386672 385026 384758 387215 379187 399079 406713
15974 406713 406708 401766 398686 393555 392196 376263 382908 387602 394420 391481 415830 398028 377481 380322
15960 380322 413623 404557 401650 409404 396100 382048 393016 397178 396328 398560 391056 407786 407940
15947 407940 395692 398809 395867 402315 402982 417648 414901 405160 418655 401805 385426 391380 395490
15934 395490 380009 380869 400393 399925 421636 403017 408878 405862 393527 400296 404919 412542 421031
15921 421031 410420 408688 403580 404640 397325 396218 413309 401021 391950 394375 404462 392745 393659
15908 393659 398342 395341 397476 376640 380469 392534 405359 390027 378360 399982 400239 390941 394746
15895 394746 400305 395453 401830 406413 410048 418819 412849 405692 411835 407422 406187 411348 424949 411226
15881 411226 404903 400465 399207 399438 389613 384996 394768 397164 405746 409744 395853 394733 394549 391477
15867 391477 397004 409035 415013 399533 391408 408040 413072 406850 410274 397241 397801 407606 405394
15854 405394 390022 392472 380682 380484 405057 395629 395332 406825 424516 419773 400913 388247 390126
15841 390126 387812 379920 393363 404387 407267 413908 418329 402722 393302 397948 407848 418059 408927
15828 408927 413954 425283 415327 406968 385087 410278 414047 410037 407056 376661 371272 398638 412967
15815 412967 427258 426788 427538 424209 411387 400420 401095 422349 429595 418801 419701 424395 418912 411040
15801 411040 417908 413210 410439 414329 418827 419443 405482 397178 403742 411624 413535 413922 422922 410997
15787 410997 408999 409874 409091 415368 404400 412240 418050 392516 404017 388039 406699 416926 410519
15774 410519 413002 409231 410280 402519 406496 409803 408725 388922 384491 406935 406441 405461 412049 411699
15760 411699 399717 401970 400212 408719 424945 414952 422038 405183 394746 415611 414195 398153 395431
15747 395431 391601 395489 414123 424563 408721 400461 396842 386846 394790 399804 406497 398861 408919
15734 408919 406501 404558 407114 402102 396744 395848 384964 393606 402356 393550 408153 405328 406142 408578
15720 408578 422081 424088 428619 413074 417430 413210 419968 404615 402162 405426 399495 396299 411294
15707 411294 401686 386960 377380 385706 400318 410966 406809 416944 419254 407798 410677 402233 397129
15694 397129 411366 409732 417738 417639 408189 416377 413818 410338 412088 389835 395588 403826 406732 416763
15680 416763 409293 401862 409326 400291 400251 415455 421356 409252 410648 400428 399037 410468 409989 410069
15666 410069 410950 406125 418674 413523 408176 401467 416492 422131 402358 394255 392069 411688 417277
15653 417277 409597 426408 425175 418564 420707 423827 411600 411917 413696 413512 418371 415892 409862 402622
15639 402622 397927 406766 397345 390447 404659 400585 398924 385824 381057 389445 417483 419785 420862
15626 420862 421655 406991 416419 419650 420603 424348 424059 429563 422056 415370 419443 416842 422033 418261 404661
15611 404661 405418 417920 421725 408190 420536 411234 402714 419890 430491 417747 421746 411721 404853
15598 404853 406818 423057 428238 432849 406164 414631 404305 394845 389338 400309 420218 434758 419200
15585 419200 398769 393249 405418 389782 400646 403844 410116 413737 421103 411458 392364 377204 407155
15572 407155 400917 404919 408208 405479 414974 418857 424154 403632 405697 409150 399158 408537 397400 398347
15558 398347 402732 417511 419225 420023 429475 407029 407089 415773 417983 409049 422196 426524 419654 407368
15544 407368 403646 414685 409132 410590 409058 394168 397380 393658 400271 395200 385974 406652 427131
15531 427131 420610 409365 409511 421499 411999 419015 406902 414635 420604 434045 436460 425110 413109
15518 413109 423110 415390 395094 400534 422978 417539 422308 430389 433737 423677 423019 424503 432867
15505 432867 422366 437551 422527 420337 414275 397978 419896 431497 421922 408420 423051 415641
15493 415641 388330 401251 405872 402264 418505 416259 420233 422024 418524 409310 399878 400399 404057 406579
15479 406579 411946 418008 429280 423399 434288 433709 416226 419417 418041 411211 424564 438157 427573
15466 427573 425082 420278 415574 407330 413228 413622 425010 425540 421360 415711 406584 404530 418803 424125
15452 424125 426473 417707 426581 409401 405868 406320 410009 435982 430264 431376 430284 436460 426113 426963
15438 426963 424889 409849 415759 415940 418072 417129 403744 407713 412941 403076 427482 439232 404969
15425 404969 405332 421822 432360 436253 432759 428762 396128 402315 404261 404237 404542 401115 422578 409739
15411 409739 408321 418954 431245 447334 447949 427541 427575 437419 443624 429126 433258 418070 414396
15398 414396 421412 413179 406220 421005 426485 407976 428270 427784 428087 422838 431793 424471 420101 418998
15384 418998 416297 425759 408564 422473 422703 426259 423299 427766 440673 438219 431449 430821 420839 412539
15370 412539 414463 429263 432345 445011 428999 416759 409324 417906 410665 404751 410423 416112 424251
15357 424251 439198 426756 433613 418593 438601 431979 411183 425206 436732 434514 426676 430789
15345 430789 419907 423961 424015 438519 449340 443829 418727 414779 426689 428407 422626 414438 418154
15332 418154 420365 423217 431993 427246 452336 454547 443808 435929 451046 441895 434051 422865 427285
15319 427285 431519 419883 407430 426822 425711 420552 433840 424421 426316 434436 443314 445940 452057
15306 452057 435048 424415 416901 418544 410319 413513 408037 400697 414943 417137 407066 411554 418235
15293 418235 417691 420557 402080 411430 428737 418181 418876 421955 421393 414500 423946 427340 443094 433801
15279 433801 426958 437190 435456 428352 417661 419057 431879 427572 414250 430850 430756 424288 429784
15266 429784 415211 416687 428325 425291 439967 441232 441710 434531 423642 424914 424199 430840 445091
15253 445091 426538 424855 439850 410692 411549 419163 422293 424869 427873 424946 440379 435979 415501
15240 415501 418530 425702 436502 423460 443063 425775 440928 420621 416778 431071 411982 414554
15228 414554 414516 433979 428368 416900 417407 400767 422548 427149 419613 425078 435567 434773 443110 422576
15214 422576 415758 414827 408426 409179 412072 425921 441300 435022 419662 426877 419692 425403 431003 445199
15200 445199 429173 423872 419637 433546 436629 430067 446714 430971 429156 435652 431920 427003 431389
15187 431389 426126 430576 446546 450696 448952 445232 431986 444121 440043 439053 421196 426915 418145
15174 418145 421797 432511 441279 437116 430031 422995 434728 431966 428522 437955 437136 446437 431684 429336
15160 429336 431005 433601 437178 452756 434855 451215 448950 429359 424310 417560 438182 444513 438873
15147 438873 435743 429329 430674 418513 417911 447374 456172 444417 425771 425582 425141 414199 427679
15134 427679 434640 431911 420804 414253 425314 444825 428304 442351 431292 440972 433147 427022 419776
15121 419776 420923 419575 427400 421960 418213 429524 420303 425831 431944 411469 415999 424504 428603 428637
15107 428637 430880 426479 413525 413079 417439 404272 421381 423358 436933 436829 428439 449190 448139
15094 448139 441728 428294 430114 423354 411242 429447 428884 422590 421605 431217 449928 438162 429739
15081 429739 428228 436849 431053 431398 442335 445342 428628 429462 434669 431933 439654 439283 443736 463051
15067 463051 468366 451365 441672 430443 435477 444615 435699 442641 450261 434931 416738 417071 436979
15054 436979 441184 427864 435833 424388 419859 430545 425509 425033 426878 409376 407868 433436 453219
15041 453219 444063 450071 467710 461154 453917 454657 442531 461047 459772 453348 446032 435327 433215
15028 433215 445338 444366 443244 443097 449737 432019 403932 422700 444982 435332 432032 445429 447031
15015 447031 430631 427268 417539 415354 431267 437200 445806 454683 459900 445080 446798 441869 451838
15002 451838 465614 466380 454798 448192 449450 446064 443276 427743 430703 439051 447111 458096 459252
14989 459252 448083 444248 445259 444326 431826 441253 439840 441018 433416 438144 437449 432095 418928 429574
14975 429574 437462 438158 437941 434239 434195 417375 422917 439394 427967 424412 430594 420079 434159 435128
14961 435128 434849 429367 433354 444161 442441 424536 432345 451469 450952 445081 433575 444289 444014 436181
14947 436181 436293 444158 448427 454982 450292 450462 450820 439346 451115 461203 457775 451846 442388 440629
14933 440629 433708 437414 417779 425735 418126 433316 444344 438248 436792 428038 448071 454712 459212
14920 459212 444655 443785 434137 435659 424287 426971 438536 441590 441067 445550 433340 440783 449396 442974
14906 442974 447215 454460 450990 447807 440356 435854 435744 447377 448072 443706 451557 459169 458253 441690
14892 441690 437593 449770 445569 468606 464534 438992 447861 446593 454910 463196 464534 454052 450138
14879 450138 443825 439486 435512 444794 432938 439385 443374 445732 452404 441264 453455 460658 460429 446463
14865 446463 442770 433167 432981 431203 425660 427097 437309 438243 442742 443385 446388 453308 454412 445260 442141
14850 442141 451993 452163 441589 448463 429072 433468 437361 449410 451163 446095 432953 435871 435594 439743
14836 439743 450515 435791 422289 432328 453363 456360 450645 455117 445093 439030 436949 439445 429271
14823 429271 433221 458987 475202 454302 438473 434744 439617 431050 444704 454131 467107 452686
14811 452686 444041 449556 433038 423951 420261 456992 463616 467036 460013 452978 440730 439177 437695
14798 437695 435183 444184 456048 456284 458278 443837 441288 445303 449314 451034 450199 453959 464926 460518
14784 460518 448959 448595 466357 469383 467736 452629 461337 447290 455263 452853 453335 444446 435514 433737
14770 433737 445165 462206 463686 448405 434221 446206 450134 454919 466493 459023 460586 458717 455287
14757 455287 442192 429181 443125 438002 442280 463007 434958 436991 459346 454647 441062 459364
14745 459364 462304 470689 469742 460740 461811 465342 450813 434932 440521 446017 445767 422961 436162 446805
14731 446805 437759 434120 439483 442420 440767 452352 453237 447240 439933 443764 453361 460116 455979 455111
14717 455111 443832 438197 431922 445246 452515 439783 444019 453285 454432 460528 466217 472841 458391
14704 458391 459193 457205 453444 457131 456714 446897 449026 454121 457284 466798 458115 446291 445651 466209
14690 466209 453201 462726 456188 451482 464388 456776 458809 453778 442960 440000 451367 462091 454886
14677 454886 452122 453891 463276 464687 473524 462178 448177 440188 443286 455191 468203 476551 469353
14664 469353 471828 488731 490528 497381 467464 461659 464710 472065 448118 448810 452330 457289 463015 467079
14650 467079 464522 473102 476690 477905 466699 448596 447112 458114 450626 464174 466053 475295 475662
14637 475662 478015 458180 439876 436711 465143 468308 458908 469101 471037 479683 478178 477654 469096
$$ [...]
##END NTUPLES=NMR SPECTRUM
##END=
