##TITLE=1H_DE-80H_X3
 200.13MHz, d2o
 8 sc
 
 19ns.26.2.2025
##JCAMPDX= 6.0         $$ Bruker NMR JCAMP-DX V2.0
##DATA TYPE= NMR SPECTRUM
##DATA CLASS= NTUPLES
##ORIGIN= UXNMR, Bruker Analytische Messtechnik GmbH
##OWNER= pz
$$ XWIN-NMR		Version 3.5
$$ Wed Dec 17 10:45:58 2025 Russian Standard Time (UT+4h)  Yarkov@DPX200
##.OBSERVE FREQUENCY= 200.1313
##.OBSERVE NUCLEUS= ^1H
##.ACQUISITION MODE= SIMULTANEOUS
##.ACQUISITION SCHEME= undefined
##.AVERAGES= 8
##.DIGITISER RES= 18
##SPECTROMETER/DATA SYSTEM= spect
##.PULSE SEQUENCE= zg30
##.SOLVENT NAME= CDCl3
##.SHIFT REFERENCE= (INTERNAL, CDCl3, 0, 15.4681)
##AUDIT TRAIL= $$ (NUMBER, WHEN, WHO, WHERE, WHAT)
$$ ##TITLE= Audit trail, XWIN-NMR		Version 3.5
$$ ##JCAMPDX= 5.01
$$ ##ORIGIN= Bruker BioSpin GmbH
$$ ##OWNER= Yarkov
$$ C:/Bruker/XWIN-NMR/data/yarkov2/nmr/H-C/1/pdata/1/auditp.txt
$$ ##AUDIT TRAIL=  $$ (NUMBER, WHEN, WHO, WHERE, WHAT)
(   1,<2025-12-17 10:45:16.04 +0400>,<Yarkov>,<DPX200>,
      <created by zg, POWCHK disabled, PULCHK disabled
       configuration hash MD5:
       00 E9 B6 7A A2 85 ED C7 34 08 36 98 17 FE 4E 26
       data hash MD5: 16K
       CF 9A D8 48 F9 68 A0 37 1C D8 7E 0B 99 2C 14 60>)
(   2,<2025-12-17 10:45:19.84 +0400>,<Yarkov>,<DPX200>,
      <Start of raw data processing
       efp BC_mod = 2 LB = 0.25 FT_mod = 6 PKNL = 1 PHC0 = -5301.728 PHC1 = 12.22193 SI = 16K 
       data hash MD5: 16K
       B7 CE 9D 6D 0C AC 86 35 7E C0 D8 C3 64 B6 1E EF>)
$$ ##END=
$$ 
$$ hash MD5
$$ 4E 87 CE 19 32 BD 01 46 24 78 6F 47 AA E6 98 9F
##$RELAX= 
##$RELAX= 
##$RELAX= 
##$RELAX= 
##$RELAX= 
##$RELAX= 
$$ Bruker specific parameters
$$ --------------------------
##$DU= <C:/Bruker/XWIN-NMR>
##$EXPNO= 1
##$NAME= <H-C>
##$PROCNO= 1
##$TYPE= <nmr>
##$USER= <yarkov2>
##$AMP= (0..31)
100 100 100 100 100 100 100 100 100 100 100 100 100 100 100 100 100 100 
100 100 100 100 100 100 100 100 100 100 100 100 100 100 
##$AQSEQ= 0
##$AQ_mod= 1
##$AUNM= <au_zg>
##$AUTOPOS= <>
##$BF1= 200.13
##$BF2= 200.13
##$BF3= 200.13
##$BF4= 200.13
##$BF5= 200.13
##$BF6= 200.13
##$BF7= 200.13
##$BF8= 200.13
##$BYTORDA= 1
##$CFDGTYP= 0
##$CFRGTYP= 5
##$CHEMSTR= <none>
##$CNST= (0..31)
1 1 145 1 1 1 1 1 1 1 1 1 1 1 1 1 1 1 1 1 1 1 1 1 1 1 1 1 1 1 1 1 
##$CPDPRG= <>
##$CPDPRG1= <>
##$CPDPRG2= <>
##$CPDPRG3= <>
##$CPDPRG4= <mlev>
##$CPDPRG5= <mlev>
##$CPDPRG6= <mlev>
##$CPDPRG7= <mlev>
##$CPDPRG8= <mlev>
##$CPDPRGB= <>
##$CPDPRGT= <>
##$D= (0..31)
0 0.7 0 0 0 0 0 0 0 0 0 0.03 0 0 0 0 0 0 0 0 0 0 0 0 0 0 0 0 0 0 0 0 
##$DATE= 1765953915
##$DBL= (0..7)
120 120 120 120 120 120 120 120 
##$DBP= (0..7)
150 150 150 150 150 150 150 150 
##$DBP07= 0
##$DBPNAM0= <>
##$DBPNAM1= <>
##$DBPNAM2= <>
##$DBPNAM3= <>
##$DBPNAM4= <>
##$DBPNAM5= <>
##$DBPNAM6= <>
##$DBPNAM7= <>
##$DBPOAL= (0..7)
0.5 0.5 0.5 0.5 0.5 0.5 0.5 0.5 
##$DBPOFFS= (0..7)
0 0 0 0 0 0 0 0 
##$DE= 6
##$DECBNUC= <off>
##$DECIM= 32
##$DECNUC= <off>
##$DECSTAT= 4
##$DIGMOD= 1
##$DIGTYP= 9
##$DL= (0..7)
0 120 120 120 120 120 120 120 
##$DP= (0..7)
$$ [...]
##$SUBNAM2= <"">
##$SUBNAM3= <"">
##$SUBNAM4= <"">
##$SUBNAM5= <"">
##$SUBNAM6= <"">
##$SUBNAM7= <"">
##$SUBNAM8= <"">
##$SUBNAM9= <"">
##$SW= 18.0517328524113
##$SWIBOX= (0..15)
0 0 2 0 0 0 0 0 0 0 0 0 0 0 0 0 
##$SW_h= 3612.71676300578
##$TD= 16384
##$TD0= 1
##$TE= 0
##$TE2= 300
##$TE3= 300
##$TEG= 300
##$TL= (0..7)
0 120 120 120 120 120 120 120 
##$TP= (0..7)
150 150 150 150 150 150 150 150 
##$TP07= 0
##$TPNAME0= <>
##$TPNAME1= <>
##$TPNAME2= <>
##$TPNAME3= <>
##$TPNAME4= <>
##$TPNAME5= <>
##$TPNAME6= <>
##$TPNAME7= <>
##$TPOAL= (0..7)
0.5 0.5 0.5 0.5 0.5 0.5 0.5 0.5 
##$TPOFFS= (0..7)
0 0 0 0 0 0 0 0 
##$TUNHIN= 0
##$TUNHOUT= 0
##$TUNXOUT= 0
##$USERA1= <user>
##$USERA2= <user>
##$USERA3= <user>
##$USERA4= <user>
##$USERA5= <user>
##$V9= 5
##$VALIST= <valist>
##$VCLIST= <CCCCCCCCCCCCCCC>
##$VD= 0
##$VDLIST= <DDDDDDDDDDDDDDD>
##$VPLIST= <PPPPPPPPPPPPPPP>
##$VTLIST= <TTTTTTTTTTTTTTT>
##$WBST= 1024
##$WBSW= 4
##$XGAIN= (0..3)
0 0 0 0 
##$XL= 0
##$YL= 0
##$YMAX_a= 233948
##$YMIN_a= -157038
##$ZGOPTNS= <>
##$ZL1= 120
##$ZL2= 120
##$ZL3= 120
##$ZL4= 120
##$ABSF1= 0
##$ABSF2= 0
##$ABSG= 0
##$ABSL= 0
##$ALPHA= 0
##$AQORDER= 0
##$ASSFAC= 0
##$ASSFACI= 0
##$ASSFACX= 0
##$ASSWID= 0
##$AUNMP= <proc_1d>
##$AZFE= 0.1
##$AZFW= 0.1
##$BCFW= 0
##$BC_mod= 2
##$BYTORDP= 0
##$COROFFS= 0
##$CY= -3
##$DATMOD= 1
##$DC= 0
##$DFILT= <>
##$DTYPP= 0
##$F1P= 0
##$F2P= 0
##$FCOR= 1
##$FTSIZE= 16384
##$FT_mod= 6
##$GAMMA= 0
##$GB= 0
##$INTBC= 1
##$INTSCL= 3.241238e-09
##$ISEN= 128
##$LB= 0.25
##$LEV0= 0
##$LPBIN= 0
##$MAXI= 10000
##$MC2= 0
##$MEAN= 0
##$ME_mod= 0
##$MI= 1.114404
##$NCOEF= 0
##$NC_proc= -7
##$NLEV= 6
##$NOISF1= 3.799351
##$NOISF2= 2.8
##$NSP= 0
##$NTH_PI= 0
##$NZP= 0
##$OFFSET= 15.46814
##$PC= 1
##$PHC0= -5301.728
##$PHC1= 12.22193
##$PH_mod= 1
##$PKNL= yes
##$PPARMOD= 0
##$PSCAL= 0
##$PSIGN= 0
##$REVERSE= no
##$SF= 200.130010719718
##$SI= 16384
##$SIGF1= 3
##$SIGF2= 2
##$SINO= 0.751879
##$SIOLD= 32768
##$SREGLST= <19F.Aceton>
##$SSB= 0
##$STSI= 16384
##$STSR= 0
##$SW_p= 3612.71676300578
##$SYMM= 0
##$S_DEV= 0
##$TDeff= 16384
##$TDoff= 0
##$TI= <>
##$TILT= no
##$TM1= 0
##$TM2= 0
##$TOPLEV= 0
##$USERP1= <user>
##$USERP2= <user>
##$USERP3= <user>
##$USERP4= <user>
##$USERP5= <user>
##$WDW= 1
##$XDIM= 16384
##$YMAX_p= 283550485
##$YMIN_p= -610511
$$ End of Bruker specific parameters
$$ ---------------------------------
##NTUPLES= NMR SPECTRUM
##VAR_NAME=  FREQUENCY,     SPECTRUM/REAL,   SPECTRUM/IMAG
##SYMBOL=    X,             R,               I
##VAR_TYPE=  INDEPENDENT,   DEPENDENT,       DEPENDENT
##VAR_FORM=  AFFN,          ASDF,            ASDF
##VAR_DIM=   16384,         16384,           16384
##UNITS=     HZ,            ARBITRARY UNITS, ARBITRARY UNITS
##FACTOR=    0.220516191357247, 1,           1
##FIRST=     3095.63895365589, 0,            0
##LAST=      -517.077809349888, 0,           0
##MIN=       -517.077809349888, -610511,     0
##MAX=       3095.63895365589, 283550485,    0
$$ Real data points
##PAGE= N=1
##DATA TABLE= (X++(R..R)), XYDATA
$$ [...]
10156a28039J2896n7897J7689j65746J25348J04071J50741m4328k49231k4377
$$ -128039 -115143 -173040 -155351 -321097 -195749 -91678 59063 14735 -234496 -258873
10146b58873Q7795O1877l2184r882o3951N4309R830J12850j01689j2672Q1402
$$ -258873 -171078 -109201 -141385 -151267 -215218 -160909 -151079 -38229 -139918 -152590 -71188
10135g1188p1618L6689J7478K1218P959l374o9847p1863J72344M90q3103n4724
$$ -71188 -142806 -106117 -88639 -67421 -59462 -62836 -132683 -204546 -32202 -31712 -114815 -169539
10123a69539j9992M9244N0729L2885j72206k2705K84432O5097j42402R6542o7680
$$ -169539 -189531 -140287 -89558 -56673 -228879 -251584 32848 97945 -44457 52085 -15595
10112a5595j97282L8916Q5431J04643p5385j45577n9969N8240p5580J08791R8348
$$ -15595 -212877 -173961 -88530 16113 -59272 -204849 -264818 -206578 -282158 -173367 -75019
10101g5019l1993O1144m1081L4660K4734K2982P6472j00720K0722l1167J524j8157
$$ -75019 -107012 -45868 -86949 -52289 -27555 -4573 71899 -28821 -8099 -39266 -37742 -55899
10089e5899m5357k303j1125N6850m908q3443J8992M0136M3137J7851J28670J4934
$$ -55899 -101256 -103559 -114684 -57834 -62742 -146185 -127193 -87057 -43920 -26069 102601 117535
10077A17535m8770k9816m2583j20488K7320J0413m3197P3369L4492n9443j708
$$ 117535 68765 38949 -3634 -124122 -96802 -86389 -129586 -56217 -21725 -81168 -82876
10066h2876j5220m1336P0468J11365j15333j09814L0449L1222l5918j136J23649
$$ -82876 -98096 -139432 -68964 42401 -72932 -182746 -152297 -121075 -156993 -158129 -34480
10055c4480M4881q1436Q2322l6957j40825K2169J31686l5973p9316j0171M244
$$ -34480 10401 -71035 11287 -25670 -166495 -144326 -12640 -48613 -127929 -138100 -133856
10044a33856R7670j00995L2632N7317j4552l2373l2656P8050M5026j22413l1561
$$ -133856 -36186 -137181 -104549 -47232 -61784 -94157 -126813 -48763 -3737 -126150 -157711
10033a57711k6945l3510P9021K6592K394R1304n3718q9769k182J29409m9925k3103
$$ -157711 -184656 -218166 -139145 -112553 -110159 -18855 -72573 -162342 -164524 -35115 -85040 -108143
10021a08143K32936q0878k01041l0818l8621p4084K5605N9197J55428O9609n8067
$$ -108143 124793 43915 -157126 -187944 -226565 -300649 -275044 -215847 -60419 9190 -48877
10010d8877M8809n8134K4004n4442J06412o7568j36039K1657K35877p9518j30890
$$ -48877 -68 -58202 -34198 -88640 17772 -49796 -185835 -164178 71699 -7819 -138709
9999a38709k11R0871j81040j02902K0990O4095R6331j02881j0182l2525Q7052
$$ -138709 -138920 -48049 -229089 -331991 -311001 -246906 -150575 -253456 -263638 -296163 -209111
9988b09111j4544J06027J3356J2078j64190n5986L5678J4505J37121O7691o5853
$$ -209111 -223655 -117628 -104272 -92194 -256384 -312370 -276692 -262187 -125066 -57375 -123228
9977a23228J359j4255n0335L7419o0135m2062R5893j24973R8400J7613j34358
$$ -123228 -121869 -136124 -186459 -149040 -209175 -251237 -155344 -280317 -181917 -164304 -298662
9966b98662J67107R3714L3996j90117J40636J48278J5955o8358n7343j1107j32081
$$ -298662 -131555 -37841 -3845 -193962 -53326 94952 110907 42549 -14794 -25901 -157982
9955a57982n0434k3723m1321J80717K5710o6879P2277p2759r2340k811K8799J35137
$$ -157982 -208416 -232139 -273460 -92743 -67033 -133912 -61635 -134394 -226734 -229545 -200746 -65609
9943f5609r2316l8829J75625j64478l5808J00936j637m7734j03231l5043N6870
$$ -65609 -157925 -196754 -21129 -185607 -221415 -120479 -122116 -169850 -273081 -308124 -251254
9932b51254J20746q4322j09944J9552J61563J28332m1816o6580Q8960j15588j3370
$$ -251254 -130508 -214830 -324774 -305222 -143659 -15327 -57143 -123723 -34763 -150351 -163721
9921a63721k708O8493J19007k52505J15743P6533l2157K6660L65o357J38274j63925
$$ -163721 -166429 -97936 21071 -231434 -115691 -39158 -71315 -44655 -44290 -50647 87627 -76298
9909g6298j32124J21994L1508j84916N2464l7635K2228J3741l4130j0454L6200
$$ -76298 -208422 -86428 -54920 -239836 -187372 -225007 -202779 -189038 -223168 -233622 -197422
9898a97422R2622n649j57973m5589J90363n2875J3448J7320j04820K4809J9949
$$ -197422 -104800 -110449 -268422 -314011 -123648 -176523 -163075 -145755 -250575 -225766 -205817
9887b05817k15L7614j5346n1729O4309K48J34842J7806p3656j6144P3495o4052
$$ -205817 -206032 -168418 -183764 -235493 -171184 -170936 -36094 -18288 -91944 -108088 -34593 -98645
9875i8645P7064j28886R768J32606m7516j3984J6356p0987j03077N7232J27704
$$ -98645 -21581 -150467 -140699 -8093 -55609 -69593 -53237 -124224 -227301 -170069 -42365
9864d2365j8553m2404J7537q7205l677N3866J58067j01429n9323j01053O7215
$$ -42365 -60918 -103322 -85785 -172990 -176667 -122801 35266 -66163 -125486 -226539 -159324
9853a59324p777M984J32219M3003q8093j17469n6032J23352O6339k6683r0479
$$ -159324 -167101 -162117 -29898 13105 -74988 -192457 -248489 -125137 -58798 -85481 -175960
9842a75960P831J11471j20522q0381J21357M5079r02j03367k1818p199O231k2424
$$ -175960 -168129 -56658 -177180 -257561 -136204 -91125 -92027 -195394 -217212 -224411 -218180 -240604
9830b40604K4393j4524J06207k2224l993j0756L7564K274J67577k13975r7036
$$ -240604 -216211 -230735 -124528 -146752 -150745 -161501 -123937 -121663 45914 -168061 -265097
9819b65097J82138J19034k0577q4698j2356m9266n1259l1371j7318J20182R5306
$$ -265097 -82959 36075 15498 -69200 -81556 -130822 -182081 -213452 -230770 -110588 -15282
9808a5282q9227k6294l5167M5421o3482N7726n5050J57427q2737j9043L6745P851
$$ -15282 -104509 -130803 -165970 -120549 -184031 -126305 -181355 -23928 -106665 -125708 -88963 -81112
9796h1112o5067o373J5174m157O9720l0259J4978M2841j33167J4752l4833n3103
$$ -81112 -146179 -152552 -137378 -141535 -71815 -102074 -87096 -44255 -177422 -162670 -197503 -250606
9784b50606n9449J0864L9031J14610J3994j41918J22586Q5010N527k9811m7935
$$ -250606 -310055 -299191 -260160 -145550 -131556 -273474 -150888 -65878 -60351 -90162 -138097
9773a38097J06560P1283j48151l9306J21248O8543l5774n7570r6038J2976l2241
$$ -138097 -31537 39746 -108405 -147711 -26463 42080 6306 -51264 -147302 -134326 -166567
9762a66567O3899o6494j5361J2092K1498Q9681N2260n8712l4626M244n7261J40372
$$ -166567 -102668 -169162 -184523 -172431 -150933 -61252 -8992 -67704 -102330 -98086 -155347 -14975
9750a4975k6307k15662J16375m7897k8577J15191M6323p5198j11328J15477p1169
$$ -14975 -41282 -256944 -140569 -188466 -217043 -101852 -55529 -130727 -242055 -126578 -197747
9739a97747n8751n0857J27193R0828M0278Q1922j00238o7663M4853j7801K4898
$$ -197747 -256498 -307355 -180162 -89334 -49056 32866 -67372 -135035 -90182 -107983 -83085
9728h3085j0377J7832n2752l9076p7698j9862K07878m4795o7762j23120l3078
$$ -83085 -93462 -75630 -128382 -167458 -245156 -265018 -57140 -101935 -169697 -292817 -325895
9717c25895J54507J28107o1483R0527N1603q5687P3946p1010J1889N8968j12854
$$ -325895 -171388 -43281 -104764 -14237 37366 -48321 25625 -45385 -33496 25472 -87382
9706h7382N5255j00844j35135L7148j19090P5424K04160J62906j1643j47822j33345
$$ -87382 -32127 -132971 -268106 -230958 -350048 -274624 -70464 92442 80799 -67023 -200368
9695b00368k4852J13799n9871L7376J48964p5037K5881O3016j3784J03288l7039
$$ -200368 -225220 -111421 -171292 -133916 15048 -59989 -34108 28908 15124 118412 81373
9684H1373k6717j08345M1636J44981k37844r7471J53237l9808P3844P9334n487
$$ 81373 54656 -53689 -12053 132928 -104916 -202387 -49150 -88958 -15114 64220 58733
9673E8733m7034q6741p9981M6928J4106J7284N4097j15773Q5699j39028R661J04430
$$ 58733 11699 -75042 -155023 -108095 -93989 -76705 -22608 -138381 -52682 -191710 -182049 -77619
9661g7619L4990k9437P9976J3779L8892j12470L112O8527m187l9993r9520j0161
$$ -77619 -42629 -72066 7910 21689 60581 -51889 -48777 19750 15563 -24430 -123950 -134111
9649a34111M6062J2527O8107K0544j9671n0341K8733r0395l3730R3572j49438
$$ -134111 -88049 -75522 -7415 13129 -6542 -56883 -28150 -118545 -152275 -58703 -208141
9638b08141o3783J88714R7022j06856m8890P3429R8965j62765L6141N6721l7462
$$ -208141 -271924 -83210 13812 -93044 -141934 -68505 30460 -132305 -96164 -39443 -76905
9627g6905J02737K5105j05018m092L0870k5145p1767N6066j3249Q585P0183k2060
$$ -76905 25832 50937 -54081 -58173 -27303 -52448 -124215 -68149 -81398 -72813 -2630 -24690
9615b4690l2804M493J58930j044o1445l7069p664J14686p7778m8972o321N3653
$$ -24690 -57494 -53001 105929 104885 43440 6371 -1293 113393 35615 -13357 -19678 33975
9603C3975k9047J4444J4077n2498m6601q3731Q4434j7596j20043l6472J01403
$$ 33975 4928 19372 33449 -19049 -65650 -149381 -64947 -82543 -202586 -239058 -137655
9592a37655Q5263Q5516J698q3530L4766l4698L8775J0159N9566L2126L9828j02487
$$ -137655 -52392 33124 34822 -48708 -13942 -48640 -9865 294 59860 91986 131814 29327
9580B9327j6777L4526N9735P5066m8967k04659j24205j6019O004M9446J35205
$$ 29327 12550 47076 106811 181877 132910 -71749 -195954 -211973 -205969 -156523 -21318
9569b1318k3880Q9325J7311o0363l9510R5940Q7247o0134j6903q691k1328l3512
$$ -21318 -45198 44127 61438 1075 -38435 57505 144752 84618 67715 59024 37696 4184
9557D184o6613o436L6480L7215K0612l6225M5296J3916J5625N0130k0433j40392
$$ 4184 -62429 -68865 -32385 4830 25442 -10783 34513 48429 64054 114184 93751 -46641
9545d6641j41946l0848M2384K84749J25051r3120j08298j03700O1717l9423M6890
$$ -46641 -188587 -219435 -177051 107698 232749 139629 31331 -72369 -10652 -50075 -3185
9534c185P503j00687O795O7045n5440L6323J08474N3358m5254o0888r1955P6259
$$ -3185 4318 -96369 -89574 -22529 -77969 -41646 66828 120186 74932 14044 -77911 -1652
9522a652K7743P6221r794k3166p3318q391J05491j48187q2792O4389K0409P7950
$$ -1652 26091 102312 92518 69352 -3966 -12357 93134 -55053 -137845 -73456 -53047 24903
9510B4903q1171m9403M4867K9815J8098l4301J26438j9362q3889L9792r8000J32461
$$ 24903 -56268 -105671 -60804 -30989 -12891 -47192 79246 59884 -24005 15787 -82213 50248
9498E0248N882l5775j00719n0020J19000R0595L3114Q3143r0320j47476M9836
$$ 50248 56130 20355 -80364 -130384 -11384 79211 112325 195468 105148 -42328 7508
9487G508M1387l8823k7756J44726K0731p6333p8676N0850J20307P0755J0130j1476
$$ 7508 48895 10072 -17684 127042 147773 71440 -7236 43614 163921 234676 244806 233330
9475B33330L0153j82115J20582J9497r8472L0372N8050K0182j08843J43685p7078
$$ 233330 263483 81368 201950 221447 122975 153347 211397 231579 122736 266421 189343
9464A89343r9224p6593J5267J56492O732r9808J5291J01863j94354O3817P4259
$$ 189343 90119 13526 28793 185285 192017 92209 107500 209363 15009 78826 153085
9453A53085j17998J26487J00238m5475j19672j0414l617J27141r038j35565n911
$$ 153085 35087 161574 261812 216337 96665 86251 82634 209775 200737 65172 59261
9442E9261J44887J16475j17200J56458l9455l5197J0708r1697M2452J32122P0131
$$ 59261 204148 320623 203423 359881 320426 285229 295937 204240 246692 378814 448945
9431D48945P4242p6262o9854J03568r4720R2057r9408k7356L4247P3055K1990
$$ 448945 523187 446925 377071 480639 385919 477976 378568 351212 385459 458514 480504
9420D80504K8468J08391L54q9868k9261p9640L5943k3991K1051K2912J30273o579
$$ 480504 508972 617363 617717 527849 498588 418948 454891 430900 451951 474863 605136 598557
9408E98557j63829J6047M0296Q3101n5925m3688l599n1481Q2143M6025K3132J3858
$$ 598557 434728 450775 491071 574172 518247 474559 470960 419479 501622 547647 570779 584637
9396E84637r649p7435n7416O0723q4492J21623O3468o5512p2894l8020k7947J31211
$$ 584637 574988 497553 440137 500860 416368 537991 601459 535947 463053 425033 397086 528297
9384E28297J52595R6024P9459n7491j935M952J4469j30659q0879j3189K139J43308
$$ 528297 680892 776916 856375 798884 796949 801901 816370 685711 604832 591643 593782 737090
9372G37090O8535j56968l1316k143J04074K8168l5933j3302r7507k0615j7530
$$ 737090 805625 648657 617341 615198 719272 747440 711507 698205 600698 580083 562553
9361E62553j10146q5999K8119l9283J40538n8015L2899M1125q5874j55561J02975
$$ 562553 452407 366408 394527 355244 495782 437767 470666 511791 425917 270356 373331
9350C73331Q7962J20344L4748q8357k4525m9539n6091J40792K47939j73693k1694
$$ 373331 461293 581637 616385 528028 503503 453964 397873 538665 786604 612911 591217
9339E91217j8704R7011J67147J19416k3399K17216n3369p6069n723J08460Q3983
$$ 591217 572513 669524 836671 956087 932688 1149904 1096535 1020466 1014743 1123203 1207186
9328A207186J5968J9164M5296n3786O7954K03579J6488L1391L9485R2278j6616
$$ 1207186 1223154 1242318 1287614 1233828 1301782 1505361 1521849 1553240 1592725 1685003 1668387
9317A668387K9408K489L6902o091k9601q6868K9472l0258n933N7841p664p2664
$$ 1668387 1697795 1700284 1737186 1731095 1701494 1614626 1644098 1613840 1607907 1665748 1658084 1585420
9305A585420K2769Q2364L5804j4931J16555j642j27536N9547J36978K1548O836
$$ 1585420 1608189 1690553 1726357 1711426 1827981 1826339 1698803 1758350 1895328 1916876 1923712
9294A923712j4537n6513J48901N199j51012O7702J98148q5160P4274J21730K8106
$$ 1923712 1909175 1852662 2001563 2006762 1855750 1923452 2121600 2036440 2110714 2232444 2260550
9283B260550m3546j10225L8840o9879J9811J38299k5054p3375j00216n3018j01692
$$ 2260550 2217004 2106779 2145619 2075740 2095551 2233850 2208796 2135421 2035205 1982187 1880495
9272A880495k7551J79445Q4361N0629r5940L9230P2646N9262J93393K17604J41622
$$ 1880495 1852944 2032389 2116750 2167379 2071439 2110669 2183315 2242577 2435970 2653574 2795196
9261B795196K16955J77168J75630j9189J0207L0183L5926j09291J06436J39099
$$ 2795196 3012151 3189319 3364949 3345760 3355967 3386150 3422076 3312785 3419221 3558320
9251C558320J34742K65338J01399o9640j83086n8819J13945N870m2501N4416J4484
$$ 3558320 3693062 3958400 4059799 3990159 3807073 3748254 3862199 3868069 3825568 3879984 3894468
9240C894468j52994N7901l5878J71239j08644r8991J11218n4427o0394L2941J18193
$$ 3894468 3741474 3799375 3763497 3934736 3826092 3727101 3838319 3783892 3723498 3756439 3874632
9229C874632p8769L9430O7657P0319L03741O88085P15536N25245M39456L58685
$$ 3874632 3795863 3835293 3902950 3973269 4277010 4965095 5680631 6205876 6645332 7004017
9219G004017k38682n21015p046J41564L51443Q33549Q30230N61740N71037K43492
$$ 7004017 6765335 6244320 6237274 6378838 6730281 7563830 8394060 8955800 9526837 9770329
9209I770329n65718n24619m09593j38925j15870j02710l8345O3678l36762m02783
$$ 9770329 9204611 8679992 8270399 8131474 8015604 7912894 7874549 7938227 7601465 7198682
9199G198682j42351k93901l84975j97019o2086k79828l29327j66146k34906m05961
$$ 7198682 7056331 6762430 6377455 6180436 6118350 5838522 5509195 5343049 5108143 4702182
9189D702182l41744j87398j11373N3638j16103j83205k35401k79715P5118m69
$$ 4702182 4360438 4173040 4061667 4115305 3999202 3815997 3580596 3300881 3375999 3375530
9179C375530j25998j17338n2637M8720J5270K5318q1357j02537k08572j94217
$$ 3375530 3249532 3132194 3079557 3128277 3143547 3168865 3087508 2984971 2776399 2582182
9169B582182j54975N3003R4276j75958M192K0461r5138O5887K2528P0871l1111
$$ 2582182 2427207 2480210 2574486 2398528 2402720 2423181 2328043 2393930 2416458 2487329 2456218
9158B456218l7308j90689L6793m807K0895p9150j37929k3488J43769p0591p8126
$$ 2456218 2418910 2228221 2265014 2260207 2281102 2201952 2064023 2040535 2184304 2113713 2035587
9147B035587k6645M7145N759m1743P45l8839o6645J3883J1900K0875M7531l702
$$ 2035587 2008942 2056087 2061846 2020103 2020848 1982009 1915364 1929247 1941147 1962022 2009553 2005851
9135B005851j06285k4784j1544L0722M1823j49375O8419O7782J19776K366j14213
$$ 2005851 1899566 1874782 1863238 1893960 1935783 1786408 1854827 1922609 2042385 2044751 1930538
9124A930538M5553J24767k6150J00368J07465J59996Q4516J2399o3138q0021R6826
$$ 1930538 1976091 2100858 2074708 2175076 2282541 2442537 2527053 2539452 2476314 2396293 2493119
9113B493119J95239R6767J09434p5520R2147j7281J52315n6948j7155P677k7197
$$ 2493119 2688358 2785125 2894559 2819039 2911186 2893905 3046220 2989272 2972117 2979794 2952597
9102B952597k9434m7190k9489N5130K002o3762j27869l2837O6646L9719K29566
$$ 2952597 2923163 2875973 2846484 2901614 2903616 2839854 2711985 2679148 2745794 2785513 3015079
9091C015079J43306k5462J62315O7205J11155K09575R9700J68305J04458P2509
$$ 3015079 3158385 3132923 3295238 3362443 3473598 3683173 3782873 3951178 4055636 4128145
9081D128145k1040j75321q8565l5577R7111o6280j87338N5897j30138l8728j34983
$$ 4128145 4107105 3931784 3843219 3807642 3904753 3838473 3651135 3707032 3576894 3538166 3403183
9070C403183q4157M6490j7114O4806j4445o3507J8104K4176K6159j10894p3136
$$ 3403183 3319026 3365516 3348402 3413208 3398763 3335256 3353360 3377536 3403695 3292801 3219665
9059C219665M9192o281P0275J7608k2802m6599J0268P9954J42982O9976n04P2566
$$ 3219665 3268857 3262576 3332851 3350459 3327657 3281058 3291326 3371280 3514262 3584238 3583734 3656300
9047C656300J95105J43520N1984o749r3196l9883p0249L0445j9729r0942j69096
$$ 3656300 3851405 3994925 4046909 4040160 3946964 3907081 3836832 3867277 3847548 3756606 3587510
9036C587510k1534J80088q9902l2927J55136n8469p0907N7523j81453l1766q548
$$ 3587510 3565976 3746064 3656162 3623235 3778371 3719902 3648995 3706518 3525065 3493299 3484751
9025C484751j6186J96186P4453k3757K8837n9434J39458m2189k3808J17033n9852
$$ 3484751 3468565 3664751 3739204 3715447 3744284 3684850 3824308 3782119 3758311 3875344 3815492
9014C815492K9457N8391N4718n1750Q6697J71010J45069p9990O1069K72346P9692
$$ 3815492 3844949 3903340 3958058 3906308 3993005 4164015 4309084 4229094 4290163 4562509 4642201
9003D642201J32040K74400J02593K72857K65643J51925J50958J83497K08938N9915
$$ 4642201 4774241 5048641 5151234 5424091 5689734 5841659 5992617 6176114 6385052 6444967
8993F444967K15872M02076L32588J40325K47659M78924L95809K31481J00135J08980
$$ 6444967 6660839 7062915 7395503 7535828 7783487 8262411 8658220 8889701 8989836 9098816
8983I098816P8267K32147J64813J09011l6038P0015R6799K53201K30461J47549
$$ 9098816 9177083 9409230 9574043 9683054 9647016 9717031 9813830 10067031 10297492 10445041
8973A0445041K07834J55831J52653L999K86472K78330J21327K85035M38957M43590
$$ 10445041 10652875 10808706 10961359 10965358 11251830 11530160 11651487 11936522 12375479 12819069
8963A2819069L31726M00431M16068O76862Q53578J128191Q51038P27230R85797
$$ 12819069 13150795 13551226 13967294 14644156 15497734 16625925 17476963 18204193 19189990
8954A9189990J131119L74541n17396n97321l11568j10265j2190J38507K81370
$$ 19189990 20321109 20695650 20178254 19580933 19269365 19159100 19146910 19285417 19566787
8945A9566787L97111M05704O03497M88663M75735P17698P04173Q71096J166420
$$ 19566787 19963898 20369602 20973099 21461762 21937497 22655195 23359368 24230464 25396884
8936B5396884J520800J342046J598497J637904J836063K064211L210332N324251
$$ 25396884 26917684 28259730 29858227 31496131 33332194 35396405 38606737 43930988
8928D3930988P842692J1085459J1939421Q125163M361147K945453j711578o982354
$$ 43930988 51773680 62859139 74798560 82923723 87284870 90230323 88518745 81536391
8920H1536391q221629n582655j780113K091741O543420O916311N223300O381943
$$ 81536391 73314762 67732107 65951994 68043735 74587155 81503466 86726766 93108709
8912I3108709O408885K079545l861283m910903l589077k321423j335872m86944
$$ 93108709 99517594 101597139 97735856 92824953 89235876 86914453 85578581 85091637
8904H5091637j33156J9256K68444M89219M63753k01865o83193r29979j056693
$$ 85091637 84958481 84977737 85246181 85735400 86199153 85997288 85314095 84384116 83327423
8895H3327423j099068j020911o28190m99454m01250J10174R02658K535212K329532
$$ 83327423 82228355 81207444 80579254 80079800 79678550 79788724 80691382 83226594 85556126
8886H5556126J629170K224008K408641J081668j263722j081559J089392M338441
$$ 85556126 87185296 89409304 91817945 92899613 91635891 90554332 91643724 95982165
8878I5982165R486962J2248635R406267R646957J1319642Q618610O80048k484847
$$ 95982165 105469127 117717762 127124029 136770986 148090628 156709238 157389286 154904439
8870A54904439K295652O669799R983116J0838175R058263Q753374O077139J295994
$$ 154904439 157200091 163869890 173853006 184691181 193749444 202502818 208579957 209875951
8862B09875951k937687o544001m419355j364520k9886Q29231J015966R19741j418
$$ 209875951 206938264 200394263 195974908 194610388 194580502 195409733 196425699 197345440 197344022
8853A97344022l168939n209344o402271o380907n087848m233209l481314l185170
$$ 197344022 194175083 188965739 182563468 176182561 171094713 166861504 163380190 160195020
8845A60195020k765846k143668j456731o45230K3021K41080j86703r11707j304565
$$ 160195020 157429174 155285506 153828775 153183545 153206566 153447646 153260943 152349236 151044671
8836A51044671j132237j662258k276273k979094k993575k369044k995720l931357
$$ 151044671 149912434 148250176 145973903 142994809 140001234 137632190 134636470 130705113
8828A30705113m256449m181077l708020l350764l512136m110921m201828m047154
$$ 130705113 126448664 122267587 118559567 115208803 111696667 107585746 103383918 99336764
8820I9336764m107578m221986l916333l767196l166997k847231k508634k386865
$$ 99336764 95229186 91007200 87090867 83323671 80156674 77309443 74800809 72413944
8812G2413944k432173k001272k000408j890519j966082j684493j579238j632978
$$ 72413944 69981771 67980499 65980091 64089572 62123490 60438997 58859759 57226781
8804E7226781j549210j466874j371210j125191j171666j101531j018499j074971
$$ 57226781 55677571 54210697 52839487 51714296 50542630 49441099 48422600 47347629
8796D7347629j021792p67336r63546r07252q34137q28506q67986r24112p08906
$$ 47347629 46325837 45558501 44594955 43687703 42853566 42025060 41157074 40232962 39524056
8787C9524056q33429q54353r02265p44197r14715o65256p47848n90962n34526
$$ 39524056 38690627 37836274 36934009 36189812 35275097 34609841 33861993 33271031 32736505
8778C2736505p26751p45153p50366o29863o77493o21021o85384p15836m89929
$$ 32736505 32009754 31264601 30514235 29884372 29206879 28585858 27900474 27184638 26694709
8769B6694709l96935m12727k65560j10315k33546k39239k10380k64236j03524
$$ 26694709 26297774 25885047 25619487 25509172 25275626 25036387 24826007 24561771 24458247
8760B4458247j60604P7125j2563r7610j06580K8921K5627k86459j92556r5190
$$ 24458247 24297643 24374768 24362205 24264595 24158015 24186936 24212563 23926104 23733548 23638358
8750B3638358q5504O7831n1670l324P0595j81230j35456p9158j81619l20830j43529
$$ 23638358 23552854 23620685 23569015 23565691 23636286 23455056 23319600 23240442 23058823 22737993 22594464
8739B2594464r0122j26581J4475J56256L78589M33221N24824O20650N25944M43288
$$ 22594464 22504342 22377761 22392236 22548492 22927081 23360302 23885126 24505776 25031720 25475008
8729B5475008O22907M89125K77918K37300L48046L32779N22041N86840M10151
$$ 25475008 26097915 26587040 26864958 27102258 27450304 27783083 28305124 28891964 29302115
8720B9302115N83979P49681N39135N19133L12590J11186o1512j75187m84096n17809
$$ 29302115 29886094 30635775 31174910 31694043 32006633 32117819 32056307 31881120 31397024 30879215
8710C0879215m99408l37262k48718m96397l74435k48804l32903k23878j93534
$$ 30879215 30379807 30042545 29793827 29297430 28922995 28674191 28341288 28117410 27923876
8701B7923876l12193k98499l65224j96607k48055l83676k95204k67309j92749
$$ 27923876 27611683 27313184 26947960 26751353 26503298 26119622 25824418 25557109 25364360
8692B5364360q7596Q2642K6377J0032O0024k02560j94655J04553q6911j950m9250
$$ 25364360 25276764 25359406 25385783 25395815 25455839 25253279 25058624 25163177 25076266 25074316 25025066
8681B5025066o9697j2465Q2527J45152J26461J85523R6700K45643K1638j21234
$$ 25025066 24955369 24942904 25025431 25170583 25297044 25482567 25579267 25824910 25846548 25725314
8671B5725314j28487l0733k54443k91895k34765k17752l02446l68396m27688m57129
$$ 25725314 25596827 25566094 25311651 25019756 24784991 24567239 24264793 23896397 23468709 23011580
8661B3011580l80955l24371n79987l11830k94950l73457l96948k80524k70899
$$ 23011580 22630625 22306254 21726267 21414437 21119487 20746030 20349082 20068558 19797659
8652A9797659k00901l23134r6920j13040r3708n9578j02337k52754j67192k27101
$$ 19797659 19596758 19273624 19176704 19063664 18969956 18910378 18808041 18555287 18388095 18160994
8642A8160994j83570q8491j3279J6968m1750P5837Q5698J0963j96620p4910k26293
$$ 18160994 17977424 17888933 17875654 17892622 17850872 17926709 18012407 18023370 17826750 17751840 17525547
8631A7525547j08896k27146j62458q094l324J20080M0555l7323J0927j07601j29626
$$ 17525547 17416651 17189505 17027047 17018953 17015629 17135709 17176264 17138941 17149868 17042267 16912641
8620A6912641j08178m4437r8277k47444j58822r5727j86030j71252k57640k03260
$$ 16912641 16804463 16760026 16661749 16414305 16255483 16159756 15973726 15802474 15544834 15341574
8610A5341574l00737j23288k06326k54870j51782l21146k14931j38387k13267
$$ 15341574 15040837 14917549 14711223 14456353 14304571 13983425 13768494 13630107 13416840
8601A3416840N0355l9613j64482l2049J45418j06701j85283k49448m485L6297
$$ 13416840 13467195 13427582 13263100 13231051 13376469 13269768 13084485 12835037 12830552 12866849
8591A2866849j22267n3310o1345p9995J84327J36496j68636Q659J09982j21052
$$ 12866849 12744582 12691272 12629927 12549932 12734259 12870755 12702119 12710778 12820760 12699708
8581A2699708R1747M9401J6221j996q5697J8656O5573R3460m8238j69484P4345
$$ 12699708 12791455 12840856 12857077 12855081 12769384 12788040 12853613 12947073 12898835 12729351 12803696
8570A2803696L65j2700o509j05312O4049J59977K54812J66471J18561J27591L81168
$$ 12803696 12804061 12791361 12784852 12679540 12743589 12903566 13158378 13324849 13443410 13571001 13952169
8559A3952169L23995M81191N30677N89976N41020P21135Q01511L50048L43005
$$ 13952169 14276164 14757355 15288032 15878008 16419028 17140163 17941674 18291722 18634727
8550A8634727M13937L86395N15563M83302P44480J114266J361662J721788K267696
$$ 18634727 19048664 19435059 19950622 20433924 21178404 22292670 23654332 25376120 27643816
8541B7643816K864678M543579O826501R297413J1060260J1915201J2136611J0456238
$$ 27643816 30508494 35052073 41878574 51175987 62236247 74151448 86288059 96744297
8533I6744297O994159K424895j999441n666226o782396n764097m025612k181441
$$ 96744297 103738456 106163351 104163910 98497684 91715288 85951191 81925579 79744138
8525G9744138j118331k17565L84092J125093J701402J983923J854860J704815
$$ 79744138 78625807 78408242 78792334 79917427 81618829 83602752 85457612 87162427
8517H7162427J586118J242036Q87619N23882J69131k33975n06123j003665j432929
$$ 87162427 88748545 89990581 90878200 91402082 91571213 91337238 90831115 89827450 88394521
8508H8394521j973491k260825k455572k317497k209088j682115m86739J326311
$$ 88394521 86421030 84160205 81704633 79387136 77178048 75495933 75009194 76335505
8500G6335505L977865O069457P214092P855545P038343N404190K586409j100397
$$ 76335505 80313370 86382827 93596919 101452464 108490807 113894997 116481406 115381009
8492A15381009m519404o705543o489813n360127l662280k386018j455058q00469
$$ 115381009 110861605 104156062 97666249 92306122 88643842 86257824 84802766 84002297
8484H4002297l47039k02417M75139O39274M61268L84769K20291O4867j74318n49443
$$ 84002297 83655258 83452841 83927980 84567254 85028522 85413291 85633582 85698449 85524131 84974688
8474H4974688p97575j138980j341779j696973k132905k493264k790203l141066
$$ 84974688 84177113 83038133 81696354 79999381 77866476 75373212 72583009 69441943
8466F9441943l456749l519013l389299l256125k807688k502715k184601k132670
$$ 69441943 65985194 62466181 59076882 55820757 53013069 50510354 48325753 46193083
8458D6193083j895353j768135j751247j599639j515390j213333j222759j021537
$$ 46193083 44297730 42529595 40778348 39178709 37663319 36449986 35227227 34205690
8450C4205690r62501j001080q73813p58164q45430q75609r89749p35569q21719
$$ 34205690 33243189 32242109 31368296 30610132 29764702 28889093 27899344 27163775 26342056
8441B6342056p23205p57668q24164o71330p20708q17453n40310n21501n16266
$$ 26342056 25618851 24861183 24037019 23365689 22644981 21827528 21287218 20765717 20249451
8432B0249451o25099l37364l81710m47588m83702m31425l91799l53272l44871
$$ 20249451 19624352 19286988 18905278 18457690 17973988 17542563 17150764 16797492 16452621
8423A6452621m58505l60466k62371l07265m96309k87426l18076m55267m00729
$$ 16452621 15994116 15633650 15371279 15064014 14567705 14280279 13962203 13506936 13106207
8414A3106207l49411k20589l9762k64345k27240k23228l95228k37883j94198k71992
$$ 13106207 12756796 12536207 12496445 12232100 12004860 11781632 11386404 11148521 10954323 10682331
8404A0682331k46958j60695j77819k04115j70136r5725n01112q7323j6441k61803
$$ 10682331 10435373 10274678 10096859 9892744 9722608 9626883 9125771 9038448 9022007 8760204
8394H760204j09482j43873j74327j83013p3825j17410j33028l6195n5600J28433
$$ 8760204 8650722 8506849 8332522 8149509 8075684 7958274 7825246 7789051 7733451 7861884
8384G861884P7201j11174J05964J4268k42362j46696r0644k73041j39600k11771
$$ 7861884 7939085 7827911 7933875 7948143 7705781 7559085 7468441 7195400 7055800 6844029
8374F844029j8556k3680k40030j44936j0519m2852j94758p9864J6664l7807m1745
$$ 6844029 6825473 6801793 6561763 6416827 6406308 6363456 6168698 6088834 6105498 6067691 6025946
8363F025946j66452k8029l3812p2783l3182q578j35556k18281P7645j58494L0562
$$ 6025946 5859494 5831465 5797653 5724870 5691688 5683110 5547554 5329273 5406918 5248424 5278986
8352E278986R0686k39859o4078K2518j37109P7899R7546j34991J38585J9117K1558
$$ 5278986 5369672 5129813 5065735 5088253 4951144 5029043 5126589 4991598 5130183 5149300 5170858
8341E170858Q7073j0548j96042j74643M4359k25689m6506n9082m26r7955j37245
$$ 5170858 5257931 5247383 5051341 4876698 4921057 4695368 4648862 4589780 4589354 4491399 4354154
8330D354154o3844o1874Q5904j42787p9537m4953p5862j47549N4228J24689j49921
$$ 4354154 4290310 4228436 4314340 4171553 4092016 4047063 3971201 3823652 3877880 4002569 3852648
8319C852648n9520P2728n0652K2991k05726l0972m5237j26830n3737j2131k0891
$$ 3852648 3793128 3865856 3815204 3838195 3632469 3601497 3556260 3429430 3375693 3363562 3342671
8308C342671n216R6615o6554j35035m2247N8069Q0294k4121q0161m3523O4080
$$ 3342671 3337455 3434070 3367516 3232481 3190234 3248303 3328597 3304476 3224315 3180792 3244872
8297C244872r5737p1873j13315r5170o360L0660q2927O1158M9810J00182R3786
$$ 3244872 3149135 3077262 2963947 2868777 2862417 2893077 2810150 2871308 2921118 3021300 3115086
8286C115086j11781M7986R2236N3511J65267o6657m6891m4473r6740o7511r1865
$$ 3115086 3003305 3051291 3143527 3197038 3362305 3295648 3248757 3204284 3107544 3040033 2948168
8275B948168l8894j5732L2534K3069K0350o7413O6599k4102R3551M5985m8285
$$ 2948168 2909274 2893542 2926076 2949145 2969495 2902082 2968681 2944579 3038130 3084115 3035830
8264C035830o4735Q1298j0403M2106K4772l2483j45973J61534Q7471M1889o5081
$$ 3035830 2971095 3052393 3041990 3084096 3108868 3076385 2930412 3091946 3179417 3221306 3156225
8253C156225N7325P1464K9278l2932O916J8652J72477q3189j24210O4792l667
$$ 3156225 3213550 3285014 3314292 3281360 3288276 3306928 3479405 3396216 3272006 3336798 3333131
8242C333131r6790j65820J55002L0373m2364j36286m7415j5216M3376j78112R4104
$$ 3333131 3236341 3070521 3225523 3255896 3213532 3077246 3029831 3014615 3057991 2879879 2973983
8231B973983j47957q8817J10328j22864l5118J88780j00593p7463K5322q2851
$$ 2973983 2826026 2737209 2847537 2724673 2689555 2878335 2777742 2700279 2725601 2642750
8221B642750j70907p3305N9615k9959J00504Q52l7971J01843L3404m8416P3760
$$ 2642750 2471843 2398538 2458153 2428194 2528698 2529550 2491579 2593422 2626826 2578410 2652170
8210B652170o6505p1045m5480j21508n2230J5287l413Q202j0990p3741r0412j6204
$$ 2652170 2585665 2514620 2469140 2347632 2295402 2310689 2307276 2315478 2304488 2230747 2140335 2124131
8198B124131j01938M8020Q0767k8182J94757j25787j87712M0181J63778K8907
$$ 2124131 2022193 2070213 2150980 2122798 2317555 2191768 2004056 2044237 2208015 2236922
8188B236922j95736j7420r6646j3550P7514K4308j31215N7836J27714j6568N4977
$$ 2236922 2041186 2023766 1927120 1913570 1991084 2015392 1884177 1942013 2069727 2053159 2108136
8177B108136n6258J2625N6673j34382K2586J05064J02692K8137J31381O8353o1621
$$ 2108136 2051878 2064503 2121176 1986794 2009380 2114444 2217136 2245273 2376654 2445007 2383386
8166B383386q5307J06249M1879J4781q4468j76856L7495j02925l9429l9125J14872
$$ 2383386 2298079 2404328 2446207 2460988 2376520 2199664 2237159 2134234 2094805 2055680 2170552
8155B170552n4512J25064n9919l6899R2191k3066k4489K5218O4256K3972N9866
$$ 2170552 2116040 2241104 2181185 2144286 2236477 2213411 2188922 2214140 2278396 2302368 2362234
8144B362234J18700J05326n4008P0818m6033M3206J9042n373l3298N381P4337
$$ 2362234 2480934 2586260 2532252 2603070 2557037 2600243 2619285 2613912 2580614 2585995 2660332
8133B660332P3329J30972J67522K28673K95863J29102K30175K38204J25101Q1412
$$ 2660332 2733661 2864633 3032155 3260828 3556691 3685793 3915968 4154172 4279273 4360685
8123D360685K46784J63082N9322n1084k9089J77616r0745j24561j09494j50267
$$ 4360685 4607469 4770551 4829873 4778789 4749700 4927316 4836571 4712010 4602516 4452249
8113D452249O6572J13646M9236n0684j53099p592K3244N8082k6992N9260J5579
$$ 4452249 4518821 4632467 4681703 4631019 4477920 4470328 4493572 4551654 4524662 4583922 4599501
8102D599501k1376m2044l1623P1919n2457L5250J96128J65269j756n9222J08492
$$ 4599501 4578125 4536081 4504458 4576377 4523920 4559170 4755298 4920567 4918811 4859589 4968081
8091D968081J25629L3324j15235J51197J98218K51003L86260K99504L71091K35913
$$ 4968081 5093710 5127034 5011799 5162996 5361214 5612217 5998477 6297981 6669072 6904985
8081F904985J96392L4427l2696m3869r1987k6645l16156j39195m6566j88444r9342
$$ 6904985 7101377 7135804 7103108 7059239 6967252 6940607 6624451 6485256 6438690 6250246 6150904
8070F150904l0119j10267r9978p0831J42608m651l9566l7903N9673J50342j318
$$ 6150904 6120785 6010518 5910540 5839709 5982317 5977666 5938100 5900197 5959870 6110212 6108894
8059F108894o3637J9023K5415J05774k604j5848o4379j40812j136j50349r4879
$$ 6108894 6045257 6064280 6089695 6195469 6192865 6177017 6112638 5971826 5970690 5820341 5725462
8048E725462n1522K3479j07616m288O4197J13629J28077L2395p6696l6950J6498
$$ 5725462 5673940 5697419 5589803 5585515 5649712 5763341 5891418 5923813 5847117 5810167 5826665
8037E826665j1043j86078j49071L6393o1973j01062k58326r0434L0165r5205J3796
$$ 5826665 5815622 5629544 5480473 5516866 5454893 5353831 5095505 5005071 5035236 4940031 4953827
8026D953827J0261j4669Q4644j6509r5052j71874m3001J81698J08301J19058j83005
$$ 4953827 4964088 4949419 5034063 5017554 4922502 4750628 4707627 4889325 4997626 5116684 4933679
8015D933679j57187j20594L3532k51084j76355N4990j7729p4701q7245j27330
$$ 4933679 4776492 4655898 4689430 4438346 4261991 4316981 4299252 4224551 4137306 4009976
8005D009976j47472O0674K2254j22466j44332l730j00684k37015l8848j28526
$$ 4009976 3862504 3923178 3945432 3822966 3678634 3674904 3574220 3337205 3298357 3169831
7995C169831m7574r241q8537j01862k4599j7203j37253L9629p2991j4977j03060
$$ 3169831 3122257 3113016 3024479 2922617 2898018 2880815 2743562 2783191 2710200 2695223 2592163
7984B592163n0537q4278r685M7859j52859K6642O5603m7152k1841j09526l5212
$$ 2592163 2541626 2457348 2447663 2495522 2342663 2369305 2434908 2387756 2365915 2256389 2221177
7973B221177l9621O603J30047p66j73788j21725j71210o167J6404L3984p292J14161
$$ 2221177 2181556 2188159 2318206 2317440 2143652 2021927 1850717 1844550 1860954 1894938 1887646 2001807
7961B001807k6544j53711j12285l3844K1653j7529l5322J5009O1576p2543J05588
$$ 2001807 1975263 1821552 1709267 1675423 1697076 1679547 1644225 1659234 1720810 1648267 1753855
7950A753855j39868n1257N7850J8059j11280N2629j10738j3121J62359n6529J4646
$$ 1753855 1613987 1562730 1620580 1638639 1527359 1579988 1469250 1456129 1618488 1561959 1576605
7939A576605m1470L9611j01511j2226L1444m0023P0726q2797J0305O4890Q0210
$$ 1576605 1535135 1574746 1473235 1461009 1492453 1452430 1523156 1440359 1450664 1515554 1595764
7928A595764o0316Q487j82643J31366J8502j34K6061K9713M7434j288j2639j79282
$$ 1595764 1535448 1543935 1361292 1492658 1511160 1511026 1537087 1566800 1614234 1612946 1600307 1421025
7916A421025Q5290L7410k941l2122J12843r9225P0003M300J10635Q0549j24408
$$ 1421025 1506315 1543725 1540784 1508662 1621505 1522280 1592283 1596583 1707218 1787767 1663359
7905A663359j2289l1057l1104n2033j56589J56880j2350N3420k0691L8799J15898
$$ 1663359 1651070 1620013 1588909 1536876 1380287 1537167 1524817 1578237 1557546 1596345 1712243
7894A712243Q0179p1715P6532Q6717j94J37480K4937J68568J38519L05806L17957
$$ 1712243 1792422 1720707 1797239 1883956 1883762 2021242 2046179 2214747 2353266 2659072 2977029
7883B977029K75156J92261l1982J614O9476k26801L7503Q5774p1005L3189l3263
$$ 2977029 3252185 3444446 3412464 3414078 3483554 3256753 3294256 3380030 3309025 3342214 3308951
7872C308951Q6504l2313j48349r2998j9713j53939j55591k28081p8312j16641
$$ 3308951 3395455 3363142 3214793 3121795 3102082 2948143 2792552 2564471 2486159 2369518
7862B369518j95933R2698R7392j33288k21952J16532P9468l1357N8883N0963m7741
$$ 2369518 2173585 2266283 2363675 2230387 2008435 2124967 2204435 2173078 2231961 2282924 2235183
7851B235183L5633Q371J40287J61771L46061K64859J75823K64097M0474j92205
$$ 2235183 2270816 2279187 2419474 2581245 2927306 3192165 3367988 3632085 3672559 3480354
7841C480354M9114Q6129r8954k34661j49273P4493K03598j03946k00062Q8224
$$ 3480354 3529468 3615597 3516643 3281982 3132709 3207202 3410800 3306854 3106792 3195016
7831C195016O5971j7402p8470k52310k35992k44051q3789n9201j6617n3481j17978
$$ 3195016 3260987 3243585 3165115 2912805 2676813 2432762 2348973 2289772 2273155 2219674 2101696
7820B101696l8600o7651j24386n2501j05191L9005M4692j14570J5013j3776Q0854
$$ 2101696 2063096 1995445 1871059 1818558 1713367 1752372 1797064 1682494 1697507 1683731 1764585
7809A764585J24259j00579j8500p5778r9185k88643N05243P30299m98173j29505
$$ 1764585 1888844 1788265 1769765 1693987 1594802 1306159 1811402 2541701 2043528 1914023
7799A914023j5745r3684j37993n5923o7736j65427o3647P6415j2256j4611p9143
$$ 1914023 1898278 1804594 1666601 1610678 1542942 1377515 1313868 1390283 1378027 1363416 1284273
7788A284273J74733j080J303o1264l7141p3165N59l4910n0810N3999j20542K26690
$$ 1284273 1459006 1457926 1459229 1397965 1360824 1287659 1288218 1253308 1202498 1256497 1135955 1362645
7776A362645K9645j00079m7749q9684J2417J19785J3849j83947j5238K31236l3555
$$ 1362645 1392290 1292211 1244462 1154778 1167195 1286980 1300829 1116882 1101644 1332880 1299325
7765A299325q3425R1770O5191j48379j21850J1460j0868j2534L244j27045n0956
$$ 1299325 1215900 1307670 1372861 1224482 1102632 1114092 1103224 1090690 1093934 966889 915933
7754I15933K2444J0121J04462O2029j46860K9347N5982j1370n4048l5691K7695
$$ 915933 938377 948498 1052960 1114989 968129 997476 1053458 1042088 988040 952349 980044
7743I80044M1270R5075l4346o5433K7315o0838o7342J49004O5678n5337N851O2471
$$ 980044 1021314 1116389 1082043 1016610 1043925 983087 915745 1064749 1130427 1075090 1080941 1143412
7731A143412p4994P019J35838J27452j60495n1237K6490p658j9371o4210M3977
$$ 1143412 1068418 1075437 1211275 1338727 1178232 1126995 1153485 1145827 1126456 1062246 1106223
7720A106223O738l83o6963J41234L9862k0992J92871R6020K1487j04917k207o0981
$$ 1106223 1112961 1112578 1045615 1186849 1226711 1205719 1398590 1494610 1516097 1411180 1408973 1347992
7708A347992J26002L8706K4693J40365j1649l9995n639j14862N6627K17918M6020
$$ 1347992 1473994 1512700 1537393 1677758 1666109 1626114 1620475 1505613 1562240 1780158 1826178
7697A826178K66120l3671m5649r605K10043J17006j4291J26352J74412K52964
$$ 1826178 2092298 2058627 2012978 2003373 2213416 2330422 2316131 2442483 2616895 2869859
7687B869859J10263N6654J08076o900J95322K43987K4982J74156K46129K49036
$$ 2869859 2980122 3036776 3144852 3137952 3333274 3577261 3602243 3776399 4022528 4271564
7677D271564L18843J45473R7808J31725Q3923O8728J19784J8488k5044k6544K49858
$$ 4271564 4590407 4735880 4833688 4965413 5049336 5118064 5237848 5256336 5231292 5204748 5454606
7666E454606J31613J8601P0888J02804J28617L4428j21494m2368p138j1559M4173
$$ 5454606 5586219 5604820 5675708 5778512 5907129 5941557 5820063 5777695 5770557 5758998 5803171
7655E803171k49817p8668l8707N6129n7655R7153l4647n9072N2595j80560K0151
$$ 5803171 5553354 5474686 5435979 5492108 5434453 5531606 5496959 5437887 5490482 5309922 5330073
7644E330073J34485k4390j6095k2605n0602J86954N3117N527n5933P2642O0339
$$ 5330073 5464558 5440168 5424073 5401468 5350866 5537820 5590937 5596464 5540531 5613173 5673512
7633E673512K5787j62766l0000j82226k38835K5836j40977m6276p0615q2161j23961
$$ 5673512 5699299 5536533 5506533 5324307 5085472 5111308 4970331 4924055 4853440 4771279 4647318
7622D647318R692m6307q5308j28543p3860o8187k38400k12767k05000k83740j64287
$$ 4647318 4657010 4610703 4525395 4396852 4322992 4254805 4016405 3803638 3598638 3314898 3150611
7611C150611k05087n0331p5177j28968j48578L6675j20245j25780j82385l0037
$$ 3150611 2945524 2895193 2820016 2691048 2542470 2579145 2458900 2333120 2150735 2120698
7601B120698j01253j22655n8362j38362m7998M6242j8776j60625q3148K0136q295
$$ 2120698 2019445 1896790 1838428 1700066 1652068 1698310 1679534 1518909 1435761 1455897 1447602
7590A447602o6748j65081J4571j4895K1304K763j23444J63293j13854p6173o2361
$$ 1447602 1380854 1215773 1230344 1215449 1236753 1239516 1116072 1279365 1165511 1089338 1026977
7579A026977L6185J01242j4399O996L3999n0269l9654k7152M556n8750j58287
$$ 1026977 1063162 1164404 1150005 1157001 1191000 1140731 1101077 1073925 1078481 1019731 861444
7568H61444J3699J29261m1471r0935r5013K27191p8599q1320p5590J48131m1160
$$ 861444 875143 1004404 962933 871998 776985 1004176 925577 844257 768667 916798 875638
7557H75638j08059N8519K5219K4945J9027o5133j2203o2003J2791N2022O967L98752
$$ 875638 767579 826098 851317 876262 895289 830156 817953 755950 768741 820763 827730 1226482
7545A226482L85534K51143O8829J40491j24821j37763j03467j32270k65700k35417
$$ 1226482 1612016 1863159 1931988 2072479 1947658 1809895 1706428 1574158 1308458 1073041
7535A073041r6836j65809q0007q785j13472j10150Q2275M1051n9287Q2152k5026
$$ 1073041 976205 810396 730389 721604 608132 497982 580257 621308 562021 644173 619147
7524F19147j01817j9429N368l6854o1454k2822J05705l9859l2819J08281k4369
$$ 619147 517330 497901 503269 466415 404961 382139 487844 447985 415166 523447 499078
7513D99078n3588K0011J1653j7518L1738l7656m0874N6450N901k3944L7965L4619
$$ 499078 445490 465501 477154 459636 491374 453718 412844 469294 475195 451251 489216 523835
7501E23835r3091M732n8132r7300N600k218k6917Q3107L3599n0298L2873k0972
$$ 523835 430744 435476 377344 280044 285644 283426 256509 339616 373215 322917 355790 334818
7489C34818k6091L1906Q1098P7564M882n4840n4597o5490P0818J1608n6495j59766
$$ 334818 308727 340633 421731 499295 504177 449337 394740 329250 400068 411676 355181 195415
7477A95415J7616P8951J9146p245q2166m1975Q5564J36174j14508o8612k3662
$$ 195415 213031 291982 311128 303883 221717 179742 265306 401480 286972 218360 194698
7466A94698P5946J14629J9945j29014q8570k5296P4421K13430L2720j73398j18136
$$ 194698 270644 385273 405218 276204 187634 162338 236759 450189 482909 309511 191375
7455A91375K0739J59399m3297J04704j06275m1322n3329K869N3423Q8072J22908
$$ 191375 212114 371513 328216 432920 326645 285323 231994 234863 288286 376358 499266
7444D99266j97602j44071k0380J29363K1779m360m1604n2248N2029K6162q0570
$$ 499266 301664 157593 137213 266576 288355 283995 242391 190143 242172 268334 187764
7433A87764M3950p394k2827p2796O6314J01029l2008o8845L7437k4329o2462K5984
$$ 187764 231714 224320 201493 128697 195011 296040 264032 195187 232624 208295 145833 171817
7421A71817p7344J49741Q8808o1303K0761l7902R9193N0723r2736M3467J7064
$$ 171817 94473 244214 333022 271719 292480 254578 353771 404494 311758 355225 372289
7410C72289o9205J05741l5389j00490p9705o9790J12067j14946K4357J43967o2001
$$ 372289 303084 408825 373436 272946 193241 123451 235518 120572 144929 288896 226895
7399B26895K0871N6432j1410r6231J09295J67451R3599j6719N2320O080N7952
$$ 226895 247766 304198 292788 196557 305852 473303 566902 550183 602503 608583 666535
7388F66535k16858j5392K3016j4296n0689m923L3680L7149k2584J668j24069r8984
$$ 666535 449677 434285 457301 443005 392316 387393 421073 458222 435638 437306 313237 214253
7376B14253q5400R4749M342R7488P3076j54587J7003M4596o0241m7780O5664O6736
$$ 214253 128853 223602 227944 325432 398508 243921 260924 305520 245279 197499 263163 329899
7364C29899k877j22354J19050p2939q2703N7986L5919p3405J51550N2151r0284
$$ 329899 327022 204668 323718 250779 168076 226062 261981 188576 340126 392277 301993
7353C01993j08964K4048P4262K5266J11902Q5165j83671m0469k6339J78123J2453
$$ 301993 193029 217077 291339 316605 428507 513672 330001 289532 263193 441316 453769
7342D53769m2772j7538P309O9595J1662K4570j45685o4790J8284J42630Q3079
$$ 453769 410997 393459 400768 470363 482025 506595 360910 296120 314404 457034 540113
7331E40113n7838M8788K5622O8796k2436n2977K5858O2554J22543o9581r5355
$$ 540113 482275 531063 556685 625481 603045 550068 575926 638480 761023 691442 596087
7320E96087j5933q1157m1700L9065R0531J06494m9726j06305L7583q1379O3248
$$ 596087 580154 498997 457297 496362 586893 693387 643661 537356 574939 493560 556808
7309E56808K6834J0842M7759p3414k2920q9093j13557K17294m8825j81772J20988
$$ 556808 583642 594484 642243 568829 545909 456816 343259 560553 511728 329956 450944
7298D50944J8854j7732K2227j31594j6069R4000q2466L1595J49201K9362q4436
$$ 450944 469798 452066 474293 342699 326630 420630 338164 369759 518960 548322 463886
7287D63886p4168J59935J49159m9259l668q9770m1520M1196J3078l4239k7915
$$ 463886 389718 549653 698812 649553 645885 556115 514595 555791 568869 534630 506715
7276E06715k1230M8788J62667q0324m2151Q056l6487J24719j54391J01856O7150
$$ 506715 485485 534273 696940 616616 574465 582521 546034 670753 516362 618218 685368
7265F85368j14076j2411L7977L4094J63025K8584j33833l33p8637Q4193j24146
$$ 685368 571292 558881 596858 630952 793977 822561 688728 688395 609758 693951 569805
7254E69805O067R7053K6716q7381J08756P2345L1423j22670k3586J16070M189
$$ 569805 575872 672925 699641 612260 721016 793361 824784 702114 678528 794598 798787
7243G98787p0627k7078j9104Q3286P9037K9798j9011o2276p0005K3727R3637o2823
$$ 798787 728160 701082 681978 765264 844301 874099 855088 792812 722807 746534 840171 777348
7231G77348O3047Q3739Q467L0700m413N2644J57031O4295J4655m2562J35071r6045
$$ 777348 840395 924134 932601 963301 958888 1011532 1168563 1232858 1247513 1204951 1340022 1243977
7219A243977K5085j28726J43772J33884J23014p0523j53811n5255P1447J27411
$$ 1243977 1269062 1140336 1284108 1417992 1541006 1470483 1316672 1261417 1332864 1460275
7209A460275J55640p1638n676m2975J55922Q5923L1542Q138q0784L4511J19690
$$ 1460275 1615915 1544277 1538601 1495626 1651548 1737471 1769013 1777151 1696367 1730878 1850568
7198A850568N6848O7879j2736J9387J30807l1780j0213N3844J14966N9803P9208
$$ 1850568 1907416 1975295 1962559 1981946 2112753 2080973 2070760 2124604 2239570 2299373 2378581
7187B378581N0079q0942J31322J74124J07859Q0770Q0371P5788J2599N9361N8108
$$ 2378581 2428660 2347718 2479040 2653164 2761023 2841793 2922164 2997952 3010551 3069912 3128020
7176C128020J86048K14220N3732K54934K97578K76054J97662L51021L68929M96468
$$ 3128020 3314068 3528288 3582020 3836954 4134532 4410586 4608248 4959269 5328198 5824666
7166E824666M64495L87434M54252K94806N23261M72948N70193R14683R13295J143846
$$ 5824666 6289161 6676595 7130847 7425653 7948914 8421862 8992055 9906738 10820033 11963879
7156A1963879J291911J711358J906417K218870K841206L706059N275334Q115517
$$ 11963879 13255790 14967148 16873565 19092435 21933641 25639700 30915034 39030551
7148C9030551J6019933L0251105M7986512O0405915M2517359K7128569K0210541
$$ 39030551 55050484 85301589 133288101 193694016 236211375 263339944 283550485
7141B83550485j5494325k9252725k6347814l1633875l1961793l0722276k7562232
$$ 283550485 268056160 238803435 212455621 180821746 148859953 118137677 90575445
7134I0575445j8590780j0640099p631273n931584m730480m157859l366922k679642
$$ 90575445 71984665 61344566 53713293 47781709 43051229 38893370 35526448 32846806
7126C2846806k480532k204780j630987j359774j307104j067238r38295r46759
$$ 32846806 30366274 28161494 26530507 25170733 23863629 22796391 21858096 20911337
7118B0911337q41653o87611p66161p59005o90678n99925n69908n07690p05380
$$ 20911337 20069684 19382073 18615912 17856907 17166229 16566304 15996396 15488706 14783326
7109A4783326l32541l38704n69951m09536l17653l79573l38797l33314m43792
$$ 14783326 14450785 14112081 13542130 13132594 12814941 12435368 12096571 11763257 11319465
7100A1319465l02016o7615k86524k00414m92116j44825k90958l11673l07847k57391
$$ 11319465 11017449 10949834 10663310 10462896 9970780 9825955 9534997 9223324 8915477 8658086
7090H658086k56152k25273k88401o7077l49582m33559l05958k78115j85338j70562
$$ 8658086 8401934 8176661 7888260 7821183 7471601 7038042 6732084 6453969 6268631 6098069
7080F098069j39835Q601r5067j56860k41649r0807j5305k02719j94888k69675
$$ 6098069 5958234 5966835 5871768 5714908 5473259 5382452 5367147 5164428 4969540 4699865
7070D699865l727J4965j06220k30595k22236j52889r8549j65511j60608q0703
$$ 4699865 4696138 4711103 4604883 4374288 4152052 3999163 3900614 3735103 3574495 3493792
7060C493792r0058K2946j10722R966Q778n6684j70141r0232K0138M3478L4911
$$ 3493792 3403734 3426680 3315958 3325924 3334702 3278018 3107877 3017645 3037783 3081261 3116172
7049C116172j25276j54527N53n9356J0478J00713j73736k05897m4192j0967j76214
$$ 3116172 2990896 2836369 2836922 2777566 2788044 2888757 2715021 2509124 2464932 2453965 2277751
7038B277751l9531n6915r4636O0155o5986l9724J4678J14839o5227j61325m8576
$$ 2277751 2238220 2181305 2086669 2146824 2080838 2041114 2055792 2170631 2105404 1944079 1895503
7027A895503N2206N8957j4877r8743j75308j86729J03437l0375J2728J2950k3305
$$ 1895503 1947709 2006666 1991789 1893046 1717738 1531009 1634446 1604071 1616799 1629749 1606444
7016A606444N1928o7695J66887p7553j35872n5315r3974j32888R2117o2722l9720
$$ 1606444 1658372 1590677 1757564 1680011 1544139 1488824 1394850 1261962 1354079 1291357 1251637
7005A251637n8632R1673R585p5238j15340J71090p6862l1437j35661L5506N6154
$$ 1251637 1193005 1284678 1294263 1219025 1103685 1274775 1197913 1166476 1030815 1066321 1122475
6994A122475n4982Q5596k01045j9930R5624J32216j07403o8169O5916l3037K1439
$$ 1122475 1067493 1153089 952044 932114 1027738 1159954 1052551 984382 1050298 1017261 1038700
6983A038700r3340j96983o2428R4927Q3790l6582K3363q7512m6647p873O1614
$$ 1038700 945360 748377 685949 780876 864666 828084 851447 763935 717288 709415 771029
6972G71029o617L2624l7225q099j43831j07021m7533j8654j7176J67936r352Q929
$$ 771029 764412 797036 759811 751712 607881 500860 453327 434673 417497 585433 576081 585010
6960E85010j90241j4452J7115J8470Q232o3951L9922n7627N1858L5624M2329j45966
$$ 585010 394769 380317 397432 415902 424134 360183 400105 342478 394336 429960 472289 326323
6948C26323o5376Q4009N368j2730j6181r0057J00757m4668J55702P9984L3797
$$ 326323 260947 344956 350324 337594 321413 231356 332113 287445 443147 523131 556928
6937E56928j74193p6916J09769k0076O0571j9254p1009m8283J23220L2319l0459
$$ 556928 382735 305819 415588 395512 456083 436829 365820 317537 440757 473076 442617
6926D42617l289j4361n8064m3069k4039o48j33143j0297Q5382q4929m0332K1747
$$ 442617 439328 424967 366903 323834 299795 299147 166004 155707 241089 156160 115828 137575
6914A37575J65604N620j02036p0972K83940N8939n2454j99752j3860K4351j15202
$$ 137575 303179 308799 206763 135791 419731 478670 426216 226464 212604 236955 121753
6903A21753J75710Q5740j42550q8829P238N7740P0758K8379K4575q0251k6190
$$ 121753 297463 383203 240653 151824 159062 216802 287560 315939 340514 260263 234073
6892B34073q4249p1130L9150M5884O7816k6187l9207L8715l2742j27895l043M8607
$$ 234073 149824 78694 117844 163728 231544 205357 166150 204865 172123 44228 41185 89792
6880H9792N8436m7542J03659Q5444k0181r166J83263m769j45657M5157o7008j18078
$$ 89792 148228 100686 204345 289789 269608 260442 443705 438936 293279 338436 271428 153350
6868A53350N8793P7852l6369R0732j59975n6943R5909K5014m7250L8236k09151
$$ 153350 212143 289995 253626 344358 184383 127440 223349 248363 201113 239349 30198
6857C0198L9452Q1075k8582l6489Q9709J1579J643k8813m6978O5518j2209J1879
$$ 30198 69650 150725 122143 85654 175363 186942 188585 159772 112794 178312 166103 177982
6845A77982l2718m1866N4961k4711N2977Q0217K8327j65983j0711O2437j21015
$$ 177982 145264 103398 158359 133648 186625 266842 295169 129186 118475 180912 59897
6834E9897p1820O1390K2824q9729P9669M237L0504k7329L8064k7060Q3148P114
$$ 59897 -11923 49467 72291 -17438 62231 66468 96972 69643 107707 80647 163795 170909
6822A70909q7448l0283J18779k6393p8241q97N6722J7146n2392j2057J5618k6921
$$ 170909 83461 53178 171957 145564 67323 66426 123148 140294 87902 75845 91463 64542
6810F4542P5507P3337K7401k8352l7870K4144l1360J21784j98155j14746n5121
$$ 64542 140049 213386 240787 212435 174565 198709 167349 289133 90978 -23768 -78889
6799g8889J34720R3622K8820j04232R5414J40304j34144N5544q8699p1514L8745
$$ -78889 55831 149453 178273 74041 169455 309759 175615 231159 142460 70946 109691
6788A09691m9078Q8526k521j0972J11631J7766J4684j01107O0877J3202o6280
$$ 109691 60613 149139 146618 135646 247277 265043 279727 178620 239497 252699 186419
6777A86419J1893j04786M7289o7607O7320n3400m1267Q5782R4851L7662j52495
$$ 186419 198312 93526 140815 73208 140528 87128 45861 131643 226494 264156 111661
6766A11661J9678p8376L5912L5693l3852l7052J22901R025l1874j31P1074j2986
$$ 111661 131339 52963 88875 124568 90716 53664 176565 185590 153716 153585 224659 211673
6754B11673k6306k2709k9825K304J1834L6644m686J04808p5515n7480J57720J21770
$$ 211673 185367 162658 132833 135137 146971 183615 178929 283737 208222 150742 308462 430232
6742D30232K8342L11395M19996K97957K11236l3353j16338k39168P341l28801
$$ 430232 458574 769969 1189965 1487922 1699158 1665805 1549467 1310299 1317640 988839
6732I88839k22083J0989j66998O481r0128j28373m7670l0293r0325K9046k3692
$$ 988839 766756 777745 610747 617228 527100 398727 351057 320764 230439 259485 235793
6721B35793n8470O0900K3086K293O1147J55008j8245o9177J9541j28447j00273
$$ 235793 177323 238223 261309 263602 324749 479757 461512 392335 411876 283429 183156
6710A83156j06915L2125M2094M1910q4980R6762K9225j12615J98221j18947j04332
$$ 183156 76241 108366 150460 192370 107390 204152 233377 120762 318983 200036 95704
6699I5704J09873m6143q1685N3790r2090O0182J1419J6196J03231k9678j02269
$$ 95704 205577 159434 77749 131539 39449 99631 111050 127246 230477 200799 98530
6688I8530j9750M6183k3059K8086M5716L9283N9278n1506L3129O2981q373r5465
$$ 98530 78780 124963 101904 129990 175706 214989 274267 222761 255890 318871 310498 215033
6676B15033q3141J5535O2444o909K2087J3486j27199Q1490j21493P9378m2291
$$ 215033 131892 147427 209871 202962 225049 238535 111336 192826 71333 150711 108420
6665A08420O6488p8935O2608j7721o407J20350j65681k8176k6256J09778L2501
$$ 108420 174908 95973 158581 140860 134453 254803 89122 60946 34690 144468 176969
6654A76969l9555o124p0966K6249J09714N7148R1102r2915l1700l9018j65276
$$ 176969 137414 131290 60324 86573 196287 253435 344537 251622 219922 180904 15628
6643A5628J11533n6444j37743O4315m8037K2040J05598P9969J47485P090o9811
$$ 15628 127161 70717 -67026 -2711 -50748 -28708 76890 156859 304344 311434 241623
6632B41623j18653j32661n0505L6420J94924j01619K1501J74481O1106j49068
$$ 241623 122970 -9691 -60196 -23776 171148 69529 91030 265511 326617 177549
6622A77549j25167L1466J44946m9815k27542L3058J38649j6175r912N1927m0237
$$ 177549 52382 83848 228794 178979 -48563 -15505 123144 106969 97057 148984 108747
6611A08747l4313m0053k3932M1943R8890R6262L1881j58405K6222N3732j04925
$$ 108747 74434 34381 10449 52392 151282 247544 279425 121020 147242 200974 96049
6600I6049M9199L4772o9093n8154r2520j11388Q8966J32846J10288L111j22413
$$ 96049 145248 180020 110927 52773 -39747 -151135 -62169 70677 180965 184076 61663
6589F1663J01806J39713O0710j0861j78329j255m0323J8486K0748J4940J023l6397
$$ 61663 163469 303182 363892 353031 174702 173447 133124 151610 172358 187298 188321 151924
6577A51924R608P2523p8221q5697o7197R054P4425J64885p2126o1149j0319r7309
$$ 151924 161532 234055 155834 70137 2940 11994 86419 251304 179178 118029 107710 10401
6565A0401P1803L86Q2121L011n5912O1000J14544m6305k3237j23993l5902J2691
$$ 10401 82204 82590 164711 167722 111810 172810 287354 241049 217812 93819 57917 70608
6553G0608j2643J5071L0510r7887N6158P2786o9447N0869K0242P3849j58700k1878
$$ 70608 57965 73036 103546 5659 61817 134603 65156 116025 136267 210116 51416 29538
6541B9538P655q8118J17004Q2595J20943j59877j05604Q6654K27917Q6298j66451
$$ 29538 37193 -50925 66079 148674 269617 109740 4136 90790 318707 405005 238554
6530B38554n1429J06724j85558K6957Q0832m5596r01j13913j30390R2122J20320
$$ 238554 187125 293849 108291 135248 216080 170484 169583 55670 -74720 17402 137722
6519A37722k21139M4425J18469K544j2449L8232K0488l9083j2902N1456L1730
$$ 137722 -83417 -38992 79477 82021 69572 107804 128292 89209 76307 127763 159493
6508A59493q087O4290l5752j00280l2898p6906L9094j5386J30405N0479r1420
$$ 159493 151406 215696 179944 79664 46766 -30140 8954 -6432 123973 174452 83032
6497H3032K5542o7817J03801k9319k2105N9185j19883m0267J80840Q1571l9294
$$ 83032 108574 40757 144558 115239 93134 152319 32436 -7831 173009 254580 215286
6486B15286J03446q3469j68702R1492l6081m2415P2355R134J28175l2954p3161
$$ 215286 318732 235263 66561 158053 121972 79557 151912 161046 289221 256267 183106
6475A83106m2276J80074J20452j92849R7423j14182l8780J28893j063p7227l825
$$ 183106 140830 320904 441356 248507 345930 231748 192968 321861 320798 243571 239746
6464B39746J07920K743j00779j6780P1122J11329j11926j3839j31318P3285Q8522
$$ 239746 347666 350409 249630 232850 303972 415301 303375 289536 158218 231503 320025
6453C20025p1708P6k0793R6009L5613M4719R6163j17224o0235O772K2829M8492
$$ 320025 248317 248393 227600 323609 359222 403941 500104 382880 322645 329417 352246 400738
6441D00738k03217l479J68736k5831j29575P2201p1970r056J53780P3846r6333
$$ 400738 197521 194042 362778 336947 207372 279573 207603 198547 352327 426173 329840
6430C29840l0551M1585L3408j50445K1526J47809N8967j33229n388k4139q676
$$ 329840 299289 340874 374282 223837 245363 393172 452139 318910 313522 289383 280707
6419B80707l120j05338M0306k2194r349J07494o3294O2686o7315k9603k8979M3366
$$ 280707 277587 172249 212555 190361 181012 288506 225212 287898 220583 190980 162001 205367
6407B05367P7550o8646J9916j3668j1872L2212K7170l310R3722j3225n1487J05550
$$ 205367 282917 214271 234187 220519 208647 240859 268029 264719 358441 345216 293729 399279
6395C99279m221m8196j5261O1445j726R8954M8027L6716p3602J3033o1870K4778
$$ 399279 395058 346862 331601 393046 391320 490274 538301 575017 501415 514448 452578 477356
6383D77356n3344p1675N4901O1521l9376L3480M8529R1081K4711j23924J0558
$$ 477356 424012 352337 407238 468759 429383 462863 511392 602473 627184 503260 513818
6372E13818j1984k3684o0427l6392n3047O8891r821N2987M4315N2043j49959M7845
$$ 513818 501834 478150 417723 381331 328284 397175 387354 440341 484656 536699 386740 434585
6360D34585J81274q6741m9465P1013j94556J03096K4503r7950O5040J11143j62651
$$ 434585 615859 529118 479653 550666 356110 459206 483709 385759 450799 561942 399291
6349C99291j96138Q9248K29243l17p9392o6689J39849r988O2147o6600n4844j821
$$ 399291 203153 292401 521644 521327 441935 375246 515095 505107 567254 500654 445810 443989
6337D43989o2775L9923p4559p2180J88632J31478j00116r7959J58344J05757p3700
$$ 443989 381214 421137 346578 274398 463030 594508 494392 396433 554777 660534 586834
6326E86834J428n9862K1429P9260P346J303L8759k5902m4857o5196K7609L6069
$$ 586834 588262 528400 549829 629089 636435 637738 676497 650595 605738 540542 568151 604220
6314F04220R450p5301o5007J155J34697r954k7650q97k5633p1056m9516P1036
$$ 604220 613670 538369 473362 474517 609214 599260 571610 570713 545080 474024 424508 495544
6302D95544J00021M7174l8037l8441p7838J27057L5568k447K3048R9646M1935
$$ 495544 595565 642739 604702 566261 488423 615480 651048 648601 671649 771295 813230
6291H13230n9094O7924q7926O4180K8966j55985J19028O91j73789M8190R4212
$$ 813230 754136 822060 734134 798314 827280 671295 790323 791014 617225 665415 759627
6280G59627J05798M9023J34561j3225j46675M4501J59964m1523k9062P8121J6428
$$ 759627 865425 914448 1049009 1035784 889109 933610 1093574 1052051 1022989 1101110 1117538
6269A117538O5214j04339n2808J42517r3807j2260O1052q8403j3772J15214j05800
$$ 1117538 1182752 1078413 1025605 1168122 1074315 1062055 1123107 1034704 1020932 1136146 1030346
6258A030346m0287J09869J32804j30092K5373N9934L1241m096p3969M1320O3419
$$ 1030346 990059 1099928 1232732 1102640 1128013 1187947 1219188 1215092 1141123 1182443 1245862
6247A245862M2373n1919p2365j0130J15575m9161P3752J7819J0368r3399l5718
$$ 1245862 1288235 1236316 1163951 1153821 1269396 1220235 1293987 1311806 1322174 1228775 1193057
6236A193057r900R0544N1646O8441o2428l2637m5092n409J97893o0671q2659j6069
$$ 1193057 1183157 1273701 1325347 1393788 1331360 1298723 1253631 1248222 1446115 1385444 1302785 1286716
6224A286716J54168N0649M3119j4444o2119O1897k9479r4927J66710j07115m7004
$$ 1286716 1440884 1491533 1534652 1520208 1458089 1519986 1490507 1395580 1562290 1455175 1408171
6213A408171J49576n1149m0518J4588J86163J27691n9485L1932k2635j5811P3488
$$ 1408171 1557747 1506598 1466080 1480668 1666831 1794522 1735037 1766969 1744334 1728523 1802011
6202A802011M7039p4771n1018J15501R2609n6298M2574m6018M6732J41204m1460
$$ 1802011 1849050 1774279 1723261 1838762 1931371 1875073 1917647 1871629 1918361 2059565 2018105
6191B018105n0073O9573J98471j428m0842R5074Q468k1144J33211J3495J31034
$$ 2018105 1968032 2037605 2236076 2234648 2193806 2288880 2297348 2276204 2409415 2422910 2553944
6180B553944K46274R4640j84181J0520J66922N1292J11379R6028J36742K39943
$$ 2553944 2800218 2894858 2710677 2721197 2888119 2939411 3050790 3146818 3283560 3523503
6170C523503K14992m4416J69617K31308M8291J70716K36426J75655K56037L09806
$$ 3523503 3738495 3694079 3863696 4095004 4143295 4314011 4550437 4726092 4982129 5291935
6160E291935M56388N92211N79448P98910J170859J516181J798153K066414K252469
$$ 5291935 5748323 6340534 6919982 7718892 8889751 10405932 12204085 14270499 16522968
6151A6522968K138423K017818J397309R51061L48430j47093J81057N17485J047949
$$ 16522968 18661391 20679209 22076518 23027579 23376009 23228916 23409973 23927458 24975407
6142B4975407J636338J929761K066852J875321J358071R51729L8904o26220p43066
$$ 24975407 26611745 28541506 30608358 32483679 33841750 34793479 34832383 34206163 33463097
6133C3463097q99589o01026l82188l71721j27710l14769l11161r0041j60525m34479
$$ 33463097 32563508 31962482 31580294 31208573 31080863 30766094 30454933 30364892 30204367 29769888
6123B9769888n35749n29525n67783o37599o98055q29910n61521o97135r16363
$$ 29769888 29234139 28704614 28136831 27499232 26801177 25971267 25409746 24712611 23796248
6114B3796248p71766q39246r82288r25575r59595p52933p69012o59802n50289
$$ 23796248 23024482 22185236 21202948 20277373 19317778 18564845 17795833 17136031 16585742
6105A6585742m77173m77810n04670k66412l75970k18630k13478j11115j20648
$$ 16585742 16108569 15630759 15126089 14859677 14483707 14265077 14051599 13940484 13819836
6096A3819836J7426J1665k5579p250J62685J38013K76340M12590O89049P85582
$$ 13819836 13837262 13848927 13823348 13816098 13978783 14116796 14393136 14805726 15494775 16280357
6086A6280357J024087J612503K031656K479603K751553L101474K916096K397266
$$ 16280357 17304444 18916947 20948603 23428206 26179759 29281233 32197329 34594595
6078C4594595J634785P47796L0699j13908M8990P83926J494532K309344K692730
$$ 34594595 36229380 36977176 37007875 36893967 36942957 37726883 39221415 41530759 44223489
6069D4223489K664788K345218J726350O29839l28137q07414j166577j315391j034603
$$ 44223489 46888277 49233495 50959845 51589684 51261547 50454133 49287556 47972165 46937562
6060D6937562n90137n93014n60984m08962m19163m95538o02674o42484p89887
$$ 46937562 46347425 45754411 45193427 44784465 44365302 43869764 43267090 42624606 41834719
6051D1834719r42884j092426j053422j169508j018266j133461j343048j369053
$$ 41834719 40891835 39799409 38745987 37576479 36558213 35424752 34081704 32712651
6043C2712651j408326j365211j434531j394865j368532j179236j133427j033614
$$ 32712651 31304325 29939114 28504583 27109718 25741186 24561950 23428523 22394909
6035B2394909r46743q19522r29860o10518o48721p44335o76369n71473m05015
$$ 22394909 21448166 20628644 19698784 19088266 18439545 17695210 17018841 16447368 16042353
6026A6042353m75410l40002n45247m53591l11036l89375k56652m24105k17503
$$ 16042353 15566943 15226941 14681694 14228103 13917067 13527692 13271040 12846935 12629432
6017A2629432j54346m16879l15817k89698k72851k33875l67467j80209j59883
$$ 12629432 12475086 12058207 11742390 11452692 11179841 10945966 10578499 10398290 10238407
6008A0238407j78706j16803k28898k52172k46449j51207j14260j52153j02165
$$ 10238407 10059701 9942898 9714000 9461828 9215379 9064172 8949912 8797759 8695594
5999H695594k82807k24973j28297j32982l21937j00099k43335o5365j15740k50992
$$ 8695594 8412787 8187814 8059517 7926535 7604598 7504499 7261164 7195799 7080059 6829067
5989F829067j32658q0151k15924j05146r9558j14111N366j25493k1186j90098
$$ 6829067 6696409 6616258 6400334 6295188 6195630 6081519 6086885 5961392 5940206 5750108
5979E750108j35084j87037j93735q7842N200q8522m6045P5973o639j23086j48307
$$ 5750108 5615024 5427987 5234252 5146410 5151610 5063088 5017043 5093016 5086377 4963291 4814984
5968D814984m815k8711j24088k7852L843q1626o4877Q819o5805N5410j1378n6226
$$ 4814984 4810169 4781458 4657370 4629518 4633361 4551735 4486858 4495677 4429872 4485282 4473904 4417678
5956D417678j1218R957j84684p4504q6057j493o3808j31939o2443Q1329J02192
$$ 4417678 4406460 4416417 4231733 4157229 4071172 4069679 4005871 3873932 3811489 3892818 3995010
5945C995010k4956k3395m1016l7675j7762P1822J3766O9646j4092J02014j77049
$$ 3995010 3970054 3946659 3905643 3867968 3850206 3922028 3935794 4005440 3991348 4093362 3916313
5934C916313k07718J42898j1763P0871M8599o3632q626q8129J11266p7078O724
$$ 3916313 3708595 3851493 3839730 3910601 3959200 3895568 3886942 3798813 3910079 3833001 3839725
5923C839725R0112p2959l8760J8784N2712j0676m9674J9441Q1246n4510K4431
$$ 3839725 3929837 3856878 3818118 3836902 3889614 3878938 3829264 3848705 3929951 3875441 3899872
5912C899872K033k21159O3928J42556j21243Q7962o4975n8920J31885P0641P4237
$$ 3899872 3901905 3680746 3744674 3887230 3765987 3853949 3788974 3730054 3861939 3932580 4006817
5901D006817M5702j02182M6759q8442j8512P2220L6246j29095P4214J36383j04330
$$ 4006817 4052519 3950337 3997096 3908654 3890142 3962362 3998608 3869513 3943727 4080110 3975780
5890C975780l083Q89m8304n9577J00255L1650R5546Q2974n1349q843M6282J31795
$$ 3975780 3972697 3973586 3925282 3865705 3965960 3997610 4093156 4176130 4124781 4115938 4162220 4294015
5878D294015J509p7857R8103M3662O032J41088J56244K7815J36714R2083J03869
$$ 4294015 4295524 4217667 4315770 4359432 4365464 4506552 4662796 4690611 4827325 4919408 5023277
5867E023277J0785R5815R2325K42115J81680l236J8772J34918L59259K04312J46988
$$ 5023277 5034062 5129877 5222202 5464317 5645997 5642761 5661533 5796451 6155710 6360022 6507010
5856F507010J23518J22520J85875K48555J84330K05586J62819P8780O9927K33050
$$ 6507010 6630528 6753048 6938923 7187478 7371808 7577394 7740213 7818993 7888920 8121970
5846H121970K94261K43644J67841R1898N5568J38587K93305J38131J51916K92334
$$ 8121970 8416231 8659875 8827716 8919614 8975182 9113769 9407074 9545205 9697121 9989455
5836I989455j03186O0087J12544K4354K03266P7165k1212j4879q7749M6461l7164
$$ 9989455 9886269 9946356 10058900 10083254 10286520 10363685 10342473 10327594 10239845 10286306 10249142
5825A0249142j60367n1114P3446m0916l9922q4962j0281K2447j30P6219j9445
$$ 10249142 10088775 10037661 10111107 10070191 10030269 9945307 9935026 9957473 9957343 10033562 10014117
5814A0014117j9214r3166j58706j48527O9492j04534j77612J6231K756n1229j85052
$$ 10014117 9994903 9901737 9743031 9594504 9663996 9559462 9381850 9398081 9400837 9349608 9164556
5803I164556k43318j90044j65149j05523j82996l19968k24195r4298j03897j25324
$$ 9164556 8921238 8731194 8566045 8460522 8277526 7957558 7733363 7639065 7535168 7409844
5793G409844K4838j51182j58646m2684l9869j2489P0961O1773L0931K2603N0555
$$ 7409844 7434682 7283500 7124854 7082170 7042301 7029812 7100773 7162546 7193477 7216080 7266635
5782G266635r7142k3361N2535K09924J63070K8403J68587J75854K97309J92066
$$ 7266635 7169493 7146132 7198667 7408591 7571661 7600064 7768651 7944505 8241814 8433880
5772H433880N34093L09611N21028Q39007Q19480J145859J560369J706109K003131
$$ 8433880 8967973 9277584 9798612 10637619 11457099 12602958 14163327 15869436 17872567
5763A7872567J940605J609722J501209J161640N14634n2047o75146q96933q26163
$$ 17872567 19813172 21422894 22924103 24085743 24600377 24548330 23873184 22976251 22150088
5754B2150088o31937m42224j41663m9152p5998J38002L36119O11257Q01565Q72900
$$ 22150088 21518151 21075927 20934264 20885112 20809114 20947116 21283235 21894492 22696057 23568957
5744B3568957J310619J687389J858382K152831K252899J903039J625843J126845
$$ 23568957 24879576 26566965 28425347 30578178 32831077 34734116 36359959 37486804
5736C7486804L82980k71542n69652q70172q64924o70234n95333l01189l49851
$$ 37486804 37869784 37598242 37028590 36158418 35293494 34623260 34027927 33726738 33376887
5727C3376887l65740m56107m02676l75168l80727l27603m13305l87461n65829
$$ 33376887 33011147 32555040 32152364 31777196 31396469 31068866 30655561 30268100 29702271
5718B9702271l37969k11815l00620k95608j55068k2833k01141j81436j24247r3310
$$ 29702271 29364302 29152487 28851867 28556259 28401191 28378358 28177217 27995781 27871534 27778224
5708B7778224P4463j4995l2241m9314j27018k8598j77712k11131l05087m01940
$$ 27778224 27852687 27837692 27805451 27756137 27629119 27600521 27422809 27211678 26906591 26504651
5698B6504651j67008r0976J66934L06102N02180P40249O38744O82736M29508K29331
$$ 26504651 26337643 26246667 26413601 26719703 27221883 27962132 28600876 29283612 29713120 29942451
5688B9942451l77588o49057j007590j057775r64080o33819m85953l82472k76837
$$ 29942451 29564863 28915806 27908216 26850441 25886361 25252542 24766589 24384117 24107280
5679B4107280m02723k03873J31009J16428L21295M18445P57840J157933J310257
$$ 24107280 23704557 23500684 23631693 23748121 24069416 24487861 25245701 26403634 27713891
5670B7713891J298509J405436J136645R70681M44648k12848l98439o33551q08133
$$ 27713891 29012400 30417836 31554481 32525162 32969810 32756962 32358523 31724972 30916839
5661C0916839p17809o56073n13239l68103m23963m70831m51609m24119l79840
$$ 30916839 30199030 29542957 29029718 28661615 28237652 27766821 27315212 26891093 26511253
5652B6511253l89448m31732l43722m52077k17804m05282n23080k92104k62647
$$ 26511253 26121805 25690073 25346351 24894274 24676470 24271188 23748108 23456004 23193357
5643B3193357l08756k72624l25359j61709k40926j60690o8475j95246l25650j19645
$$ 23193357 22884601 22611977 22286618 22124909 21883983 21723293 21654818 21459572 21133922 21014277
5633B1014277j18747k87483m20970n63390o39724m94729o09530n34045m30789
$$ 21014277 20895530 20608047 20187077 19623687 18983963 18489234 17879704 17345659 16914870
5624A6914870p00030p11180m62627o01278m10173l49836l25062m51876m75100
$$ 16914870 16214840 15503660 15041033 14439755 14029582 13679746 13354684 12902808 12427708
5615A2427708l84312m75365l23732k40302l12873l41517k27675k94249j54384
$$ 12427708 12043396 11568031 11244299 11003997 10691124 10349607 10121932 9827683 9673299
5606I673299j57010j31268r5085j96244k98239o2742j90646k20103o7669j07321
$$ 9673299 9516289 9385021 9289936 9093692 8795453 8732711 8542065 8321962 8254293 8146972
5596H146972l4817M949p5720j03416l12170m7785j75944k57625k45015j32967
$$ 8146972 8112155 8117104 8041384 7937968 7625798 7578013 7402069 7144444 6899429 6766462
5586F766462j73352j47945j81852k11850n9564j22391j68152j34802m0214k16927
$$ 6766462 6593110 6445165 6263313 6051463 5991899 5869508 5701356 5566554 5526340 5309413
5576E309413n6961k8164o1709o2310k9163P0599Q27n3221N0017r5357j42550k49254
$$ 5309413 5252452 5224288 5162579 5100269 5071106 5141705 5142532 5089311 5139328 5043971 4901421 4652167
5564D652167j53330j15463j75718j70830j669l3443j19027k49571n7574p502j05411
$$ 4652167 4498837 4383374 4207656 4036826 4035157 4001714 3882687 3633116 3575542 3568040 3462629
5553C462629n3768p753j92726J9672r3613l5092O1510j05541l8687j2655j7537
$$ 3462629 3408861 3401108 3208382 3228054 3134441 3099349 3160859 3055318 3016631 3003976 2986439
5542B986439j44050n2318r9417N5820J8689j08682j24401L2351P8001M389n6604
$$ 2986439 2842389 2790071 2690654 2746474 2765163 2656481 2532080 2564431 2642432 2646821 2590217
5531B590217J5610m0110j03558M2951n3611j29031l0549p972m0265j10847o0797
$$ 2590217 2605827 2565717 2462159 2505110 2451499 2322468 2291919 2283947 2243682 2132835 2072038
5520B072038K28480k1506j85591P9253n5107k3208j6151L366q2755M9099n153
$$ 2072038 2300518 2279012 2093421 2172674 2117567 2094359 2078208 2081574 1998819 2047918 2042765
5509B042765n6648n524J9770K3300k2097l7682k6999L1275j29468k04241o447
$$ 2042765 1986117 1980593 2000363 2023663 2001566 1963884 1936885 1968160 1838692 1634451 1628004
5498A628004J43565o0803p9602R5196N0859o4512o5451Q6167K125o5840Q9388
$$ 1628004 1771569 1710766 1631164 1726360 1777219 1712707 1647256 1733423 1735548 1669708 1759096
5487A759096r6767l9872N904N4458J13957J792p174j4515p0368j21393R3613j0554
$$ 1759096 1662329 1622457 1628361 1682819 1796776 1798568 1791394 1776879 1706511 1585118 1678731 1668177
5475A668177j66459P565O5404p4285l9362L8672P3578q2862l0126J11066p2236
$$ 1668177 1501718 1509283 1574687 1500402 1461040 1499712 1573290 1490428 1460302 1571368 1499132
5464A499132r600k1279j3621l9154L1263J58038Q2370K741O0470k4221m5223N2682
$$ 1499132 1489532 1468253 1454632 1415478 1446741 1604779 1687149 1689890 1750360 1726139 1680916 1733598
5452A733598n9507K7862J60388k9485o8098p357j23761j49433K8421N9792N5399
$$ 1733598 1674091 1701953 1862341 1832856 1764758 1757401 1633640 1484207 1512628 1572420 1627819
5441A627819N3590j46008M7391J46519q660M1108j86276N2833M2123Q8057K9017
$$ 1627819 1681409 1535401 1582792 1729311 1720651 1761759 1575483 1628316 1670439 1758496 1787513
5430A787513N8947Q1186q8501q6883P6787O4938L1034R1463o9302j4038N6642
$$ 1787513 1846460 1927646 1839145 1752262 1829049 1893987 1925021 2016484 1947182 1933144 1989786
5419A989786J18325m7280l3184L1326O9861J2127l2481j01818J22952m1969J73906
$$ 1989786 2108111 2060831 2027647 2058973 2128834 2140961 2108480 2006662 2129614 2087645 2261551
5408B261551P8545j30569N356O3678q9415p5795J03095L9579L981J00801J55465
$$ 2261551 2340096 2209527 2214883 2278561 2189146 2113351 2216446 2256025 2260006 2360807 2516272
5397B516272n3648r4909n7135Q3703k6957m7688K6880N1117K8233p2559p8898
$$ 2516272 2462624 2367715 2310580 2394283 2367326 2319638 2346518 2397635 2425868 2353309 2274411
5386B274411j03312M0726K23843J5735O0035J06667n4066l0171M4744o1006L921
$$ 2274411 2171099 2211825 2435668 2451403 2511438 2618105 2564039 2533868 2578612 2517606 2521527
5375B521527J43136J55695P0275o0103O1936k0255J6343j09337m014P5174j19260
$$ 2521527 2664663 2820358 2890633 2830530 2892466 2872211 2888554 2779217 2775203 2850377 2731117
5364B731117p5373m496k3589m233J13373J20808O2480J13090N0010J1102L0607
$$ 2731117 2655744 2651248 2627659 2623426 2736799 2857607 2920087 3033177 3083187 3094289 3124896
5353C124896J18737J74407J8508o7860m341J04353L7255j24044J9573J31328J4747
$$ 3124896 3243633 3418040 3436548 3368688 3364347 3468700 3505955 3381911 3401484 3532812 3547559
5342C547559J69393J87253K57940K35903L73811L26270L70070M24784K32293K67987
$$ 3547559 3716952 3904205 4162145 4398048 4771859 5098129 5468199 5892983 6125276 6393263
5332F393263J92349J86853M155J24880M0313J45821R9817M7805J28158K18258
$$ 6393263 6585612 6772465 6776620 6901500 6941813 7087634 7187451 7235256 7363414 7581672
5322G581672Q3740j612j1633K58830K63653J98441J66108M07914J056469Q61902
$$ 7581672 7665412 7663800 7652167 7910997 8174650 8373091 8539199 8947113 10003582 10865484
5312A0865484P50062J031441J414670J160781Q57336J004791J278109J151850
$$ 10865484 11615546 12646987 14061657 15222438 16079774 17084565 18362674 19514524
5304A9514524P04650O18428O75425O93418Q93954P92489J031866J388202J487987
$$ 19514524 20219174 20837602 21513027 22206445 23100399 23892888 24924754 26312956 27800943
5295B7800943J724885J946653K221152K276291J922973J395941J166475J379559
$$ 27800943 29525828 31472481 33693633 35969924 37892897 39288838 40455313 41834872
5287D1834872J896187K678005L332845M105053L533220K532135K464930K148642
$$ 41834872 43731059 46409064 49741909 53846962 57380182 59912317 62377247 64525889
5279F4525889J362174J339149J950736K514572K724666K681066K255639J611209
$$ 64525889 65888063 67227212 69177948 71692520 74417186 77098252 79353891 80965100
5271H0965100N27313l8804k74914R1282J2704m12665m36995j39293j32259L53783
$$ 80965100 81492413 81453609 81178695 81269977 81282681 80870016 80433021 80293728 80161469 80515252
5261H0515252N49373l5939n65387q41740j013302r24124q14290q47166n38319
$$ 80515252 81064625 81028686 80463299 79621559 78608257 77684133 76869843 76022677 75484358
5252G5484358j50898J8893m53755j132446j867901k263941k411528j853497j188554
$$ 75484358 75333460 75352353 74898598 73766152 71898251 69634310 67222782 65369285 64180731
5243F4180731r45330o39817p57301j075086j261879j602709j737562k003067j809217
$$ 64180731 63235401 62595584 61838283 60763197 59501318 57898609 56161047 54157980 52348763
5234E2348763j553141j559052j432474j172403j431725j672952j645176j479064
$$ 52348763 50795622 49236570 47804096 46631693 45199968 43527016 41881840 40402776
5226D0402776j335718j315689j497028j387376j298526j301273j360006j034698
$$ 40402776 39067058 37751369 36254341 34866965 33568439 32267166 30907160 29872462
5218B9872462j087124j149457r31170q59844r12005o87588q67748p90127p49354
$$ 29872462 28785338 27635881 26704711 25844867 24932862 24245274 23377526 22587399 21838045
5209B1838045o69633o39250p17901m91574m91670m50461n75693l69495k54579
$$ 21838045 21168412 20529162 19811261 19319687 18828017 18377556 17801863 17432368 17177789
5200A7177789m47549n71568l31725m61180l80897l06058m25752m10694m22196
$$ 17177789 16730240 16158672 15826947 15365767 14984870 14678812 14253060 13842366 13420170
5191A3420170l60692k44756j88667m17427l04039m46180k75795k04437j29799
$$ 13420170 13059478 12814722 12626055 12208628 11904589 11458409 11182614 10978177 10848378
5182A0848378k11021k86008j37109k36603j69486k84177j75670p4937j56286l9854
$$ 10848378 10637357 10351349 10214240 9977637 9808151 9523974 9348304 9273367 9117081 9077227
5172I077227k22181m4486k04504j97320j11408R525k2862j60382l5058J50479
$$ 9077227 8855046 8810560 8606056 8408736 8297328 8306853 8283991 8123609 8088551 8239030
5162H239030J80472N4559M28463K86144O01099Q38828J268848J346421J533954
$$ 8239030 8419502 8474061 8902524 9188668 9789767 10628595 11897443 13243864 14777818
5153A4777818J570683J158896Q57913L14470m56030j242798j864516j899425j823831
$$ 14777818 16348501 17507397 18365310 18679780 18223750 16980952 15116436 13217011 11393180
5144A1393180j515335q78443p62611m74774k51281k87126m6180m8475k10121O384
$$ 11393180 9877845 8999402 8236791 7762017 7510736 7223610 7177430 7128955 6918834 6925218
5134F925218M1447q0223o799k8193K6494J25099J69161N20346M48052K99553K31498
$$ 6925218 6966665 6886442 6879643 6851450 6877944 7003043 7172204 7692550 8140602 8440155 8671653
5123H671653J58006L3775L111J64590M84876O22399N25716Q85384J334509J599946
$$ 8671653 8829659 8863434 8866545 9031135 9516011 10138410 10664126 11549510 12884019 14483965
5113A4483965K081472K069907J456099J014610K08173r29428k051617k460253
$$ 14483965 16565437 18635344 20091443 21106053 21314226 20384798 18333181 15872928
5105A5872928j940713j277598p25446j38528L54351P59427J457268K025881J868063
$$ 15872928 13932215 12654617 11929171 11790643 12144994 12904421 14361689 16387570 18255633
5096A8255633J416196P51702j54747j516897k220283k187416j990626j333490
$$ 18255633 19671829 20423531 20268784 18751887 16531604 14344188 12353562 11020072
5088A1020072q14634n10237m11008m39245l78790l49461k72378l18900j42870
$$ 11020072 10205438 9695201 9284193 8844948 8466158 8116697 7844319 7525419 7382549
5079G382549k06182l47718k28426j93063j35418j43938k3557m7744j48076K5010
$$ 7382549 7176367 6828649 6600223 6407160 6271742 6127804 6104247 6056503 5908427 5933437
5069E933437N5646J47032J61268J61563J32690M51560P81285J083339J380739
$$ 5933437 5989083 6136115 6297383 6458946 6591636 7043196 7824481 8907820 10288559
5060A0288559J331951J461802J594586J241255J074027Q74812M69994M0077o47228
$$ 10288559 11620510 13082312 14676898 15918153 16992180 17866992 18336986 18377063 17729835
5051A7729835q04701q62282q55877o32683m31480R9423J76797L79894L84023M46520
$$ 17729835 16925134 16062852 15206975 14574292 14142812 14242235 14419032 14798926 15182949 15629469
5041A5629469J083633J646585J451493J123464J198149O31820j4377M6581j0486
$$ 15629469 16713102 18359687 19811180 20934644 22132793 22764613 22750236 22796817 22786331
5032B2786331r4503J47196J85636Q0523M95842R63227R89754J922067L543783
$$ 22786331 22691828 22839024 23024660 23105183 23601025 24564252 25554006 27476073 31019856
5023C1019856M582227L959847L559311L252040J365399j064788j790158j220704
$$ 31019856 35602083 39561930 43121241 46373281 47738680 46673892 44883734 43663030
5015D3663030l03701k30878J83387M38814Q2040k1713l726N41731J082427K439434
$$ 43663030 43359329 43128451 43311838 43750652 43832692 43810979 43807253 44348984 45431411 47870845
5005D7870845L896160M708125N553621O616362N456891K690005J282924j72163
$$ 47870845 51767005 56475130 62028751 68645113 74102004 76792009 78074933 77902770
4997G7902770k463732l395056k664734j470551n20692j93862j11164k24263o22409
$$ 77902770 75439038 72043982 69379248 67908697 67388005 67194143 67082979 66858716 66236307
4988F6236307q40507p52792l46565K94678J654582K182626J402180R87430L85765
$$ 66236307 65395800 64643008 64296443 64591121 66245703 68428329 69830509 70817939 71203704
4979G1203704j789613m118940m550057l727255k508588j392049r53055q85971
$$ 71203704 69414091 65295151 60745094 57017839 54509251 53117202 52164147 51278176
4971E1278176q83995j360230j574097j480958j619723j631953j592771j745175
$$ 51278176 50394181 49033951 47459854 45978896 44359173 42727220 41134449 39389274
4963C9389274k081303k205365k084127j900557j613758j694618j395662j008413
$$ 39389274 37307971 35102606 33018479 31117922 29504164 27809546 26413884 25405471
4955B5405471j298666j084661q94309q81651r94969p89961o40367n51894n29591
$$ 25405471 24106805 23022144 22127835 21246184 20251215 19461254 18820887 18268993 17739402
4946A7739402m82384m51425k40500m40655o89248l41982m81656k32244n03641
$$ 17739402 17257018 16805593 16565093 16124438 15435190 15093208 14611552 14379308 13875667
4937A3875667n58428l94745j31651l19180m44015k38253j62240m08940k80753
$$ 13875667 13317239 12922494 12790843 12471663 12027648 11789395 11627155 11218215 10937462
4928A0937462j53899j01643j85467k45112j84275k29936m62556j85846j09185
$$ 10937462 10783563 10681920 10496453 10251341 10067066 9837130 9374574 9188728 9079543
4919I079543k66217j35395r4212r2406j83597k30471k4727j44022k27812L1294
$$ 9079543 8813326 8677931 8583719 8491313 8307716 8077245 8052518 7908496 7680684 7711978
4909G711978O1048k11602j75058j31932k07720j04126p8429j40528j18935n4027
$$ 7711978 7773026 7561424 7386366 7254434 7046714 6942588 6864159 6723631 6604696 6550669
4899F550669r5150k7033j7117N001j4342k3340o8740j21181o5685J6499R0358
$$ 6550669 6455519 6428486 6411369 6416370 6402028 6378688 6309948 6188767 6123082 6139581 6229939
4888F229939m570j92614j22621j20586Q9661l0971N94j5704R410O6641j29217
$$ 6229939 6225369 6032755 5910134 5789548 5879209 5848238 5848832 5833128 5842538 5909179 5779962
4877E779962q8626m9610J08315J38076r4184L6319j2780O1887k6312O855J63245
$$ 5779962 5691336 5641726 5750041 5888117 5793933 5830252 5817472 5879359 5853047 5859902 6023147
4866F023147J46160j11731L1486J17602J38791K26197L20389k8563j8681J26223
$$ 6023147 6169307 6057576 6089062 6206664 6345455 6571652 6892041 6863478 6844797 6971020
4856F971020J38906K90725K99871J37852M15733L65206L22714O25449P62324Q64576
$$ 6971020 7109926 7400651 7700522 7838374 8254107 8619313 8942027 9567476 10329800 11194376
4846A1194376J210778J460439K177215L445638N008725N941577N653617N067705
$$ 11194376 12405154 13865593 16042808 19488446 24497171 30438748 36092365 41160070
4838D1160070M142058J531176o62672r48804k16328J082513K042855K925092L997600
$$ 41160070 45302128 46833304 46170632 45221828 45005500 46088013 48130868 51055960 55053560
4829E5053560M773279M599786L752252K771087Q85239j721583k594430j417689
$$ 55053560 59826839 64426625 68178877 70949964 71835203 70113620 67519190 66101501
4821F6101501P86930K802813L353773K615461J754257J22022j977278l105212
$$ 66101501 66888431 69691244 73045017 75660478 77414735 77536757 75559479 72454267
4813G2454267k947460k117810j508087p38242L51838J238928J766587J513576
$$ 72454267 69506807 67388997 65880910 65142668 65494506 66733434 68500021 70013597
4805G0013597R89940j04922k080581l785962l866483l256611k240373j669013
$$ 70013597 71003537 70898615 68818034 65032072 61165589 57908978 55668605 53999592
4797E3999592j705522j916027k051357k076501k108465k000270j858478k189229
$$ 53999592 52294070 50378043 48326686 46250185 44141720 42141450 40282972 38093743
4789C8093743k264205j926211j636796j416218r35188r51844j092150r72898r85862
$$ 38093743 35829538 33903327 32266531 30850313 29915125 28963281 27871131 26898233 25912371
4780B5912371j060453r03348o71383p77393o54037o61033o33531n10390m55998
$$ 25912371 24851918 23948570 23277187 22499794 21845757 21184724 20551193 20040803 19584805
4771A9584805k95930k60186p7764J369J59288J01797M549O2912j08538j52918
$$ 19584805 19288875 19028689 18950925 18952294 19111582 19213379 19217928 19280840 19172302 19019384
4761A9019384k54328k10047k83292l57101l87590m73643n14546n19238n47598
$$ 19019384 18765056 18555009 18271717 17914616 17527026 17053383 16538837 16019599 15472001
4752A5472001m12596l55580l71625k83831k46390J38024J7828j24761P1698p8443
$$ 15472001 15059405 14703825 14332200 14048369 13801979 13940003 13957831 13833070 13904768 13826325
4742A3826325k57292l49078j59459M9405j14269k53261j7153m783J77479L89571
$$ 13826325 13569033 13219955 13060496 13109901 12995632 12742371 12725218 12720435 12897914 13287485
4732A3287485Q38354J460818J727192J841097J377307Q26922L05071k60483o02214
$$ 13287485 14125839 15586657 17313849 19154946 20532253 21359175 21664246 21403763 20801549
4723B0801549l28952L45381Q88075J046400P74970K79056J79635q33095j349810
$$ 20801549 20472597 20817978 21706053 22752453 23527423 23806479 23986114 23153019 21803209
4714B1803209j249409j079161q20348o81534l65235P0473N95961P12073O85670
$$ 21803209 20553800 19474639 18654291 17972757 17607522 17677995 18273956 18986029 19671699
4705A9671699O62065O4773k94971O4030J91725J49778N97566M51762O0965k50812
$$ 19671699 20333764 20398537 20103566 20167596 20359321 20509099 21106665 21558427 21619392 21368580
4695B1368580n71192j036141j380270j171441j180886j195260j285661j278157
$$ 21368580 20797388 19761247 18380977 17209536 16028650 14833390 13547729 12269572
4687A2269572j125301q49863n92277m67180m00024n43161l08481j24538m34030
$$ 12269572 11144271 10294408 9702131 9234951 8834927 8291766 7983285 7858747 7424717
4678G424717k66378l52430j45998j08549k37450k52186o7686n6573r9732j45664
$$ 7424717 7158339 6805909 6659911 6551362 6313912 6061726 5994040 5937467 5837735 5692071
4668E692071j20155j57928k8775k38740l08520k4753j03710j02307j60954j5789
$$ 5692071 5571916 5413988 5385213 5146473 4837953 4813200 4709490 4607183 4446229 4430440
4658D430440n8681j92365j7650o6723m0793K7373q9245j01078m3719r5398j55227
$$ 4430440 4371759 4179394 4161744 4095021 4054228 4081601 3992356 3891278 3847559 3752161 3596934
4647C596934j37629k8705j36809K6662j39419M5486j20842j78230Q0481k1766
$$ 3596934 3459305 3430600 3293791 3320453 3181034 3226520 3105678 2927448 3007929 2986163
4637B986163m8555L2063k34194k4141K25558j18402r7425K0552N5338o7050j28910
$$ 2986163 2937608 2969671 2735477 2711336 2936894 2818492 2721067 2741619 2796957 2729907 2600997
4626B600997n4696L1997j12813R4270P307q0344p3011Q6020R3981n3065j55548
$$ 2600997 2546301 2578298 2465485 2559755 2567062 2486718 2413707 2499727 2593708 2540643 2385095
4615B385095J02339O2264j76899m7613L6454R185K134P2681j23855n1831l6116
$$ 2385095 2487434 2549698 2372799 2325186 2361640 2370825 2372959 2445640 2321785 2269954 2233838
4604B233838J22683j22623o5255R0578N6910p7880N3153M8704j24455R4093j49935
$$ 2233838 2356521 2233898 2168643 2259221 2316131 2238251 2291404 2340108 2215653 2309746 2159811
4593B159811Q8063J66121j76498k7493k5831j59405j6721J36185M5487o4491q3030
$$ 2159811 2247874 2413995 2237497 2210004 2184173 2024768 2008047 2144232 2189719 2125228 2042198
4582B042198J82278o8822j08976O2946N7726p2431j03853J1630K1484m9623j33706
$$ 2042198 2224476 2155654 2046678 2109624 2167350 2094919 1991066 2002696 2024180 1974557 1840851
4571A840851n703L6429j2502N0424J15624m48J9319j69872l5107K9150j02675
$$ 1840851 1835148 1871577 1859075 1909499 2025123 2024675 2043994 1874122 1839015 1868165 1765490
4560A765490N8907m7124L371R768j17019K444p4768L105Q8986L7591k8899m3811
$$ 1765490 1824397 1777273 1780644 1790412 1673393 1675837 1601069 1604174 1693160 1730751 1701852 1658041
4548A658041o1331J19185j76403J09330N383K6429O1038R356q5081R138j21310
$$ 1658041 1596710 1715895 1539492 1648822 1654205 1680634 1741672 1751028 1665947 1675085 1553775
4537A553775q2113K5877L2965r0241J00044L1510K087j10026J02723n3762k956
$$ 1553775 1471662 1497539 1530504 1440263 1540307 1571817 1573904 1463878 1566601 1512839 1509883
4526A509883J42837M4545m48r2463Q669J8204L7494Q6114Q5414o1383N3056K03028
$$ 1509883 1652720 1697265 1696817 1604354 1613023 1631227 1668721 1754835 1840249 1778866 1831922 2034950
4514B034950J98809K27104L57357L53693O52212N37800N76512K86773K41439K8322
$$ 2034950 2233759 2460863 2818220 3171913 3824125 4361925 4938437 5225210 5466649 5494971
4504E494971n7949J1083J08148k4350m908J22325K86955L81554L13301J49638
$$ 5494971 5437022 5448105 5556253 5531903 5526995 5649320 5936275 6317829 6631130 6780768
4494F780768m8174j80630q3848Q9284M3037J40225J94034O1252J08970k9918p8727
$$ 6780768 6732594 6551964 6468116 6557400 6600437 6740662 6934696 6995948 7104918 7075000 6996273
4483F996273j88063k26664j9724q6581j69506l6438J7070R8146J49294R9592p863
$$ 6996273 6808210 6581546 6561822 6475241 6305735 6269297 6286367 6384513 6533807 6633399 6625536
4472F625536r5479j28991l46232k24797k53478k66869l46341k88019j77203m48739
$$ 6625536 6530057 6401066 6054834 5830037 5576559 5309690 4963349 4675330 4498127 4049388
4462D049388j18272k96944q4816j34785k71068k16602r9314k0067m7841l7305
$$ 4049388 3931116 3634172 3549356 3414571 3143503 2926901 2827587 2807520 2759679 2722374
4452B722374j72425M5063k7300j60588k14411J53881J38744l9028n2656o0385
$$ 2722374 2549949 2595012 2567712 2407124 2192713 2346594 2485338 2446310 2393654 2333269
4442B333269J23663R5690J10905R6747K969L4589o5874P1271n0712n6933j00190
$$ 2333269 2456932 2552622 2663527 2760274 2763243 2797832 2731958 2803229 2752517 2695584 2595394
4431B595394j68423P5476R6358O9570L979p4264n2029Q3899j18338N4331L3815
$$ 2595394 2426971 2502447 2598805 2668375 2672354 2598090 2546061 2629960 2511622 2565953 2599768
4420B599768q4402J1857R5177k0767M4753l1277N9597N814j89332O385j4728o5802
$$ 2599768 2515366 2527223 2622400 2601633 2646386 2615109 2674706 2680520 2491188 2497573 2482845 2417043
4408B417043O5615O713j6522o684K9956p4820k051M7973n3369j26843k37546o8051
$$ 2417043 2482658 2489371 2472849 2466165 2496121 2421301 2419250 2467223 2413854 2287011 2049465 1981414
4396A981414o9248n0617N3986j12147j23456K6452L1350R991l9254K4343R9185
$$ 1981414 1912166 1861549 1915535 1803388 1679932 1706384 1737734 1747725 1708471 1732814 1831999
4385A831999J6026j30295R5179o1768n3274Q4010J13599k07921m1324q2360k31490
$$ 1831999 1848025 1717730 1812909 1751141 1697867 1781877 1895476 1687555 1646231 1563871 1332381
4374A332381p6837J25279J8365o3155k9672q0246r4680J33370n5201L3553J0916
$$ 1332381 1255544 1380823 1399188 1336033 1306361 1226115 1131435 1264805 1209604 1243157 1254073
4363A254073j27948J6683j04558J21367M9497o5790l6834m5361j0362m8111L0730
$$ 1254073 1126125 1142808 1038250 1159617 1209114 1143324 1106490 1061129 1050767 1002656 1033386
4352A033386P9717k39624P6719Q9290l4974l5149j868m0866q7307J88395m5002
$$ 1033386 1113103 873479 950198 1039488 1004514 969365 967497 926631 839324 1027719 982717
4341I82717l8499M3483l3745P569o6614K0294J4312p0430j1351P1302j45832R7032
$$ 982717 944218 987701 953956 961525 894911 915205 929517 859087 847736 919038 773206 870238
4329H70238l8101n7230M2502J2862K3256m4884N632J3949J18073Q0618k8641k33808
$$ 870238 832137 774907 817409 830271 853527 808643 814275 828224 946297 1026915 998274 764466
4317G64466k1105L9806P8726J0165p2637O6956j3901P157p3450J95413J64148
$$ 764466 743361 783167 861893 872058 799421 866377 852476 859633 786183 981596 1145744
4306A145744j35442j15677n9795j1894k0416O2473k2517J2195J43495k716j32626
$$ 1145744 1010302 894625 834830 822936 802520 864993 842476 854671 998166 995450 862824
4295H62824J3444n0072R498K0417n4845j14701P0113q7231J49624N9424l1121
$$ 862824 876268 826196 835694 856111 801266 686565 756678 669447 819071 878495 847374
4284H47374k15019m5523J14220j32586J05839l050N9832J9548m0346o0856J2269
$$ 847374 632355 586832 701052 568466 674305 671255 731087 750635 710289 649433 661702
4273F61702O806J10710J3155k5127j65051r9766Q748K5713N8633m4408J03469
$$ 661702 668508 779218 792373 767246 602195 502429 511177 536890 595523 551115 654584
4262F54584K5857k21142k3313J17888P5639L0639p7501k4287J62517M2497J8644
$$ 654584 680441 459299 435986 553874 629513 660152 582651 558364 720881 763378 782022
4251G82022J9202L6247j8782J9358J60811j71084j03181j13821j1706J22648K7375
$$ 782022 801224 837471 818689 838047 998858 827774 724593 610772 599066 721714 749089
4240G49089j29821J5739j24386J11139Q9024j40164J42489K5660J5951r2463n2330
$$ 749089 619268 635007 510621 621760 710784 570620 713109 738769 754720 662257 609927
4229F09927J4841J9094M3833M7087r5206k0164J00296o4952m5831p8495K71487
$$ 609927 624768 643862 687695 734782 639576 619412 719708 654756 608925 530430 801917
4218H01917k2284L5614n911q0292o8480o3840p6165l9911N7111j92887m810l0958
$$ 801917 779633 815247 809336 729044 660564 596724 520559 480648 537759 344872 340062 309104
$$ [...]
##END NTUPLES=NMR SPECTRUM
##END=
