##TITLE=1H_DE-80H_X3
 200.13MHz, d2o
 8 sc
 
 19ns.26.2.2025
##JCAMPDX= 6.0         $$ Bruker NMR JCAMP-DX V2.0
##DATA TYPE= NMR SPECTRUM
##DATA CLASS= NTUPLES
##ORIGIN= UXNMR, Bruker Analytische Messtechnik GmbH
##OWNER= pz
$$ XWIN-NMR		Version 3.5
$$ Thu Dec 11 10:51:13 2025 Russian Standard Time (UT+4h)  Yarkov@DPX200
##.OBSERVE FREQUENCY= 200.1313
##.OBSERVE NUCLEUS= ^1H
##.ACQUISITION MODE= SIMULTANEOUS
##.ACQUISITION SCHEME= undefined
##.AVERAGES= 8
##.DIGITISER RES= 18
##SPECTROMETER/DATA SYSTEM= spect
##.PULSE SEQUENCE= zg30
##.SOLVENT NAME= CDCl3
##.SHIFT REFERENCE= (INTERNAL, CDCl3, 0, 15.4781)
##AUDIT TRAIL= $$ (NUMBER, WHEN, WHO, WHERE, WHAT)
$$ ##TITLE= Audit trail, XWIN-NMR		Version 3.5
$$ ##JCAMPDX= 5.01
$$ ##ORIGIN= Bruker BioSpin GmbH
$$ ##OWNER= Yarkov
$$ C:/Bruker/XWIN-NMR/data/yarkov2/nmr/H-C/1/pdata/1/auditp.txt
$$ ##AUDIT TRAIL=  $$ (NUMBER, WHEN, WHO, WHERE, WHAT)
(   1,<2025-12-11 10:50:30.65 +0400>,<Yarkov>,<DPX200>,
      <created by zg, POWCHK disabled, PULCHK disabled
       configuration hash MD5:
       00 E9 B6 7A A2 85 ED C7 34 08 36 98 17 FE 4E 26
       data hash MD5: 16K
       F1 37 99 E5 45 84 6C 38 5F 77 E7 C0 60 28 0A B2>)
(   2,<2025-12-11 10:50:36.21 +0400>,<Yarkov>,<DPX200>,
      <Start of raw data processing
       efp BC_mod = 2 LB = 0.25 FT_mod = 6 PKNL = 1 PHC0 = -5306.083 PHC1 = 17.82193 SI = 16K 
       data hash MD5: 16K
       1E 5C 1C 86 A0 C9 D0 6F 54 71 11 5C 26 1E F7 81>)
$$ ##END=
$$ 
$$ hash MD5
$$ 3E 69 33 23 08 9B D6 6B 4D 9C 74 F5 80 4C 55 3A
##$RELAX= 
##$RELAX= 
##$RELAX= 
##$RELAX= 
##$RELAX= 
##$RELAX= 
$$ Bruker specific parameters
$$ --------------------------
##$DU= <C:/Bruker/XWIN-NMR>
##$EXPNO= 1
##$NAME= <H-C>
##$PROCNO= 1
##$TYPE= <nmr>
##$USER= <yarkov2>
##$AMP= (0..31)
100 100 100 100 100 100 100 100 100 100 100 100 100 100 100 100 100 100 
100 100 100 100 100 100 100 100 100 100 100 100 100 100 
##$AQSEQ= 0
##$AQ_mod= 1
##$AUNM= <au_zg>
##$AUTOPOS= <>
##$BF1= 200.13
##$BF2= 200.13
##$BF3= 200.13
##$BF4= 200.13
##$BF5= 200.13
##$BF6= 200.13
##$BF7= 200.13
##$BF8= 200.13
##$BYTORDA= 1
##$CFDGTYP= 0
##$CFRGTYP= 5
##$CHEMSTR= <none>
##$CNST= (0..31)
1 1 145 1 1 1 1 1 1 1 1 1 1 1 1 1 1 1 1 1 1 1 1 1 1 1 1 1 1 1 1 1 
##$CPDPRG= <>
##$CPDPRG1= <>
##$CPDPRG2= <>
##$CPDPRG3= <>
##$CPDPRG4= <mlev>
##$CPDPRG5= <mlev>
##$CPDPRG6= <mlev>
##$CPDPRG7= <mlev>
##$CPDPRG8= <mlev>
##$CPDPRGB= <>
##$CPDPRGT= <>
##$D= (0..31)
0 0.7 0 0 0 0 0 0 0 0 0 0.03 0 0 0 0 0 0 0 0 0 0 0 0 0 0 0 0 0 0 0 0 
##$DATE= 1765435830
##$DBL= (0..7)
120 120 120 120 120 120 120 120 
##$DBP= (0..7)
150 150 150 150 150 150 150 150 
##$DBP07= 0
##$DBPNAM0= <>
##$DBPNAM1= <>
##$DBPNAM2= <>
##$DBPNAM3= <>
##$DBPNAM4= <>
##$DBPNAM5= <>
##$DBPNAM6= <>
##$DBPNAM7= <>
##$DBPOAL= (0..7)
0.5 0.5 0.5 0.5 0.5 0.5 0.5 0.5 
##$DBPOFFS= (0..7)
0 0 0 0 0 0 0 0 
##$DE= 6
##$DECBNUC= <off>
##$DECIM= 32
##$DECNUC= <off>
##$DECSTAT= 4
##$DIGMOD= 1
##$DIGTYP= 9
##$DL= (0..7)
0 120 120 120 120 120 120 120 
##$DP= (0..7)
$$ [...]
##$SUBNAM2= <"">
##$SUBNAM3= <"">
##$SUBNAM4= <"">
##$SUBNAM5= <"">
##$SUBNAM6= <"">
##$SUBNAM7= <"">
##$SUBNAM8= <"">
##$SUBNAM9= <"">
##$SW= 18.0517328524113
##$SWIBOX= (0..15)
0 0 2 0 0 0 0 0 0 0 0 0 0 0 0 0 
##$SW_h= 3612.71676300578
##$TD= 16384
##$TD0= 1
##$TE= 0
##$TE2= 300
##$TE3= 300
##$TEG= 300
##$TL= (0..7)
0 120 120 120 120 120 120 120 
##$TP= (0..7)
150 150 150 150 150 150 150 150 
##$TP07= 0
##$TPNAME0= <>
##$TPNAME1= <>
##$TPNAME2= <>
##$TPNAME3= <>
##$TPNAME4= <>
##$TPNAME5= <>
##$TPNAME6= <>
##$TPNAME7= <>
##$TPOAL= (0..7)
0.5 0.5 0.5 0.5 0.5 0.5 0.5 0.5 
##$TPOFFS= (0..7)
0 0 0 0 0 0 0 0 
##$TUNHIN= 0
##$TUNHOUT= 0
##$TUNXOUT= 0
##$USERA1= <user>
##$USERA2= <user>
##$USERA3= <user>
##$USERA4= <user>
##$USERA5= <user>
##$V9= 5
##$VALIST= <valist>
##$VCLIST= <CCCCCCCCCCCCCCC>
##$VD= 0
##$VDLIST= <DDDDDDDDDDDDDDD>
##$VPLIST= <PPPPPPPPPPPPPPP>
##$VTLIST= <TTTTTTTTTTTTTTT>
##$WBST= 1024
##$WBSW= 4
##$XGAIN= (0..3)
0 0 0 0 
##$XL= 0
##$YL= 0
##$YMAX_a= 193421
##$YMIN_a= -154956
##$ZGOPTNS= <>
##$ZL1= 120
##$ZL2= 120
##$ZL3= 120
##$ZL4= 120
##$ABSF1= 0
##$ABSF2= 0
##$ABSG= 0
##$ABSL= 0
##$ALPHA= 0
##$AQORDER= 0
##$ASSFAC= 0
##$ASSFACI= 0
##$ASSFACX= 0
##$ASSWID= 0
##$AUNMP= <proc_1d>
##$AZFE= 0.1
##$AZFW= 0.1
##$BCFW= 0
##$BC_mod= 2
##$BYTORDP= 0
##$COROFFS= 0
##$CY= -3
##$DATMOD= 1
##$DC= 0
##$DFILT= <>
##$DTYPP= 0
##$F1P= 0
##$F2P= 0
##$FCOR= 1
##$FTSIZE= 16384
##$FT_mod= 6
##$GAMMA= 0
##$GB= 0
##$INTBC= 1
##$INTSCL= 3.241238e-09
##$ISEN= 128
##$LB= 0.25
##$LEV0= 0
##$LPBIN= 0
##$MAXI= 10000
##$MC2= 0
##$MEAN= 0
##$ME_mod= 0
##$MI= 1.114404
##$NCOEF= 0
##$NC_proc= -7
##$NLEV= 6
##$NOISF1= 3.799351
##$NOISF2= 2.8
##$NSP= 0
##$NTH_PI= 0
##$NZP= 0
##$OFFSET= 15.47805
##$PC= 1
##$PHC0= -5306.083
##$PHC1= 17.82193
##$PH_mod= 1
##$PKNL= yes
##$PPARMOD= 0
##$PSCAL= 0
##$PSIGN= 0
##$REVERSE= no
##$SF= 200.130008735464
##$SI= 16384
##$SIGF1= 3
##$SIGF2= 2
##$SINO= 0.751879
##$SIOLD= 32768
##$SREGLST= <19F.Aceton>
##$SSB= 0
##$STSI= 16384
##$STSR= 0
##$SW_p= 3612.71676300578
##$SYMM= 0
##$S_DEV= 0
##$TDeff= 16384
##$TDoff= 0
##$TI= <>
##$TILT= no
##$TM1= 0
##$TM2= 0
##$TOPLEV= 0
##$USERP1= <user>
##$USERP2= <user>
##$USERP3= <user>
##$USERP4= <user>
##$USERP5= <user>
##$WDW= 1
##$XDIM= 16384
##$YMAX_p= 346712910
##$YMIN_p= -831375
$$ End of Bruker specific parameters
$$ ---------------------------------
##NTUPLES= NMR SPECTRUM
##VAR_NAME=  FREQUENCY,     SPECTRUM/REAL,   SPECTRUM/IMAG
##SYMBOL=    X,             R,               I
##VAR_TYPE=  INDEPENDENT,   DEPENDENT,       DEPENDENT
##VAR_FORM=  AFFN,          ASDF,            ASDF
##VAR_DIM=   16384,         16384,           16384
##UNITS=     HZ,            ARBITRARY UNITS, ARBITRARY UNITS
##FACTOR=    0.220516191357247, 1,           1
##FIRST=     3097.62232812482, 0,            0
##LAST=      -515.094434880959, 0,           0
##MIN=       -515.094434880959, -831375,     0
##MAX=       3097.62232812482, 346712910,    0
$$ Real data points
##PAGE= N=1
##DATA TABLE= (X++(R..R)), XYDATA
$$ [...]
14281 227964 242989 70181 7435 160173 298438 629916 971454 928774 735727 246676
14271 246676 -213864 -329082 -233625 29180 235070 407717 338626 79863 -155390 -445180
14261 -445180 -580322 -421824 -341905 -214418 -2788 67202 128197 267751 278051 227199
14251 227199 252900 215894 130463 320761 438440 491816 484986 406041 285311 98229 -50946
14240 -50946 -31926 203936 248590 109568 -113645 -431350 -546156 -231147 -4289 292463
14230 292463 348392 215595 104240 -159607 -120768 163172 525658 683489 507036 45980
14220 45980 -229814 -299285 -172166 126806 213137 232616 126972 32883 -162049 -113087 -19793
14209 -19793 105360 225545 121986 -106985 -233969 -266945 -102286 -117565 -88242 -36436
14199 -36436 64280 86446 111675 170259 258667 332830 222624 17552 -259790 -281948 -187950
14188 -187950 172776 527199 709715 645827 419400 114948 -11327 -85592 -248491 -255079
14178 -255079 -122717 -43517 -93629 -259507 -265521 -393208 -277003 -79332 215188 254247
14168 254247 268594 166219 148367 280860 202645 93887 111745 194154 309898 499713
14158 499713 376166 90560 114760 107259 83804 137073 7697 -106894 -268554 -188068 102365
14147 102365 289648 298292 202041 -32870 -274400 -424199 -448304 -376497 -324819 -107188 231562
14136 231562 330258 433133 399082 509671 500322 259316 -67482 -71262 -57217 15270 179272
14125 179272 131005 61408 -153492 -278680 -339249 -368586 -333499 -243832 -161229 133691 466426
14114 466426 446616 447164 352074 216699 137180 113266 346925 361734 374916 225922 4414
14103 4414 -467069 -490503 -352045 -87488 285530 319469 9317 -345403 -462607 -435818
14093 -435818 -188105 309533 573443 659141 396430 65473 -228084 -281032 -55977 121812
14083 121812 287262 316330 252766 26529 103649 197897 342830 445087 376245 332907 -7296
14072 -7296 -205553 -275836 -364847 -362142 -383211 -152673 -141125 -36400 141214 381239 447763
14061 447763 342678 84939 -148913 -216710 -6942 163000 275793 414887 472569 212000
14051 212000 -84263 -20844 -68779 -122474 33501 -119393 -120075 -74734 30324 106899 83015
14040 83015 -104733 -271163 -261234 -286310 -20809 335716 442763 257545 -20732 -71031
14030 -71031 -98744 89011 376786 314364 137978 -131703 -273951 -194896 -108659 302409
14020 302409 649529 564349 316268 167531 39431 -74482 -323 223964 286682 13207
14010 13207 -301658 -210144 -51642 217460 444823 482196 371134 162224 24232 -15763
14000 -15763 45891 236849 252499 54086 -32155 -190249 -439669 -444337 -208426 -134275 -113666
13989 -113666 19811 89840 86235 195302 205835 406845 315719 202937 17195 14989 -55818
13978 -55818 -53268 36224 55350 158000 93869 13548 -6359 -56989 -158029 -278415 -116241
13967 -116241 129514 143008 326325 205979 157075 128649 -106011 -124993 -138038 3892
13957 3892 24180 200721 307694 393648 291527 256655 156294 -30868 -170290 -180014 -271029
13946 -271029 -265553 -225267 -196870 -99174 -106029 92546 243101 484894 668803 637877 334561
13935 334561 -56595 -219742 -170060 61359 227967 367804 411431 243972 -92821 -401261
13925 -401261 -315199 -137364 250200 461088 494936 369674 -63153 -377821 -366380 -184062
13915 -184062 -302319 -201497 -103015 -45518 261264 471059 332051 270458 149929 -37322
13905 -37322 -10130 40227 7132 -29139 -57001 -144289 -279418 -115485 35929 84398 254739
13894 254739 273893 93881 -8104 129806 146223 212650 321042 202052 -111704 -213618
13884 -213618 -459228 -525576 -323709 -135766 -37741 106559 158096 128560 184995 255972 477162
13873 477162 565043 384507 284459 -4411 -43477 -119448 -72572 -178336 -199060 -176941 -195519
13862 -195519 -71138 39543 282047 383665 430378 292202 25330 -142665 -285507 -183710
13852 -183710 131269 360828 479784 283171 104465 -38361 4768 245935 381130 553284
13842 553284 451371 68332 -157437 -324992 -406194 -365663 -84777 197764 385323 437730
13832 437730 350335 361563 271102 346246 142927 -119186 -150947 -123725 -67642 8526 -12039
13821 -12039 -25721 -134127 -322545 -379610 -286016 8396 235454 506309 861778 958078
13811 958078 609794 197159 -7276 -75756 -46079 68049 153063 170439 35283 -113975
13801 -113975 -189445 -105148 116400 297038 269150 86609 -112264 -340092 -300335 -147987
13791 -147987 148406 254929 305960 378342 414066 537723 326018 88491 -65791 -280208
13781 -280208 -341551 -284412 -133770 144017 384505 442141 223632 -69420 -252214 -389919
13771 -389919 -451168 -338270 56148 449785 460107 256481 41968 -41008 -154661 -299589
13761 -299589 -222329 -78561 43089 156989 146640 361419 408325 392684 259034 289785
13751 289785 117898 67449 24319 -103513 -67772 -96734 -150200 -288400 -248196 -124772 -94350
13740 -94350 -16083 -74875 3754 92209 285812 433242 399116 319401 -11540 -12512 -141788
13729 -141788 -40266 253895 434715 399565 190288 47642 -162420 -139563 -24952 69894
13719 69894 107677 206612 31626 -146867 -150944 -168587 -11919 24149 -47220 -128916 -364330
13708 -364330 -457569 -201869 75444 297732 253789 244074 223157 129397 142570 91396 133774
13697 133774 130296 -4763 -51424 -117855 -150522 71032 219450 246178 159458 79729 -35070
13686 -35070 -50208 -224205 -282020 -238643 -362952 -201357 151040 164576 337436 312148 375851
13675 375851 153619 -123392 -219570 -182548 76339 127566 227084 399426 188925 14804
13665 14804 -55741 -78078 80831 -118051 -257349 -566326 -662082 -571921 -429044 -243759
13655 -243759 -41945 -69290 80040 172774 275433 287379 389526 659074 773079 582840
13645 582840 401858 181029 91611 106550 142737 57653 63586 -114364 -188746 -332888 -510023
13634 -510023 -629156 -390457 -351445 -375200 -311931 52973 378706 404498 397891 357387 285603
13623 285603 276449 100425 -3562 98556 239040 414881 374635 360836 350550 477234
13613 477234 462684 388844 226273 104006 -267608 -428455 -556042 -461525 -316336 -101637
13603 -101637 9227 -93557 -119693 -170871 -237426 -108604 88468 473427 632042 651579
13593 651579 502725 39067 -156166 -303970 -282533 35418 152182 269168 234548 295785
13583 295785 376693 244819 141388 -69144 -48579 -10069 118288 168502 145646 70815 -202575
13572 -202575 -475865 -589263 -447320 -154932 150722 540536 503937 371757 280764 56405
13562 56405 -11801 3918 132249 120686 66580 -147320 -282371 -136463 -48030 25401 245291
13551 245291 301596 323240 39776 -8418 15588 159165 450278 541887 437294 114059
13541 114059 -42419 -231214 -285234 -61053 138543 283130 445787 437388 503450 313358
13531 313358 89218 30903 -37582 4800 3113 224898 296937 145748 63200 -62132 -241481
13520 -241481 -391410 -197924 29182 363171 462610 408671 136304 -157644 -150196 -49505
13510 -49505 300088 418647 450313 368000 158969 -28356 -126196 -131448 135934 224392 146586
13499 146586 -54465 -276648 -416780 -305058 -312651 -38396 193666 268961 188204 -28731
13489 -28731 -146678 -292517 -283620 -166196 -106312 123773 45643 -77521 94989 151896 172798
13478 172798 249887 299176 200470 145738 128450 247473 350762 436360 421313 389045 103208
13467 103208 -229206 -336231 -185049 -117680 -184424 -248094 -232917 -197124 -245580 -197620 -12965
13456 -12965 211782 471990 446529 140298 -125091 -283635 -377092 -240780 -8917 192637
13446 192637 234200 236763 232208 97009 -2911 -28849 -114483 -126543 -313362 -341236 -376394
13435 -376394 -163032 183426 391119 441249 328275 109692 -105333 -252777 -126212 -2745
13425 -2745 184189 280788 317222 26828 -73582 -71878 -47351 42650 115981 -34136 -53342
13414 -53342 50252 -18039 1924 -19321 -64868 -97483 10250 66536 72199 29259 157743
13403 157743 137451 137792 -47701 -38978 -35188 -69858 -5365 38343 153359 412297 687764
13392 687764 712568 745042 607499 224306 -27774 -194084 -220460 -106614 82810 122609
13382 122609 23430 -18715 -229094 -283115 -99030 -4332 157139 147046 254552 31746
13372 31746 -127448 -71775 -30453 8990 -119715 -109406 -47820 -11308 151657 345351 536963
13361 536963 557387 613917 449256 296496 78115 9311 -80639 -150777 -278520 -384596
13351 -384596 -176606 -108305 45785 261979 433230 261896 188615 14499 15747 173931
13341 173931 389266 464211 297630 140171 12978 -326513 -297821 -129145 -27980 141167
13331 141167 126643 153230 94113 213191 234304 219052 98700 43745 -52040 -74583 -171904
13320 -171904 15448 53395 -122462 -275266 -337353 -177458 192041 648625 890862 797431
13310 797431 473130 71379 -182810 -210732 -265283 -63949 122838 141766 232380 224461 -28338
13299 -28338 -243652 -311673 -250848 -118949 -115638 -234865 -45891 40170 310337 349651 296006
13288 296006 98385 -231057 -219886 -21754 115453 150466 245858 258274 160834 -21346
13278 -21346 -23976 138233 978 -83277 -195851 -200034 -143084 13858 238582 327241 256597
13267 256597 132359 -41579 -295632 -210947 -48833 53572 171843 332231 340749 208619
13257 208619 183386 -5638 -47977 -68041 -19216 285183 378293 100157 -109198 -190547 -377968
13246 -377968 -377797 -234149 29512 182213 133833 208877 34240 -265168 -471043 -409162 -92013
13235 -92013 86778 319010 107062 -44522 -199981 -296609 -217862 -102808 194113 294136
13225 294136 581929 751945 712788 491575 261322 32281 -54563 -86548 13854 87212
13215 87212 -2442 -97243 -178976 -369170 -546464 -302389 -60235 287912 626802 725301
13205 725301 432659 50460 -165937 -242077 -218733 -42439 -219990 -391498 -425595 -467594
13195 -467594 -432750 -223981 -122670 36255 115284 185265 188394 343043 426689 377262 111896
13184 111896 -102521 -66754 17232 391267 793763 790805 530172 40885 -445652 -461922
13174 -461922 -283586 166478 579099 721577 567114 206394 -49682 -273205 -525534 -473196
13164 -473196 -461961 -518157 -434485 -360326 -99495 181849 496569 619512 596028 307613
13154 307613 -125463 -244975 -216533 -105946 212706 253754 131893 107229 84994 234378
13144 234378 399035 396525 176476 82260 -134279 -340836 -35249 287773 419849 344506
13134 344506 9120 -379964 -601628 -423746 -25774 372633 383272 213311 18412 -213044
13124 -213044 -407535 -274236 -63199 140116 111119 116788 8471 -104659 -155828 -83919
13114 -83919 -28905 -89548 -96868 15710 21495 400460 384610 223699 15144 -94225 -111208
13103 -111208 -150343 -44639 86958 258810 310258 120264 130544 202570 253622 149378
13093 149378 26896 -329314 -510998 -495243 -491817 -267301 -245973 -187765 -59434 119725
13083 119725 262544 361094 446698 469400 328872 200417 78593 -7067 -109342 -117511 -40013
13072 -40013 223701 235952 22077 -101191 -64438 -164801 -113739 64746 174237 177549 144986
13061 144986 104640 174575 146006 40202 -189236 -186142 -188458 -70004 125321 373268 529600
13050 529600 686153 633539 555597 370199 33073 -171012 -348348 -308124 -89858 24596
13040 24596 -23308 44440 145653 42506 -3172 -142092 50649 288339 369759 233667
13030 233667 122 -338546 -578128 -491902 -351997 -107660 188136 285045 254153 109012
13020 109012 39215 140394 109164 -19479 38859 139572 200666 300307 256443 129864 5169
13009 5169 -76538 -135205 -8605 63725 214501 359060 334396 302572 164691 -47999 -107563
12998 -107563 -198793 -149482 -190273 -68027 -22475 -3857 241060 424124 323531 177145
12988 177145 26503 -208408 -166867 153643 385779 357515 417900 101861 -214297 -269175
12978 -269175 -349434 -336596 -234104 -90535 135174 284225 251546 295033 208081 -1431
12968 -1431 -105796 -6116 110497 364557 429034 423522 345414 47525 -93439 -87801 -139554
12957 -139554 -116636 16772 201360 288049 108119 -101801 -365486 -447656 -444833 -385189 -136617
12946 -136617 36519 -74667 12937 81121 125188 145354 -8911 -87894 -32158 -25996 -33476
12935 -33476 174353 447726 678606 500600 334870 139038 -79273 -361803 -279095 -7124
12925 -7124 394358 704319 838870 832154 691205 425991 -17335 -309515 -447853 -284602
12915 -284602 31073 183389 148577 58121 -39743 -25015 26403 -72071 -139536 -201526 -167513
12904 -167513 -317755 -284148 -49873 27480 29388 -28553 -35601 8085 1238 -31058 133471
12893 133471 265886 189911 277439 468346 498062 492056 387060 199654 154673 37068 221910
12882 221910 454499 537118 486209 299911 67633 -175133 -317273 -106287 88029 208525
12872 208525 259777 -27267 -227910 -527824 -733922 -599441 -339099 -48669 172067 352104
12862 352104 498027 459806 378979 263402 68914 -61601 -201484 -338550 -27460 371554
12852 371554 462353 300641 20809 -12712 -19117 57880 292925 415777 366422 88041 -77615
12841 -77615 -308420 -461086 -418521 2080 253692 448056 502743 245834 -45568 -238820
12831 -238820 -356089 -375378 -268890 -231454 -305975 -357390 -400389 -304203 -53557 247391 374539
12820 374539 265762 134530 -56851 -274267 -79623 148801 478138 581699 314782 36209
12810 36209 -245130 -538354 -425464 -358502 -283040 -226433 -149611 28979 269637 449829
12800 449829 553344 661156 464643 187591 -114151 -204740 -84047 67267 220576 237732
12790 237732 113502 163351 264205 190210 244424 63019 17697 56404 -111469 -115959 -191383
12779 -191383 -112428 -101827 -56940 38700 -155920 -178936 -183132 -6360 233771 210086 104712
12768 104712 -4217 -106942 -132606 -57372 90543 272849 242178 181473 44361 -72677
12758 -72677 92894 311849 495435 395003 191026 -18983 -248500 -111935 2763 128639
12748 128639 170651 178561 -117241 -299541 -319185 30996 208007 480500 492640 307518
12738 307518 262100 60019 122054 95369 -68438 -239781 -385707 -292121 -109111 244424
12728 244424 434018 429663 424022 329162 189136 103232 40375 -247410 -288266 -259038 -347876
12717 -347876 -191254 -185225 63323 299234 501042 495968 166206 -55975 -177246 -70263
12707 -70263 66827 151565 253462 86461 17356 -27773 -86197 49000 166874 45496
12697 45496 -72246 53100 9339 162813 356525 407788 293477 168520 -48283 -303779
12687 -303779 -330636 -205616 -179740 -174276 -2488 215409 377876 592947 781439 697159
12677 697159 587026 434747 218150 5969 -129476 -94094 -241509 -269600 -235949 -226304
12667 -226304 2611 -28406 190097 90025 -44480 -164408 -292596 -121623 74716 287466
12657 287466 309850 192955 -33149 -87070 -27877 -2939 51646 -26322 -40363 -263183 -403977
12646 -403977 -215862 90780 388532 499344 333401 241074 247959 99186 115646 63410
12636 63410 303747 514060 567169 614938 435307 223621 121330 138759 135299 -119492 -166988
12625 -166988 -146039 -150181 -178291 -102455 -147494 -186219 -225563 -116445 -208070 -197409 -70676
12614 -70676 131034 205908 187744 192626 5165 -268122 -164353 -230028 -124374 287085 363861
12603 363861 336756 263993 132085 151705 274341 481136 619656 397104 29718 -254474
12593 -254474 -328082 -174351 77026 463685 481351 382594 101829 -263942 -539463 -675888
12583 -675888 -736613 -463116 -175968 46897 236438 148095 67331 -156264 -341372 -352484
12573 -352484 -275254 -153939 70792 353151 563876 629170 579411 393525 199958 8906
12563 8906 23374 69582 194872 82631 -118878 -160197 -103784 -191100 25199 412235 545224
12552 545224 443515 136634 -203141 -403914 -345312 -168988 105752 318377 226569 163263
12542 163263 48776 -177558 -363237 -279419 -150489 152095 251390 247618 203944 339011
12532 339011 333804 326282 212554 123165 12735 -281641 -299885 -86131 169856 261728 334162
12521 334162 350853 203490 28152 1285 181945 329934 507558 332213 -25529 -204601
12511 -204601 -250558 -305998 -158962 160988 198474 207433 31332 -295149 -408112 -226864
12501 -226864 151147 360223 333436 110044 324 -26112 -99926 -38638 352802 360887 180544
12490 180544 62662 -94529 -261636 -291736 -135421 87548 185068 51902 99606 77363
12480 77363 66850 122423 69904 2330 -9810 -145797 -154296 -172111 -103361 -23169 12344 -39165
12468 -39165 171471 265845 166726 106625 41131 -92598 -99259 -47827 78009 165465 208465
12457 208465 115538 -42142 -92444 -114198 -51293 -78896 -3961 132762 6649 -112353 -5413
12446 -5413 196060 110619 174867 218891 7900 -40616 -44797 -247047 -262938 -145538 98727
12435 98727 246225 430073 522704 399981 215458 54787 7087 -64827 83018 73675 33397
12424 33397 -17452 -169115 -122796 47037 170009 162533 213009 168027 98713 225242 368969
12413 368969 536799 430143 464023 257948 -9512 -288761 -407779 -403248 -467447 -277047
12403 -277047 33702 -4288 49112 -94014 -199691 -121358 58763 301246 313053 319853 293318
12392 293318 385245 328645 229069 -2258 -302243 -389083 -295221 -258643 83274 349132 408372
12381 408372 155481 65839 93511 155796 240593 459327 571250 551308 579359 497933 289929
12370 289929 215352 -78397 -166039 -269660 -517275 -530082 -426451 -224403 -187100 -115515
12360 -115515 -194018 -28600 25760 113806 347290 500316 431387 86699 -151529 -343608
12350 -343608 -452369 -215086 65615 426433 336712 378121 420167 456845 345550 179847
12340 179847 7522 -110351 -18697 62293 184584 57087 -117132 -299383 -341308 -343620
12330 -343620 -275580 -145311 41877 139921 -69565 -177756 19751 133252 292857 178758
12320 178758 94395 -156310 -519410 -660491 -606951 -286354 153817 573512 705192 679120
12310 679120 437391 379113 173165 28756 200688 227816 222809 180969 189921 163355 234583
12299 234583 178117 -5164 -204878 -290668 -400257 -319542 -76272 254114 342940 136086
12289 136086 17807 -92185 -255237 -241306 -175709 -174477 -182165 -191189 -205825 -55715 179739
12278 179739 368907 296863 86763 -10415 -81533 44311 38263 170414 456407 378766 438030
12267 438030 350355 201510 116674 -145664 -165819 -198339 -166669 -174325 -55014 8480 96844
12256 96844 78922 116715 201097 68617 -547 158807 96958 171660 176856 160980 168073 116335
12244 116335 8888 -109241 -177470 -334977 -353318 -145032 -17854 90370 143630 115592
12234 115592 -1030 94897 191141 379159 550256 416891 226673 164338 139858 52488
12224 52488 722 -106541 -168990 -70731 69756 255640 557924 577107 342651 104689
12214 104689 -210143 -419522 -231271 150125 519684 549660 372828 -43251 -448148 -499080
12204 -499080 -382626 -136492 252172 208471 -5746 -158226 -246805 -233878 2341 394389
12194 394389 731784 595673 462309 267137 77093 154533 327152 349997 107250 -195229
12184 -195229 -500509 -696148 -587736 -211736 26144 310187 405094 320300 240651 98315
12174 98315 -68207 -153632 -56520 25342 188491 228763 110400 -7587 -114877 -185964 -358756
12163 -358756 -466957 -270912 -81091 -75910 192550 301320 191219 163452 134839 -36591
12153 -36591 -73530 130345 90752 46459 -38011 6584 79984 107149 -66745 -259478 -313423
12142 -313423 -369494 -149940 49621 293359 354832 269035 341874 275797 297014 324503 55477
12131 55477 -102453 -262170 -213585 -76157 48619 306472 225603 90521 -188574 -340402
12121 -340402 -150124 -45949 18205 203447 158900 58214 -68666 -285236 -184000 92254
12111 92254 246844 305315 348936 353231 80550 -2193 -30244 -95576 2291 239827 293388
12100 293388 61179 -189004 -169273 -181019 -154212 11225 118817 165005 365267 374728 425705
12089 425705 478887 503200 647075 529641 381086 236031 102847 -26813 -119704 -282208
12079 -282208 -373286 -508409 -527908 -412423 -243004 -144156 21023 134558 48600 -44350
12069 -44350 107008 -59203 -33556 -39997 -77787 155170 322147 375994 364563 279568 207760
12058 207760 141136 168124 247661 327949 148592 297369 360006 206599 132297 132735 75159
12047 75159 -15122 -59277 -210631 -395069 -560183 -419380 -342781 -193767 -99619 -194637 -134728
12036 -134728 -185936 9148 239111 210289 183199 -80627 -285730 -255588 -183695 -100587 195653
12025 195653 334636 333608 328333 280026 29055 -113335 -270317 -231575 -140864 57802 173621
12014 173621 157610 90340 74307 244697 203239 -39568 -48993 117650 226007 449120 475279
12003 475279 529377 541328 318446 22706 -89108 -231225 -314437 -280814 -408396 -475518
11993 -475518 -555883 -407420 -139786 178890 482802 427595 215024 42522 193103 265821
11983 265821 330186 513667 443407 373698 300152 -26148 -245657 -350829 -205249 -37847
11973 -37847 34499 134596 211030 224530 193417 104111 -57081 -105772 74987 24920 -80670
11962 -80670 -191583 -228121 -211270 -129776 21115 108557 237374 285543 356826 524046 556096
11951 556096 564319 376029 342733 329947 -5886 -234549 -263881 -192168 -189472 -155630 -135803
11940 -135803 -270522 -416507 -418013 -382607 -185312 14434 324450 395480 319156 121335
11930 121335 126497 123677 170772 180409 45564 -284192 -500143 -682362 -551845 -379440 -40162
11919 -40162 461045 579060 485623 371484 282508 157031 226557 361199 442756 416138 100323
11908 100323 -154665 -190031 -43631 8584 -61926 -31214 -71507 -286777 -288201 -444280 -342776
11897 -342776 53993 344861 350209 279642 282071 175870 -67519 -87613 -145051 -116476 47066
11886 47066 -71740 -152614 -191523 20848 34127 113612 258258 295467 214650 117639 -49116
11875 -49116 27293 93229 117239 132772 108214 91085 103373 176653 396172 429001 171940
11864 171940 -152305 -352938 -372287 -384122 -275392 195434 423546 211844 239883 20354
11854 20354 -433941 -542401 -393186 -116768 11744 289564 599684 597769 498975 250281
11844 250281 -18717 -25696 -14644 185856 327751 403217 352864 216713 -1266 -80656 -217863
11833 -217863 -214745 -69977 55632 280843 224374 167646 70390 -7484 55040 280094 350210
11822 350210 409181 492387 141830 -213847 -315883 -302453 -218157 -198449 -60198 35822 69701
11811 69701 235319 282462 246279 412226 269675 136303 130856 -72820 -58296 124337 343247
11800 343247 338523 346617 205739 -52046 -335622 -339220 -262850 -112357 140281 284672 349220
11789 349220 412681 327108 201677 29203 -101489 106182 212878 250485 358594 315230
11779 315230 124222 -175669 -331198 -324593 -373776 -346013 -261187 -80629 -84864 -117412 52842
11768 52842 321302 440543 458816 505563 364665 314118 108307 -54124 -69384 55908
11758 55908 67404 55253 -28535 -149543 -16150 105091 219181 466646 527037 322587
11748 322587 350576 102062 -219838 -458220 -402032 -337705 -86095 182766 145507 -1594
11738 -1594 19897 22769 144380 238506 353640 337904 171408 53460 -115400 -78656 109290
11727 109290 232813 77717 36123 74501 16232 -65235 -203284 -110349 -46780 148575 331490
11716 331490 378712 332698 253209 122537 111298 94862 186482 189639 85855 -26861 -130291
11705 -130291 -303415 -276307 -107762 -126178 -238288 -397931 -350798 -288093 -104952 48154
11695 48154 138547 72967 37762 165089 301666 440774 594530 417547 354452 82234
11685 82234 -222339 -278592 -213818 -52756 -394 97998 45477 2924 -161557 -216623 -77384
11674 -77384 76678 251308 382408 448569 398397 301520 84574 -108296 -144115 -336052
11664 -336052 -219882 -120532 49592 186454 92773 -5700 -41337 -82594 -173169 -126917 -41415
11653 -41415 51604 142280 297390 409858 362506 154510 231979 206501 222955 350615 225630
11642 225630 -8914 -142130 -284891 -312266 -236346 -158002 -43099 -58458 -126355 -231775
11632 -231775 -276620 -191627 100005 382772 348550 326458 288369 76925 -39698 -16079 -129964
11621 -129964 126350 365661 627808 736875 575305 245869 -135976 -383877 -316240 -325409
11611 -325409 -178404 -104372 -87402 126957 50559 24778 65580 81123 -39849 -40681 -4326
11600 -4326 -27014 169988 317462 471848 448950 230390 59947 -84798 -69381 -54147 108663
11589 108663 210954 161196 -59170 -188506 -141920 4746 71197 170996 305361 224278
11579 224278 204675 72154 232490 183452 -1670 -40354 51035 113672 124452 -8290 -77698
11568 -77698 -51764 -28617 -80454 -182749 -194717 -92612 115773 298124 484834 376858
11558 376858 327316 212003 -234868 -474196 -506782 -388690 -208805 -87225 -148405 -155104
11548 -155104 -18788 70867 178871 242246 362243 387449 382807 262489 275715 116843 -15791
11537 -15791 -126883 -137739 -90720 -117840 -197934 -129637 -163197 -67712 39230 80413 -19647
11526 -19647 25420 55162 -47136 -79018 30679 203056 242789 349652 397783 282475 31507
11515 31507 -205996 -284403 -273786 -122954 103309 250555 280208 189206 -5298 -225124
11505 -225124 -382463 -140789 154126 600255 792625 657854 279350 -118418 -526268 -535509
11495 -535509 -285884 169019 378409 372577 209854 -76466 -158546 -122385 3660 39533
11485 39533 213394 109751 -16696 -190903 -323567 -266304 -210855 -273037 -137832 -94635
11475 -94635 93290 276375 368142 369443 416953 459031 402051 502483 530847 583389 312808
11464 312808 -240461 -331386 -501567 -530411 -433858 -403967 -322990 -193994 -225046 -63534 138250
11453 138250 417001 513888 339107 140210 7173 -63779 -65095 76418 168115 249474 203291
11442 203291 67612 -1596 -131548 -64206 24848 126711 81520 -66802 -224534 49501
11432 49501 252808 409118 522117 333097 116246 76316 -18829 131528 359397 526235
11422 526235 524985 296985 101506 -304253 -558606 -765011 -731614 -307381 69717 395744
11412 395744 617482 583636 441610 163795 8502 -231393 -302187 -272479 -21298 70058
11402 70058 156328 229347 361587 363103 307954 270451 142121 -124666 -274253 -313104 -454343
11391 -454343 -368753 -156526 5134 55219 137896 104579 81291 115674 172689 240379 169599
11380 169599 248911 221481 81115 103794 216325 245264 235932 33900 -242940 -362038 -193263
11369 -193263 -1036 72063 130162 182601 90178 80252 220108 457776 551897 558478 376493
11358 376493 109332 -81207 -158395 -217857 -47377 283174 309489 143055 -12846 -163381
11348 -163381 -398855 -417514 -422504 -218612 -151114 8473 71262 59852 72634 120858 256768
11337 256768 395692 488280 469827 429453 367250 304559 15373 -12335 -61968 -746 50828
11326 50828 98259 208829 264487 342525 190234 -37177 -213598 -134906 -260396 -268197 -277680
11315 -277680 -275088 -251593 -270275 -306012 -131380 149821 350615 450873 477293 248201 53229
11304 53229 168426 214024 316313 247838 292171 349178 408074 369584 52577 -140013 -363637
11293 -363637 -457937 -341291 -145826 125088 312167 399529 266271 35833 8252 -111596
11283 -111596 -119005 -79231 -125224 -158237 -90398 -498 204766 225560 115742 -196849 -453563
11272 -453563 -340114 -122639 91018 283988 381203 259059 69580 -140113 -373968 -492595
11262 -492595 -308919 -64081 162919 150433 369380 462901 352275 243421 3749 -20036
11252 -20036 75262 30426 107851 219927 421457 350230 216455 924 -427688 -680813
11242 -680813 -593451 -345145 62916 356491 561814 421367 -28930 -368516 -515052 -441021
11232 -441021 -29389 338200 533581 426764 22797 -222578 -208407 55612 374496 292655
11222 292655 277238 337599 378945 331442 273631 176286 -17883 -279826 -499484 -529665 -558492
11211 -558492 -317933 -36051 245966 397874 604129 419160 338989 227909 135192 150240
11201 150240 92808 26996 1331 -253527 -441945 -519917 -419814 -94052 219887 413151
11191 413151 502789 598669 384029 170368 11848 -61034 81350 72925 82456 -16375 -156745
11180 -156745 -187546 -119397 -48811 134432 293698 299500 116326 -77370 -15663 38120 152018
11169 152018 140795 193020 175452 25808 -14110 -25249 44263 261228 316773 300955 183079
11158 183079 -124823 -201549 -150964 59734 236374 415119 393774 43287 -300971 -196236
11148 -196236 2166 165167 313903 384359 350489 271020 109187 -52578 -140489 -43553
11138 -43553 29944 14288 190870 236487 298824 308853 346896 316528 134219 -127061 -321668
11127 -321668 -356476 -272128 -126663 94132 243825 240750 -103754 -283789 -162385 35589
11117 35589 225295 464377 774793 798912 372220 -42347 -288853 -385484 -218621 -99740
11107 -99740 -40955 -119319 -291771 -265957 -96068 178616 468310 623085 639083 478830
11097 478830 193566 -200346 -305302 -345264 -394316 -233701 -57522 22830 99128 292497
11087 292497 460703 570358 339547 195742 15571 -243955 -315455 -60851 213164 314580
11077 314580 133884 45707 -218727 -247215 -98606 -58959 158989 247758 8967 -307650
11067 -307650 -314351 -74922 168305 343347 465821 195179 -49178 -208351 -364312 -230567
11057 -230567 18523 318609 506231 619735 435766 29669 -330566 -647450 -599416 -402139
11047 -402139 -280098 -84294 202894 175930 -6072 -80963 -34115 -97549 -51175 196148
11037 196148 193621 -19540 -147735 -23435 181319 361024 291637 116243 62064 -12373
11027 -12373 -56352 -40873 38924 116133 208229 132026 -58413 -181883 -391481 -196944 8076
11016 8076 -35226 -69316 -66004 -215000 -243726 -38572 86228 233070 247607 53767 -125143
11005 -125143 -201633 -155934 82236 290493 568969 445233 297178 98982 -104534 -131565
10995 -131565 49919 1675 -90805 -198762 -21712 279117 618746 836532 810784 534415
10985 534415 256364 36718 -97331 -20588 102947 190707 258236 109026 -159202 -441173
10975 -441173 -522029 -465419 -292216 -42747 18929 60895 287612 332895 178621 234408 236518
10964 236518 136035 3870 -49201 -147574 -247916 -30141 318310 511102 560984 512262
10954 512262 194926 -13283 -292969 -448892 -173578 -38687 45867 88301 112402 68673
10944 68673 86085 17043 24616 63429 147916 222285 207243 109670 105628 125451 -17802 -168068
10932 -168068 -45417 24787 104482 -78681 -217777 -438756 -312206 -35092 238945 406458
10922 406458 367773 124272 -196787 -322948 -323020 -205529 114715 403657 452938 242313 -84721
10911 -84721 -180443 -74777 126494 235340 274306 339099 207651 107855 5210 8736 -66248
10900 -66248 -140413 -111976 -111579 151318 353668 338388 196114 -5393 -224769 -200133 -57232
10889 -57232 -112685 -45303 44496 25194 -78383 -95318 -26659 13381 96888 41687 -18018
10878 -18018 -41108 15252 -148055 -356298 -179246 -181179 -191489 -122121 -1037 80029 247314
10867 247314 367097 494412 482200 295948 270858 105775 307045 450251 402890 173469
10857 173469 39455 -273377 -258266 -246935 -48884 113897 262056 111759 -223295 -236439
10847 -236439 -197572 48496 138197 180669 88406 -113379 -184834 -233152 -105119 197279 389607
10836 389607 351833 233488 23239 -175616 -103997 -151050 -193568 -97805 57951 132743 223226
10825 223226 193563 176836 26841 162 78749 107212 301012 353459 418461 267057 183327
10814 183327 -49974 -169732 15781 90929 51599 -112222 -332126 -329899 -90076 94872
10804 94872 301160 155024 -77960 -160501 -184748 -233956 -130641 173220 391489 627751
10794 627751 651364 528902 465535 403268 311061 226328 85424 85604 -211781 -610818 -752270
10783 -752270 -516012 -85876 301919 676019 554258 193312 -128640 -339443 -457540 -239380
10773 -239380 110977 492894 576379 237961 49983 -28524 -79758 -52379 6895 143127
10763 143127 131868 147336 169492 135481 211552 216539 28574 -9498 -23655 -121861 -91575
10752 -91575 -121370 -179765 -264457 -271484 -103522 -81414 -28090 209442 418798 453362 443192
10741 443192 283866 92679 -58325 -230632 -247465 -104747 108837 162556 215415 127892
10731 127892 91976 151652 -33006 -107479 127973 262646 300384 215041 128800 222156 232310
10720 232310 65447 4104 36431 -2401 -4481 88446 -42042 -135074 -131247 -229961 -176325
10709 -176325 -63921 199999 417729 351918 165481 150972 44005 -142100 -108500 -105944
10699 -105944 -3414 -27067 -183476 -182872 -247165 -297472 -308938 -208435 -65120 27654 66723
10688 66723 132606 113442 221008 328086 202250 135017 192511 105276 -428 -49785 15821
10677 15821 70023 -11337 124105 352313 103442 -183931 -270967 -472093 -344530 -152127
10667 -152127 50669 228447 138092 -12531 -188969 -254202 -147921 -31182 139260 255997
10657 255997 331400 196971 27164 -117805 -86221 -37054 -62513 108279 -35540 56390
10647 56390 191790 225177 100902 173075 312447 130019 -116208 -159375 -243369 -163448 143756
10636 143756 532648 598163 448007 264817 53686 -131381 -125801 56291 190969 338413
10626 338413 363229 32496 -379931 -600937 -621421 -385730 -94696 130861 37770 -146315
10616 -146315 -272032 -248495 -302656 -292180 -126799 133663 218097 503700 446624 323102
10606 323102 178322 94710 165128 498363 715847 539591 333095 196286 -22811 -109766
10596 -109766 -144578 -167373 -141554 -193517 -374426 -371718 -223728 -337090 -286284 -2944 137115
10585 137115 337264 445047 337562 151067 -163813 -515653 -500789 -200079 97486 381560
10575 381560 492060 490051 216071 -80413 -52534 226417 292644 375450 177232 63659
10565 63659 -183240 -207307 -170042 -212889 -65776 132171 184992 53755 31754 42620 165963
10554 165963 116366 190211 179405 138660 26706 59346 -155554 -369862 -348908 -207617 38420
10543 38420 168663 387012 400146 181301 16336 -70962 -38778 9370 36350 39099 -199149
10532 -199149 -259831 -313822 -337477 -77500 184043 472257 649252 610127 555697 316232
10522 316232 105052 33984 -125870 -281269 -146882 -9668 41821 208795 167421 76329
10512 76329 18168 -182210 -545729 -612155 -418623 -36834 256748 468410 453347 176906
10502 176906 47223 -270630 -413367 -319913 -34526 165302 239064 368060 280890 252910
10492 252910 76108 -149597 -418073 -454466 -262862 -74245 205686 412130 529119 346296
10482 346296 128181 -159697 -134331 38841 212021 271249 227634 1628 -161541 -241773
10472 -241773 -135499 142491 391409 345227 159124 144350 69345 -141113 -148425 -112118 -179173
10461 -179173 -142617 121692 187362 146684 116709 -20066 -269387 -387919 -367460 -311487 7079
10450 7079 130784 170571 156815 -149210 -257867 -84258 121164 464191 726195 636682
10440 636682 554138 444122 513416 410643 162198 24967 -235322 -303994 -486299 -577059
10430 -577059 -559951 -303758 -197023 -98762 18890 83691 105176 42865 -16425 32912 176326
10419 176326 160910 224597 104319 -56987 -250356 -353459 -274923 -89514 215289 399986
10409 399986 617106 720800 485566 88639 -263935 -428573 -208554 -25812 289203 481029
10399 481029 297277 -34695 -366731 -431299 -166618 276988 476114 528228 357330 95955
10389 95955 -116457 -286646 -215545 -50548 152112 244697 120617 -52142 -17157 4167
10379 4167 39312 91142 -13396 -22861 153078 56074 -5700 35640 19082 -109194 -255404
10368 -255404 -35395 132949 207885 365334 334227 109273 653 -151254 -37564 95216
10358 95216 -119094 -147465 -143591 -123248 -40002 -18624 -60553 25466 69491 3926 170775
10347 170775 311007 384187 539614 488780 306973 246672 119365 -110037 -235401 -369734
10337 -369734 -207428 -187497 -3369 56223 5846 93021 171528 125343 79813 21829 -132813
10326 -132813 -214628 -287027 -195493 54545 205270 347956 410808 426126 202358 -5527
10316 -5527 127793 65390 -53067 80253 -36904 -170815 -295193 -98876 85993 175619
10306 175619 112766 -79977 -121268 -226363 -298285 -314329 4427 266794 454486 393478
10296 393478 369729 188127 90497 -156996 -151056 -112006 -190177 -85673 -51180 -47617 50596
10285 50596 -20789 -80365 -194513 -80207 -45438 139006 255890 311579 413452 449176 324255
10274 324255 -27548 -263622 -303737 -162734 -46080 137635 145268 -11060 -97339 -233701
10264 -233701 -99889 70182 277839 448652 496740 239942 -152221 -252999 -210691 -1628
10254 -1628 166121 218593 257620 184036 60779 -16797 -262590 -369927 -326070 -311916 -189703
10243 -189703 -15398 129803 203115 129739 12125 119304 138818 101506 156277 148913 25542
10232 25542 -103610 10760 175699 198410 84727 7991 20725 71304 120455 326909 321127
10221 321127 231571 82344 -202123 -192363 -119990 108545 425428 608346 344296 -69467
10211 -69467 -246769 -234350 24954 232667 367929 518097 436052 58333 -309395 -510986
10201 -510986 -172544 107633 362811 376314 129985 -198134 -442367 -587131 -367867 113745
10191 113745 410511 539340 426260 84141 -155386 -242473 -99543 309706 620024 639038
10181 639038 518262 163985 -65808 18975 -140531 -41341 200216 330540 346639 236209
10171 236209 187004 101065 -162691 -252861 -167801 -107096 72216 144480 315374 340772 85933
10160 85933 -374643 -496777 -365593 -215433 9019 190076 185914 132334 3813 23719
10150 23719 97769 153110 313763 460820 465054 490953 287376 109171 37208 74904 277051
10139 277051 462117 664256 673597 437415 -28115 -422423 -564574 -526628 -300996 190200
10129 190200 316486 244314 22220 -136605 -3182 -26929 -11601 198853 97749 -119459
10119 -119459 -196191 -167331 -32087 194306 421736 411490 281739 366432 310262 232956 182717
10108 182717 -1724 51694 85279 -79089 -164717 -105047 45982 201371 388393 363124
10098 363124 193021 82850 -91233 -222928 -76215 9886 298119 456651 455297 322229
10088 322229 64231 -147365 -321903 -474020 -434762 -196876 15262 209801 504791 620950
10078 620950 381964 164865 -47967 -271928 -287719 12562 158190 78984 107320 81318
10068 81318 27752 54240 121326 52409 -4541 34337 28225 268477 414822 419913 462573 372919
10056 372919 103283 -47420 96529 -103012 -142760 77498 -113939 -415114 -383604 -353974
10046 -353974 -168986 123887 277218 387803 308716 242628 337658 270899 354295 318014 190875
10035 190875 -33367 -96859 -97616 -76642 52480 146728 150325 -8660 21211 -154906 -76038
10024 -76038 138953 167065 99561 367799 414100 386981 248562 109795 28221 -36690 -142701
10013 -142701 17309 136633 170872 232987 129733 -10459 63304 140535 129135 39435 -154072
10002 -154072 -202177 -193242 -190635 -215180 -216072 -121127 88403 96269 78926 214713 173576 270939
9990 270939 319854 474425 462368 71097 -207911 -436146 -408888 -117898 353153 636938
9980 636938 790799 652496 281174 -58734 -240862 -236542 -149438 -186536 -196196 -304072 -463857
9969 -463857 -533869 -374200 -137056 -56554 3792 165743 142995 137376 376751 485709 384204
9958 384204 117781 -227428 -264689 -149342 13066 307021 430821 529194 421269 275387
9948 275387 283933 167912 36717 -41145 162719 234978 279247 410078 402657 181561 -213520
9937 -213520 -552516 -551251 -202980 216565 375973 410726 232969 51600 -29384 8082 206969
9926 206969 371105 259272 109053 67015 167998 244332 268476 172943 156893 -81174 -322052
9915 -322052 -196837 -168757 -177261 -124103 36229 230934 297204 178114 111624 152273 106289
9904 106289 91325 122997 -17037 -79014 -118041 -5563 111762 460450 551528 517876 338534
9893 338534 74802 -69515 -165462 -57906 119025 154337 -36409 -264047 -378714 -393922
9883 -393922 -84166 139490 250898 265610 317606 335627 262584 249365 315080 251213 302287
9872 302287 254610 303572 297044 80128 -155037 -368886 -474623 -320752 -197863 15095
9862 15095 280192 272816 283997 382920 380068 361709 536693 450976 67364 -222418 -223574 118869
9850 118869 492944 574692 462038 147210 -201952 -389827 -310428 -56853 280568 392972
9840 392972 352401 229083 108405 108570 -96413 -98365 176693 351417 369951 359103 190812
9829 190812 -77277 -71769 -28594 -79988 -93382 19969 72477 136049 130613 212240 141384 118430
9817 118430 -34022 -27712 85513 328553 464421 522838 422711 388487 -17384 -408305
9807 -408305 -589996 -451192 71684 401953 597761 547323 341779 165899 37569 -172551
9797 -172551 -300901 -334949 -192117 -94742 231319 285316 355091 268426 37982 -231168 -373075
9786 -373075 -168334 71045 200043 259713 146598 114250 87492 -25486 25706 77282 56055
9775 56055 131701 102306 160296 250833 138706 113981 56152 136353 239852 346716 272314
9764 272314 301149 39804 -28505 -33752 256392 493979 446965 484603 510639 481268 244675
9753 244675 32630 -88341 -124561 -101679 -76515 -87052 17580 317147 384530 344561 245137
9742 245137 179819 107215 106881 346847 597717 682276 508595 239278 -10278 -186896 -137999
9731 -137999 88334 257132 478386 486288 308828 34836 -58215 -93340 125060 446135
9721 446135 657077 684593 610899 238882 -29654 -145557 -82369 21475 112737 133007 118629
9710 118629 19739 -1663 61893 113887 328838 515944 558106 504228 452832 326218 322047
9699 322047 53077 -91902 -2423 -105688 -113967 5766 169040 336874 361335 376947 209646
9688 209646 160679 218011 23841 7705 86408 178866 195628 304996 87834 -130977 -14221
9677 -14221 130032 295898 523791 848854 930772 780061 585069 290928 117179 131816
9667 131816 -31649 29283 179699 44638 81983 209707 301247 341771 152230 -127398
9657 -127398 -252563 -336379 -226126 -57368 183857 529901 816637 700725 480977 443677
9647 443677 224901 114812 47429 -7916 268554 423995 527545 675523 659218 389683
9637 389683 315526 301555 242245 509246 621500 631682 397751 178061 113703 108683 136078
9626 136078 67633 76972 119283 192214 355351 324049 300774 429928 442231 347214 219635
9615 219635 337748 446942 513595 588669 307585 69625 21806 -56647 194800 520342
9605 520342 635791 501609 372832 259194 88772 86235 202517 550312 946975 1215272
9595 1215272 1187531 908860 441969 -42931 -334253 -313110 -39945 303026 517795 631780
9585 631780 483488 328849 -37783 -166456 124492 365388 568067 652269 527779 211309
9575 211309 1018 -62968 47376 115127 249785 474705 510139 436063 246161 86736
9565 86736 43315 294027 523297 825190 948827 651217 248767 -103073 -222487 -1713
9555 -1713 320220 557461 686255 588668 521162 482892 421550 423930 391790 140454 -127529
9544 -127529 -149204 87290 305653 366492 247953 76194 70975 -42770 167408 488743
9534 488743 514500 462846 410050 355592 368412 556901 793375 842892 655219 328230 240661
9523 240661 188329 272682 418183 520490 698827 853294 837692 665464 494409 221346
9513 221346 -160396 -122572 54882 241639 410398 510809 431106 300457 132926 26273
9503 26273 106602 404528 685559 831049 847853 557516 451197 399344 378484 374492 552587
9492 552587 700967 732579 603358 345244 85091 -10203 141085 370757 612559 644740
9482 644740 464975 303500 254296 487420 607197 792970 875852 697672 499444 321569
9472 321569 260516 471750 672292 508100 427670 461165 523276 804317 910777 926715 724998
9461 724998 482015 186755 187302 523731 727490 771995 777453 601727 422862 445340 522908
9450 522908 529725 551557 609022 720581 652563 706323 888136 906149 754881 662290 591588
9439 591588 433183 391858 414274 380555 537792 568231 815093 1132518 1419534 1739136
9429 1739136 1637418 1254205 790649 493666 256461 280888 606673 715214 973774 829745
9419 829745 484084 489948 402547 530084 774515 966653 1124707 1196170 1162941 905679 677131
9408 677131 540968 317165 422316 578777 749702 860992 961918 1001104 1103022 1191501
9398 1191501 1190302 1120853 1072573 1199936 1278588 1211864 985795 758261 647558 691665 802121
9387 802121 1130710 1264145 1366570 1344886 1015408 912858 980892 1426761 1621392 1520667
9377 1520667 1569719 1334147 1153577 1193334 1235675 1209293 912296 666165 354041 367888
9367 367888 594206 877834 1205395 1392121 1649013 1708188 1516283 1468585 1239051 1136925
9357 1136925 1081603 996336 1003740 1049040 1057533 1126563 1171409 977049 845115 846947 1004898
9346 1004898 1000025 957882 1044725 1140933 1168804 1040107 862261 815724 980963 1023157 1050320
9335 1050320 1084789 1292488 1331785 1567260 1703286 1775792 1917932 2255880 2603246 2580293
9325 2580293 2365487 2223102 1783043 1615121 1642496 1920610 2417794 2761682 3019000 2865513
9315 2865513 2761666 2553693 2317562 2177620 2189540 2130078 2250730 2358058 2310433 2188866
9305 2188866 2090803 1946624 1870502 1714015 1797203 2010964 1949536 1951598 2056171 2285453 2275397
9294 2275397 2237738 2264353 2301131 2244758 2275067 2247543 2362575 2407379 2252691 2164262 2175735
9283 2175735 2265625 2353424 2654167 2840209 2934792 2892704 2617887 2305876 2086386 2139996
9273 2139996 2201725 2104705 2201092 2254483 2175566 2289516 2516393 2754243 3131403 3516054
9263 3516054 3621487 3588197 3801383 3923123 4331295 4659872 4779952 4794624 4950817 5104499
9253 5104499 5130560 5241345 5169983 4840101 4492206 4413043 4224565 4000148 4246435 4486149
9243 4486149 4758314 4749526 4738570 4430710 3994398 3768795 3781386 3926308 4086520 4188442
9233 4188442 4195179 4058529 3922425 4018467 4321796 4637579 4677489 4667387 4552635 4338886
9223 4338886 4295183 4657402 5255105 6472359 8369545 10729998 11443136 10579299 10088175
9214 10088175 8858295 7562567 7071795 7341911 8443675 10449559 12636127 12782120 11373804
9205 11373804 10119268 8431578 6818746 5722197 5010756 4561899 4320024 4160636 4152427
9196 4152427 4016045 3850117 3732511 3565964 3431528 3250051 3208592 3134813 3227670 3294017
9186 3294017 3225287 2971882 2901651 2903609 2963796 2948858 2779663 2626601 2340087 2450397 2544535
9175 2544535 2678541 2872992 2889133 2702629 2418226 1993011 1928859 2275622 2413310 2388189
9165 2388189 2328357 2149806 1913093 1876779 2006643 2385739 2802664 3077420 3111249 3044548
9155 3044548 2858831 2656519 2479160 2408657 2257706 2332526 2271671 2011529 1886342 1988714
9145 1988714 2117887 2434450 2675176 2754060 2602335 2535490 2282493 2178459 2363491 2302988
9135 2302988 2372335 2492152 2602148 2816171 3017017 3063776 2553613 2321779 2222146 2255265
9125 2255265 2586063 3155556 3445024 3489876 3404206 3323727 3188038 3007790 3117290 3262676
9115 3262676 3304161 3399855 3482117 3349142 3510963 3815238 3845923 3764729 3803586 3828103 3911686
9104 3911686 3940164 4030114 3924290 3945896 4106945 4192460 4257088 4094363 3852788 3778717 3573130
9093 3573130 3648934 3930408 4099362 4414467 4437080 4086118 3875160 3847496 4144061 4575439
9083 4575439 4938302 5140213 5049646 4979275 4956419 5030961 5114038 5188325 5251220 5370879 5291652
9072 5291652 5140081 4940145 4686555 4470536 4269786 4274127 4240263 4267666 4456489 4400699
9062 4400699 4330872 4130647 3940127 3922300 4195860 4338944 4426332 4509940 4587805 4628297 4457367
9051 4457367 4533869 4548543 4568380 4766291 5156087 5416692 5561220 5604225 5400201 5384727
9041 5384727 5509652 5479004 5650134 5680174 5762473 5550119 5415480 5492056 5573106 5593255 5690033
9030 5690033 5987937 6026326 6032160 6057622 6061903 5714782 5570207 5435169 5347858 5516757 5929231
9019 5929231 6276275 6474702 6604840 6525629 6323270 6146041 6075141 6249099 6502051 6795913
9009 6795913 7095496 7171670 7087030 6933750 6746997 6653482 6965603 7415051 7797882 8123002
8999 8123002 8221414 8221329 8465099 8804845 9520751 10577548 11430323 11866574 12393969 12514461
8989 12514461 12784062 13210790 13548561 13969448 14780251 15855449 16294407 16027112 16131259
8980 16131259 16194863 16342902 16206540 15363091 14566748 14287635 13991495 13957388 13909691 13974859
8970 13974859 14172848 14494889 14858244 14939335 15120328 15525545 15635039 16005397 16364736 16920288
8960 16920288 17441445 18403951 19487385 20877336 22299903 23098341 24446960 26645671 29555153
8951 29555153 34101376 38510840 39129317 37541182 36414884 33923034 30956060 28627030
8943 28627030 27420745 26542928 25966725 25862064 25862943 26015753 26538270 27272659 28441193 30228368
8933 30228368 32800454 36460873 42526363 53109457 70773767 95857949 128490305 151511964
8925 151511964 147649504 140050404 129959653 115030999 110218828 116058324 130829177 140147995
8917 140147995 134963113 127397167 117018155 103610873 93871860 90355125 95043519 109203899
8909 109203899 132998875 156287064 159337638 149623649 136832117 116967229 96976540
8902 96976540 81269540 69527242 60850213 54197839 49548365 46534617 44593657 43190954
8894 43190954 42303177 41794583 41751312 42117856 42670654 43262837 44268744 45289530 46793626
8885 46793626 49539863 54531124 62796835 75410013 92759525 110314341 116160502 113921970
8877 113921970 110368522 103780796 98499825 99428743 108663050 129638104 163815158 208322596
8869 208322596 235737002 232444443 220956060 201726541 176124068 158982139 154933739
8862 154933739 168701028 204602202 260774493 312708262 346523027 346712910 315329874
8855 315329874 277395053 234347852 197679219 177380982 175234370 190434916 207348260
8848 207348260 211188071 205733963 186039733 159858580 133875071 109811270 90835613
8841 90835613 76774435 66403745 58846992 53237724 49108928 45852668 43148792 41060875
8833 41060875 39267569 37752907 36400351 34881603 33436322 32163312 31221740 30365237
8825 30365237 29787592 29163787 28519706 27781706 26964330 26051582 24968475 24181064 23518465
8816 23518465 22895794 22313209 21827233 21319353 20781187 20385322 19834990 19135313 18472099
8807 18472099 18006021 17773123 17578020 17633867 17461461 17269865 16822954 16328956 16096895 16341856
8797 16341856 16675765 17013103 17087564 16932965 16593527 16267678 16029176 15752647 15589126 15634759
8787 15634759 15682246 15661729 15672866 15767772 15676770 15450875 14834415 14278062 13831259 13592242
8777 13592242 13367010 13440781 13347003 13399037 13411376 13248280 13063277 12904332 12851370 12559923
8767 12559923 12220345 12027644 11599032 11186080 10937944 10975332 11038074 11333357 11705469 12100592
8757 12100592 12451346 12786373 12775428 12933490 13251214 13474791 13537672 13528420 13855790 14822146
8747 14822146 16268690 18255419 19609181 19782836 19301232 18592376 17747320 17415365 17879683
8738 17879683 19329321 21725632 25047115 27299795 27560123 27075378 25839676 24339877
8730 24339877 23216586 22321043 21871792 22033327 22729582 23309722 23047526 22623607 22278937
8721 22278937 22151421 22898609 24356212 26067245 27986030 29880530 31031028 31871840 32200318
8712 32200318 31715953 31326896 31715110 33663586 37179763 41578421 46760269 51630714 54017765
8703 54017765 52156838 47312290 41997946 35864728 30477994 26494795 23861695 22055769
8695 22055769 21119412 20459917 19850137 19500183 19025674 18241583 17472754 16853321 16364858
8686 16364858 16353806 16188388 15877666 15593056 15490368 15148607 14386189 13752421 13348596 12877638
8676 12877638 12299298 11977838 11853462 11977879 12280254 12537738 12746024 12822590 12762050 12597773
8666 12597773 12532101 12435455 12737345 13120336 13369785 13539855 13346315 13313602 13061472 12701750
8656 12701750 12298511 11848871 11445511 11114458 10749547 10464272 10526113 10627313 10727128 11025664
8646 11025664 11187996 11244298 11229346 11246854 11416728 11673165 11888696 12222397 12544024 12810060
8636 12810060 13170959 13418393 13649848 13878299 14300176 14916756 15338345 15258051 14988419 14601561
8626 14601561 14046284 13459246 13225149 12749043 12332745 12112130 11985394 11861551 11584523
8617 11584523 11467618 11292851 11129924 11140316 11265254 11495671 11617213 11552383 11224171 10790437
8607 10790437 10181000 9748913 9317264 9039498 9032793 9023223 9215722 9411377 9546125 9639325
8597 9639325 9884653 10101000 10431567 10775591 11177896 11341817 11610821 11675064 11526457 11223493
8587 11223493 11028910 10734422 10578353 10258985 10212153 10356309 10573000 10768329 10924370 10942743
8577 10942743 11660848 11458333 11002866 11009102 10983066 11078703 11134459 11319131 11201567 11061735
8567 11061735 11024228 11148455 11289163 11508777 11769734 12122727 12530247 12875711 12949008 13174565
8557 13174565 13558764 14046361 14667775 15520815 16318729 17456419 18614049 20017311 21335463
8548 21335463 22472619 23264689 23768435 23882841 24007137 24382566 24721396 25157646 26270508
8539 26270508 27809138 29661955 32538890 36629643 42391330 52151251 68274648 93809885
8531 93809885 130432403 174744201 214719217 240666872 247675108 233262504 205591516
8524 205591516 172699636 139504485 110610708 87730336 70610942 58437410 50179564
8517 50179564 44535119 40895491 38652058 37493450 36620411 35790727 35132569 34713371 34423675
8508 34423675 34196168 33945687 33390669 32929050 32553118 32263773 32175012 32170760 32313413 32880135
8498 32880135 34558995 37926355 43631433 53122690 68814637 92795836 125130383 160747729
8490 160747729 189394902 205258355 203897671 186444231 161360435 133184333 106033921
8483 106033921 83085010 65472120 52852250 43996402 38061412 34166788 31223568 28924362
8475 28924362 27007427 25351022 24119996 23263438 22752396 22175507 21772463 21371210 20698654
8466 20698654 19708018 18578861 17725530 16631429 15624919 14444027 13412959 12657964 12186840
8457 12186840 11686939 11341788 11082182 10519113 10231019 9980239 9961547 10162171 10314011 10039228
8447 10039228 9597787 9024508 8442359 7881371 7589378 7615506 7720837 7780549 7885447 7844124
8437 7844124 7667047 7402402 7311644 7146372 7059859 6854346 6653470 6478326 6009208 5423850
8427 5423850 5127845 5035669 5122968 5227265 5163397 5077754 4863713 4676562 4547598 4523296
8417 4523296 4640067 4851680 4996017 4968620 4762992 4399311 4137445 4303377 4258582 4176391
8407 4176391 4130029 4010171 3735176 3475427 3322683 3402145 3699808 4086289 4302113 4161828
8397 4161828 4100998 3914991 3749072 3513172 3292649 3166532 3218093 3224329 3042848 3082588
8387 3082588 3262928 3230230 3258307 3345649 3238070 3194199 3432985 3802413 4301145 4835114
8377 4835114 5208604 5344329 5207460 5034993 4905333 4743971 4575761 4136949 3765800 3234347
8367 3234347 2727415 2440298 2449865 2592839 2507126 2554038 2566165 2285859 2144657 2034114
8357 2034114 1929895 2148309 2376197 2450969 2455382 2339546 2158603 2013003 1997457 2036033
8347 2036033 2239427 2386262 2366067 2256999 2019751 2203157 2628170 3145131 3698803 3999369
8337 3999369 4308783 4493797 4235158 3883665 3493181 3163549 2989105 2906513 2963021 2974192
8327 2974192 3158401 3367976 3196314 2917177 2514034 2114089 1796108 1825443 1918798 2029853
8317 2029853 2199956 1973305 1738569 1518816 1226943 1451841 1709413 1952252 2002470 1949072
8307 1949072 1877214 1768111 1681478 1683897 1796396 1842760 1814498 1700726 1495486 1171831 1106931
8296 1106931 1353173 1547834 1773685 1847263 1844205 1929585 2048483 2108546 2267219 2331547 2394110
8285 2394110 2135486 1733894 1667346 1746345 2007150 2383439 2899437 3403442 3673319 3935906
8275 3935906 4236579 4230713 4059679 3865281 3639536 3416557 3218705 3074668 2890475 2771294
8265 2771294 2548401 1989056 1650037 1483161 1548596 1960438 2213067 2320787 2536493 2526062
8255 2526062 2328471 2433328 2526931 2636643 2702891 2484291 2237728 1997666 1881878 1898303
8245 1898303 2324376 2573986 3055053 3444021 3513866 3458099 3067164 3022946 2897244 3085069
8235 3085069 3490660 3511103 3331990 2939741 2644124 2292697 2114613 1899315 1951182 1977256
8225 1977256 1820123 1692589 1724833 1756003 1668470 1622470 1588053 1650976 1807726 1739739 1708467
8214 1708467 1435076 1326555 1232438 1171337 1345752 1513022 1628236 1546160 1387316 1204436
8204 1204436 903119 869716 900923 967774 1128286 1188383 963053 687694 564787 161868
8194 161868 135332 819035 2970243 2820407 2385882 2230614 1697220 1213398 700359 793887
8184 793887 1122251 1499680 1650379 1524375 1368151 999403 620371 710318 933513 1284638
8174 1284638 1563679 1674512 1454970 1388305 1319490 1446083 1596866 1846248 2206638 2322069
8164 2322069 2238442 2212592 2184064 2363266 2295095 2519013 2552796 2478987 2324820 2209281 2128875
8153 2128875 1957911 1906587 1998360 1949284 1806165 1645809 1409760 1448171 1439358 1620957 1798728
8142 1798728 1865875 1849410 1685644 1658709 1534023 1499066 1559749 1616243 1653400 1775053 2107507
8131 2107507 2513959 2716910 2869357 2976918 3115535 3295402 3622294 4016219 4364817 4479539
8121 4479539 4232473 3953678 3381120 3174664 3345307 3604494 4046512 4905510 5852476 7282323
8111 7282323 9536455 12732997 16117832 18793224 19710370 18533648 16785543 14001141
8103 14001141 11150039 8824593 7559781 6935522 6863474 7283413 7265862 7118575 6604472
8094 6604472 6148841 5796292 5546125 5182757 4649835 4138213 3614044 3462513 3755936 4188074
8084 4188074 4667771 5181583 5505871 5721669 6143052 6591111 7100565 7265594 7030038 6775209
8074 6775209 6379873 6003555 6324382 7494531 9749605 12971806 16058674 17624743 17708679
8065 17708679 16346504 14142273 11606507 9210487 7442424 6015010 4967365 4264132
8057 4264132 3458465 2937746 2801694 2628586 2697826 2640082 2664771 2665940 2550995 2444502
8047 2444502 2287396 2183483 2064544 1827375 1729746 1750895 2076937 2390150 2536595 2796267
8037 2796267 2718648 2433289 2027951 1779758 1526835 1489090 1536366 1528843 1556292 1552535 1465616
8026 1465616 1277062 1180978 1082872 1093700 1117350 1158500 1343007 1480995 1339771 1112886
8016 1112886 891350 682059 620164 668609 776700 1017155 1101052 1204870 1111233 981638
8006 981638 911391 946741 1061586 1033531 1074689 1070232 1177029 1207337 1261984 1217075 1064277
7995 1064277 1164277 1234987 1278071 1173415 1131740 965625 824989 728000 801150 948326
7985 948326 997747 869049 804810 730646 645255 612793 548341 454810 320157 277605 338048
7974 338048 537767 680117 906933 891771 840955 849089 807448 980566 1114801 1061007 993889
7963 993889 1016129 1036454 1039446 1119589 1177880 1159728 1172138 1347712 1502346 1615217 1662555
7952 1662555 1621920 1237977 986438 815704 674041 652082 767277 899339 886711 778786
7942 778786 831087 664122 552946 536993 437927 319966 438538 687007 858359 952768
7932 952768 971509 798997 537731 529808 541383 586288 692303 870291 1064432 934032 899242
7921 899242 1002429 878723 826840 851079 1027618 1051102 1144076 1212498 1124580 1123832 1069387
7910 1069387 1014205 894664 844325 883421 940540 867720 795318 856137 1091565 1315050 1275869
7899 1275869 1149012 1044197 854616 747692 831317 811254 985397 965809 828185 974116
7889 974116 1136700 1060699 921670 782490 807421 1144919 1612604 2223634 2714728 2949780
7879 2949780 2899191 2546595 2111721 1967847 1928949 1909931 2172791 2313697 2466909 2475760
7869 2475760 2491841 2490357 2572674 2491622 2452296 2403678 2390449 2246594 2136726 2140461 2055594
7858 2055594 1956123 1939414 2083136 2207856 2192304 2115708 2052975 2023073 1911844 1882684 1827407
7847 1827407 1759509 1950269 2224194 2411987 2758072 2948533 2807037 2573399 2170309 1783629
7837 1783629 1617038 1723337 1903500 2123583 2307839 2405973 2558610 2414913 2229514 2095462
7827 2095462 1844411 1577281 1302814 1185834 1330035 1466163 1441617 1204394 1032508 972445
7817 972445 825683 855813 833883 1063567 1303281 1327444 1555640 1792653 2137909 2257811
7807 2257811 1722841 1957102 1950697 1636949 1492911 1519013 1292614 979140 889047 737952
7797 737952 503426 712470 901641 1110748 1277916 1328669 1216433 1091441 1100398 1012034
7787 1012034 953127 709916 579421 515911 358750 515116 605440 732515 876428 874595
7777 874595 823736 786786 809485 730240 1010702 1290496 1545355 1522672 1448604 1203783 1037249
7766 1037249 1007538 1145173 1187966 1231264 1181117 988739 963323 1016732 1131066 1252206 1214949
7755 1214949 811099 365440 151593 82877 146283 363954 621658 783520 708768 800527
7745 800527 805846 881732 1051513 1068186 1022050 841223 844061 936686 910674 732422 605762
7734 605762 434795 396909 406716 729703 1043696 1014915 921702 803395 749875 655629 701739
7723 701739 774820 882119 912391 1129111 1285934 1169051 845025 396516 171745 153557
7713 153557 276153 683540 1061362 1230801 1145220 931047 670931 640460 890814 1130240
7703 1130240 1321275 1333243 1174683 926587 698611 702848 797329 995933 1236186 1313084
7693 1313084 1477713 1434977 1277374 1089855 1065605 1086245 1271338 1466789 1535588 1706459
7683 1706459 1805380 1897940 1953695 1868104 1938023 2016354 2032698 2218652 2401357 2511560 2829256
7672 2829256 3046795 3193390 3276292 3281229 3282903 3442646 3637478 3777829 4097684 4384489
7662 4384489 4787953 5201276 5919375 6797803 7380739 7917405 8274203 8422454 8512217 8664626
7652 8664626 8981632 9397060 9530280 9415500 9257801 8784057 8120304 7505900 7058684 6673051
7642 6673051 6126149 5714817 5414298 4969760 4523142 4207520 4239974 4435357 4627650 4645502
7632 4645502 4524053 4033104 3409883 2684929 2363127 2275692 2262500 2535966 2570418 2404753
7622 2404753 2123593 1759314 1494961 1510820 1411850 1231286 1266236 1533317 1704495 1610041
7612 1610041 1552189 1416980 1285186 1356696 1539168 1671748 1822919 2071592 2059535 2166194
7602 2166194 2139730 2041354 1889364 1607467 1525751 1427582 1175542 1054839 847454 655141
7592 655141 552745 473890 489254 591042 799210 991680 1062828 928352 801604 743920
7582 743920 703815 861917 872105 863757 676659 406389 345121 494230 847622 1011771 1166736
7571 1166736 1122671 1020294 806543 457724 433668 453855 813192 1109928 1304836 1479593
7561 1479593 1397629 1358903 1073383 732604 379964 411112 534952 645120 635658 619456 563133
7550 563133 461313 356442 423361 505024 660837 683268 601878 538642 449742 569148 592387
7539 592387 523016 472130 522889 279806 206191 210285 243706 318826 358113 243641 197727
7528 197727 218263 193404 277305 533488 713806 700674 695376 514165 324267 71644 3504
7517 3504 19775 185719 424081 707025 741771 440062 310385 268626 196729 359808 481875
7506 481875 585794 427067 -18913 -263657 -254747 -69320 182158 457589 687275 622951
7496 622951 500365 491969 410335 389813 534290 465853 396545 214360 222842 412219 298895
7485 298895 106568 -94261 -323731 -522070 -450457 -300590 -25734 476874 792840 760613
7475 760613 523521 227091 -126705 -293401 -219148 -7894 183820 322700 400952 254335
7465 254335 158120 242634 416301 364830 467308 364774 158761 13831 -132716 -145671
7455 -145671 -137699 -27158 95598 -10176 7039 101481 111714 285764 327466 218573 134797
7444 134797 101119 179418 182480 169171 133032 283244 515930 664868 508428 218909 244367
7433 244367 190885 31867 -15874 102 -42468 -13211 -210197 -332512 -228879 -103830 41191
7422 41191 119131 205477 39699 -94238 -25032 193758 293367 525782 431803 251796 44553
7411 44553 -95354 56484 282071 452485 477171 362549 106182 9467 -21619 -17298 130178
7400 130178 262637 238793 30 -284968 -509368 -545784 -254229 55644 241617 540650
7390 540650 625392 477503 298747 160659 264350 404347 607594 736626 575571 269296
7380 269296 37158 -156912 -98897 5801 135249 150831 -105282 -153561 -51605 8808
7370 8808 26952 8396 -23378 -211084 -123210 316711 589758 815843 897258 659666 259654
7359 259654 -70466 -225354 -119131 188811 207825 118284 11750 -343403 -450534 -266092
7349 -266092 -521 531949 631792 612669 399826 99480 66335 40678 143388 260898
7339 260898 209125 145379 -221942 -275507 -204657 6158 237279 301266 297100 108785 -205157
7328 -205157 -223344 -157582 26626 234795 214131 257173 224929 -47714 -272905 82373 120435
7317 120435 175483 349340 287615 328314 454768 302469 297054 241456 3966 -193530 -295540
7306 -295540 -60802 144087 321718 499187 483506 240501 -92125 -281303 -398406 -357370
7296 -357370 -333086 -260911 -113244 104178 151464 94310 -9269 -160066 -334123 -380020 -137245
7285 -137245 255412 586875 770195 636683 275389 14126 -98409 134867 228382 146783
7275 146783 93532 89088 28518 -99519 -55684 -53805 -189732 -477447 -635211 -604980 -405875
7264 -405875 -179438 102673 191892 188342 107524 -82073 -135551 -104067 59973 31765 -22479
7253 -22479 29870 34482 134218 178562 308239 440666 243906 116769 23285 -25643 47718
7242 47718 158523 100464 -131107 -307419 -446636 -478780 -478259 -451455 -290284 -135703 42114
7231 42114 20547 -23735 -72103 -64577 44214 64289 -177353 -309362 -199336 127403 377200
7220 377200 571134 610359 485239 503754 398754 496433 599455 605373 647759 171586 -196832
7209 -196832 -407624 -546927 -542526 -321473 -137557 -246034 -362679 -361892 -380540 -164095 237671
7198 237671 253877 155066 41855 51621 -67553 -49449 284494 470027 523769 518770 381231
7187 381231 316899 195606 131490 39145 -13067 -62279 -39056 95462 66861 74252 136574
7176 136574 18312 50230 166069 210260 259162 342196 188007 8955 -219202 -279225 -180998
7165 -180998 -213077 -133773 -81436 -16982 103247 92641 -8783 118436 230529 25455 1771
7154 1771 161457 395556 430987 549219 585017 277621 -105089 -205739 -101199 156520
7144 156520 369958 648015 893146 814593 860321 711184 370354 9285 -159835 -144598
7134 -144598 -88301 -207646 -102249 38630 -5829 -62103 8186 131311 125370 8886 -37402
7123 -37402 -46045 68487 148410 163575 133271 101295 51673 27108 222346 374763 421720
7112 421720 196634 -58648 -31146 219293 217070 281031 279303 1408 -159820 -231877 -247575
7101 -247575 -154241 9985 251856 147867 -1836 17675 -25681 -22079 -44843 17733 -76204
7090 -76204 -112907 -45417 -103108 36065 324141 455471 469633 478071 239903 7049 -46305
7079 -46305 -680 227998 241549 158137 114371 -217618 -467689 -600246 -557862 -311193 -78468
7068 -78468 124774 63679 -5329 50933 -18154 -58879 240603 444984 437178 366864 52262
7057 52262 -279443 -333784 -213426 78087 331042 586091 541538 376452 274106 272903 130077
7046 130077 -26592 -24708 -4354 116036 206219 23683 -164819 -484654 -642332 -596466 -344348
7035 -344348 -127998 -44932 116989 75869 78199 179218 225704 449027 427928 418827 404062
7024 404062 284380 327367 212333 240544 338509 46897 16242 -42403 -181396 -151271 -41357
7013 -41357 34463 186209 282408 256621 11038 -180113 -159626 -114595 -20304 132585 385137
7002 385137 73111 -76023 -199667 -153075 66931 134744 269540 264830 159725 19603
6992 19603 720 66132 156974 146131 98360 -28313 -93472 -52222 -91077 92103 50456
6981 50456 71706 -5647 -91154 43885 121582 172346 276034 273870 325938 230322 176450 -66901
6969 -66901 -219603 -274995 -177802 -76084 32162 148962 192031 32549 -213541 -233093 -239349
6958 -239349 -135744 45848 143066 219236 323575 503538 517514 420770 217337 -126226
6948 -126226 -232389 -273878 -206932 10582 164678 239370 64215 -317639 -559195 -484627
6938 -484627 -465403 -282017 -84934 -19332 -32567 78986 192413 226390 383113 477747 594127
6927 594127 436234 111867 -213135 -325768 -175106 -71905 -33550 19817 183365 59300
6917 59300 -195076 -217224 -120726 -221040 -213438 -120430 69307 218822 154328 -27223 -290485
6906 -290485 -365194 -452598 -374159 -241554 125512 468132 408609 211434 119365 -8444 8788
6895 8788 -114260 -205378 -30125 95667 251621 382717 321558 176227 -63289 -188951
6885 -188951 -289228 -94050 110913 288584 379045 357866 215172 -124977 -206484 88349
6875 88349 288597 173299 68225 -177239 -611846 -811184 -658850 -141695 295465 421370
6865 421370 482451 356214 20227 -151002 -148426 43337 104867 -2141 33079 -92611 -151166
6854 -151166 116550 112006 236712 47777 -73433 -254498 -281862 -136774 -6467 -14892 21468
6843 21468 -13541 -287611 -407395 -227132 -7966 115980 19531 -102599 -288589 -612661
6833 -612661 -396762 -84535 228230 535737 456110 265842 198675 54557 199955 125171
6823 125171 191958 201131 145446 -29220 -38710 -28452 -32934 -68476 -12036 -207099 -277002 -327655
6811 -327655 -497073 -497696 -509868 -430615 -319062 -92364 127338 357167 502894 521917 318054
6800 318054 106593 -84914 63576 378233 413970 293054 157965 -142229 -292406 -77550
6790 -77550 10734 162800 133862 55920 164776 46976 -149016 -361355 -541449 -515749 -397787
6779 -397787 -195069 -56724 57959 61817 80623 144854 75350 40160 138277 485167 765321
6768 765321 969764 840052 488352 85807 -249154 -330479 -375638 -33354 7653 -65555
6758 -65555 -88832 -154265 -262837 -286383 109855 373847 372270 241688 88651 -45106 -58866
6747 -58866 -178 78482 117339 -57451 -196460 -113995 129723 198374 111146 21745 -180983
6736 -180983 -326292 -363789 -72423 226388 532544 666496 395893 62454 -82593 -108408
6726 -108408 -158347 -30581 -53816 -124698 -43828 -129894 7793 107720 -111266 -117984 -98787
6715 -98787 -37087 140602 216805 427891 430475 453963 398329 129229 110779 37656 23189
6704 23189 114679 119921 -36977 -43979 -23828 -159170 -227531 -162781 -65081 108873 345656
6693 345656 437025 391879 298535 84985 -120596 -244997 -186124 -314886 -191301 -62076
6683 -62076 125472 320552 215902 91359 -160039 -254178 -412547 -476411 -198736 138785
6673 138785 350270 536915 673451 552258 430144 103555 -194883 -267903 -27324 139673
6663 139673 370193 413768 147328 -26104 -304862 -426296 -435506 -332479 -177434 22809
6653 22809 -50066 -212979 -494847 -468612 -429647 -284770 5970 314822 482648 654274
6643 654274 740245 648259 446176 238890 -7649 -86280 -140858 34141 10459 25049 162810
6632 162810 408079 411227 178539 141007 -96718 -328745 -566096 -549015 -375449 -54035
6622 -54035 377424 560469 377092 -30564 -352510 -472138 -412616 -200177 144694 356366
6612 356366 395522 259538 106720 -49363 -186453 -228990 -93001 47194 206682 421229
6602 421229 191979 10659 -215591 -251609 -21212 83283 26779 67996 -33931 -218294
6592 -218294 -310357 -177066 -39340 121432 239412 166246 -32364 -206351 -166330 -13202
6582 -13202 294740 495387 472946 266837 -56294 -243137 -281083 -227412 112662 253257
6572 253257 54716 -112737 -109858 -133772 -112989 100733 351286 298718 231261 190534 78035
6561 78035 149974 85963 76605 -97411 -40862 -4853 4772 61903 231910 209159 -21093 57554
6549 57554 16465 -81842 -409 -33131 -9930 -27674 -19250 12904 122279 124284 149496 11144
6537 11144 -110496 -21205 -42405 185558 363331 357671 305647 222752 114735 24569 51322
6526 51322 126026 104175 23947 -125219 -267267 -326160 -112323 73813 254610 353556 218756
6515 218756 46924 -64936 -169746 37244 245433 548284 719594 595856 474845 270508
6505 270508 79189 -93473 -199602 -2420 170587 282588 167533 73226 62274 25782
6495 25782 16173 6255 -17027 -14500 -27683 67586 118981 132105 342369 455082 349292 283624
6483 283624 350200 353135 374588 437898 474156 295798 122241 -74041 -194333 -182737 -79801
6472 -79801 -952 357854 394010 394168 117530 -182264 -249973 -170295 157996 444306 480072
6461 480072 442689 345448 331593 180292 -15198 -12669 102803 341713 455058 327292 511157
6450 511157 709965 692180 555348 506585 447291 440309 495370 306062 301970 291252 416272
6439 416272 515196 497122 571929 452573 244655 154594 73767 80121 128079 321405 380350
6428 380350 244924 -14056 39222 256287 399854 413123 565615 431712 272866 159198
6418 159198 271134 400052 478852 468206 432572 551356 560376 627872 646644 523513 293783
6407 293783 -119455 -158623 -244117 -102554 171704 117581 63866 224729 237621 261225 367780
6396 367780 610021 754447 815606 634729 430750 231513 173246 300918 499389 652790
6386 652790 761169 852457 684357 596257 712799 831251 859557 710912 502991 463747
6376 463747 192772 283533 564676 727910 748233 643919 531901 349435 277924 415574
6366 415574 529549 541662 436862 212718 235230 421423 610717 741630 638253 598450
6356 598450 294770 140141 -60188 -32306 50234 334922 644416 781090 663090 459331
6346 459331 213818 191006 217151 151722 241718 575936 741793 747530 679293 447664 454581
6335 454581 640928 806988 875819 825462 694088 406134 381768 444996 503641 623772 810937
6324 810937 852984 776044 672601 609070 530393 351917 325311 417707 677570 822003 974365
6313 974365 1066049 876627 851400 784711 717249 757834 684601 823477 909947 911376 860530
6302 860530 1021127 996878 962144 937053 853793 750822 587183 385758 253403 426151
6292 426151 718896 1061276 1288841 1362179 1310024 1044366 755471 648318 849786 977875
6282 977875 1241554 1332755 1359332 1127362 835390 775430 896751 1014496 1025545 1191806
6272 1191806 1127407 1043050 1004758 960988 950259 914189 1045318 1252999 1395985 1718013 1629119
6261 1629119 1404849 1227957 1222893 1296682 1498439 1643628 1622476 1575451 1521443 1555030 1481014
6250 1481014 1511476 1411305 1350658 1439818 1423396 1412389 1400299 1291853 1412007 1352752 1378293
6239 1378293 1341274 1386550 1566622 1627082 1571734 1318813 1230361 1171907 1251698 1488861 1552376
6228 1552376 1807349 2070998 1930226 1796879 1784682 1645602 1767782 1982334 2105991 2204130
6218 2204130 2100981 1864980 1724293 1696923 1753644 1741840 1734387 1899693 1827954 1845218 1952469
6207 1952469 2083181 2305881 2474570 2474063 2457569 2339311 2275810 2278579 2298229 2515302 2531707
6196 2531707 2568954 2597247 2628217 2552457 2499985 2456561 2490288 2541184 2560767 2828070 2961746
6185 2961746 3025388 2929223 2837512 2693243 2783670 3027830 3178021 3273588 3445002 3418918 3459250
6174 3459250 3494160 3656678 3737095 3838834 4332324 4608370 4787514 4817905 4795980 4847759
6164 4847759 4950977 5117500 5400900 6008555 6375583 6411736 6552470 6597594 6855981 7608102
6154 7608102 8732851 10247635 12030652 14138132 17008595 20793633 25777246 31735144
6146 31735144 37846823 42928983 46128837 46682600 44934776 41858856 38409571 35834038
6138 35834038 34914595 36285188 39774786 44074439 47993182 50008685 49324445 46360342
6130 46360342 41462233 35885665 30536424 26002197 22015259 18899158 16497294 14565448
6122 14565448 13280422 12294491 11530322 10795518 10188278 9712502 9377024 9066155 8706501
6113 8706501 8380601 8250446 7974565 7767665 7611440 7641626 7656561 7646830 7716362 7561968
6103 7561968 7285292 7189902 7394175 7533049 7658881 7818980 7873775 7929083 8119315 8372599
6093 8372599 8811618 9210307 9497262 9420446 9296201 9533914 9852027 10488415 11537263 12815790
6083 12815790 14348859 15951549 17863352 20604662 24696776 30777980 38907806 47989205
6075 47989205 56512108 62867069 65773963 65168435 61749246 57107547 52660506 49974589
6067 49974589 49870524 52588613 57719410 63439657 67793038 69137719 66897475 61761698
6059 61761698 54677956 47075235 39899165 33790102 28679420 24425454 21276732 18630474
6051 18630474 16684386 15145054 13901048 12743353 11801131 10876681 10095561 9816324 9642735
6042 9642735 9378716 9060733 8655791 8164193 7945087 7595269 7246771 6944465 6723307 6423233
6032 6423233 6138548 5989280 5813079 5782951 5826316 5750383 5536429 5258251 5171161 5129208
6022 5129208 5171637 5344037 5505143 5482955 5176119 4937376 4903446 4966431 5160750 5190566
6012 5190566 4940130 4593754 4304299 4129256 4080213 3972492 3898978 3899646 3800690 3790911 3817375
6001 3817375 3707851 3699531 3864523 3894023 3920485 3700254 3598805 3701991 3651766 3574928 3503269
5990 3503269 3607654 3706717 3551973 3427605 3291784 3100032 2831427 2575132 2585545 2702510
5980 2702510 2869363 3062488 3112008 3138991 3022332 2852671 2494105 2350964 2433227 2637186
5970 2637186 2903551 2979409 2890188 2863694 2735845 2825648 2968549 2986617 2903407 2791962 2759119
5959 2759119 2657371 2542148 2401121 2546802 2503136 2422885 2700109 2844672 2890890 3033103
5949 3033103 3019706 3071495 3018280 2708543 2507832 2611266 2709470 2812122 2800609 2722303 2648883
5938 2648883 2510164 2527756 2599268 2694491 2829148 2858410 2971624 2949033 3027341 3178727 3336829
5927 3336829 3391329 3263849 3006187 2865403 2779070 2878023 3142023 3395338 3482166 3359356
5917 3359356 3077333 2815796 2678440 2816029 2997776 3135746 3411513 3387236 3216798 3084342
5907 3084342 2988709 2904248 2778580 2890459 2952949 2998890 3170900 3355302 3579569 3635419
5897 3635419 3582897 3368205 3328335 3173363 3050561 3134047 3330419 3479442 3629612 3690036
5887 3690036 3478356 3434953 3506236 3489118 3661896 3802566 3856609 3916667 4114999 4249538
5877 4249538 4081258 3761362 3556702 3589718 3835695 4091673 4478654 4822417 4868765 4794188
5867 4794188 4878980 4791208 4769812 4998283 5244257 5424251 5511719 5658410 5678560 5728265 5799671
5856 5799671 6034441 6159814 6476010 7148787 7664259 8166616 8366558 8466615 8325493 7944283
5846 7944283 7961341 7984673 8258254 8499743 8860751 9013386 9015412 9097340 9214121 9407738
5836 9407738 9603510 9831550 9795328 9729452 9848395 10016385 9984011 10008238 9870863 9541625
5826 9541625 9099259 8771564 8570473 8449995 8492150 8780990 9105099 9230922 9378295 9375366
5816 9375366 9403711 9641323 9879615 9909458 9900214 9631207 9332042 8895903 8586789 8270208
5806 8270208 8108453 7846419 7378833 7209304 6990882 6942348 6824844 6549882 6292475 6443268
5796 6443268 6717525 6996968 7153535 7024002 6700135 6315833 5951249 5711847 5573972 5857792
5786 5857792 6224809 6345283 6415576 6187046 5997016 6018087 6159189 6322472 6447195 6798269
5776 6798269 6903008 6587986 6374431 6525952 6692607 7110976 7559750 8081673 8501263 8769364
5766 8769364 9348391 9943131 10613932 11479202 12551034 13932399 15591059 17896316 21368772
5757 21368772 26365302 33134163 41499810 50139750 56939179 60047972 59388314 55488311
5749 55488311 49503739 43093397 36874980 31583366 27563179 24714474 22797699 21531727
5741 21531727 20541866 20128585 19977506 20078218 20819950 22746509 26128454 31341905 38870703
5732 38870703 48035317 57263808 64320366 67233720 65829645 60849692 53781769 45839944
5724 45839944 38368586 32092762 27026753 23162210 20303681 18049221 16600795 15536638
5716 15536638 14634501 13645283 12828577 12223012 11722108 11477424 11177330 10996959 10827945
5707 10827945 10581077 10110124 9797413 9494202 9097406 8724888 8649051 8719863 8746680 8811331
5697 8811331 8947189 8942764 9095353 9298202 9512913 9918911 10776683 11838525 13203083 15039202
5687 15039202 17810569 21669204 26845196 33312147 39376006 43440468 44660864 43114525
5679 43114525 39538432 34873898 29858082 25634801 22221612 19565819 17692390 16277481
5671 16277481 15236627 14573207 14465634 14618494 15369705 16387639 18224113 20936194 25039120
5662 25039120 30831667 37772900 44351520 48627069 49844775 47870207 43494120 37857592
5654 37857592 32142243 26763495 22292049 18714421 16073347 14176197 12616422 11430419
5646 11430419 10517999 9895010 9579047 9188355 8986209 8655799 8212008 7556893 7022521
5637 7022521 6706658 6573715 6493768 6466752 6449530 6182852 5849007 5596856 5357359 5239236
5627 5239236 5284724 5189253 4988966 4863742 4683764 4624387 4604594 4487306 4534390 4581749 4441793
5616 4441793 4148474 3859162 3611494 3628966 3795566 3908747 4205409 4372970 4438098 4287846
5606 4287846 4122222 3672280 3445388 3614295 3737007 3889350 3722781 3756776 3740557 4116222
5596 4116222 4689913 5591028 6630592 7547408 8168382 8485543 8443464 8046718 7428558 6746434
5586 6746434 5937106 5243995 4454564 4204967 4001265 3600537 3499528 3328976 3301417 3514817
5576 3514817 3740719 3888082 3994232 3968300 4380640 4997691 6051504 7271639 8316863
5567 8316863 9011989 9037867 8374998 7394116 6421447 5591843 4952287 4353155 3963952 3523692
5557 3523692 3045456 2851752 2721888 2705294 2640022 2954304 2965464 2796054 2569950 2329966
5547 2329966 2298228 2231472 2387251 2439073 2341993 2325478 2300644 2248509 2339165 2316598 2149540
5536 2149540 1822651 1705158 1927266 2206909 2408177 2553028 2544629 2121315 1755558 1519637
5526 1519637 1586803 1875835 2390560 2611218 2630400 2385298 1916846 1569214 1463008 1474602
5516 1474602 1641324 1698581 1740904 2089118 2366975 2482858 2589463 2563020 2042731 1691397
5506 1691397 1417050 1284567 1302340 1503125 1727372 1936488 2011443 2038916 1904407 1987858
5496 1987858 1962805 1814396 1905683 1805806 1737322 1667832 1503621 1430228 1359495 1370107 1526470
5485 1526470 1805687 1967059 2003780 1894094 1807325 1852475 2001323 2085630 2095976 2150671 2191118
5474 2191118 2244826 2036482 2041493 2122428 2028178 2037556 2013069 1889902 1932193 2109704 1987754
5463 1987754 1873553 1802806 1737249 1669891 1560043 1556590 1687052 2017784 2555738 3000210
5453 3000210 3224615 2892583 2455669 2083098 1936575 2142789 2577338 2879128 2978460 2778556
5443 2778556 2385239 2096020 1943497 2099858 2463198 2812791 2957215 3200097 3234880 3120099
5433 3120099 3184167 3115564 2958051 2770718 2518511 2460276 2499645 2785799 2996303 3166124
5423 3166124 3260073 3303198 3161934 3028062 3093150 3205769 3431251 3614458 3537518 3442272
5413 3442272 3422965 3329054 3247268 3335879 3645782 3923068 3973580 3727505 3394708 3178420
5403 3178420 3103159 3330953 3520916 3939606 4262418 4460711 4466511 4372104 4243859 4149066
5393 4149066 4005294 4082233 4115308 4204907 4322324 4321470 4194531 3885478 3754806 3765066 3812060
5382 3812060 3983286 4072676 4159182 4129623 3991638 3997756 4114450 4321512 4577859 4713543
5372 4713543 4943388 5086570 5006813 5177262 5138111 5089730 4910532 4798893 4721493 4759586
5362 4759586 4849029 5225541 5341431 5321743 5358978 5227885 5358773 5610276 5706534 5882160
5352 5882160 5926799 5736950 5681511 5675974 5790254 6089579 6416448 6531065 6703359 6852130
5342 6852130 6798400 6933123 7038316 7342729 7791297 8527634 9580282 10976172 12998322
5333 12998322 14702536 15662093 16650713 17818127 18625201 18548203 17692237 16733277 15800680
5324 15800680 14890212 14283850 13875227 13592696 13460725 13432566 13507394 13486892 13492623 13617677
5314 13617677 14001343 15009643 16237592 18610087 22219167 27222409 32554900 35956643
5306 35956643 38356060 41659499 44608940 45714104 45512838 45237216 44883468 43893333 43458238
5297 43458238 43754444 43168653 41571381 40554158 39920309 40518006 43300803 48641240 55922261
5288 55922261 62667371 66236542 68045498 70643998 74770020 80767076 86681372 91838883
5280 91838883 98295334 105590340 109407769 111254457 113316325 113592436 113368016 115951844
5272 115951844 118366422 118881435 119990303 117151337 112530482 109543038 105580621 99353121
5264 99353121 92406055 85934628 80214857 76345593 75450020 77464954 80500184 82818845
5256 82818845 84816850 85878151 84109255 80569208 75213162 69946304 66371188 65183636
5248 65183636 66742926 68924746 68614849 65968853 62136173 57645658 53697506 50458030
5240 50458030 47016595 44075169 42160749 40751764 40163175 39805528 39072432 38014554 37320963
5231 37320963 37009457 36260094 34006711 31458533 29066073 26414449 24250881 22520888
5223 22520888 21090569 19907109 18784893 17892476 17150878 16439228 15869116 15345633 14981690
5214 14981690 14747358 14318211 14036064 13513210 13020563 12829172 12501759 12046382 11662806
5205 11662806 11540533 11303404 11044205 10684340 10528447 10442980 10468855 10506611 10361267 10233295
5195 10233295 9862207 9703241 9510929 9325497 9451667 9353288 9273404 8917127 8367128 7876003
5185 7876003 7433791 7464393 7564948 7800431 7849864 7900360 7956065 7794101 7757986 7768816 7802024
5174 7802024 7574078 7409380 7148618 6980862 6946189 6978261 7021606 7096387 7519108 7869447
5164 7869447 7869890 7730438 7525371 7488357 7759328 8325994 9561949 11308835 13424760 15743874
5154 15743874 17735567 19946529 23581462 27779116 30475205 31297518 30571241 27772652
5146 27772652 24355162 21050182 17924137 15427386 13517556 11828311 10374207 9453141
5138 9453141 8912223 8666735 8603871 8663340 8767907 8889100 8964664 8875881 8933073 9009429 9414902
5127 9414902 10134265 11348829 12853859 14063722 13997994 13699808 13552129 13083277 13082308 13882813
5117 13882813 15167283 16705418 17842483 18767235 21057467 25058590 31236384 38464144
5109 38464144 41788744 40251124 37621289 33652370 28699331 24514902 21383810 19098415
5101 19098415 17904273 17879297 19090180 21753030 26343062 32948098 38849203 39727668 37644656
5092 37644656 34880836 30959746 27197604 24330764 21963543 19783986 18038386 16673334
5084 16673334 15329597 14767539 14541352 14286117 13789389 13115791 12551035 11957490 11484440
5075 11484440 11235292 10832746 10344819 9992409 9789122 9699835 9782367 10034948 10557458 10834374
5065 10834374 10811963 11002206 11435554 12310733 14046838 17044779 21766816 28075344 32948099
5056 32948099 35418275 37801305 38885423 39347468 38892428 37435121 34892608 31371010
5048 31371010 28199003 25280830 23272491 22413307 22965554 24937496 26939644 28998961
5040 28998961 31176482 32997971 36910449 42790371 48852251 50388186 48822306 47216954
5032 47216954 44518297 42073654 39491895 37572229 36792269 35878881 35057483 35102812 36176343
5023 36176343 38006748 40479749 44481000 52363024 63783672 76170708 84623275 87339870
5015 87339870 86553577 81259688 71207073 61263965 52308995 44100114 38074568 34129172
5007 34129172 31747778 30899293 31255536 33133533 36731970 43054972 53067244 67253048
4999 67253048 83588541 98302240 110850311 119135370 117846172 108685465 96277428 81856171
4991 81856171 67785192 56122381 47194066 40490608 36049976 33296184 31670955 31101121
4983 31101121 31483738 33247425 37064741 44247492 54972562 67310478 75442425 75901853
4975 75901853 71552770 63941371 54263185 44993703 37460819 31780952 27473840 24262153
4967 24262153 22065263 20420508 19330041 18419335 17935603 17564397 16833037 15948843 14861225
4958 14861225 13770769 12913828 12223377 11683192 11313773 11208591 11125017 10908076 10749689
4949 10749689 10698112 10509483 10566368 10675031 10632737 10533410 10207426 9836189 9365713 8906224
4939 8906224 8627483 8175521 7988545 7949399 7986544 8090399 8128738 7832786 7436395 7079006
4929 7079006 6977567 6924124 6957001 6963967 6696627 6492562 6554755 6629784 6784561 6651987 6467283
4918 6467283 6240336 6006565 5997781 6082441 6139450 6095572 6151332 6038179 5884809 5678313 5572029
4907 5572029 5616995 5815494 5951783 6081360 6039329 6009071 5741748 5729100 5677843 5537039
4897 5537039 5520436 5647217 5869309 6122111 6245584 6007183 5787888 5389246 5226427 5302811
4887 5302811 5311162 5482373 5747686 5825472 5960225 6221033 6128439 6191655 6285069 6238863 6285630
4876 6285630 6369754 6412922 6582311 6434281 6282071 6300395 6357970 6469968 6440954 6461367 6340569
4865 6340569 6392632 6516089 6754611 6844493 7119020 7448539 7680140 7852514 7942134 8224344
4855 8224344 8366883 8476293 8656083 8963705 9371745 9685183 10142193 10471090 10820863 11316126
4845 11316126 12088678 13406041 15197208 17449389 20777018 25981602 34115254 45860207
4837 45860207 59605373 71063180 75924722 74385817 69151289 61344949 53314787 47240463
4829 47240463 43649907 43128764 46240910 53337410 63679050 73997922 79369627 78697146
4821 78697146 74257451 67694700 61238826 57759891 58420625 63212844 69676051 73261536
4813 73261536 72021748 67587848 61248614 53712957 46863409 41996653 39434624 39550737
4805 39550737 43032154 49874743 58131849 63942055 64676100 61454756 55484768 47949555
4797 47949555 40849130 34707003 29808330 26081173 23101708 21009094 19472499 18166577
4789 18166577 17062431 16280048 15817369 15818218 16155078 16712707 17290884 17380678 17015790 16529878
4779 16529878 15831930 14996734 14344666 13982442 13729102 13663388 13852487 13835620 13588518 13245797
4769 13245797 12744873 12627425 12990735 13744666 14720952 15673244 16479831 17066676 17177236
4760 17177236 16918125 16439854 15810682 15032817 14327483 13463861 12684680 12055845 11451117
4751 11451117 10853173 10417406 10076484 9836507 9715677 9827061 10330320 10992754 12019622
4742 12019622 12764197 13151104 13422965 13402859 13105218 12712104 12176131 11778518 11884686 12479906
4732 12479906 13573137 15614560 19294875 24811723 31748883 37650648 40854466 40324252
4724 40324252 37273766 33552303 29812823 28100821 28982332 33264032 40251328 45550167
4716 45550167 44752980 41841882 37811599 32243549 27408547 24100153 22269397 21717710
4708 21717710 23059289 26500831 30790867 34014758 35535496 35326128 34949920 33249128
4700 33249128 31241628 30746663 31977610 34311633 37483522 39573595 38024301 34347733
4692 34347733 30067923 24957883 20223463 16727717 14258117 12583090 11213545 10300013
4684 10300013 9652503 9033574 8432935 8109060 7870309 7590819 7180156 7031452 6903243
4675 6903243 6843088 6835746 6773629 6617750 6412836 6121373 5747510 5491670 5430327 5297889
4665 5297889 5226989 5197666 4954563 4821273 4783556 4729405 4543465 4251713 4176095 4245631 4243937
4654 4243937 4156362 3865129 3765500 3684776 3601271 3826654 4070323 4024324 3832984 3757609 3784316
4643 3784316 3715332 3679275 3750321 3611171 3426491 3111218 2723774 2635049 2779144 2985443
4633 2985443 3312772 3530249 3444791 3341682 3295451 3217696 2939587 2824207 2738960 2592086
4623 2592086 2558909 2531947 2507816 2643232 2870813 2881820 2795019 2770158 2940066 3216973 3491250
4612 3491250 3557585 3378512 3192371 2928972 2574662 2334693 2293619 2280043 2312400 2155456
4602 2155456 2120441 2282529 2297797 2315268 2457018 2700819 2745091 2755868 2798298 2674019 2680637
4591 2680637 2719260 2722211 2483767 2488626 2384028 2311064 2316650 2365599 2344750 2358351 2448165 2478598
4579 2478598 2314993 2127416 2028757 1726950 1764759 1767532 1868430 2158806 2409629 2620201
4569 2620201 2514970 2291138 1981291 1890479 1919276 1666081 1828538 1960313 1979538 1841604
4559 1841604 1734854 1726785 1622862 1597338 1632081 1681142 1695639 1689764 1837971 2109174 2222349
4548 2222349 2227332 2172089 1851427 1478133 1424977 1684127 1952028 2182814 2156532 1901550
4538 1901550 1572592 1305897 1182235 1391188 1723787 1949528 1923826 1830867 1665296 1461320
4528 1461320 1369015 1336562 1380382 1392992 1560702 1532958 1637404 1640170 1425019 1415080 1702440
4517 1702440 1979941 2276479 2575637 2676875 2729440 2660681 3009248 3807867 4576138 5548666
4507 5548666 6540457 6921279 6715061 6139605 5642694 5436943 5419042 5361826 5322940 5394585
4497 5394585 5677331 6200176 6904018 7235534 7382394 7130445 6655568 6445291 6249148 6082734
4487 6082734 6389029 6808677 7010706 7127264 7011264 6703204 6365632 6009841 5711779 5596216
4477 5596216 5606311 5690274 5836966 6124856 6241109 6357369 6381238 6067424 5848692 5309740
4467 5309740 4654056 4212220 3842006 3567714 3310132 3120421 2788745 2387216 2130420 2020414
4457 2020414 1908573 2063001 1932938 1794845 1758711 1792761 2000413 2369805 2519985 2427874
4447 2427874 2192397 2155377 2234889 2210380 2128432 2173562 2107732 2140013 2227495 2474006 2787958
4436 2787958 3056232 3103815 2918609 2576898 2338272 2278615 2381575 2483025 2506691 2382592
4426 2382592 2311196 2386256 2525666 2672559 2547211 2355065 2432516 2595844 2508187 2650260
4416 2650260 2725430 2769073 2679848 2592412 2558586 2266195 2153051 2202672 2020535 1886257 1928443
4405 1928443 2105494 2441173 2566979 2740260 2854019 2619340 2324076 2029801 1946808 1669068
4395 1669068 1510377 1533874 1525534 1613336 1762962 1572100 1474943 1484074 1586432 2060245 2529421
4384 2529421 2796872 2820162 2362275 2139442 1979172 1929674 1912705 1849650 1661587 1331279
4374 1331279 1124262 1116428 1243458 1238547 1346490 1417108 1414951 1459999 1417538 1497634 1490285 1347442
4362 1347442 1199074 1097969 1121965 1083945 934998 848747 908388 819924 726739 806291 1096160
4351 1096160 1251630 1348383 1502496 1423059 1302472 1416337 1506022 1492088 1650538 1486451
4341 1486451 1338829 1179825 992390 800342 725405 804625 815508 1050901 1028667 1031907 1145942
4330 1145942 1217281 1278690 1324031 1419913 1281921 1217911 1183023 1195478 1373299 1523928 1420439
4319 1420439 1324266 1073465 899755 897638 1091200 1391246 1532980 1456878 1385420 1497432
4309 1497432 1879492 2479306 3022595 3086997 2577641 2359062 2072756 1795620 1729505 1884354
4299 1884354 1774000 1490787 1073863 914751 927370 1132859 1522136 1632000 1603206 1630140
4289 1630140 1620613 1482706 1229683 1075394 937172 749453 667073 632703 888568 941793
4279 941793 773617 683768 448406 345037 487191 881607 1248408 1422440 1389765 1209544
4269 1209544 1095013 891982 828749 858786 686116 667946 629899 719365 834370 971920
4259 971920 1022121 1041153 630607 503411 651060 882135 1155454 1368942 1461139 1284238
4249 1284238 895372 890988 933355 1077145 1352767 1475631 1338541 1031444 812252 522835
4239 522835 508750 572027 690026 708836 763171 468827 471735 674284 1094548 1287361 1289210
4228 1289210 1129913 930541 843833 850775 1026461 1055204 1083599 1030394 938725 805152 720505
4217 720505 538357 604061 729916 737367 958528 1152420 1096141 1099292 1005767 769803 628508
4206 628508 532931 635892 885516 1114750 953122 731203 465037 182873 415764 892506
4196 892506 1146081 1329397 1336065 1074545 621816 392845 596702 975386 1287365 1384554
4186 1384554 1207326 832431 486718 672559 661392 722575 943283 1034840 1084071 967974
4176 967974 946701 1083063 1103279 930934 564576 326588 350150 581448 909921 1114043
4166 1114043 1011873 720300 396177 198571 180353 380541 573980 689754 699179 696412
4156 696412 771166 684067 809288 863080 771283 755262 872548 959397 986835 1070211 944936
4145 944936 761346 705776 604184 512286 530433 687278 815185 678292 518015 320478
4135 320478 376903 629300 845863 850397 730830 617635 665208 799333 966845 1001265 931867
4124 931867 960940 1056989 1146841 1085047 994824 925267 874121 661116 470971 265299 465461
4113 465461 629060 661692 717405 620593 394505 136002 -132359 -40032 293971 739974
4103 739974 1084387 1199923 1251713 1086763 865212 730862 610238 743026 720494 628758
4093 628758 444697 503838 583455 621073 649109 427890 378786 531957 1022255 1366388 1529868
4082 1529868 1310759 762297 404843 249335 273883 516466 875855 909141 685709 407414
4072 407414 188050 447544 817263 1154526 1397751 1347701 1217202 1070549 986540 999221
4062 999221 931396 866088 705738 436600 201089 283715 367341 331564 493883 433469 644672
4051 644672 840227 964787 956171 894865 799930 757837 866218 970576 922154 814448 723868
4040 723868 671696 581468 439512 386446 448289 623480 865969 1252946 1465287 1275559
4030 1275559 1004200 801436 582289 446943 598325 850291 919028 955837 819800 801782
4020 801782 723978 557391 460365 408214 444549 565031 631522 724768 917239 1029177 1075220
4009 1075220 938492 996220 1075091 1193130 1175796 903594 663457 446811 396458 754033
3999 754033 1166337 1123997 1123682 803391 520752 387545 368480 556315 910747 940742 975155
3988 975155 901716 802226 665189 589190 501506 598693 649256 861229 1193225 1343408 1271617
3977 1271617 908280 484690 277499 182202 314525 737480 968149 1165608 1074185 1069471
3967 1069471 876776 829956 896135 827010 914924 1109730 1243443 1262778 1140510 923079
3957 923079 597470 619607 667015 777976 1022182 1302640 1413543 1276109 1117180 961782
3947 961782 915546 893935 783684 787115 788237 799630 1011176 1010473 968774 983178 937856 973551
3935 973551 1070398 1220171 1358599 1366508 1297551 1245897 1249929 1398617 1426609 1327469 1349686
3924 1349686 1267037 1329781 1297304 1193663 1102777 1109993 826195 654409 674052 845586 1141395
3913 1141395 1213136 1037025 1007114 908566 761108 897934 1022296 1188736 1261557 1254729 1225666
3902 1225666 1471404 1685998 1832714 2071886 1900396 1563570 1363780 1025971 952253 1068089
3892 1068089 1149845 1265950 1300838 1316955 1333550 1123192 1232392 1284403 1427713 1537604
3882 1537604 1684935 1693246 1461150 1203863 1194040 1235507 1572923 1926152 1995152 1942221 1542230
3871 1542230 1117716 1151358 1285470 1459147 1902194 2234417 2370494 2221927 2132310 2086248
3861 2086248 2133336 2306873 2444667 2385367 2270241 2118501 2205882 2240754 2345299 2408142
3851 2408142 2378924 2520878 2552168 2662061 3023831 3184020 3371429 3614102 3811983 4027577
3841 4027577 4300611 4895150 5631028 6496384 7580420 8850488 10312881 12148077 14687908
3832 14687908 17932305 21521840 24745197 27034252 27810956 27075329 25065924 22306540
3824 22306540 19302997 16437996 13755106 11650695 10195088 9007473 8061129 7332625
3816 7332625 6719568 6076836 5465119 5165909 4809120 4448919 4113856 3910452 3733892 3671205
3806 3671205 3646616 3517626 3449643 3269302 3115823 2947600 2956295 2644835 2541742 2627571
3796 2627571 2671175 2550478 2552537 2479764 2399278 2502118 2498203 2466432 2394672 2180860 2097734
3785 2097734 2114607 2151910 2275617 2321611 2325201 2207698 2067015 1960218 1928189 1966782 1770600
3774 1770600 1526557 1410978 1393976 1398271 1508527 1550023 1705149 1820305 1801076 2046724
3764 2046724 2245075 2404778 2411281 2161247 1743594 1228354 1114507 1293931 1442389 1591284
3754 1591284 1521447 1221181 964805 868067 900724 1072104 1488612 1758047 1751540 1781960 1687824
3743 1687824 1615867 1606031 1564783 1405897 1235612 878430 755604 803442 1056986 1530309
3733 1530309 1944749 2136438 2272055 2157913 1782657 1392165 1071360 884016 983296 1271917
3723 1271917 1372795 1377773 1341319 1184438 1197848 1328000 1394944 1515439 1350638 1208008
3713 1208008 1091135 1071244 1120031 1381398 1472889 1438741 1471122 1386017 1348783 1314378 1507042
3702 1507042 1548645 1253036 1032307 1119873 1253350 1343378 1317032 1426330 1375565 1320087 1258710
3691 1258710 1333822 1369226 1358952 1439284 1408650 1548023 1397585 1242329 1319680 1228322 1292440
3680 1292440 1338994 1376789 1432944 1191089 1131156 834698 741896 973830 1154978 1295949
3670 1295949 1339729 1276653 1072143 853009 1027243 1133069 1216269 1299840 1339496 1363351 1253020
3659 1253020 1513612 1565119 1527746 1543885 1576944 1517484 1251396 1207542 1203785 883739 545312
3648 545312 496170 579172 700282 980692 1117494 1210737 1331895 1565157 1851111 1820657
3638 1820657 1790643 1648687 1334833 1029618 734778 900523 1223576 1380658 1420278 1307017
$$ [...]
##END NTUPLES=NMR SPECTRUM
##END=
