##TITLE=1H_DE-80H_X3
 200.13MHz, d2o
 8 sc
 
 19ns.26.2.2025
##JCAMPDX= 6.0         $$ Bruker NMR JCAMP-DX V2.0
##DATA TYPE= NMR SPECTRUM
##DATA CLASS= NTUPLES
##ORIGIN= UXNMR, Bruker Analytische Messtechnik GmbH
##OWNER= pz
$$ XWIN-NMR		Version 3.5
$$ Wed Dec 10 11:44:21 2025 Russian Standard Time (UT+4h)  Yarkov@DPX200
##.OBSERVE FREQUENCY= 200.1313
##.OBSERVE NUCLEUS= ^1H
##.ACQUISITION MODE= SIMULTANEOUS
##.ACQUISITION SCHEME= undefined
##.AVERAGES= 8
##.DIGITISER RES= 18
##SPECTROMETER/DATA SYSTEM= spect
##.PULSE SEQUENCE= zg30
##.SOLVENT NAME= CDCl3
##.SHIFT REFERENCE= (INTERNAL, CDCl3, 0, 15.4703)
##AUDIT TRAIL= $$ (NUMBER, WHEN, WHO, WHERE, WHAT)
$$ ##TITLE= Audit trail, XWIN-NMR		Version 3.5
$$ ##JCAMPDX= 5.01
$$ ##ORIGIN= Bruker BioSpin GmbH
$$ ##OWNER= Yarkov
$$ C:/Bruker/XWIN-NMR/data/yarkov2/nmr/H-C/1/pdata/1/auditp.txt
$$ ##AUDIT TRAIL=  $$ (NUMBER, WHEN, WHO, WHERE, WHAT)
(   1,<2025-12-10 11:43:29.53 +0400>,<Yarkov>,<DPX200>,
      <created by zg, POWCHK disabled, PULCHK disabled
       configuration hash MD5:
       00 E9 B6 7A A2 85 ED C7 34 08 36 98 17 FE 4E 26
       data hash MD5: 16K
       6A 0D 5D 05 89 31 56 0E 8C B8 89 A7 E7 2C 36 29>)
(   2,<2025-12-10 11:43:34.65 +0400>,<Yarkov>,<DPX200>,
      <Start of raw data processing
       efp BC_mod = 2 LB = 0.25 FT_mod = 6 PKNL = 1 PHC0 = -5306.083 PHC1 = 17.82193 SI = 16K 
       data hash MD5: 16K
       0E 96 0E 61 67 D8 B6 0B 56 A7 9C F1 78 C3 19 9F>)
(   3,<2025-12-10 11:43:40.42 +0400>,<Yarkov>,<DPX200>,
      <abs ABSG = 5 
       data hash MD5: 16K
       CC 53 9F 0E BE E1 64 F0 37 DE C7 C3 C3 EA 0E BE>)
$$ ##END=
$$ 
$$ hash MD5
$$ 43 A9 97 8A 71 1B 27 BF 8D AE 64 71 09 4D 68 DD
##$RELAX= 
##$RELAX= 
##$RELAX= 
##$RELAX= 
##$RELAX= 
##$RELAX= 
$$ Bruker specific parameters
$$ --------------------------
##$DU= <C:/Bruker/XWIN-NMR>
##$EXPNO= 1
##$NAME= <H-C>
##$PROCNO= 1
##$TYPE= <nmr>
##$USER= <yarkov2>
##$AMP= (0..31)
100 100 100 100 100 100 100 100 100 100 100 100 100 100 100 100 100 100 
100 100 100 100 100 100 100 100 100 100 100 100 100 100 
##$AQSEQ= 0
##$AQ_mod= 1
##$AUNM= <au_zg>
##$AUTOPOS= <>
##$BF1= 200.13
##$BF2= 200.13
##$BF3= 200.13
##$BF4= 200.13
##$BF5= 200.13
##$BF6= 200.13
##$BF7= 200.13
##$BF8= 200.13
##$BYTORDA= 1
##$CFDGTYP= 0
##$CFRGTYP= 5
##$CHEMSTR= <none>
##$CNST= (0..31)
1 1 145 1 1 1 1 1 1 1 1 1 1 1 1 1 1 1 1 1 1 1 1 1 1 1 1 1 1 1 1 1 
##$CPDPRG= <>
##$CPDPRG1= <>
##$CPDPRG2= <>
##$CPDPRG3= <>
##$CPDPRG4= <mlev>
##$CPDPRG5= <mlev>
##$CPDPRG6= <mlev>
##$CPDPRG7= <mlev>
##$CPDPRG8= <mlev>
##$CPDPRGB= <>
##$CPDPRGT= <>
##$D= (0..31)
0 0.7 0 0 0 0 0 0 0 0 0 0.03 0 0 0 0 0 0 0 0 0 0 0 0 0 0 0 0 0 0 0 0 
##$DATE= 1765352609
##$DBL= (0..7)
120 120 120 120 120 120 120 120 
##$DBP= (0..7)
150 150 150 150 150 150 150 150 
##$DBP07= 0
##$DBPNAM0= <>
##$DBPNAM1= <>
##$DBPNAM2= <>
##$DBPNAM3= <>
##$DBPNAM4= <>
##$DBPNAM5= <>
##$DBPNAM6= <>
##$DBPNAM7= <>
##$DBPOAL= (0..7)
0.5 0.5 0.5 0.5 0.5 0.5 0.5 0.5 
##$DBPOFFS= (0..7)
0 0 0 0 0 0 0 0 
##$DE= 6
$$ [...]
##$SUBNAM3= <"">
##$SUBNAM4= <"">
##$SUBNAM5= <"">
##$SUBNAM6= <"">
##$SUBNAM7= <"">
##$SUBNAM8= <"">
##$SUBNAM9= <"">
##$SW= 18.0517328524113
##$SWIBOX= (0..15)
0 0 2 0 0 0 0 0 0 0 0 0 0 0 0 0 
##$SW_h= 3612.71676300578
##$TD= 16384
##$TD0= 1
##$TE= 0
##$TE2= 300
##$TE3= 300
##$TEG= 300
##$TL= (0..7)
0 120 120 120 120 120 120 120 
##$TP= (0..7)
150 150 150 150 150 150 150 150 
##$TP07= 0
##$TPNAME0= <>
##$TPNAME1= <>
##$TPNAME2= <>
##$TPNAME3= <>
##$TPNAME4= <>
##$TPNAME5= <>
##$TPNAME6= <>
##$TPNAME7= <>
##$TPOAL= (0..7)
0.5 0.5 0.5 0.5 0.5 0.5 0.5 0.5 
##$TPOFFS= (0..7)
0 0 0 0 0 0 0 0 
##$TUNHIN= 0
##$TUNHOUT= 0
##$TUNXOUT= 0
##$USERA1= <user>
##$USERA2= <user>
##$USERA3= <user>
##$USERA4= <user>
##$USERA5= <user>
##$V9= 5
##$VALIST= <valist>
##$VCLIST= <CCCCCCCCCCCCCCC>
##$VD= 0
##$VDLIST= <DDDDDDDDDDDDDDD>
##$VPLIST= <PPPPPPPPPPPPPPP>
##$VTLIST= <TTTTTTTTTTTTTTT>
##$WBST= 1024
##$WBSW= 4
##$XGAIN= (0..3)
0 0 0 0 
##$XL= 0
##$YL= 0
##$YMAX_a= 353179
##$YMIN_a= -284411
##$ZGOPTNS= <>
##$ZL1= 120
##$ZL2= 120
##$ZL3= 120
##$ZL4= 120
##$ABSF1= 15.47034
##$ABSF2= -2.58151
##$ABSG= 5
##$ABSL= 3
##$ALPHA= 0
##$AQORDER= 0
##$ASSFAC= 0
##$ASSFACI= 0
##$ASSFACX= 0
##$ASSWID= 0
##$AUNMP= <proc_1d>
##$AZFE= 0.1
##$AZFW= 0.1
##$BCFW= 0
##$BC_mod= 2
##$BYTORDP= 0
##$COROFFS= 0
##$CY= -3
##$DATMOD= 1
##$DC= 0
##$DFILT= <>
##$DTYPP= 0
##$F1P= 0
##$F2P= 0
##$FCOR= 1
##$FTSIZE= 16384
##$FT_mod= 6
##$GAMMA= 0
##$GB= 0
##$INTBC= 1
##$INTSCL= 3.241238e-09
##$ISEN= 128
##$LB= 0.25
##$LEV0= 0
##$LPBIN= 0
##$MAXI= 10000
##$MC2= 0
##$MEAN= 0
##$ME_mod= 0
##$MI= 1.114404
##$NCOEF= 0
##$NC_proc= -7
##$NLEV= 6
##$NOISF1= 3.799351
##$NOISF2= 2.8
##$NSP= 0
##$NTH_PI= 0
##$NZP= 0
##$OFFSET= 15.47034
##$PC= 1
##$PHC0= -5306.083
##$PHC1= 17.82193
##$PH_mod= 1
##$PKNL= yes
##$PPARMOD= 0
##$PSCAL= 0
##$PSIGN= 0
##$REVERSE= no
##$SF= 200.130010278897
##$SI= 16384
##$SIGF1= 3
##$SIGF2= 2
##$SINO= 0.751879
##$SIOLD= 32768
##$SREGLST= <19F.Aceton>
##$SSB= 0
##$STSI= 16384
##$STSR= 0
##$SW_p= 3612.71676300578
##$SYMM= 0
##$S_DEV= 0
##$TDeff= 16384
##$TDoff= 0
##$TI= <>
##$TILT= no
##$TM1= 0
##$TM2= 0
##$TOPLEV= 0
##$USERP1= <user>
##$USERP2= <user>
##$USERP3= <user>
##$USERP4= <user>
##$USERP5= <user>
##$WDW= 1
##$XDIM= 16384
##$YMAX_p= 445811563
##$YMIN_p= -469863
$$ End of Bruker specific parameters
$$ ---------------------------------
##NTUPLES= NMR SPECTRUM
##VAR_NAME=  FREQUENCY,     SPECTRUM/REAL,   SPECTRUM/IMAG
##SYMBOL=    X,             R,               I
##VAR_TYPE=  INDEPENDENT,   DEPENDENT,       DEPENDENT
##VAR_FORM=  AFFN,          ASDF,            ASDF
##VAR_DIM=   16384,         16384,           16384
##UNITS=     HZ,            ARBITRARY UNITS, ARBITRARY UNITS
##FACTOR=    0.220516191357247, 1,           1
##FIRST=     3096.07925820588, 0,            0
##LAST=      -516.6375047999, 0,             0
##MIN=       -516.6375047999, -469863,       0
##MAX=       3096.07925820588, 445811563,    0
$$ Real data points
##PAGE= N=1
##DATA TABLE= (X++(R..R)), XYDATA
$$ [...]
12000F3763R080k6229J2050j31673p176P702j4296m8333Q6521l6955r7646P1142
11988a12050m0590P5304m5430K9108Q7536J29889K5995l3241n7183l9327l86M4482
11976F4107k2192N3417p9854O077J09706n7482j17713J6309m8960n434N1329j4832
11964d5522J40939M2094m9803n9859L7394r410L7140O3753p1829J04917p239j21413
11952F1162j05579n4731O6274L5819k8903j17274Q2363K8693k5854p7864J2241
11941a23653k5389O7196N7860L8125L2760N8562j52561l85K4439Q1010J0070n0828
11929A7206j31737J52932L9653j62860R446P1185O4117k4304j13187L0692O5413
11918A8556n8341l5958J00669l2534o4615M4089n924m089O0913k8794M4420o6096
$$ y = [63763, 72843, 46614, 58664, -73009, -80185, -72483, -86779, -135112, -48591, -85546, -183192, -112050, -152640, -77336, -122766, -93658, -6122, 123767, 149762, 116521, 59338, 20011, 19625, 64107, 41915, 95332, 15478, 21555, 131261, 73779, -43934, -27625, -76585, -82019, -30690, -45522, 95417, 137511, 87708, 27849, 65243, 55833, 92973, 156726, 84897, 189814, 182575, 61162, -44417, -99148, -32874, 2945, -25958, -143232, -60869, -32176, -58030, -135894, -123653, -149042, -81846, -23986, 14139, 46899, 105461, -47100, -47485, -23046, 57964, 68034, 17206, -114531, 38401, 78054, -84806, -75360, -4175, 59942, 35638, -77549, -46857, 18556, -39785, -75743, 24926, -7608, -72223, -28134, -34058, -38147, 22766, -6028, 38392, -27704]
11906b7704j1461M2341J01926n6475P314l4350j4431k6051k8272J7648M7108J47807
11894A65400m1000m3511l2188j7573m7175L9764n8262K7064j41554j7146J5046
11883a51135J6147J36634q279l1960M6014L072l8231J4188P9855j02350N9433
11872B3388J45392J16807o9277j30604k11497M0681N6403J1221m4337l6721j5514
11861a14058J45286N4853q9233l6546P3494O1502j6022m5933p4969P9241R4498
11850A32113k6754o2124J18972J0825j55773K4046j6440K4434J6986j81725m089
11839a19529J48136O2840p5149r6148O9978K4165Q8783m9644j85682r3813K13410
11828a2653J36638j83751r961J58029Q4209j50366l3445L0776m9940r209K4773
$$ y = [-27704, -39165, 3176, 105102, 48627, 55941, 21591, 7160, -18891, -47163, -29515, 17593, 165400, 124400, 80889, 48701, 31128, -16047, 23717, -34545, -7481, -149035, -166181, -151135, -134988, 1646, -6633, -38593, 7421, 10493, -27738, -13550, 66305, -36045, 23388, 168780, 285587, 216310, 85706, -125791, -85110, -28707, -17486, -61823, -98544, -114058, 31228, 86081, -3152, -39698, 33796, 95298, 79276, 33343, -41626, 37615, 132113, 105359, 43235, 162207, 173032, 17259, 41305, 24865, 49299, 66285, -115440, -119529, 28607, 91447, 16298, -79850, -9872, 14293, 103076, 53432, -132250, -226063, -12653, 123985, -59766, -69727, 88302, 172511, 22145, -11300, 19476, -30464, -39673, -14900]
11817a4900q6990O3119J8829N3319L43L6877k7648j40389j2432M1056L3521L3324
11805a971J1846q1607L2139l1513j17154J39372K33512n8178j75675K7839l62
11794b1752J5821P7720r363K5761r9074P2090o4394N3439M2407o8775j01936J4007
11782f4049J03630n5827M932N0966j00289J2275j03388l2349K59271k0507j09442
11771e4777Q2288j20420o3081P5939J9136K3957k1513L7071Q4867L9684j47811
11760d4660m2503j00500J86026Q6548j13365L1001l0139q0125R9119J43276M7927
11749A82605r6236l8837M2163K7763j22661L4177m8044P9055j16214n884P2573
11738A0460j779Q3550j52836J1843o478l2629L2429N2299r118J22358r2910j02094
$$ y = [-14900, -101890, -38771, -19942, 33377, 33720, 70597, 42949, -97440, -109872, -68816, -35295, -1971, 9875, -71732, -39593, -71106, -188260, -48888, 184624, 126446, -49229, -21390, -21752, -5931, 71789, 62426, 88187, -10887, 61203, -3191, 50248, 92655, 23880, -78056, -64049, 39581, -16246, -11314, 39652, -60637, -48362, -151750, -184099, 75172, 54665, -54777, 27511, -92909, -155990, -80051, -60915, -36958, -58471, -21400, 63467, 103151, -44660, -87163, -187663, -1637, 84911, -28454, 2547, -27592, -107717, -8598, 134678, 182605, 86369, 47532, 89695, 117458, -5203, 28974, -19070, 59985, -56229, -62113, 10460, 8681, 92231, -60605, -48762, -55240, -87869, -55440, -3141, -12259, 110099, 17189, -84905]
11726h4905R093l6303l3283J30222K8224j48172N2462J00637m3783R1698O6205
11715A32095l0059K7382p5407l638l6575k7611K5010K04865j0116j16321m200
11704H5425r1177r675p6606R8825q2732j13933Q7852Q907Q9437n8105P2136P5521
11692H5875l4338J0969J290j4679K1083m5805R8610q4356o0066J1287j06549J9494
11680i7185K12240j33150k18745K5167J95605O6674n1752o2432L0162q2142R7876
11669a7682J43359q8454Q9495l3923k1401j37999J02279q960O2704p3664j08879
11658i3125N1857O0614l8203j16352J53968K9095j8287P0066k8886k9036J5853
11647E7564l1256j7819l9278r343J35371L2157l6932Q627o1645q6448N7977p7571
$$ y = [-84905, -75812, -112115, -145398, -15176, 13048, -135124, -82662, 17975, -25808, 65890, 132095, 102036, 129418, 54011, 50373, 13798, -13813, 11197, 216062, 205946, 89625, 85425, -5752, -15427, -92033, 6792, -75940, -189873, -102021, -93114, -3677, -61782, 10354, 85875, 51537, 62506, 63796, 49117, 70200, 24395, 123005, 38649, -21417, -10130, -116679, -97185, 115055, -18095, -236840, -211673, -16068, 50606, -1146, -63578, -33416, -115558, -17682, 125677, 37223, 126718, 92795, 71394, -66605, 35674, 26714, 89418, 15754, -93125, -41268, 19346, -18857, -135209, 18759, 47854, 29567, 99633, 70747, 41711, 57564, 26308, 8489, -30789, -40132, 95239, 127396, 90464, 99091, 37446, -49002, 8975, -68596]
11635f8596J8319K2334o9024J99870R8975m4714k18229K1072M5067N8315J52733
11624B16122j40803j98815J11689P5777p0117L7250j30536N8651m0353N6755J25552
11613A01172p5596q07N8477m0095l33M693k5673m1079p87J09223q156j46928K9870
11600c6019R1195N0503j13162o1865O6324M519N2370K8827j06530O2248m737k4464
11588I209P2221M39j950j07241j05172k2622J20778O6757J5584M6574K340N9919
11576A56836l2861N7769k1888m043n7830o3556P9225j11943J6870o0033l7004
11565g8458J5916K5411j7707M3046L946l1745J6664k408J08038j08295p4355r3657
11553a93604m1091R8135K02702N1116O1075j03146k6423K7089m5907K9108J25359
$$ y = [-68596, -50277, -27943, -96967, 102903, 201878, 157164, -61065, -39993, 5074, 63389, 216122, 75319, -123496, -11807, 63970, -6147, 31103, -99433, -40782, -81135, -24380, 101172, 25576, 24769, 83246, 43151, 42818, 47511, 21838, -19241, -20028, 89195, 81039, -65889, -36019, 55176, 105679, -7483, -69348, -3024, 1495, 53865, 82692, -23838, 38410, 33673, 9209, 81430, 81869, 79919, -27322, -132494, -155116, -34338, 32419, 48003, 94577, 96917, 156836, 123975, 181744, 159856, 155813, 97983, 34427, 113652, 1709, 18579, -41454, -78458, -62542, -37131, -54838, -11792, -7846, -39591, -22927, -25335, 82703, -25592, -99947, -193604, -234695, -136560, 66142, 117258, 178333, 75187, 48764, 75853, 29946, 59054, 184413]
11542A84413k3952p2202k157l6419l6047j01142O2797P6189O8512n2254j03720
11531c5982M3799O2855M0993K6933j10863j345M1170P9224J8508k0798p9733p0178
11519e417j35764j01569J26598J7079M0633K05901k00361N2125M7969l2228o0417
11508d5451n0196J09088n6404n3372j8177J6168J1481N3278J4054o2228P5487
11497f272R4363q8140j06980k0813O7663J99873O2980l040j26482j26796j48622
11486b02266J01108M2783O0745L0610O1049j47591o9105L4264R371k3648O2068
11475d0612P4745k195R751n0660n2232j12029J74885J57709k7346n4086P1975
11464A49905j10659j09250L5536P0929j27190J16376J27704l1047p7727N9278
$$ y = [184413, 160461, 88259, 86102, 49683, 13636, -87506, -24709, 51480, 119992, 67738, -35982, 7817, 70672, 111665, 138598, 27735, 26390, 67560, 146784, 165292, 144494, 64761, -5417, -141181, -242750, -116152, -99073, -58440, 147461, -52900, -775, 47194, 14966, -45451, -95647, 13441, -42963, -96335, -114512, -98344, -86863, -33585, -19531, -81759, -6272, 88091, -49, -107029, -127842, -60179, 139694, 202674, 199634, 73152, -53644, -202266, -101158, -58375, 2370, 32980, 94029, -53562, -122667, -88403, -79032, -102680, -40612, 34133, 31938, 41689, -8971, -61203, -173232, 1653, 159362, 132016, 77930, 149905, 39246, -70004, -34468, 36461, -90729, 25647, 153351, 122304, 44577, 103855]
11454A03855p6875m8667k5963L5546J54905j14247Q632M2921P310j18595N5120
11443B3942n6442o5510J21521O1438q0020K1018o7934m9799N2715J32010O7506
11432A60445L5652o8785j40416J46387j8383k7123J158n334L5005j3699j00703
11421D204M7279n3450k5943R624K5864P5839K6054j05204n3090j03582J86959
11410C4554L177j31977O1114k3929K3998M0582O1434j02571m4577N9221q2143
11399a01117J2206J39158j5760j7380J2617K3822p624j00704K0437j487J08074
11388G2242R7334j48831m7548J71605k6760q2446P998M2121n9664j43585O4487
11377e3047Q0271j00262J17468J760r1381j6697O2136K9583j39869R2223Q3423
$$ y = [103855, 26980, -21687, -47650, -12104, 142801, 28554, 37186, 80107, 87417, -31178, 23942, -32500, -98010, 23511, 84949, 4929, 25947, -41987, -91786, -39071, 92939, 160445, 196097, 127312, -13104, 133283, 114900, 87777, 88935, 83601, 118606, 104907, 4204, 51483, -1967, -27910, -18286, 7578, 83417, 109471, 4267, -48823, -152405, 34554, 37731, -94246, -33132, -57061, -33063, 7519, 68953, -33618, -78195, -18974, -101117, -88911, 50247, 34487, 17107, 29724, 53546, 45922, -54782, -34345, -35832, 72242, 169576, 20745, -26803, 144802, 118042, 35596, 43594, 85715, 26051, -117534, -53047, 27224, -73038, 44430, 46190, -45191, -61888, 248, 29831, -110038, -17815, 65608]
11366F5608r6940P9148M6473o1443J1535n3998K43q172L4109L857k6766J18010
11354A11664o2175l3945j05961l8721J11684J31373j1418n4816Q9014k6134m8355
11343F2210N4711j7299l9446p6314j55649J37141J00943p0798k9133O7367r9922
11332f6189J674n8792p388p431P0918J46241O5347j5837l5329q4636q4767L9844
11320c6345P0809k3511L8721O8345L3885n385j44763o0808L0456J61670N1139
11309A84213m9923k9469P3020m3511q4460j52957O2182q6751M2000R5266o3847
11298e4237J62784M9454j8921k2162o1310m0660l3565M595j7251M0776K2547j0994
11286B1056J40770j73478O5443J45946L7467r1280n8805R9023Q233l6290n0461
$$ y = [65608, -31332, 47816, 94289, 32846, 44381, -9617, -9374, -17546, 16563, 20420, -6346, 111664, 49489, 15544, -90417, -129138, -17454, 113919, 102501, 47685, 136699, 110565, 62210, 116921, 99622, 60176, -16138, -171787, -34646, 66297, -4501, -33634, 33733, -66189, -64515, -123307, -130695, -138126, -67208, 79033, 144380, 128543, 93214, 8578, -76189, -36345, 34464, 10953, 49674, 118019, 151904, 146519, 1756, -59052, -28596, 133074, 184213, 134290, 104821, 177841, 134330, 49870, -103087, -40905, -127656, -85656, 9610, -54237, 108547, 158001, 139080, 116918, 55608, 14948, -18617, -14022, -31273, 9503, 32050, 21056, 161826, -11652, 53791, 199737, 237204, 145924, 87119, 186142, 194375, 158085, 107624]
11275A07624j53058j62994R6475J90132J00408J9020k4606l4156J02334O8125
11265C09304m0937J2999q3224j04838n9354J192r9368l7401M5876K10773P595
11254A62617k23185l8392K5196L5391R176Q2225N1758R229N6448p1876k9523L4713
11242A03777M5406p265L4502k9320J47023r2431k14542j72534J29074J50522j23157
11231b8945k3559R2325k6537l1795N762Q371r154o0622K0021J95485n2948n6547
11219C1857J22528r4116m7401R1269L9983R2637l0492j47267O0396M7949m2017
11208A25326j5606j11061M256M1589j7685L9525P5879N1930M1512r3783n5671
11197H6211K7876j00527K9200p1047J02924L8682M443j48598J06759P5888q3070
$$ y = [107624, -45434, -208428, -111953, 78179, 178587, 197607, 173001, 138845, 241179, 309304, 268367, 281366, 198142, 93304, 33950, 35142, -64226, -101627, -55751, 155022, 162617, -60568, -98960, -73764, -38373, -29197, 53028, 104786, 114015, 170463, 98587, 69064, 103777, 149183, 141918, 176420, 147100, 294123, 201692, -12850, -185384, -56310, 94212, -28945, -52504, 39821, 13284, -18511, -12749, -4378, -13532, -74154, -54133, 141352, 88404, 31857, 154385, 60269, 12868, 104137, 144120, 236757, 206265, 58998, 119394, 167343, 125326, 109720, -1341, 2915, 44504, 26819, 66344, 142223, 194153, 235665, 141882, 86211, 114087, 13560, 42760, -28287, 74637, 113319, 117762, -30836, 75923, 151811, 68741]
11186F8741M4071q208k60253M5106J20668K2988R3699N6701P532m5443q0806O4320
11174A29116L1669j40806M933J61336j41573L3847l2079K3574o0448M6809R4448
11163A50826O8585j74347j82315N1796J42144J01633K2415m1819r9509O048o5992
11152b0535k2557j7567M5361J18375J12279j35843J8074R2792o0042J097k5931
11141A05503q6321o3285P5579j5188j7055Q7070N2242L3322k4415J5234k4150
11130A38536k506P3410j63826o8536J61540p5579j68114j3526J98825J40100n7673
11119A62651j66164M7046j3545m1946m7520P9584m0637l9020L826K2450M3647
11108A0372o2526m5574j46999N1344N6782R9142J6757J7072L1361l6364R6428
$$ y = [68741, 112812, 104604, -155649, -110543, 10125, 33113, 126812, 183513, 191045, 145602, 64796, 129116, 160785, 19979, 24912, 186248, 44675, 78522, 46443, 70017, 9569, 56378, 150826, 219411, 45064, -137251, -85455, 56689, 158322, 180737, 138918, 39409, 45457, -20535, -43092, -60659, -15298, 103077, 215356, 79513, 97587, 190379, 130337, 131434, 105503, 19182, -44103, 31476, 16288, -767, 86303, 138545, 171867, 147452, 162686, 138536, 136030, 209440, 45614, -22922, 138618, 63039, -105075, -118601, 80224, 220324, 162651, -3513, 43533, 29988, -11958, -59478, 20106, -20531, -59551, -55725, -33275, 10372, -52154, -97728, -244727, -193383, -136601, -37459, -20702, -3630, 27731, -8633, 87795]
11097H7795j21682P0401J47797j09723N4986Q2413k18946l5459O1530m3819k2232
11086d6939K9240J6919r5987O7598P760J35204q759M9011N6125o5914j38290P626
11074A3594Q0669o6696j4388O5094O8882p2963O9841o2636j6908K4772j8824q664
11062F1773J4338m5486J09387j18649J04985K3885n9720k3081M6144R1510l8046
11051A67040j9761L054p1852m7668k9004J25942o409K9016j8304M7172K5576m2653
11039A62149j48601R1277Q0118j67494L964N3611p1329J6113k069O8098J634j37545
11027e0074J15196K9985j29956j4291N7307K8729N9865K0504M7090r5517p1828
11016b990o3948l0014J53726J57633j07121o9428j1014l5156k2643k0596J40761
$$ y = [87795, -33887, 36514, 184311, 74588, 129574, 211987, -6959, -42418, 19112, -24707, -46939, -17699, -780, -96767, -29169, -21409, 113795, 105036, 154047, 210172, 144258, 5968, 13594, 94263, 27567, 13179, 78273, 147155, 74192, 144033, 81397, 64489, 89261, 70437, 61773, 76111, 30625, 140012, 21363, 126348, 150233, 90513, 67432, 113576, 205086, 167040, 147279, 150333, 78481, 30813, 1809, 127751, 121342, 150358, 132054, 179226, 204802, 162149, 13548, 104825, 184943, 17449, 21413, 75024, 3695, 19808, 17739, 85837, 87471, -50074, 65122, 95107, -34849, -49140, 8167, 36896, 96761, 117265, 164355, 68838, -2990, -66938, -96952, 56774, 214407, 107286, 37858, 26844, -8312, -30955, -51551, 89210]
11005H9210j40534k1641l2362Q9581K8783O5404Q6257j25311J35945q5J0207k2161
10993A63293j12825o1074Q7069o5215q5076k1748M4460O2700L3986r3043M8220
10982G47q302J79265R683j30332O002k64r2956p211K1067N9948q9025R821l434
10969d4991L6181r5284n4528J40105J52555j3835J14384K0734l5332k36661P3079
10958E6407L3051j01316O0883o2267P5373M1801K3896j1305j20914l4788Q6727
10947D7548J67469j7597j00068r3926L515J5701J19544k0668m7438J06238l8206
10936A42112k8918P2945J00491M8863L7036p6759o8052J9175J49439j16748j77832
10925A01752j5208o0801Q6565J56522L9815j1625j53161j35543O946o4816N5491
$$ y = [89210, -51324, -72965, -105327, -15746, 13037, 78441, 164698, 39387, 175332, 175247, 185454, 163293, 50468, -10606, 76463, 11248, -73828, -95576, -51116, 11584, 45570, -47473, 747, -7555, 171710, 181393, 51061, 57063, 56799, -36157, -43368, -22301, 37647, -51378, -41557, -44991, -8810, -104094, -158622, -18517, 134038, 120203, 234587, 255321, 219989, -16672, 56407, 89458, -11858, 49025, -13242, 62131, 103932, 127828, 116523, -4391, -39179, 47548, 215017, 197420, 97352, 3426, 6941, 22642, 142186, 121518, 74080, 180318, 142112, 113194, 186139, 286630, 335493, 372529, 295770, 227718, 246893, 396332, 279584, 101752, 86544, 25743, 112308, 268830, 308645, 297020, 143859, 8316, 15262, -49554, 5937]
10914E937J41891J0947J6969j21270L3366R901M1248n7460r1628R601J3244p049
10902E697J28124Q1979n0700l4835k9121O935J0669K0386L385K5289J19162j01384
10890A85586j03758p348J36189L2992q8976j16548k0798j9578J2073j15748R6539
10879i375P6676L6575r0567O1715q304q4100j27252O9307J74722j19951q6276
10868a06830J20538K28126p4587j6340k5775p4297j15827Q9607Q0400p0908m5992
10857a1885m5126J1009N3067J44331j25893r74P2997j01829K9656R3641n4447
10846F4547P8289K5641n7751p4140R2694l2320q1448j7264k6785N5662p7285l4277
10834h4437m3683N8065Q0420J10213J2659r2421J38380O7455j47720j36879j18782
$$ y = [5937, 147828, 158775, 175744, 54474, 87840, 97741, 138989, 81529, -10099, -498, 12746, 5697, 133821, 215800, 165100, 130265, 101144, 108079, 118748, 139134, 142519, 167808, 286970, 185586, 81828, 74480, 210669, 243661, 154685, 38137, 17339, -2239, 9834, -105914, -9375, 67301, 103876, 13309, 75024, 66720, -17380, -144632, -75325, 99397, -20554, -106830, 13708, 241834, 167247, 150907, 125132, 50835, -64992, 24615, 105015, 34107, -11885, -57011, -46002, 7065, 151396, 25503, 24529, 97526, -4303, 25353, 118994, 64547, 142836, 168477, 110726, 36586, 129280, 96960, 15512, -1752, -28537, 27125, -50160, -84437, -128120, -70055, 10365, 120578, 133237, 40816, 179196, 246651, 98931, -37948, -156730]
10823a56730J53840Q6075J0606N628m6066p8599n582n7994J04493R5972J0550
10812A22193k3560o5315J05010r3732q8043n0787J11886Q4774L6743J76211j68545
10801A46835l9493l1465M9155J6572J2688L4597j17250m8041m1173N3396J7896
10790E3717K0903K0984Q8056J1062j37937Q2412n3171R3543o6274L5360k9182
10779A19473j13470J39472n5053l6347m6990n6397R8008K20132p5546k98759O5245
10768d0232j8063m5328J19613k2891M0534J44101J26578j22327o7400m1324m8040
10757B5221N9623n5455j9574J26991P4523m6224o9554p301n9576M2949J1571j9532
10745F3662J02327N3983l0566l0680J01705j35413p4793M4602L949R2613k3122
$$ y = [-156730, -2890, 83185, 93791, 99419, 53353, -25246, -30828, -88822, 15671, 111643, 122193, 98633, 33318, 138328, 44596, -43447, -94234, 17652, 102426, 139169, 315380, 146835, 107342, 75877, 125032, 141604, 154292, 188889, 71639, 23598, -17575, 35821, 53717, 74620, 95604, 183660, 194722, 56785, 139197, 86026, 179569, 113295, 148655, 119473, 6003, 145475, 90422, 54075, 7085, -49312, 48696, 268828, 193282, -105477, -40232, -58295, -103623, 15990, -6901, 33633, 177734, 304312, 181985, 114585, 73261, 25221, 84844, 29389, 9815, 136806, 211329, 165105, 95551, 88250, 28674, 71623, 83194, 63662, 165989, 219972, 189406, 158726, 260431, 125018, 50225, 94827, 98776, 191389, 168267]
10734A68267j6243m1242p650K76705r125j49818K9184q1166K0013O3883m680M8121
10722B96249l0449j30439j01380O4865q6941J24893P3346p1316K3162M8353M4115
10711B54458p1690j00641q648l3933q974L1490k3759Q1233m6794j18851J42275
10700I6166R1138O4193M6496j16584j8682n4034l6751o3811k1060Q7636n0502
10689B4205O3484J30962j56289n3974j1736L6589P4464m822j7679j7444R646R900
10677H7306L9949k8669R7828N4273k04531o7628L2232k1667N520R7686m7428J11420
10665A56291O7560j1324j11894M8428J05872k24389k1485K26724j5952l956j96987
10654A8888l4505J78023r0929N1046J12427M3816k9757Q7996J5231Q5259l6178
$$ y = [168267, 152024, 110782, 103132, 379837, 370712, 220894, 250078, 168912, 188925, 252808, 248128, 296249, 265800, 135361, 33981, 98846, 11905, 136798, 210144, 138828, 161990, 210343, 254458, 182768, 82127, 73479, 39546, 30572, 62062, 38303, 119536, 72742, -46109, 96166, 187304, 251497, 297993, 181409, 162727, 108693, 71942, 8131, -12929, 74707, 24205, 87689, 218651, 62362, 8388, -3348, 33241, 107705, 102883, 85204, 67760, 77406, 87306, 127255, 98586, 196414, 250687, 46156, -21472, 10760, -10907, -5387, 92299, 44871, 156291, 223851, 212527, 100633, 149061, 254933, 30544, 9059, 235783, 219831, 215875, 18888, -15617, 162406, 71477, 122523, 234950, 278766, 249009, 337005, 352236, 437495, 401317]
10643D01317j48331o3072p7540l2510P5051K7428j10592N653P4873O4591j17730
10632I9138L4312m5003N3983J9117J4332p2803M4803N4083j55389o6594J43990
10621A23969j11630N366r0028K8967Q7200O8354l1196o850M0205j19863J22151
10610A16645J44324O3081o5282p0370n967r4586L6860L7568m7744P4097k2587
10599A66039N8132l4247K1954o2753R2274j22591N3738Q695K2521r524n0526M4035
10587A87747k255J4182j7990L6889M9144K213q8735j21798N1453O0803N4620p0792
10575A55481n8897K188j0836j06635M9897J25382P772q9116n5011J01129n6762
10564F4592P4687J76104M27m860j65825m0974J39461o1780o2848J9499m0348J01653
$$ y = [401317, 252986, 189914, 112374, 79864, 154915, 182343, 71751, 77404, 152277, 216868, 99138, 133450, 88447, 142430, 161547, 175879, 103076, 147879, 201962, 46573, -20021, 123969, 12339, 17705, -72323, -43356, 43844, 112198, 81002, 74152, 114357, -5506, 116645, 260969, 324050, 258768, 188398, 182431, 87845, 124705, 162273, 114529, 188626, 166039, 224171, 189924, 211878, 149125, 241399, 118808, 172546, 181241, 203762, 194238, 143712, 187747, 185492, 199674, 181684, 218573, 267717, 269930, 181195, 59397, 110850, 171653, 226273, 155481, 96584, 98772, 87936, -18699, 31198, 156580, 164352, 75236, 20225, 121354, 64592, 139279, 315383, 315810, 310950, 145125, 104151, 243612, 181832, 118984, 138483, 98135, 199788]
10552A99788k5404j7348O289l909j27178Q0146J09239L8669o5710m575n3034k8187
10540A08786q783J09005n3341j10254J44290j14117j9181N7099Q7807q3033J4241
10529A32519K1601J2935j8652N7064N9223N9366P2834p3030q6227m9110L5296
10518B23819J48874j31046j60082M0353J22897q3221j2407q4051O82r8320Q6444
10507E3942Q8464J31604J881m7318M5762J05287o7948j62545o1174J20191M6616
10496B54762j8625Q2166m7306r6702o7302P3121K1030N6717m4106O6599j06009
10485A74345K6901J8742k2245N2133j5073n9661K1729M0688M1286j28528N1461
10474B01778M5538L2778k296n5732o0922p7053m1285n6086N9415J18948k6492
$$ y = [199788, 174384, 157036, 163325, 159416, 32238, 112384, 221623, 260292, 194582, 190007, 136973, 108786, 100003, 209008, 155667, 45413, 189703, 75586, 56405, 113504, 201311, 118278, 132519, 154120, 167055, 148403, 205467, 264690, 324056, 396890, 323860, 237633, 188523, 223819, 372693, 241647, 81565, 121918, 244815, 161594, 149187, 65136, 65818, -32502, 53942, 142406, 274010, 275891, 228573, 274335, 379622, 311674, 149129, 87955, 208146, 254762, 236137, 318303, 270997, 174295, 106993, 180114, 201144, 257861, 213755, 280354, 174345, 201246, 219988, 197743, 249876, 234803, 175142, 196871, 237559, 278845, 150317, 201778, 247316, 280094, 277798, 222066, 161144, 84091, 42806, -13280, 46135, 165083, 138591]
10463A38591k0682J2032L1838N761J5584l1082m798n4194k20062O6462R1791M349
10451C5590J90576k442p0906Q5762j35138P6604J9627J0493N7679p3996j3076
10440A80773j13150M8256R3668m2333L8542L0705N1995o8804j6280j01532J8905
10429A20745O7418N4570M7512l0407m893j0382p7623J5224Q652J30661p5522n7879
10417A88076Q0186M0957j7883l5989O0490k6953K2519p9059r5121n2869Q8624
10406A72978J37872l3881L7372K685l4718J20713j3421j05227J9722l9137l4860
10395B30098j14973K7679K03922j60552J04967P3115o8647L5893J08653r2466
10385C47689n4941M7229o2872m3111l7645O5667J1803j00657J16173O2653j9560
$$ y = [138591, 117909, 129941, 161779, 167540, 183124, 152042, 147244, 93050, -127012, -60550, 31241, 35590, 226166, 223724, 152818, 238580, 103442, 180046, 199673, 210166, 267845, 193849, 180773, 67623, 115879, 209547, 167214, 205756, 236461, 288456, 219652, 203372, 101840, 120745, 188163, 242733, 290245, 259838, 254945, 244563, 166940, 182164, 190816, 321477, 245955, 188076, 268262, 309219, 291336, 255347, 315837, 288884, 311403, 232344, 137223, 84354, 172978, 310850, 276969, 314341, 317026, 282308, 403021, 389600, 284373, 304095, 264958, 230098, 115125, 142804, 346726, 186174, 291141, 364256, 295609, 331502, 440155, 347689, 292748, 339977, 277105, 233994, 196349, 262016, 273819, 173162, 289335, 351988, 332428]
10374C32428m9307K7446K215j09276M5334q6875O5017O9638k419l7338P5277R5923
10362D28063o7312l8144o8525r4872Q956Q3229J0216M130P7375P700k05440q904
10350A36472M0214j27200J22578N3492m6586j380J58085o8235j70451l1070j1389
10339E4530K7432M7251K52119o9831L2673r6327K2096j5250k8338N824L7176O7776
10327C37131o5386m5311K3758n3739l6027N2700N4671n8867j03961R0515L6948
10316B32432P0370k1242K8744o5747o1028j63688j1474J55215M9308J57796J9679
10305C90365j37378o0311L1073k8836m6553R3022q6743o8835N0704k0976J7067
10294A32599K40179m8688j73199Q6619R5862k4577L5889j5968j76504m255L5776
$$ y = [332428, 283121, 310567, 312782, 203506, 248840, 161965, 226982, 296620, 294201, 256863, 332140, 428063, 360751, 322607, 254082, 159210, 168166, 251395, 261611, 265741, 343116, 350816, 145376, 136472, 176686, 49486, 172064, 225556, 178970, 177590, 335675, 267440, 96989, 65919, 54530, 81962, 129213, 381332, 311501, 344174, 247847, 269943, 254693, 226355, 232179, 269355, 337131, 271745, 226434, 250192, 196453, 160426, 213126, 267797, 208930, 104969, 195484, 232432, 302802, 281560, 310304, 244557, 183529, 19841, 8367, 163582, 212890, 370686, 390365, 252987, 192676, 223749, 194913, 148360, 241382, 154639, 85804, 136508, 115532, 132599, 372778, 324090, 150891, 237510, 333372, 308795, 344684, 328716, 152212, 147957, 183733]
10283A83733K01233M101q7522J20657q8962P6883J4403q3404J9213k0025j22905
10272B17405j40124J04632O0617j0435p0416K75306J5661m6196k2170q8545J21022
10261D16757j23200Q772j42057j7612J44272K45761r4086k26755m787q81K0451
10250B26635L4208J17511n6155n7921M6997K4813K6386l616N1551n1076j45654
10239B13679L7436M6814j6429M2274j15743O094J0194N9212N3510n7407m9087
10228B30547m8486m1326J17414J41890N9946j38288m1386l8597L0356R7135M6225
10217D15430l8944j07636O9406j03830j6450N7419K02484j23482K4156J07880
10207D86433K2165N5049r9202J692k3748n734N1909r8022K9634K7949L6101p0187
$$ y = [183733, 384966, 389067, 301545, 422202, 333240, 410123, 424526, 341122, 360335, 340310, 217405, 77281, 181913, 242530, 232095, 161679, 436985, 452646, 406450, 384280, 295735, 416757, 293557, 302329, 160272, 142660, 286932, 532693, 438607, 211852, 207065, 206184, 226635, 260843, 378354, 322199, 264278, 311275, 336088, 362474, 358858, 410409, 359333, 213679, 251115, 297929, 281500, 323774, 208031, 214125, 224319, 283531, 337041, 279634, 230547, 182061, 140735, 258149, 400039, 459985, 321697, 280311, 241714, 272070, 369205, 415430, 376486, 268850, 338256, 234426, 217976, 275395, 477879, 354397, 378553, 486433, 508598, 563647, 464445, 466137, 442389, 436655, 488564, 390542, 420176, 448125, 484226, 414039]
10195D14039l7104o4045k8305j61796J4520M8839N1481N3020J8850J55389l7086
10184D27802l0043p0817n0691M8243N3383L8842Q7070m9500l8768q8684N4813
10173C81650N7076K0237J2402o2582M9545n7936j91239L5017R1032M1943P4121
10162D51266Q2805q3705m6509J18061k43102N3593R164P0676m0100j9927J9703
10151C71925m9750L553M3869J37948J3250k11321o8786P5410l429O3059j5339
10140C60389O9217Q2242O8892j26152j49506O7203O95j7095J19275q6542r0589
10129B98029m1875L0129N5781O6647o9853p516r371K8223m4681k2630P0797j0061
10117C43619K3470k9705O055J30269j51455J34324p369k1099r518j7295q480l1456
$$ y = [414039, 376935, 312890, 284585, 122789, 137309, 186148, 237629, 290649, 309499, 464888, 427802, 397759, 326942, 276251, 324494, 377877, 416719, 503789, 454289, 415521, 326837, 381650, 438726, 458963, 471365, 408783, 458328, 400392, 209153, 244170, 335202, 377145, 451266, 534071, 450366, 403857, 521918, 278816, 332409, 341573, 412249, 372149, 352222, 371925, 322175, 325728, 369597, 507545, 520795, 309474, 240688, 316098, 312669, 375728, 360389, 429606, 511848, 580740, 454588, 305082, 372285, 372980, 355885, 475160, 388618, 298029, 256154, 286283, 342064, 408711, 338858, 331342, 321971, 350194, 305513, 282883, 353680, 343619, 367089, 337384, 343439, 473708, 322253, 456577, 449208, 428109, 418591, 401296, 392816, 361360]
10105C61360L1764k738k2134n5134P5854k9338L3206J00204j55275M059J56429
10094D98257M4601r2163j4927N0407J85831p3358r5261R4096o4113l7385o0490
10083D35495N4703j00003m6637L4665K1554J44135Q8529q7607j40272l4045j0987
10072C59530k8148k6523l8823P8327k9635o6882J8847J91004N2939j6251j92797
10061C01588L4810P5444j0578M1247r811J4838J3039N4271l135L2919k1149j02154
10049D21329J06227k2585r2995r3748r7420L9127J67032O8402j9375j0746n8146
10038D07102q1566o4136N2446K8785j26049J56429Q8071l8971k1385N6591o1323
10027C95994l6754R1570m6839o205L5314J18846n0871n0573j58563J25523R2547
$$ y = [361360, 393124, 390386, 368252, 313118, 388972, 359634, 392840, 493044, 337769, 341828, 498257, 542858, 450695, 435768, 486175, 672006, 598648, 503387, 597483, 533370, 495985, 435495, 490198, 390195, 343558, 378223, 399777, 543912, 632441, 544834, 404562, 370517, 359530, 331382, 304859, 266036, 344363, 314728, 247846, 266693, 457697, 510636, 494385, 301588, 336398, 411842, 401264, 442511, 432700, 447538, 460577, 514848, 511713, 544632, 523483, 421329, 527556, 504971, 411976, 318228, 220808, 259935, 426967, 495369, 475994, 465248, 407102, 325536, 261400, 313846, 342631, 216582, 373011, 461082, 422111, 400726, 457317, 395994, 359240, 450810, 403971, 397766, 433080, 551926, 501055, 450482, 291919, 417442, 509989]
10016E09989j26318J2421n8621k0319R6900N8115k271k809j0769p6432n4933J46182
10004D71135q93n6558j3059O639j0339l9767O3034K4569j8468L0195o0418q0921
9992C15149R2110Q433K7059O3070o6209R001Q3382P2931l1779p3132l9468o0571
9980C99976k4835p2840P8827l01J15687K3761m8693m4324q2398J05721M2179J5845
9968E08605m7648r1531L7662o516n894l3579O9418r199q9188M0387J35139J1019
9956E18675j5170K4998j41756k8685K30396O7632J5114J104l8549l494j00265
9945E30000j00800K1234l2115M4842K5574r5536O8135N0123J55041j17618m3350
9934E05530L8599n79l0601Q1342m01L2858j02375k20904O6160J4935n7891O3216
$$ y = [509989, 383671, 396092, 337471, 317152, 414052, 472167, 469896, 467087, 456318, 379886, 324953, 471135, 470242, 413684, 400625, 407264, 396925, 357158, 420192, 444761, 426293, 456488, 396070, 315149, 407259, 415692, 442751, 505821, 439612, 448613, 531995, 604926, 573147, 500015, 460547, 399976, 375141, 302301, 381128, 380827, 496514, 520275, 471582, 427258, 344860, 450581, 492760, 508605, 460957, 369426, 407088, 400572, 394678, 361099, 430517, 421318, 332130, 372517, 507656, 518675, 503505, 528503, 386747, 358062, 588458, 656090, 671204, 672308, 633759, 630265, 530000, 429200, 450434, 418319, 463161, 488735, 393199, 461334, 511457, 666498, 548880, 505530, 544129, 543550, 512949, 594291, 593890, 626748, 524373, 303469, 369629, 384564, 326673, 389889]
9922C89889J22403n8386q4655J63055m0895j58320K932Q7996O7086J19804m3842
9911E67067j04294P332M3998P3295M4825j01244o2375J03638P7273l7320o7071
9900E45124o4821k398J00084k5128j02961o9687R2716n8735Q133J10603k7181
9889E05749k5943J6045k5533J0866P0975L0641j2763J5126n1250J9498j7936O8388
9877F03863q2153K647j6609K4032J41373O0470j6927j19597l1614p7543l5457
9866D52485r0375O8860J89719Q306p5899o524P5214L4353N4757j26926q0180j22277
9854C81513j3782J29468Q0384O6086q60p772j15562m6975K3457r85k4618o6351
9842D04003m8248K4671Q9373O1612n0444M7642k5016m678J3363K7034M4808P8206
$$ y = [389889, 512292, 453906, 369251, 532306, 491411, 333091, 336023, 424019, 491105, 610909, 567067, 462773, 470105, 514103, 587398, 632223, 530979, 468604, 572242, 649515, 612195, 545124, 480303, 477905, 577989, 552861, 449900, 380213, 472929, 414194, 422327, 532930, 505749, 479806, 495851, 470318, 481184, 552159, 582800, 570037, 585163, 533913, 553411, 535475, 603863, 521710, 524357, 507748, 531780, 673153, 733623, 716696, 597099, 565485, 487942, 452485, 362110, 430970, 620689, 628995, 553096, 546572, 621786, 656139, 710896, 583970, 503790, 381513, 367731, 497199, 577583, 643669, 642809, 635037, 519475, 472500, 495957, 494972, 470354, 404003, 355755, 380426, 469799, 531411, 480967, 528609, 503593, 498915, 512278, 539312, 584120, 662326]
9830F62326j2073k2640l4229M9895k9963O6772p7232J480q576l291O3621J1354
9818F67444K75997N2231j73575p9072o285p3550O8033j0673j39664j007Q8443
9807F68322o2027J99650j30909k2630P9349P2651m7219j24380O786q9327j8501
9796E31765K43407K2483p0163J0748p7807L0261j79153o6603O1048J24439J73753
9785H04178m6051k1069J0737J50790n0362j04443l3305j424r8999N0020Q6750
9774G46822L3607l5165q7570J89602r3403j73973J09545J12525m0380J0257j9553
9763G52314p6780j5775J69165J0688P232j24522j0038J35707o4463m9304J86701
9752I20925o2385q2875j30790P6392Q8536j04084l9828N95J1494l6343J30329
$$ y = [662326, 650253, 627613, 593384, 643279, 613316, 680088, 602856, 604336, 595760, 592469, 656090, 667444, 943441, 995672, 822097, 743025, 736740, 663190, 731223, 720550, 580886, 579879, 668322, 606295, 805945, 675036, 652406, 731755, 804406, 757187, 632807, 639593, 550266, 531765, 775172, 797655, 727492, 738240, 660433, 690694, 511541, 444938, 505986, 630425, 804178, 758127, 737058, 747795, 898585, 848223, 743780, 710475, 709051, 610052, 660072, 746822, 780429, 745264, 657694, 847296, 753893, 579920, 689465, 801990, 761610, 771867, 752314, 675534, 659759, 828924, 839612, 846844, 722322, 712284, 847991, 783528, 734224, 920925, 858540, 775665, 644875, 721267, 809803, 705719, 665891, 666486, 677980, 641637, 771966]
9741G71966J23434q1997j25362P3350p7107j37877K5701j10973J24523J4482J41165
9730G41305N3147k8582p2062R4368p5935l6711k7117Q4111L9278m3175J38805
9719H67432p4709j21106P7128O4603q7841M8277M9522J1123n7404Q2025M258p3739
9707G89569L1156k722q3681m0580O9756M3174K0631J65728M4582r0702j27269
9696H19642q5009R8286J58166k1202p940j7517j4495K0203r9770m2841N0822p9884
9684G78461J33902m8794j7650L0690n0706J70665J31301L6650o0594p4339k07
9673A029379R8909j15309P1875k6255q4590M6059l4275r6046k1110J33252j26311
9662H75578M2410j0347q743n5238J7850J16295K2517j18869J57092j92250J8102
$$ y = [771966, 895400, 813403, 688041, 761391, 684284, 546407, 572108, 461135, 585658, 600140, 741305, 794452, 765870, 693808, 788176, 712241, 675530, 648413, 732524, 771802, 728627, 867432, 792723, 671617, 748745, 813348, 725507, 773784, 823306, 834429, 777025, 859050, 863308, 789569, 820725, 818003, 734322, 693742, 763498, 806672, 827303, 993031, 1037613, 946911, 819642, 734633, 832919, 991085, 969883, 961943, 944426, 929931, 950134, 850364, 807523, 858345, 778461, 912363, 863569, 845919, 876609, 825903, 996568, 1127869, 1164519, 1103925, 1029586, 1029379, 1128288, 1012979, 1084854, 1058599, 974009, 1020068, 985793, 889747, 868637, 1001889, 875578, 917988, 907641, 898898, 843660, 861510, 977805, 1000322, 881453, 1038545, 846295, 864397]
9651H64397J25075O9867j30779M4134P4169j6445k0805k3436J15429q2155j5560
9640A003891k5159Q2134N4209j20518O7598J3240J2283K3577M060J3366M7375
9629A176056n6035j03806Q4349o3249M1393P6418j212j74052K207M0409o5124
9618I57354j1124M4004J27050j33165k8435Q3107Q0901M960J6177J5282o0877
9607A095234q2763K5606J06145k201l3669j10532N1670q0709R7268J2962j1773
9596A067238n8762n4441J96694K4439j00017Q8656m6117P1627J18583m3976m1285
9585A222639M5771j9089k3249P6068k4977j33474O3463J13247m5839l9939O1884
9574A296505o5627j36303Q7792N7511j01143j17675j4410J82997L2775r6381m3966
$$ y = [864397, 989472, 1059339, 928560, 972694, 1046863, 1030418, 1009613, 986177, 1101606, 1019451, 1003891, 978732, 1060866, 1115075, 994557, 1062155, 1075395, 1087678, 1111255, 1115315, 1128681, 1176056, 1120021, 1016215, 1100564, 1037315, 1078708, 1155126, 1153914, 979862, 982069, 1022478, 957354, 946230, 990234, 1117284, 984119, 955684, 1038791, 1119692, 1124652, 1140829, 1156111, 1095234, 1012471, 1038077, 1144222, 1142021, 1108352, 997820, 1049490, 968781, 1066049, 1079011, 1067238, 1008476, 954035, 1150729, 1175168, 1075151, 1163807, 1117690, 1189317, 1307900, 1263924, 1222639, 1268410, 1249321, 1226072, 1302140, 1277163, 1143689, 1207152, 1320399, 1274560, 1234621, 1296505, 1230878, 1094575, 1182367, 1239878, 1138735, 1021060, 1006650, 1189647, 1222422, 1126041, 1082075]
9563A082075l7874J05183M6017Q1064K6394M207K546k8486l3715L6912j12296
9552A172027J10233J10165j42837j34287m1899O8872K8385r0146p833J19687N2281
9541A244648N166o8719R1350m7423L2239J26701J4111o0261K5705N4292j31754
9530A286055M1895K2907n6678J28381n5664J21855k5427m6246j12689P9145J09055
9519A492589j5008r1461j14645j15746J58036J18109Q8232l6754j57537q0987
9509A244828J63050l3356P1955p5901n0437Q444j1397J91751J7081p4926m6446
9498A404646l1521N3009J235K1352Q6628l638K6831p9997M6506L5489q0262L9661
9486A519939Q8753l2034J5683j8787M592k8488p7232o7204N2858m2475j08578
$$ y = [1082075, 1044201, 1149384, 1195401, 1276465, 1302859, 1307066, 1309612, 1281126, 1247411, 1284323, 1172027, 1282260, 1392425, 1249588, 1115301, 1073402, 1142274, 1170659, 1080513, 1072680, 1192367, 1244648, 1249814, 1181095, 1272445, 1225022, 1257261, 1383962, 1398073, 1337812, 1363517, 1417809, 1286055, 1327950, 1350857, 1294179, 1422560, 1366896, 1488751, 1463324, 1417078, 1304389, 1383534, 1492589, 1477581, 1386120, 1271475, 1155729, 1313765, 1431874, 1520106, 1483352, 1325815, 1244828, 1407878, 1374522, 1446477, 1370576, 1320139, 1328583, 1317186, 1508937, 1526018, 1451092, 1404646, 1373125, 1426134, 1427369, 1448721, 1535349, 1531711, 1558542, 1478545, 1525051, 1560540, 1480278, 1519939, 1608692, 1576658, 1592341, 1573554, 1578146, 1549658, 1472426, 1405222, 1458080, 1415605, 1307027]
9475A307027m495J17594J37972l2581j7768k1808l7558J37208L5830M6260p2566
9464A595115J02885J11528L5309n5746J91349j8846j24445N1412J0458n2472l2555
9453A813992j70472L6691p36M9956p2526Q1337Q1239p5939k0097O5813k20348
9442A568910K0730M4446J54516J2594N9871M9497j97629J4344K556r6886P0902
9431A703851M464O1602O8108J11243j38448r2328J79491L5237k6640j17185j21123
9420A668272k3781J45553J43700o4881J9123J27775P0249J4334j85225J07115
9410B022234L0682j23344L6861J71509M1940m4008n0327J4803Q4335J02825O7458
9399B354968N3620O3238J00301m856m7105j72958r0188j05573K9770m0811q5588
$$ y = [1307027, 1302532, 1420126, 1558098, 1525517, 1507749, 1485941, 1448383, 1585591, 1621421, 1667681, 1595115, 1698000, 1809528, 1844837, 1789091, 1980440, 1961594, 1837149, 1888561, 1899019, 1846547, 1813992, 1643520, 1680211, 1679475, 1729431, 1656905, 1738242, 1819481, 1743542, 1723445, 1789258, 1568910, 1589640, 1634086, 1788602, 1801196, 1861067, 1910564, 1712935, 1727279, 1729835, 1632949, 1703851, 1708315, 1769917, 1838025, 1949268, 1810820, 1718492, 1897983, 1933220, 1906580, 1789395, 1668272, 1644491, 1790044, 1933744, 1868863, 1887986, 2015761, 2086010, 2100344, 1915119, 2022234, 2052916, 1929572, 1966433, 2137942, 2179882, 2135874, 2085547, 2100350, 2184685, 2287510, 2354968, 2408588, 2471826, 2572127, 2567271, 2520166, 2347208, 2257020, 2151447, 2181217, 2140406, 2054818]
9388B054818L0546J4928M1654K8030Q9506k5156M975q1082n415O2811P5473Q4402
9376B375490Q272l0012k1845Q5107j28603j0803K52743K98713L3998j32181k42294
9365B488585J22293L3489q2813j59607R7062l3032O952j4960K6050n8428L6281
9354B461872R5162K0818p2150K4268L2584q7238P9163L4097P6828j7777n5257
9343B592370q2479j8744J84403N3323j27515o6407l8166J09468J39319l2787M3498
9332B756283M2596M5212J4424P5169p420L3245m6065n7193R9365Q8625J23476
9321C167717J32571j55069Q7350J1384O7491N4468l2004j99724O4830K26501Q9699
9310C515214K08695J9806J96564J37346j27180k6720o5497o7906O6654p4153j68616
$$ y = [2054818, 2085364, 2100292, 2141946, 2169976, 2259482, 2234326, 2239301, 2158219, 2152804, 2215615, 2291088, 2375490, 2383762, 2353750, 2331905, 2417012, 2288409, 2277606, 2530349, 2829062, 2863060, 2730879, 2488585, 2610878, 2644367, 2561554, 2401947, 2499009, 2465977, 2472929, 2457969, 2484019, 2425591, 2461872, 2557034, 2577852, 2505702, 2529970, 2562554, 2475316, 2554479, 2588576, 2665404, 2647627, 2592370, 2509891, 2491147, 2675550, 2728873, 2601358, 2534951, 2496785, 2606253, 2745572, 2712785, 2756283, 2798879, 2844091, 2858515, 2933684, 2926264, 2959509, 2913444, 2856251, 2955616, 3044241, 3167717, 3300288, 3145219, 3232569, 3243953, 3311444, 3365912, 3333908, 3134184, 3199014, 3425515, 3515214, 3723909, 3743715, 3940279, 4077625, 3950445, 3923725, 3858228, 3790322, 3856976, 3782823, 3614207]
9299C614207J867J79041K4228K0719K070J51676n8650j19130k979o8185p4163
9288C670701J82045P1563R6507P711K4393P5375J87472M3195J73302L1077k5269
9277D538072J03918M4622k34415P4560Q0551k9357M3006K8172O9078K08585N5325
9266D982117K6358j86894j9448K7256j94896j4013j4594j9559J3459R7232N1045
9255D748063k63J20619J16340K78591K61293N33145N52252M56469L41315L4109
9245G441933k33804j95884J14270M67945O44230P70870Q89589O15663J04680o32550
9235I986942n54095m48659k97700J88391J93805J04044K98043l6133k62422n53669
9225H618547l10443k33721k48339j99611J1135l0082k5245J94275K03436J91002
$$ y = [3614207, 3616074, 3795115, 3819343, 3840062, 3842132, 3993808, 3935158, 3816028, 3813049, 3744864, 3670701, 3852746, 3924309, 4020816, 4028527, 4052920, 4128295, 4315767, 4358962, 4532264, 4563341, 4538072, 4641990, 4686612, 4452197, 4526757, 4607308, 4577951, 4620957, 4649129, 4718207, 4926792, 4982117, 5008475, 4821581, 4802133, 4829389, 4634493, 4620480, 4605886, 4586327, 4599786, 4697018, 4748063, 4747800, 4868419, 4984759, 5263350, 5524643, 6057788, 6610040, 7066509, 7407824, 7441933, 7208129, 7012245, 7126515, 7594460, 8238690, 9009560, 9899149, 10514812, 10619492, 9986942, 9432847, 8984188, 8686488, 8874879, 9068684, 9172728, 9470771, 9434638, 9172216, 8618547, 8308104, 8074383, 7826044, 7626433, 7637568, 7607486, 7582241, 7776516, 7979952, 8170954]
9215H170954K38624q9755J06854N8352J81596K59913L14584M79566P63076J103402
9205A1587166J886729K735297K274612J558261j79381j742978j772884r71321
9197A5375501n91695k35753J061425K097937J816842Q68299j140499k250837k083224
9188A4917996j448924j351900j562138j062868p44084n92343m79288m12331j69837
9179G094283j00543M519j31410q2242j67248l90283Q2935L1028j85717K610j1885
9168F146047j7051j32666J8228p2628L4519p2120M0468J07617q3209o0683L7767
9157E946289j2267p6161Q7264o8606j10637J47304P5418n061m1885L7201j1533
9146E967326m8960M1463N0412K4989K5747J93036n3434Q4858L2049o2232M803
$$ y = [8170954, 8409578, 8319823, 8426677, 8485029, 8666625, 8926538, 9241122, 9720688, 10483764, 11587166, 13473895, 16209192, 18483804, 20042065, 19862684, 18119706, 16346822, 15375501, 14783806, 14548053, 15609478, 17707415, 19524257, 20392556, 19252057, 17001220, 14917996, 13469072, 12117172, 10555034, 9492166, 8748082, 8155739, 7676451, 7264120, 7094283, 6993740, 6998259, 6866849, 6784607, 6617359, 6227076, 6310011, 6341039, 6155322, 6157932, 6146047, 6128996, 5996330, 6014558, 5941930, 5976449, 5904329, 5944797, 6052414, 5969205, 5908522, 5946289, 5934022, 5857861, 5945125, 5876519, 5765882, 5913186, 5988604, 5983543, 5941658, 5978859, 5967326, 5918366, 5959829, 6010241, 6035230, 6060977, 6254013, 6200579, 6285437, 6317486, 6255254, 6260057]
9135F260057j8737q5057k8607M7037k1648m4699J69729l6470M7066j22371P6182
9124F242482K2159K8525L6749J3133k3766R8770r4213J06183Q2278k1254M2239
9113F533285J56444m2773J39454J05018p2269J81600N8590L21327K65076J01111
9103G746863P9318J28085K1426J35172J68642J66979J48852K83181l4207r7724
9093H746587j43499j43190n9429j80019j21327m1695J59955J16359J12153L8325
9083H484220r396k2555L5780J1452k08666m3852L8865P3613p8305j1946J48048
9072H417258M765N5042J07199P5108K83152L19485K96283n900K10742P5147J41190
9061I979471K13481O3188K54087R7554M4920j29413j74032j35371j13811P4148
$$ y = [6260057, 6241320, 6156263, 6127656, 6174693, 6153045, 6108346, 6278075, 6241605, 6288671, 6166300, 6242482, 6264641, 6293166, 6329915, 6343048, 6319282, 6418052, 6323839, 6430022, 6512300, 6491046, 6533285, 6689729, 6646956, 6786410, 6891428, 6819159, 7000759, 7059349, 7380676, 7645752, 7746863, 7826181, 7954266, 7975692, 8110864, 8279506, 8446485, 8595337, 8878518, 8844311, 8746587, 8603088, 8459898, 8400469, 8220450, 8099123, 8057428, 8217383, 8333742, 8445895, 8484220, 8474824, 8452269, 8488049, 8499501, 8290835, 8246983, 8285848, 8359461, 8281156, 8269210, 8417258, 8422023, 8477065, 8584264, 8659372, 8942524, 9262009, 9558292, 9552392, 9763134, 9838281, 9979471, 10192952, 10256140, 10510227, 10607781, 10652701, 10523288, 10349256, 10213885, 10100074, 10174222]
9051A0174222j84331q2738J5188q8605L2333j8936Q4502j29621L4239J84091N5812
9040A0076156J22938J5533p259P6069M6338n7741q2607Q6103R251N0184J47452
9029A0482417K02937R3818K9078k9038R1906J56762R5733P1974L52609J16862
9019A1665058l1619J49543J93155k7198P664R0219N2354J05963N0529N6055J79541
9008A2491264J35604J13626L2228J52801L02791J46195M952L6352R4212p9979
8998A3430046K19994K93525K71124J86347L47765K17807J27482J08774R7913K28994
8988A5529771K40040J93152L37266L56195K23378L18603K70323M97059M12325
8979A8378112O15701R41467J147474J132703R48631R40669M00549L95546M69195
$$ y = [10174222, 9989891, 9907153, 9922341, 9833736, 9866069, 9847133, 9931635, 9802014, 9836253, 10020344, 10076156, 10199094, 10214627, 10207368, 10283437, 10329775, 10272034, 10189427, 10275530, 10284781, 10334965, 10482417, 10685354, 10779172, 10808250, 10779212, 10871118, 11027880, 11123613, 11195587, 11548196, 11665058, 11633439, 11782982, 11976137, 11948939, 11956603, 12046822, 12099176, 12205139, 12255668, 12311723, 12491264, 12626868, 12740494, 12772722, 12925523, 13228314, 13374509, 13379461, 13415813, 13510025, 13430046, 13650040, 13943565, 14214689, 14401036, 14748801, 14966608, 15094090, 15202864, 15300777, 15529771, 15769811, 15962963, 16300229, 16656424, 16879802, 17198405, 17468728, 17965787, 18378112, 18993813, 19935280, 21082754, 22215457, 23164088, 24104757, 24505306, 24900852, 25370047]
8970B5370047L21525J80726P10234J148219J103765J270039R38685Q5729L01325
8961C1430294J12922k37850q10266p81717q29634l58483Q770J17561M81046Q29054
8951B9961697O39735L92491J57235N331J99509L79873O50065Q68700Q14103J021102
8941C5089841J241182J648036K331822L070140L113135L000215K785339L513665
8933E5793375N623963O322248O627548P316466O409202Q312001J0701948R355659
8925A16462410j110502o946759j0295028j3863497j0211399p513415n231766l788277
8917E7501767k287064r03631N99254J514094K814379L934321M216455M090049
8909G1479624K751521J051419K058207L775825O493218J0569644J7034732K4123366
$$ y = [25370047, 25691572, 25872298, 26582532, 27730751, 28834516, 30104555, 31043240, 31128969, 31430294, 31543216, 31305366, 30495100, 29713383, 28883749, 28525266, 28534036, 28651597, 29132643, 29961697, 30601432, 30993923, 31151158, 31156489, 31355998, 31735871, 32385936, 33254636, 34068739, 35089841, 36331023, 37979059, 40310881, 43381021, 46494156, 49494371, 52279710, 55793375, 61417338, 67739586, 74367134, 81683600, 88092802, 96404803, 107106751, 116462410, 115351908, 108405149, 98110121, 84246624, 74035225, 66521810, 61290044, 57501767, 55214703, 54311072, 54910326, 56424420, 59238799, 63173120, 67389575, 71479624, 74231145, 75282564, 77340771, 81116596, 87609814, 98179458, 115214190, 139337556]
8901A39337556K4185762J9298558P910541j0403095j4422753r537834m239295
8894A52129440L87410P038880J7228357K3180007J9805926J1612531r684124k5076221
8886A96622206k2603537j7729588j4559607j4261114j3376039j0745935q269333
8879I5077053n711455l593812k408096j421978o84144J89961P03406J118612J818688
8870H5088235K055707K844740L781663N444228P804722J1766611J7508254K1778600
8862A58072760J9590667J4911012L526271q397708p566325j970944L776763J1072804
8854A93015300K1784383L4840108L7697129L0108029J3531062j9203664l1781457
8847B79990890k4669387j8499670j4640142j2907805p811241J084503J4058928
$$ y = [139337556, 163523318, 182821876, 190732417, 180329322, 165906569, 156368735, 152129440, 152516850, 159555730, 176784087, 199964094, 219770020, 231382551, 221698427, 196622206, 174018669, 156289081, 141729474, 127468360, 114092321, 103346386, 95077053, 89365598, 85771786, 83363690, 81941712, 81257568, 81447529, 82150935, 83269547, 85088235, 87143942, 89988682, 93770345, 99214573, 107019295, 118785906, 136294160, 158072760, 177663427, 192574439, 196100710, 187703002, 180136677, 178165733, 181942496, 193015300, 214799683, 249639791, 287336920, 317444949, 330976011, 311772347, 279990890, 255321503, 236821833, 222181691, 209273886, 201462645, 202547148, 216606076]
8840B16606076L0696934M6872691N6214840N6155080L6161962L103980k9950150
8833D15861413m6348211l4804868j8994810p326992O40017L656237N591527K905138
8825C21179451j3727060k8074852l3849550l0211514k2418639j9003060j8607236
8818A55287540j8570872j7014916j3452362r808187p312017n602487m807706m241648
8810G4477345l853170l533427l365220k941958k773634k160050j791312j473190
8802E2585384j434459j163824j197869j279514j384325j329503j177039j208172
8794D2410679j061430q34585o58685o56599o64232n41714q15193q60349o58123
8785C5659769n42638l14168k31960l50549m97288o43847o03461o72141m20730
$$ y = [216606076, 247303010, 294175701, 350390541, 406545621, 442707583, 445811563, 415861413, 369513202, 334708334, 315713524, 308386532, 309026549, 312682786, 318274313, 321179451, 307452391, 279377539, 245527989, 215316475, 192897836, 173894776, 155287540, 136716668, 119701752, 106249390, 96441203, 89129186, 83526699, 78718993, 74477345, 70624175, 67090748, 63725528, 60783570, 58009936, 55849886, 54058574, 52585384, 51150925, 49987101, 48789232, 47509718, 46125393, 44795890, 43618851, 42410679, 41349249, 40514664, 39855979, 39199380, 38535148, 37993434, 37178241, 36317892, 35659769, 35117131, 34802963, 34571003, 34220454, 33723166, 33079319, 32475858, 31803717, 31382987]
8776C1382987m95402n80595o98653m71575l81424l53605o70240n02154l40626
8767B6888713m15728l71678j35917p3575N6900K48032R6799J808l47833m33726
8757B5513795m05003k62076l42788j04894N2586N712K713P6646o8520m64758n32592
8746B3470821l44342l31011l02664k47745m85940k58381j63617j44761p2586p6399
8736B1043375m06488k05971k23856k7015M1178J60431l9545K11147J49258J56586
8726B0859100L60876N27482P43227R14447J142899J294620J664327J750057J421932
8717C0678967J316151Q61623L33948N26192J089854J596514K202610K720232L118571
8708D4444662K830639J731944m56050k365667k431231j832311j436538j412421
$$ y = [31382987, 30887585, 30306990, 29608337, 29136762, 28755338, 28401733, 27731493, 27229339, 26888713, 26472985, 26101307, 25965390, 25891815, 25948715, 26196747, 26293546, 26295354, 25947521, 25513795, 25108792, 24846716, 24503928, 24399034, 24451620, 24457332, 24460045, 24536691, 24468171, 24003413, 23470821, 23126479, 22795468, 22492804, 22245059, 21759119, 21500738, 21337121, 21192360, 21119774, 21043375, 20636887, 20430916, 20207060, 20180045, 20221223, 20381654, 20342109, 20553256, 20702514, 20859100, 21219976, 21747458, 22490685, 23405132, 24548031, 25842651, 27506978, 29257035, 30678967, 31995118, 32856741, 33190689, 33716881, 34806735, 36403249, 38605859, 41326091, 44444662, 47275301, 49007245, 48551195, 46185528, 43754297, 41921986, 40485448, 39073027]
8700C9073027j530722j609217j326512j148668j051428r79811p39897m51411j17749
8691C0117612L65948N16010J033605J475297K133091K445548K464376K212283
8683D2763770K176280K274719K592893L834107M917080N935560N997566M816384
8675G5308359K346903j568938n048407n971038n558124m167674k847680k489952
8667E0003449k635747l510865l862701l246957k548182k386780k140324j715090
8659B7956803j305085j044963q06831m53427k80091k96271l33602k19994j7675
8650B3198864L27672N85715M22833J88415P9771M8140r9465l70698l98572m05357
8640B3577318m65697o32766n81887o66947p53143o24580l89334l57479l05875
$$ y = [39073027, 37542305, 35933088, 34606576, 33457908, 32406480, 31426669, 30686772, 30235361, 30117612, 30483560, 30999570, 32033175, 33508472, 35641563, 38087111, 40551487, 42763770, 44940050, 47214769, 49807662, 53641769, 58558849, 64494409, 70491975, 75308359, 77655262, 76086324, 71037917, 65066879, 59508755, 55341081, 52493401, 50003449, 47367702, 43856837, 39994136, 36747179, 34198997, 31812217, 29671893, 27956803, 26651718, 25606755, 24799924, 24346497, 24066406, 23770135, 23436533, 23216539, 23198864, 23526536, 24112251, 24535084, 24723499, 24803270, 24851410, 24751945, 24381247, 23982675, 23577318, 23111621, 22478855, 21896968, 21230021, 20476878, 19852298, 19462964, 19105485, 18799610]
8631A8799610j26522j18953j75065J5384m7498M1385J19320J13144K78276N16609
8621A9415690O26955O29597O73658P47147P37582N94152O52713O85189M66187
8612B5228870L98680n4627o3159k79894n79261r30885r16399r65023p18943p17017
8602B0402342m67134n73955l50937j56967j17856J25225p0273k45304n86050m09128
8592A7549963l63934k45716l37152l28998k43965q9376L3695r470M7854N3886
8582A6066787Q1809J19494K27248K36813L4799K12098j0113m27750P67817M51270
8572A7760272P0699J02989j50010Q6751Q4464O1764p9758L5739K61926L77609
8562A8612445K97356J29698M4439j3431j4032j42709j5531J50663l8776K0637
$$ y = [18799610, 18673088, 18554135, 18379070, 18394454, 18346956, 18388341, 18507661, 18620805, 18899081, 19415690, 20042645, 20672242, 21345900, 22093047, 22830629, 23424781, 24077494, 24762683, 25228870, 25627550, 25572923, 25509764, 25229870, 24650609, 23719724, 22803325, 21838302, 21119359, 20402342, 19935208, 19361253, 19010316, 18853349, 18735493, 18860718, 18790445, 18545141, 17959091, 17549963, 17186029, 16940313, 16603161, 16274163, 16030198, 15940822, 15974517, 15965047, 16012901, 16066787, 16148596, 16268090, 16495338, 16732151, 16766950, 16979048, 16968935, 16541185, 17309002, 17760272, 17830971, 17933960, 17783950, 17870701, 17955165, 18016929, 17937171, 17972910, 18234836, 18612445, 18909801, 19039499, 19083938, 19070507, 19056475, 18913766, 18898235, 19048898, 19010122, 19030759]
8552A9030759K36411L20705J71914M91670L21215K23590K53300N06751N17998
8543B2074313O50974O08943P41109Q90405J319293J395897J739305J754933J904308
8534C3079480J515251J092963J082655J152470J307714J360030J406774J294111
8526D3291448J144918J642460K082944K429478K967278L360987L792291M743157
8518F5454961O395393Q562027J2461386J8332477K7155832L8104301M7325388
8511B23791765M9458390M1005830J9114777o077358k5516147l5224577l4485388
8504B32067292l1189004k8546089k5834697k2467302j7751000j2900601r062204
8497H4316395o101441m230517l091025k478528k134858j514114j010962p43387
$$ y = [19030759, 19267170, 19587875, 19759789, 20251459, 20572674, 20796264, 21049564, 21556315, 22074313, 22725287, 23334230, 24075339, 24965744, 26285037, 27680934, 29420239, 31175172, 33079480, 34594731, 35687694, 36770349, 37922819, 39230533, 40590563, 41997337, 43291448, 44436366, 46078826, 48161770, 50591248, 53558526, 56919513, 60711804, 65454961, 71850354, 80412381, 92873767, 111206244, 138362076, 176466377, 223791765, 273250155, 314255985, 333370762, 327293404, 301777257, 266552680, 232067292, 200878288, 172332199, 146497502, 124030200, 106279200, 93378599, 84316395, 78214954, 73984437, 70893412, 68414884, 66280026, 64765912, 63754950, 63011563]
8489F3011563n51932o55121o63819l76906N109K39214O43414J041823J852257
8480F4545602K803223M465161O642745J0161515J5512584K3010499L2315754L8779955
8472A98237038L9350196L0413427J1030518r023820k4420567l0694673k9226572
8465A85665547k6307238k3716146k1525896j8600621j4826372j1192376q295851
8458F1201047o068763m674878l398508k753780k323969k263539k049651j783803
8450C5884156j402739r03274p98125o92736n39717j052865j314791j433899j415718
8441B6330292j411979j395685j131873j005720q16515o11077q13896q21291o96230
8432A7626026m66012l83999n31057o54505o42305m90099n88823l43991l24703
$$ y = [63011563, 62459631, 61804510, 61140691, 60763785, 60768894, 61008108, 61651522, 62693345, 64545602, 67348825, 71813986, 78456731, 88618246, 104130830, 127141329, 159457083, 198237038, 237587234, 268000661, 279031179, 270007359, 245586792, 214892119, 185665547, 159358309, 135642163, 114116267, 95515646, 80689274, 69496898, 61201047, 55132284, 50457406, 47058898, 44305118, 41981149, 39717610, 37667959, 35884156, 34481417, 33578143, 32780018, 32087282, 31547565, 30494700, 29179909, 27746010, 26330292, 24918313, 23522628, 22390755, 21385035, 20568520, 19957443, 19143547, 18322256, 17626026, 17160014, 16776015, 16244958, 15590453, 14948148, 14458049, 13869226, 13525235, 13200532]
8423A3200532m09291k61010k42032k05412m30547k31744r1236r5202M231r7100
8413A1141189l06415k86542l06599k06390j93055l53455j84980j76220k25167
8404H902366j57972j91297k31596l4462j92000k84425q8950j05034p5509j50744
8394G390377j66887o9270j17563k10487k20830k58529j98625j51406J033o9228
8384E928585j78293j22094O67j02418j80532l9924N9497k9463j27800r2477n7467
8373E058281q5250j55371j6980j07929O7729M5553n0598R1655J01033Q5292J28073
8362E161488L48744M51389N15313N08242M08327L14590K12130j92644n14856m82830
8352F729893n26306m58054l79035l04951l59098k71522k02935k47468j05051j87634
$$ y = [13200532, 12791241, 12530231, 12288199, 12082787, 11652240, 11420496, 11329260, 11234058, 11238289, 11141189, 10834774, 10548232, 10241633, 10035243, 9842188, 9488733, 9303753, 9127533, 8902366, 8744394, 8553097, 8321501, 8287039, 8095039, 7810614, 7721664, 7616630, 7541121, 7390377, 7223490, 7154220, 7036657, 6826170, 6605340, 6346811, 6148186, 5996780, 5997813, 5928585, 5750292, 5628198, 5628865, 5526447, 5345915, 5305991, 5365488, 5336025, 5208225, 5115748, 5058281, 4973031, 4817660, 4800680, 4692751, 4760480, 4806033, 4755435, 4847090, 4948123, 5033415, 5161488, 5510232, 5961621, 6476934, 6985176, 7393503, 7708093, 7920223, 7727579, 7212723, 6729893, 6203587, 5745533, 5366498, 5061547, 4702449, 4430927, 4227992, 3980524, 3875473, 3687839]
8342C687839k07298l0015j08277k04961q8309O2927j3503N2411j2711k9525N5790
8331C164368K0132M9180J00578J77703O8836Q6932J91117m9860K94983L52486
8321D456455K87170K20676N16697M10842M8504j30131n56098k75274j74318k39803
8311D564720k58841m00989k36896j02077j91808r1166r5610j62729j34860M3773
8301B933517M7344j1938j68955r7179l0892O6179n6380j59048l2055J5552j48178
8290B357967n9708M6705o3738l1682m5707j43277j08951M904q1855p4443N0284
8279A850499m8919K4521M8485O810J78950L2947p1843J049J15301N2373J64020
8268B354193k8426r3145k0803P5485J14528J1097j25056o9174K06995R4184J64929
$$ y = [3687839, 3480541, 3450526, 3342249, 3137288, 3048979, 3111906, 3098403, 3150814, 3138103, 3108578, 3164368, 3184500, 3233680, 3334258, 3511961, 3580797, 3667729, 3858846, 3808986, 4103969, 4456455, 4743625, 4964301, 5480998, 5891840, 5940344, 5810213, 5254115, 4978841, 4804523, 4564720, 4305879, 3904890, 3667994, 3565917, 3374109, 3282943, 3187333, 3024604, 2889744, 2933517, 2980861, 2968923, 2799968, 2702789, 2671897, 2738076, 2681696, 2522648, 2490593, 2506145, 2357967, 2298259, 2344964, 2281226, 2249544, 2203837, 2060560, 1951609, 1956513, 1874658, 1800215, 1850499, 1801580, 1826101, 1874586, 1881396, 2060346, 2093293, 2021450, 2022499, 2137800, 2190173, 2354193, 2325767, 2232622, 2211819, 2287304, 2401832, 2412929, 2287873, 2218699, 2425694, 2519878, 2684807]
8257B684807L83660N01661P00831O06130J74084J90968m1158j23450o734k89050
8247D781749k51211m41242m78767l75954k03303p8245n0249n1761J4687Q4278
8237B949982m7272N7668l8872M4706J94168K83j12506Q4642K8552l5648J02259
8226C227962K14615j75798j05218J50364J81897K33158L17215J82296J30173j96122
8216D160542j88322j36971R152q8419O3064j59589j92718k14013k47106k23407
8206B782213j71196j38036j63811p8118k8221K822k2470J16269m8644K33254K7033
8195B511095N5062m7086J40396j693312M1580P43067m3623J93322j2245Q3956
8185A972212j91239Q32N2447m4538m4644M733J91J10499N867M4368j37438K2755
$$ y = [2684807, 3068467, 3570128, 4270959, 4877089, 5051173, 5242141, 5200983, 5077533, 5070799, 4781749, 4530538, 4089296, 3610529, 3234575, 3031272, 2953027, 2902778, 2851017, 2865704, 2949982, 2902710, 2960378, 2921506, 2966212, 3160380, 3160663, 3048157, 3132799, 3161351, 3125703, 3227962, 3442577, 3266779, 3161561, 3311925, 3493822, 3726980, 4044195, 4226491, 4356664, 4160542, 3972220, 3835249, 3844401, 3755982, 3819046, 3659457, 3466739, 3252726, 3005620, 2782213, 2611017, 2472981, 2309170, 2231052, 2202831, 2205653, 2183183, 2299452, 2250808, 2484062, 2511095, 2566157, 2519071, 2659467, 966155, 1007735, 1750802, 1707179, 1900501, 1888256, 1972212, 1780973, 1781805, 1834252, 1789714, 1745070, 1749803, 1749994, 1860493, 1866360, 1910728, 1773290, 1796045]
8173A796045j14156J4399k4669N3020N8737k10998j27717q3215q6072l7517j27146
8162A110711J50782j7215p936J51002N9002j36776K8298J18112L8867R1644j7877
8151A568614M6800L8347J11362N1248J23409L12042K67895M7405N6661k4796m891
8140B594096k7406k93310j77843p0591o4084r2184K9882j36237j37707n7820p9156
8129A487640q8332m3041J21374N3838p6640M1134M4527J73776m7030Q6866R1280
8118A845392j20543N2856P7662J03358J47069j1281J09761K02115J67526K17903
8108B791818J34511J81441K69293K54384J32680K68064J12902j9378P9945J73768
8098D379428Q8056Q2787R0100J52107J6570o8381m1435J15285M22241K70947L00254
$$ y = [1796045, 1681889, 1696288, 1671619, 1724639, 1783376, 1572378, 1444661, 1361446, 1275374, 1237857, 1110711, 1261493, 1244278, 1236342, 1387344, 1446346, 1309570, 1337868, 1455980, 1494847, 1586491, 1568614, 1615414, 1653761, 1765123, 1816371, 1939780, 2251822, 2519717, 2567122, 2623783, 2598987, 2594096, 2566690, 2273380, 2095537, 2024946, 1960862, 1868678, 1898560, 1762323, 1624616, 1566796, 1487640, 1399308, 1356267, 1477641, 1531479, 1454839, 1495973, 1540500, 1714276, 1667246, 1754112, 1845392, 1724849, 1777705, 1855367, 1958725, 2105794, 2094513, 2204274, 2406389, 2573915, 2791818, 2926329, 3107770, 3377063, 3631447, 3764127, 4032191, 4145093, 4125715, 4205660, 4379428, 4467484, 4550271, 4640371, 4792478, 4809048, 4740667, 4699232, 4814517, 5236758, 5507705, 5807959]
8087E807959L70444K58734O19236P69371R98140J438780J663304K162923K306810
8078A6395701J893240J127778O33437k68069j142273j135487r25381p13460m42967
8069A5422519k30580q9155l23514p24064q85778j030438j005254r40641p55250
8060I437845o19184m06993l37914l68653k86487l57531l1928O7517q7853P3110
8050G081929L59010L66526N12596N71049N65246N04107K52537L18863M62962O87584
8040A1682409J248997J483662J781677J476899P14150j40691q00560j103600j477599
8031A4865344j429296j156730r02409p38786p62108p28740p98896p26835r25117
8022F696427q69044n34895m90583l15972n73474l02635l92041j74633j05384j97326
$$ y = [5807959, 6178403, 6437137, 7056373, 7825744, 8823884, 10262664, 11925968, 14088891, 16395701, 18288941, 19416719, 20050156, 19782087, 18639814, 17504327, 16578946, 15865486, 15422519, 15191939, 15102784, 14779270, 14055206, 13169428, 12138990, 11133736, 10193095, 9437845, 8818661, 8411668, 8073754, 7705101, 7418614, 7061083, 7029155, 7096672, 7008819, 7081929, 7440939, 7807465, 8320061, 8891110, 9456356, 9960463, 10213000, 10531863, 10994825, 11682409, 12931406, 14415068, 16196745, 17673644, 18387794, 18247103, 17446543, 16342943, 14865344, 13436048, 12279318, 11376909, 10638123, 9876015, 9147275, 8348379, 7621544, 6696427, 5827383, 5292488, 4801905, 4485933, 3912459, 3609824, 3217783, 3043150, 2937766, 2740440]
8012B740440j80674o4343k02842j0322R0177l7318j46981j05398o7290o1943k069
8001A951437j62853j31848j291K1903j27212j52864J13249N1497j02922m9487
7991A409609n7719K6853j40326r1959Q7536P2822n5615k2102K16701M0385L8403
7980A524588P1600o823M5107k39221J3031o3115k1499L3069l7500j85187k11273
7969I22777J55064l2909K240J13074l7285o4907l0625O5195M1962J7025J00467
7958A252078R335n6673J6658j0551P6978r5315O434J24661p0543Q5204J15606
7947A453872J06580j7296J58092J8283J72303J25937o6168K5264k2473n219p0993
7936A878182j20305j19144J33344m2581q1639q1551L759j52369l6777N3956M9399
$$ y = [2740440, 2559766, 2495423, 2292581, 2282259, 2372436, 2335118, 2188137, 2082739, 2015449, 1953506, 1951437, 1788584, 1656736, 1655445, 1677348, 1550136, 1397272, 1510521, 1562018, 1459096, 1409609, 1351890, 1378743, 1238417, 1146458, 1233994, 1306816, 1251201, 1229099, 1445800, 1486185, 1524588, 1596188, 1589365, 1634472, 1395251, 1408282, 1345167, 1323668, 1356737, 1319237, 1134050, 922777, 1077841, 1044932, 1047172, 1160246, 1122961, 1058054, 1027429, 1092624, 1134586, 1151611, 1252078, 1261413, 1204740, 1221398, 1210847, 1287825, 1192510, 1198944, 1323605, 1253062, 1338266, 1453872, 1560452, 1543156, 1701248, 1719531, 1891834, 2017771, 1951603, 1976867, 1954394, 1949175, 1878182, 1757877, 1638733, 1772077, 1729496, 1647857, 1566306, 1570065, 1417696, 1380919, 1434875, 1484274]
7925A484274O9735j29218l7526J17759L2683q5985l4028l6366q9998j67914M2339
7914A165755l1424J0256j3746o2186L3403j35441j12076o9091r4216J8427J08002
7903H17663j1918p8205o8203Q0659p9855K3652l3422R994J27459k17399k0777
7892E49648J01234J19124J6017n2505o2128N6228N4736M8656J9290J09755O1326
7881A021381r6970m7373J09628L18040M5034J70720L71933N95631N19291K35383
7871C242698J61981l04585k34011r5067k27113j74908n967r9075p8038k28710
7861A957205k71416j02589k10278r8k91603k37901K7671n5839q523Q8849J57445
7850A052923J25169R8823L5178J8216O7095j00831L3093p0168q4549K49851P7947
$$ y = [1484274, 1554009, 1424791, 1387265, 1505024, 1537707, 1451722, 1417694, 1381328, 1291330, 1123416, 1165755, 1134331, 1144587, 1130841, 1068655, 1102058, 966617, 854541, 785450, 691234, 709661, 817663, 805745, 727540, 659337, 739996, 660141, 683793, 650371, 660365, 787824, 570425, 549648, 650882, 770006, 786023, 733518, 671390, 727618, 782354, 831010, 850300, 960055, 1021381, 924411, 877038, 986666, 1304706, 1349740, 1520460, 1892393, 2488024, 3007315, 3242698, 3404679, 3100094, 2866083, 2771016, 2543903, 2368995, 2363028, 2263953, 2185915, 1957205, 1685789, 1583200, 1372922, 1372824, 1081221, 843320, 870991, 815152, 806629, 895478, 1052923, 1178092, 1276915, 1312093, 1330309, 1397404, 1296573, 1329666, 1259498, 1174949, 1424800, 1502747]
7839A502747J44196L77945J72513O4871K70486L52490K05455J29701r0322j53179
7829B976903k48106l32964o8972j23357O7444j2340j45430j38011j68579j98982
7819A607606k42267j64700k06423R0724k3230O7710J55860O6492L2837m3142m26495
7808I14972q5510J58953j201k8491J32133l7571J31120J83385J36806K21834m0909
7797A685521M0312k19366j32651n9385J461j35945j45828k7865O925k1976m4909
7786I46294P5524j4624k9302P3322o5589J50507k1883k27481J43680Q4305Q2910
7775A197663K2046p3180o9580O8620J13163R8305n3501r9303R811J47598N3797
7764A415439m5752J81242O4010o7157K100K08072K10304M270p7506J15489J42773
$$ y = [1502747, 1646943, 2024888, 2197401, 2262272, 2532758, 2885248, 3090703, 3220404, 3130082, 2976903, 2728797, 2395833, 2326861, 2203504, 2270948, 2258608, 2113178, 1975167, 1806588, 1607606, 1365339, 1200639, 994216, 1084940, 1061710, 1129420, 1285280, 1351772, 1384609, 1341467, 914972, 829462, 988415, 987214, 958723, 1090856, 1053285, 1184405, 1367790, 1504596, 1726430, 1685521, 1725833, 1506467, 1373816, 1314431, 1315892, 1179947, 1034119, 1006254, 1013179, 991203, 946294, 1021818, 1007194, 977892, 1051214, 985625, 1136132, 1114249, 886768, 1030448, 1114753, 1197663, 1219709, 1146529, 1076949, 1145569, 1258732, 1357037, 1303536, 1204233, 1214044, 1361642, 1415439, 1369687, 1550929, 1614939, 1547782, 1549882, 1757954, 1968258, 1972528, 1895022, 2010511, 2153284]
7753B153284l2454O7444K40726K548r346m8379K81502K45409J73690Q1795K57963
7742C414182J33064J57042K31601L77898K69388M22817M17095K60246M45077M09448
7732F537858M42917M50444M02835L81198M84209N22886L20361L08917L38249K48708
7722A0438582K48440K27105K90951P7070K03719L21581J11210J12711J43703k7962
7712A2147110O645j42068k85708l85245m99669m35445o34355p24447n34756m08944
7702H103118l70360l98276l35683l94550k94970l37118l28064j35753j88953m17313
7692D902078l84085n0639j47929l49671l13831l18355j95888j53657j99847k8365
7682B759811k46691j47722j33995k32531j6297j34271k93015j15629p2534N5089
$$ y = [2153284, 2120830, 2188274, 2429000, 2431548, 2422202, 2373823, 2655325, 2900734, 3074424, 3156219, 3414182, 3547246, 3704288, 3935889, 4313787, 4583175, 5005992, 5423087, 5683333, 6128410, 6537858, 6980775, 7431219, 7834054, 8215252, 8699461, 9222347, 9542708, 9851625, 10189874, 10438582, 10687022, 10914127, 11205078, 11282148, 11485867, 11807448, 11918658, 12031369, 12175072, 12147110, 12153755, 12011687, 11725979, 11340734, 10841065, 10405620, 9771265, 9046818, 8512062, 8103118, 7732758, 7334482, 6998799, 6604249, 6309279, 5972161, 5644097, 5508344, 5319391, 4902078, 4517993, 4467354, 4319425, 3969754, 3655923, 3337568, 3141680, 2988023, 2788176, 2759811, 2513120, 2365398, 2231403, 1998872, 1982575, 1848304, 1555289, 1439660, 1367126, 1422215]
7672A422215j15359r6408L3870p05k1571k86923j09378O6780R8985k46194M5268
7661G90580r693j25887O4752q2565j86138O4421L2298N4278M1459N6232j24589
7650E75148j10704j07539J0220k9313l1727j02260P3410M7750p8728k0860J41490
7639C66887K0174k3849m2792q6813J0910r3192j06462J78953o9545j37813R4317
7628A10775j27441J88620K9897k6487k3010j54568r1107N7514Q128l610J33711
7617A02422l7558q170O8311R5508m7426j85912j60439L0665K00406L5115l3851
7606E9071L4131R3847j44462n9686r505k3672N0257j0548j9598j1878o0811M428
7594i8426j8580P9633L918J32854P5179j2804N7995j59613j87845l0113l3783
$$ y = [1422215, 1306856, 1210448, 1244318, 1243613, 1222042, 935119, 825741, 892521, 991506, 745312, 790580, 780887, 655000, 719752, 637187, 451049, 515470, 547768, 602046, 643505, 699737, 575148, 464444, 356905, 367125, 337812, 306085, 203825, 277235, 324985, 246257, 225397, 366887, 387061, 363212, 320420, 233607, 244517, 151325, 44863, 223816, 154271, 16458, 110775, -16666, 171954, 201851, 175364, 152354, -2214, -93321, -35807, -27679, -31289, 102422, 64864, 56694, 125005, 220513, 173087, -12825, -173264, -142599, 57807, 92922, 59071, 93202, 187049, 42587, -17099, -26604, -50276, -19, -10567, -30165, -42043, -102854, -98426, -117006, -37373, -33455, 99399, 174578, 161774, 219769, 60156, -127689, -157802, -191585]
7583a91585r275J20318k850q0285L7170Q9296N3687J6625J8796n1622r3121j2662
7571a05508M1817K0314n0596R0928L8076q610J7114J8014k12511p9617Q4993o7304
7559b12890p726M2828l8508M7617K2063n8978L2900O3668j0493m9922R3841p8700
7547a54300J08976l309j27380j36328m2465J11094K9427N4025l1165j0218J10587
7536i1056j0601L4417k2589O5730q4771P239P1242r1632J0253R6556j36355k7579
7524a79146L3576j66158R3982J00769o8203j05169l4193J34807j9624j588N2786
7513a58161K9749J744m2777n9528n2448J43945O2341k10952L9348j4034m8353
7502c09126K9555J4260P0169Q8065Q6751L4579o5480J7716j5017M5560p7761j44895
$$ y = [-191585, -200860, -80542, -83392, -163677, -126507, -37211, 16476, 33101, 51897, 275, -92846, -105508, -63691, -43377, -93973, -3045, 35031, 26421, 43535, 61549, -150962, -230579, -145586, -212890, -220616, -177788, -216296, -168679, -146616, -205594, -172694, -109026, -119519, -169441, -75600, -154300, -45324, -48633, -176013, -312341, -354806, -243712, -214285, -160260, -191425, -201643, -91056, -101657, -67240, -89829, -24099, -108870, -101631, -30389, -122021, -111768, -15212, -151567, -179146, -145570, -311728, -217746, -116977, -185180, -290349, -324542, -189735, -209359, -210947, -158161, -128412, -126668, -169445, -228973, -281421, -137476, -75135, -286087, -246739, -260773, -309126, -279571, -265311, -195142, -107077, -20326, 14253, -51227, -33511, -48528, -2968, -80729, -225624]
7490b25624o7872J15059J63234j26520j49273P0136j2617q6525M2212n1622J1627
7479c17785L9370l6028J08623M8244j63443R8184N8434l4880J4427r4118o3639
7468c42611j21552J4005J57437P8413l1367r3642L6861P6576m0225p4045Q5431
7457b54719k15144J57604J745R576n4994J27756J796L1201p308m6188O0115O9700
7445a18860k8185o9706o6762n4749L7727J2816k2052n3258J01268N1187R2839
7434a17735j36461M8096K1544r0722n5837q4470R9567j2765Q5289J6436k7595
7423b54653j15406k2051J3982L0404o26K685L1840m1844q0740N0821K36934j8278
7411a66932n908J0251r0936p5746j8297J14056Q1983p2702N4678L5244k0077R5558
$$ y = [-225624, -293496, -178437, -15203, -141723, -290996, -220860, -233477, -320002, -277790, -329412, -317785, -278415, -314443, -205820, -157576, -321019, -222835, -164401, -199281, -184854, -278972, -342611, -464163, -450158, -292721, -214308, -245675, -339317, -302456, -225880, -266105, -340150, -254719, -469863, -312259, -310514, -300938, -355932, -228176, -226380, -195179, -202487, -248675, -188560, -118860, -147045, -216751, -283513, -338262, -300535, -287719, -309771, -363029, -261761, -210574, -117735, -254196, -206100, -184556, -275278, -331115, -415585, -316018, -328783, -243494, -227058, -254653, -370059, -392110, -378128, -347724, -348350, -345665, -313825, -355669, -436409, -385588, -148654, -166932, -172840, -162589, -253525, -329271, -347568, -233512, -151529, -224231, -169553, -134309, -154386, -58828]
7399e8828p893p016j09954k3399P9143j67469J16438p0145M4813O9672j20028
7388b54666m601j2477R6404k4144M4431J56397J3491L9733r338j3007j20272k0540
7376a08589J04157J8574n7972j29298L1636J36888M464j12132n3572o0805J17330
7365a09319j5103k34941m6655K10090J07033k4634Q845j45037m5430J41435k8477
7354a82193l2584k7721J2335P9130L1323n360r6266K4234M1946p80l7061m1261
7342b34258p5712j31794J98981P8757r5601k8921l5490J07188k9795r8510n1226
7331c96381J43955J43524j21953J356O3964k6267L0457o3786L1457J24136R7262
7320B7724P1736M2471j0158O1764r5030K1947L6759k7118q9552J5730j12206K4167
$$ y = [-58828, -66721, -73737, -183691, -207090, -127947, -295416, -178978, -249123, -204310, -134638, -254666, -259267, -271744, -175340, -199484, -155053, 1344, 14835, 54568, 45230, 32223, -88049, -108589, -4432, 14142, -43830, -173128, -141492, -4604, -140, -112272, -165844, -226649, -109319, -124422, -359363, -406018, -195928, -88895, -113529, -104684, -249721, -295151, -153716, -182193, -214777, -242498, -230163, -151033, -119710, -125070, -221336, -197102, -155156, -155936, -192997, -234258, -309970, -441764, -242783, -164026, -259627, -288548, -324038, -216850, -246645, -345155, -396381, -252426, -108902, -230855, -229499, -165535, -191802, -161345, -225131, -193674, -69538, 27724, 99460, 141931, 131773, 193537, 98507, 120454, 157213, 130095, 40543, 56273, -55933, -31766]
7308c1766j41823k9691J74956O941r5419m2141R3651K0926m2724M139j46402R4098
7296a35255O5191j48197N9642k906P8422L4042r6490n0445J07872l7916j4307
7285a40347J04610j8162r424j81186J10826L2657l1452k535j12397J39628J48789
7274D1007Q314q0290o5316K975K2817j36132L3387J20554j12431R9174J169j72657
7262b37429P6555k1856m971j12559J45403j5117L9425Q0681j46545j9099J16039
7251i9473j2180j02264r6651L3999j465K4913l2088k2012R4928J6899K5413j78874
7239c48855R9625l7506J49570J38209n8380m6057q1094N7124j20054J14533R1249
7228d1636J58886q8944q4471j15736k0302K754l4059J8372J08748J57502N876
$$ y = [-31766, -173589, -203280, -28324, -21383, -116802, -158943, -65292, -44366, -87090, -82951, -229353, -135255, -70064, -218261, -158619, -161525, -83103, -49061, -145551, -195996, -88124, -126040, -140347, -35737, -53899, -63323, -244509, -133683, -101026, -132478, -135013, -247410, -107782, 41007, 49321, -30969, -96285, -93310, -70493, -206625, -173238, -52684, -165115, -65941, -64772, -237429, -160874, -182730, -187701, -300260, -154857, -169974, -130549, -49868, -196413, -215512, -99473, -111653, -213917, -310568, -276569, -278034, -253121, -285209, -307221, -212293, -195394, -169981, -348855, -249230, -286736, -137166, 1043, -57337, -103394, -184488, -127364, -247418, -132885, -41636, 117250, 28306, -56165, -171901, -192203, -189449, -223508, -205136, -96388, 61114, 66990]
7217F6990k36269L9967J13570j6783j5727p4493J7524L4602Q3563j04029r0682
7206a81767J60379q6154m898Q9001n7944q8590L939J22140K17667p7897r709o351
7194G9816K5709R9028j65365Q2852Q1767p6634j67783J63629J45058j68254j8247
7183H1576P3163l5125L0955N9377K6187j09750r4120m5383p8516J19729K5745
7172E3838m1730n8900R5583P838M4356K7241K8242n0228p1069J38917N2470L606
7160B30164r0162M824K7028l1340J0522R022l1739P8289m6452P0159P2973j0029
7148B93259L5826L2781j32657O1770j8499R7760K17100K03534L06984O43197J008277
7137B749332J339667J110905K47623k33568o28695j052613p80863q47073m14759
$$ y = [66990, -169279, -129312, -15742, -32525, -48252, -122745, -105221, -70619, 12944, -91085, -181767, -21388, -107542, -112440, -23439, -81383, -169973, -166034, -43894, 173773, 95876, 86167, 79816, 105525, 204553, 39188, 122040, 203807, 127173, -40610, 123019, 268077, 99823, 81576, 154739, 119614, 150569, 209946, 236133, 126383, 32263, -13120, -91636, 28093, 53838, 12108, -46792, 48791, 56629, 100985, 128226, 156468, 106240, 35171, 174088, 226558, 230164, 140002, 144826, 171854, 140514, 151036, 160058, 128319, 206608, 160156, 230315, 303288, 293259, 329085, 361866, 229209, 290979, 272480, 370240, 587340, 790874, 1097858, 1741055, 2749332, 4088999, 5199904, 5447527, 5213959, 4585264, 3532651, 2751788, 1904715, 1489956]
7128A489956l65022k58251k50432j21486l3196j29936L6409M2905j3582j11446
7118B85919J52032k420j04788k3515r8395j31344N6396p1753l9675J8462M4094
7107H5013N390n1257l95n4827L256Q3470Q8675L70K1895O7124o9361R430j22501
7094F6282j6844k0383n7232o3891K06850J05419m1341r8903l9105P5764O9988
7083A86604j56354k1125J20563m0931N9309J4136o8382J41163J20278q5048R1337
7072C61550j62146j70123k1284P5775l0586L6578L4633q520J987j34097o3385
7061g9618J14074J6756p9403j83164r249J8663K168Q4231k6364K7806q5789P5986
7049a23903L0771N2539L8970j22931k7058l529K7804J08665R7373k897K5186R7311
$$ y = [1489956, 1124934, 866683, 616251, 494765, 461569, 331633, 368042, 410947, 397365, 285919, 437951, 435531, 330743, 307228, 208833, 77489, 133885, 62132, 22457, 40919, 85013, 90403, 39146, 38751, -16076, -12820, 70650, 159325, 159695, 181590, 248714, 179353, 188783, 66282, 49438, 29055, -28177, -92068, 114782, 220201, 178860, 79957, 40852, 116616, 186604, 30250, 9125, 129688, 88757, 148066, 162202, 93820, 234983, 355261, 270213, 361550, 199404, 29281, 7997, 83772, 53186, 89764, 124397, 115877, 117864, -16233, -79618, 34456, 51212, -28191, -211355, -220604, -201941, -199773, -115542, -141906, -114100, -199889, -123903, -93132, -40593, -1623, -124554, -151612, -155141, -127337, -18672, 78701, 75804, 100990, 198301]
7037A98301l4443p7475j0040j05345J04907Q5815k2053o6957k2343j870N9851
7026A08348J29561j65727J4121J4108M5477k16846j36341J88808N37j0628l3942
7015f2524O931J05230j00225M8450J13347j8883p1771l968l1012L4409N4948m8219
7003B6713J69013L9554o0074q6057r6496r2359l534J71851O1849j67635M5095
6992G920j09204j3222J5012L3940N0336J05584j8083j34559P5899N9546K7428
6981A00597j35439m1891Q9630o0717L370K3095K6735J4564q3754L6566l6484m4731
6969a08459q1765l8909L3850J42300J0102N2013P864j7607o8896o8880O944j1372
6957a42815P7999K500P486J34814n7764j9366M814j8753P928k8934k3772Q2971
$$ y = [198301, 163858, 86383, 76343, -29002, 75905, 161720, 139667, 72710, 50367, 48497, 108348, 237909, 72182, 86303, 100411, 145888, -70958, -207299, -18491, -17954, -28582, -62524, -55593, 49637, -50588, -2138, 111209, 92326, 20555, 16587, -14425, 19984, 74932, 26713, 195726, 235280, 175206, 89149, -7347, -99706, -103240, 68611, 130460, -37175, 7920, -101284, -114506, -99494, -65554, -15218, 90366, 72283, -62276, 13623, 73169, 100597, -34842, -76733, 12897, -47820, -44450, -21355, 5380, 19944, -63810, -27244, -63728, -108459, -190224, -229133, -195283, -52983, -42881, 9132, 16996, -611, -69507, -138387, -131443, -142815, -64816, -62316, -54830, 79984, 22220, 2854, 7668, -11085, -3157, -32091, -55863, 27108]
6945B7108k9020m9978J03375J14966Q2617j36146o6583j34645k4560N0402p5367
6934a37831k3312J32479M4497k4877P2418m3468k6216m5621o4807J07619P3912
6923F4793k5369n5902p3450J30040P2073P245j00855k22866J8706n079O5290j8775
6911a44149l508K7706J10555k0686r766O5280L332K8699j27248Q5680M0280J05103
6899A61278J2237M2819j40970m3017J0847k0525l5202J0921l9136p049m6587O0645
6887c3739J11498J1235n7927l1120K8124N8913p4445q5732M8030M7044N0352J14571
6875A86804o9957j27797J20764q8938q1442p9155N9247j39647J26279Q4677j5922
6864b5087m5217m804L7103m0654Q4794O3758r9861k1658k8726J67120k5846o6184
$$ y = [27108, -1912, -51890, 51485, 166451, 249068, 112922, 46339, -88306, -112866, -62464, -137831, -161143, -28664, 15833, -9044, 63374, 19906, -6310, -51931, -116738, -9119, 64793, 39424, -16478, -89928, 40112, 112185, 119430, 18575, -204291, -185585, -190664, -125374, -144149, -147657, -119951, -9396, -30082, -39848, 25432, 28764, 57463, -69785, 15895, 56175, 161278, 173515, 216334, 75364, 32347, 43194, 22669, -12533, -1612, -40748, -47797, -94384, -33739, 77759, 88994, 31067, -53, 28071, 86984, 12539, -73193, -25163, 21881, 72233, 186804, 116847, -10950, 109814, 20876, -60566, -139721, -80474, -220121, -93842, -9165, -25087, -70304, -75108, -38005, -78659, 6135, 69893, -29968, -51626, -80352, 86768, 60922, -5262]
6852e262M2430n6249r1888J47357j31412k2538Q7175q5800n1270M7482J74993
6841E5018n999q6721p110Q5891K2739p5412K2758m9638p2814k870K1221K4919
6829f8018N7038O3916n9940Q2346P6146M7073N6068j59718o8416P6818M8843l5291
6817A16865R7086j17301q3232p5404R36J50445r6427j8218L8922P7225M0432n182
6805A26147p7446M2695q7243P6676o8144o7949O5301k3520N1125O5633k4168Q4124
6793A63231n3837n7822m0435p5036L6974R3066p1169K5968o0896l401J76283J47837
6781B80763J6184m382q6577o8248M8697J3941o6758L2228J4644o756P587j200
6769A80123n0649o2451Q5414O4605L7276j64156O2796Q0099p3035k3260l6887
$$ y = [-5262, 37168, -19081, -110969, 36388, -95024, -117562, -30387, -116187, -167457, -119975, 55018, 49019, -37702, -44812, 41079, 63818, -11594, 11164, -38474, -111288, -114158, -92937, -68018, -10980, 52936, -7004, 75342, 151488, 198561, 254629, 94911, 26495, 103313, 152156, 116865, 213951, 96650, 13418, -61986, -61050, 89395, -7032, -25250, 13672, 90897, 131329, 126147, 48701, 91396, 4153, 80829, 12685, -55264, 10037, -13483, 37642, 103275, 79107, 163231, 109394, 51572, 11137, -63899, -26925, 66141, -5028, 20940, -39956, -43357, 132926, 280763, 296947, 292565, 205988, 137740, 186437, 200378, 133620, 165848, 180492, 173736, 181323, 180123, 129474, 67023, 152437, 217042, 254318, 90162, 152958, 233057, 160022, 136762, 99875]
6758I9875M1223L7150q9221p3188l2334l7614Q5386K14269K4765m5933o8673m286
6746A51419R5625q0393p8704O7584J6938j8204r598p9532j9200K1691O1912p184
6734A22354O3251K2278O9746M8508j11846K2337m7686J13961j92644o8753J04768
6723A46274p391l9751N3336O607j8245R9695m8218N8441r7548K9195l6821q0742
6711F4832N840J83789m4088j69841M2997Q9158L9722L9621K9228K2570j08295
6700A95533m658q8089N134R3882j26114o373J20674O3717P0789j9365K3250p9155
6688B49225m5567j5920l9196m5988L3193Q8487j4310j19061J01530J1555J3811
6677B17759K27906q6635o4300l4724j39913K8699k0840j58360P1869J5737L1080
$$ y = [99875, 141098, 178248, 89027, 15839, -16495, -54109, 31277, 245546, 270311, 224378, 155705, 151419, 247044, 166651, 87947, 155531, 172469, 154265, 144667, 65135, 45935, 67626, 129538, 122354, 185605, 207883, 277629, 326137, 214291, 236628, 188942, 302903, 110259, 41506, 146274, 138883, 99132, 152468, 159075, 140830, 240525, 192307, 250748, 153200, 182395, 145574, 64832, 70672, 254461, 210373, 40532, 83529, 172687, 212409, 252030, 281258, 303828, 195533, 190875, 102786, 107920, 201802, 75688, 69315, 189989, 253706, 324495, 305130, 328380, 249225, 203658, 187738, 148542, 102554, 135747, 224234, 209924, 90863, 192393, 203948, 217759, 445665, 359030, 294730, 260006, 120093, 148792, 127952, -30408, 41461, 57198, 88278]
6666H8278O9425J17848J9536K0652r4290q3031J2417K9939l3518J82368m5563
6655B84061p1723m0796J14770m2641p8774M5670J47742j08565J08413j20037o2051
6644A76069R359l281M5870J7364J2375m8126K11899L1800J9291o1959o9500l9185
6632C01976p8097k272J10285j7682m5074j01662P8595r5764K0726Q8652R899J7674
6620B87256j04008j648N8649K4156j05558M9234J42261J13935L6668j73549q0493
6609B46903m5377M4221N2967K2742k3691M2001M479K5875j35720N5762K53642
6598E43804o95n7449K4081j47505k5992J07900O9443j7463l3307m9762j78469
6587B34586J51507J6296P316M1715J4636l9518j3254J34086j17540R3272l6983
$$ y = [88278, 157703, 275551, 295087, 315739, 221449, 138418, 150835, 180774, 147256, 329624, 284061, 212338, 171542, 286312, 243671, 164897, 210567, 358309, 249744, 358157, 238120, 176069, 185428, 182147, 228017, 245381, 257756, 209630, 421529, 453329, 472620, 410661, 341161, 301976, 223879, 221607, 331892, 314210, 269136, 167474, 246069, 150305, 171031, 259683, 269582, 287256, 183248, 181600, 240249, 264405, 158847, 208081, 350342, 464277, 500945, 327396, 246903, 201526, 245747, 298714, 321456, 297765, 339766, 344245, 370120, 234400, 290162, 543804, 543109, 485660, 509741, 362236, 336244, 444144, 513587, 496124, 462817, 413055, 234586, 386093, 402389, 409705, 451420, 466056, 426538, 413284, 547370, 429830, 523102, 486119]
6576D86119j42212N2970j2448J02610K8926J17661j00274j19512L7686j14195
6566C37331J00410Q2771L0748j49430O3794q6868M2794R4838k1742J11731k36333
6555C70044J4674j5269m5701p1504R1938M6116K5124J32938J6509n4002m6034
6544D64833M6693j3875q5060L2802K7815O3377J7170J3062k1905L241j44065K0545
6532D24633R93L6069l8930q4660J22100j05208N2678L5178O0280l2342P8860j08829
6520D40822L2378N3969r2578O4485K9792j42167l1870K09749j8942o9846N4008
6509E29800r0627O0837P1776n5319M4291M845J57970j8490k3898O252j4193n6113
6497F17131o3188N3762K835l8305R4990N0924k4251n3172j59609J0779K6857K6357
$$ y = [486119, 343907, 396877, 384429, 487039, 515965, 633626, 533352, 413840, 451526, 337331, 437741, 520512, 551260, 401830, 465624, 378756, 421550, 516388, 494646, 606377, 370044, 384718, 369449, 323748, 252244, 344182, 390298, 415422, 548360, 564869, 510867, 464833, 511526, 497651, 412591, 445393, 473208, 536585, 553755, 566817, 544912, 548153, 404088, 424633, 425626, 461695, 422765, 338105, 460205, 354997, 407675, 442853, 503133, 470791, 549651, 440822, 473200, 527169, 434591, 499076, 528868, 386701, 354831, 564580, 545638, 475792, 529800, 439173, 500010, 571786, 516467, 560758, 565603, 723573, 705083, 681185, 687437, 673244, 617131, 553943, 607705, 610540, 572235, 667225, 718149, 693898, 640726, 481117, 491896, 518753, 545110]
6485E45110L0480k6251Q7179K9310q9723Q4122k3061K1702q0205P3052k6007M5199
6473F70907J7293j19565l0432Q2680J07958J5401K3049j05015l5988J06761r1903
6462F41146l9878m0160Q5856O6129K3891J02276k0553j08326N1705L9586o1486
6451G40186k3642R8749P6159j82717q57n6544J85818J05789J4568N6342j1877
6440A001974K00260l9947o1824N8844Q7868M2795n5129P950O1148q6968q3625
6429A133346J0127N4880j3812Q7283J04060j01600J39782j5282j20141J65131
6419A443774K8807j21889J55787j10427l1795q1933L8718p0133r0792L8843L7711
6408A236671j55771L4173J80408K8353m8286q2594L3406n2253K3913J832R318
$$ y = [545110, 575590, 549339, 636518, 665828, 576105, 660227, 637166, 658868, 578663, 651715, 625708, 670907, 688200, 568635, 538203, 620883, 728841, 744242, 767291, 662276, 626288, 733049, 641146, 601268, 561108, 646964, 713093, 736984, 839260, 818707, 710381, 762086, 801672, 740186, 716544, 815293, 891452, 708735, 707878, 651334, 837152, 942941, 957509, 1013851, 1001974, 1202234, 1162287, 1100463, 1159307, 1247175, 1289970, 1234841, 1242791, 1303939, 1216971, 1133346, 1143473, 1198353, 1184541, 1271824, 1375884, 1274284, 1414066, 1398784, 1278643, 1443774, 1472581, 1350692, 1506479, 1396052, 1364257, 1282324, 1321042, 1250909, 1160117, 1198960, 1236671, 1080900, 1115073, 1295481, 1323834, 1275548, 1192954, 1226360, 1174107, 1198020, 1199852, 1209170]
6397A209170L8704J98938r7685l3713J9637k3988J7126l6199J04053J63517K6916
6386A586476K3074J22525J0284j11856j08731J24658K01320J63421m3330J56867
6376B124708J14933p5909p7818j86525r899K4184J7815J05470p1373J18785Q2439
6365B166810K56442P9614R3807j37253p9864k02091k02325N8525q2180K2029n0243
6354A923271J977m3514M8770p149p9240P0418q0912q9433o0209J00621o4243o3550
6342A656807J6018j59744J19171J02235j25735n1479k138l7669J04438N9510N2303
6331A733717r9956O5868P4288N8494N7353P0323j4940K08822J42359J24923J36165
6320B557416K9243l0303j44331O0952m2325p0250m4347p9062M2008K20664M5880
$$ y = [1209170, 1247874, 1446812, 1349127, 1315414, 1335051, 1311063, 1328189, 1291990, 1396043, 1559560, 1586476, 1609550, 1732075, 1742359, 1630503, 1521772, 1646430, 1847750, 2011171, 1967841, 2124708, 2239641, 2163732, 2085914, 1899389, 1889490, 1913674, 1931489, 2036959, 1965586, 2084371, 2166810, 2423252, 2502866, 2596673, 2459420, 2379556, 2177465, 1975140, 2033665, 1951485, 1973514, 1923271, 1925248, 1881734, 1930504, 1923355, 1844115, 1914533, 1833621, 1744188, 1683979, 1784600, 1720357, 1656807, 1672825, 1513081, 1632252, 1734487, 1608752, 1557273, 1555135, 1517466, 1621904, 1681414, 1733717, 1633761, 1699629, 1773917, 1832411, 1889764, 1960087, 1945147, 2153969, 2296328, 2421251, 2557416, 2586659, 2556356, 2412025, 2472977, 2430652, 2360402, 2316055, 2236993, 2279001, 2499665, 2545545]
6309B545545J28762J35813o9916J9048p2136j10914k37008q2991m8096o2970p0376
6298B074761Q2799L8357K3753Q5757Q5638j10350L853l4823M3526j21151J2042
6287B184162J65840k3008P1305n27j3623J38467J1546k5033j7087J6373j10442
6276B397973j0690m6386J08663P3112r6176N3761Q8685J41754p7736j4200O3704
6265B682464J66198P6143l850J66228p9598j3643l8739J02715Q3042j04901r014
6254C027045l6270J38450J34343N9998J0766M2555Q4256J2419p7545M6210J30782
6243C573009k4628j14846k9818N4514J14144M6630J05634j15433j12761P0751
6233C567196R0989O3946J93057j03806J3026M7254m2523O9166n0310l3024j10074
$$ y = [2545545, 2674307, 2810120, 2740204, 2759252, 2687116, 2576202, 2339194, 2256203, 2208107, 2145137, 2074761, 2157560, 2195917, 2219670, 2305427, 2391065, 2280715, 2284568, 2249745, 2293271, 2172120, 2184162, 2350002, 2326994, 2398299, 2397772, 2384149, 2522616, 2534162, 2509129, 2492042, 2508415, 2397973, 2387283, 2340897, 2449560, 2522672, 2426496, 2480257, 2568942, 2710696, 2632960, 2618760, 2682464, 2848662, 2924805, 2920955, 3087183, 3007585, 2993942, 2955203, 3057918, 3140960, 3036059, 3027045, 2990775, 3129225, 3263568, 3323566, 3334332, 3376887, 3461143, 3473562, 3396017, 3442227, 3573009, 3548381, 3433535, 3403717, 3458231, 3572375, 3619005, 3724639, 3609206, 3496445, 3567196, 3658185, 3722131, 3915188, 3811382, 3824408, 3871662, 3829139, 3898305, 3847995, 3814971, 3704897]
6222C704897N7681P2582k0153N8827j43438J94970R9016J15137N4814l483P5016
6211D265866o2779L0256K6227K2856K52867L068o8995J54022j18001L5448Q3424
6200D624259Q1052J1414l7028J1717J96015O892n0493J15644J21558L2299k1562
6189E091767J68840J55738M7478n6216J02917K11209K18485M6058K0703m436L9184
6178F041727K61880K35331Q546N1566J02183P2300J17438O4796K5909J82352r3832
6167G070196K41775Q9322p8059K27230K71950J63548m1591K30886J46807K85828
6157H607892L00677K48569L63563J47669K70371L21970L75902K43364M74951N09164
6147A1864092M76285L96583M10958N14470N83977P15869O28537Q79754J047736
$$ y = [3704897, 3762578, 3835160, 3815007, 3873834, 3730396, 3925366, 4024382, 4139519, 4194333, 4190850, 4265866, 4203087, 4233343, 4259570, 4282426, 4535293, 4538361, 4469366, 4623388, 4505387, 4540835, 4624259, 4705311, 4716725, 4679697, 4691414, 4887429, 4894321, 4843828, 4959472, 5081030, 5113329, 5091767, 5260607, 5416345, 5463823, 5407607, 5510524, 5721733, 5940218, 5986276, 6006979, 6002543, 6041727, 6303607, 6538938, 6547484, 6599050, 6701233, 6773533, 6890971, 6955767, 6981676, 7164028, 7070196, 7311971, 7401293, 7323234, 7550464, 7822414, 7985962, 7944371, 8175257, 8322064, 8607892, 8908569, 9157138, 9520701, 9668370, 9938741, 10260711, 10636613, 10879977, 11354928, 11864092, 12340377, 12736960, 13147918, 13662388, 14246365, 14962234, 15590771, 16470525, 17518261]
6138A7518261J155231J230602J411845J891449K294533L226074M243613N419782
6130C8391390O748717P183049O900889N393802K909444J87982j763158k462476
6122F3489639k047947j036203N74072K149079L420247L486631K566884L46222
6114G2948624k361671m640785n885459o165154n707200n222006m849687m187659
6106C3929003l533469k826712k384110j878123j436998j118772j105149q50006
6098A8795664n37524n11194m02208l92513l10390k49736l40292k02029j02262
6089A5747516o5242q4590r1789K04740J03327J66768K14101K20229K41125M76427
6079A7132612M66129K84546J45107L16022M27680M54145N10763O98014P71147
$$ y = [17518261, 18673492, 19904094, 21315939, 23207388, 25501921, 28727995, 32971608, 38391390, 45140107, 52323156, 59224045, 64617847, 67527291, 67715273, 65952115, 63489639, 61441692, 60405489, 60979561, 63128640, 66548887, 70035518, 72602402, 72948624, 70586953, 65946168, 60060709, 53895555, 48188355, 42966349, 38116662, 33929003, 30395534, 27568822, 25184712, 23306589, 21869591, 20750819, 19645670, 18795664, 18258140, 17746946, 17344738, 16952225, 16641835, 16392099, 16051807, 15849778, 15747516, 15682274, 15597684, 15505895, 15710635, 15813962, 15980730, 16194831, 16415060, 16656185, 17132612, 17598741, 17883287, 18028394, 18344416, 18772096, 19226241, 19737004, 20435018, 21206165]
6070B1206165J073383J145044J437867J683276J948472K234915K750554L698570
6062C7178246M642576O347735Q287329R681985J0133922Q865651O252355K692958
6054I4082757n53796k767093l421237k564294q10833J187822L048497M478512
6046I2680335L952091K063345j183478m380323p147408q282462q292711q010857
6038F1398532p230093o494335n739844m706608l876380l116304k622025k238028
6030B5374915j815364j462283j441164r25714r58914r55303o12133o91102n04076
6021A6008862m84867o73141n66431l38114l64151m13339k23057l40422k68829
6012A2336511k12062k67544j93584k62776j44879j06213j69617j38162j1765m5481
$$ y = [21206165, 22279548, 23424592, 24862459, 26545735, 28494207, 30729122, 33479676, 37178246, 41820822, 48168557, 56455886, 66137871, 76271793, 85137444, 91389799, 94082757, 93528961, 90761868, 87340631, 84776337, 83965504, 85153326, 88201823, 92680335, 96632426, 98695771, 97512293, 93131970, 85984562, 77702100, 69409389, 61398532, 54168439, 47674104, 41934260, 37227652, 33351272, 30234968, 27612943, 25374915, 23559551, 22097268, 20656104, 19730390, 18771476, 17816173, 17204040, 16512938, 16008862, 15523995, 14850854, 14284423, 13946309, 13582158, 13168819, 12945762, 12605340, 12336511, 12124449, 11856905, 11663321, 11400545, 11255666, 11149453, 10979836, 10841674, 10829909, 10784428]
6002A0784428n0538j51737j77317k66632n4388l9990k91918k19882o9377k05498
5992I257151k62410k12333j00224k06160j33468k14258j25504J05230j19957j3194
5982G974873q7535P4862L9858j55658j25575j18346M0328M7911R8492j22040k63149
5971G404021q5684l257j40592k33865M6535j54811N2389q0396k95265l8165j63725
5960F307185l2395j12717N7409j67519Q9351l9207j5880J52899o4173j09567q0444
5949E984942o124J2768L5122n0264K9727M2977J56508L266K48477m8668L7626
5938F446357J17787M6865M3450r8571L6495J06289p6852r8606m7832l9756j7267
5927F418359j56922N7173O9270j10558j49282n3237K46213R1525J1610j9329P318
$$ y = [10784428, 10733890, 10582153, 10404836, 10138204, 10083816, 10043826, 9751908, 9532026, 9462649, 9257151, 8994741, 8782408, 8682184, 8476024, 8342556, 8128298, 8002794, 8108024, 7988067, 7974873, 7887338, 7962200, 8002058, 7846400, 7720825, 7602479, 7642807, 7690718, 7789210, 7667170, 7404021, 7318337, 7315080, 7174488, 6940623, 6987158, 6832347, 6884736, 6804340, 6509075, 6470910, 6307185, 6274790, 6162073, 6219482, 6051963, 6141314, 6102107, 6086227, 6239126, 6174953, 6065386, 5984942, 5978818, 5991586, 6026708, 5976444, 6006171, 6049148, 6205656, 6208922, 6457399, 6408731, 6446357, 6564144, 6611009, 6654459, 6555888, 6592383, 6698672, 6621820, 6523214, 6475382, 6435626, 6418359, 6261437, 6318610, 6387880, 6277322, 6128040, 6074803, 6321016, 6412541, 6424151, 6404822, 6412140]
5916F412140n710K7117J5502K14785J02138J33481J29465M8010J67021K52567
5906G496516J55372P8260J54887M3854L5922j85646j08047l21345k16844n6571
5896G076358m4505l8562k06554j28287r7584K16587K3887M9235J39159J06901
5886G096635K01415J15794J75202J18992n5561k01061J46957J3601n2418Q3693
5876G643249K00021J28425K92694J14236P4512J0185j17830Q020J07356N4933
5866H515801Q4081J6652m8885J44254N4188J14446J69767j06796P8429K66275
5856I288212J55132J25985J56428K09084K92439L52358K71432M71809K93225L72191
5846A1988295J76426L26665K43617J16146K02106K10494K57124L24078M67205
$$ y = [6412140, 6406430, 6433547, 6449049, 6663834, 6765972, 6899453, 7028918, 7076928, 7243949, 7496516, 7651888, 7730148, 7885035, 7928889, 7964811, 7779165, 7671118, 7349773, 7132929, 7076358, 7031853, 6993291, 6786737, 6658450, 6560866, 6777453, 6801340, 6850575, 6989734, 7096635, 7298050, 7413844, 7589046, 7708038, 7652477, 7451416, 7598373, 7611974, 7559556, 7643249, 7843270, 7971695, 8264389, 8378625, 8453137, 8463322, 8345492, 8353512, 8460868, 8515801, 8599882, 8616534, 8567649, 8711903, 8766091, 8880537, 9050304, 8943508, 9021937, 9288212, 9443344, 9569329, 9725757, 9934841, 10227280, 10579638, 10851070, 11322879, 11616104, 11988295, 12164721, 12491386, 12735003, 12851149, 13053255, 13263749, 13520873, 13844951, 14312156]
5837A4312156L14584K56092J31799K28762K9143M8783L40575K58994K34615K96592
5827A6452095J86994L67279J85324J03352P419j8539p0827q1949N7213K45023
5817A7433384O9521K332o3759q7566l28874l34001l34793n05078l10300K0248
$$ y = [14312156, 14626740, 14882832, 15014631, 15243393, 15272536, 15321319, 15661894, 15920888, 16155503, 16452095, 16639089, 17006368, 17191692, 17295044, 17302463, 17283924, 17213097, 17131148, 17188361, 17433384, 17502905, 17505237, 17441478, 17353912, 17025038, 16691037, 16356244, 15851166, 15540866, 15561114]
$$ [...]
##END NTUPLES=NMR SPECTRUM
##END=
