##TITLE=1H_DE-80H_X3
 200.13MHz, d2o
 8 sc
 
 19ns.26.2.2025
##JCAMPDX= 6.0         $$ Bruker NMR JCAMP-DX V2.0
##DATA TYPE= NMR SPECTRUM
##DATA CLASS= NTUPLES
##ORIGIN= UXNMR, Bruker Analytische Messtechnik GmbH
##OWNER= pz
$$ XWIN-NMR		Version 3.5
$$ Fri Dec  5 11:20:15 2025 Russian Standard Time (UT+4h)  Yarkov@DPX200
##.OBSERVE FREQUENCY= 200.1313
##.OBSERVE NUCLEUS= ^1H
##.ACQUISITION MODE= SIMULTANEOUS
##.ACQUISITION SCHEME= undefined
##.AVERAGES= 8
##.DIGITISER RES= 18
##SPECTROMETER/DATA SYSTEM= spect
##.PULSE SEQUENCE= zg30
##.SOLVENT NAME= CDCl3
##.SHIFT REFERENCE= (INTERNAL, CDCl3, 0, 15.4747)
##AUDIT TRAIL= $$ (NUMBER, WHEN, WHO, WHERE, WHAT)
$$ ##TITLE= Audit trail, XWIN-NMR		Version 3.5
$$ ##JCAMPDX= 5.01
$$ ##ORIGIN= Bruker BioSpin GmbH
$$ ##OWNER= Yarkov
$$ C:/Bruker/XWIN-NMR/data/yarkov2/nmr/H-C/1/pdata/1/auditp.txt
$$ ##AUDIT TRAIL=  $$ (NUMBER, WHEN, WHO, WHERE, WHAT)
(   1,<2025-12-05 11:19:09.85 +0400>,<Yarkov>,<DPX200>,
      <created by zg, POWCHK disabled, PULCHK disabled
       configuration hash MD5:
       00 E9 B6 7A A2 85 ED C7 34 08 36 98 17 FE 4E 26
       data hash MD5: 16K
       8C 54 82 B0 C5 B3 69 62 7C B5 92 70 11 87 1A 24>)
(   2,<2025-12-05 11:19:19.32 +0400>,<Yarkov>,<DPX200>,
      <Start of raw data processing
       efp BC_mod = 2 LB = 0.25 FT_mod = 6 PKNL = 1 PHC0 = -5312.553 PHC1 = 20.22191 SI = 16K 
       data hash MD5: 16K
       4B 87 3E 54 12 A7 7E 58 08 15 CA F3 CC 53 0E 42>)
$$ ##END=
$$ 
$$ hash MD5
$$ 1C B3 BD F6 01 40 FA B1 57 69 CB 19 1F 4A AB B2
##$RELAX= 
##$RELAX= 
##$RELAX= 
##$RELAX= 
##$RELAX= 
##$RELAX= 
$$ Bruker specific parameters
$$ --------------------------
##$DU= <C:/Bruker/XWIN-NMR>
##$EXPNO= 1
##$NAME= <H-C>
##$PROCNO= 1
##$TYPE= <nmr>
##$USER= <yarkov2>
##$AMP= (0..31)
100 100 100 100 100 100 100 100 100 100 100 100 100 100 100 100 100 100 
100 100 100 100 100 100 100 100 100 100 100 100 100 100 
##$AQSEQ= 0
##$AQ_mod= 1
##$AUNM= <au_zg>
##$AUTOPOS= <>
##$BF1= 200.13
##$BF2= 200.13
##$BF3= 200.13
##$BF4= 200.13
##$BF5= 200.13
##$BF6= 200.13
##$BF7= 200.13
##$BF8= 200.13
##$BYTORDA= 1
##$CFDGTYP= 0
##$CFRGTYP= 5
##$CHEMSTR= <none>
##$CNST= (0..31)
1 1 145 1 1 1 1 1 1 1 1 1 1 1 1 1 1 1 1 1 1 1 1 1 1 1 1 1 1 1 1 1 
##$CPDPRG= <>
##$CPDPRG1= <>
##$CPDPRG2= <>
##$CPDPRG3= <>
##$CPDPRG4= <mlev>
##$CPDPRG5= <mlev>
##$CPDPRG6= <mlev>
##$CPDPRG7= <mlev>
##$CPDPRG8= <mlev>
##$CPDPRGB= <>
##$CPDPRGT= <>
##$D= (0..31)
0 0.7 0 0 0 0 0 0 0 0 0 0.03 0 0 0 0 0 0 0 0 0 0 0 0 0 0 0 0 0 0 0 0 
##$DATE= 1764919149
##$DBL= (0..7)
120 120 120 120 120 120 120 120 
##$DBP= (0..7)
150 150 150 150 150 150 150 150 
##$DBP07= 0
##$DBPNAM0= <>
##$DBPNAM1= <>
##$DBPNAM2= <>
##$DBPNAM3= <>
##$DBPNAM4= <>
##$DBPNAM5= <>
##$DBPNAM6= <>
##$DBPNAM7= <>
##$DBPOAL= (0..7)
0.5 0.5 0.5 0.5 0.5 0.5 0.5 0.5 
##$DBPOFFS= (0..7)
0 0 0 0 0 0 0 0 
##$DE= 6
##$DECBNUC= <off>
##$DECIM= 32
##$DECNUC= <off>
##$DECSTAT= 4
##$DIGMOD= 1
##$DIGTYP= 9
##$DL= (0..7)
0 120 120 120 120 120 120 120 
##$DP= (0..7)
$$ [...]
##$SUBNAM2= <"">
##$SUBNAM3= <"">
##$SUBNAM4= <"">
##$SUBNAM5= <"">
##$SUBNAM6= <"">
##$SUBNAM7= <"">
##$SUBNAM8= <"">
##$SUBNAM9= <"">
##$SW= 18.0517328524113
##$SWIBOX= (0..15)
0 0 2 0 0 0 0 0 0 0 0 0 0 0 0 0 
##$SW_h= 3612.71676300578
##$TD= 16384
##$TD0= 1
##$TE= 0
##$TE2= 300
##$TE3= 300
##$TEG= 300
##$TL= (0..7)
0 120 120 120 120 120 120 120 
##$TP= (0..7)
150 150 150 150 150 150 150 150 
##$TP07= 0
##$TPNAME0= <>
##$TPNAME1= <>
##$TPNAME2= <>
##$TPNAME3= <>
##$TPNAME4= <>
##$TPNAME5= <>
##$TPNAME6= <>
##$TPNAME7= <>
##$TPOAL= (0..7)
0.5 0.5 0.5 0.5 0.5 0.5 0.5 0.5 
##$TPOFFS= (0..7)
0 0 0 0 0 0 0 0 
##$TUNHIN= 0
##$TUNHOUT= 0
##$TUNXOUT= 0
##$USERA1= <user>
##$USERA2= <user>
##$USERA3= <user>
##$USERA4= <user>
##$USERA5= <user>
##$V9= 5
##$VALIST= <valist>
##$VCLIST= <CCCCCCCCCCCCCCC>
##$VD= 0
##$VDLIST= <DDDDDDDDDDDDDDD>
##$VPLIST= <PPPPPPPPPPPPPPP>
##$VTLIST= <TTTTTTTTTTTTTTT>
##$WBST= 1024
##$WBSW= 4
##$XGAIN= (0..3)
0 0 0 0 
##$XL= 0
##$YL= 0
##$YMAX_a= 161877
##$YMIN_a= -141850
##$ZGOPTNS= <>
##$ZL1= 120
##$ZL2= 120
##$ZL3= 120
##$ZL4= 120
##$ABSF1= 0
##$ABSF2= 0
##$ABSG= 0
##$ABSL= 0
##$ALPHA= 0
##$AQORDER= 0
##$ASSFAC= 0
##$ASSFACI= 0
##$ASSFACX= 0
##$ASSWID= 0
##$AUNMP= <proc_1d>
##$AZFE= 0.1
##$AZFW= 0.1
##$BCFW= 0
##$BC_mod= 2
##$BYTORDP= 0
##$COROFFS= 0
##$CY= -3
##$DATMOD= 1
##$DC= 0
##$DFILT= <>
##$DTYPP= 0
##$F1P= 0
##$F2P= 0
##$FCOR= 1
##$FTSIZE= 16384
##$FT_mod= 6
##$GAMMA= 0
##$GB= 0
##$INTBC= 1
##$INTSCL= 3.241238e-09
##$ISEN= 128
##$LB= 0.25
##$LEV0= 0
##$LPBIN= 0
##$MAXI= 10000
##$MC2= 0
##$MEAN= 0
##$ME_mod= 0
##$MI= 1.114404
##$NCOEF= 0
##$NC_proc= -7
##$NLEV= 6
##$NOISF1= 3.799351
##$NOISF2= 2.8
##$NSP= 0
##$NTH_PI= 0
##$NZP= 0
##$OFFSET= 15.47474
##$PC= 1
##$PHC0= -5312.553
##$PHC1= 20.22191
##$PH_mod= 1
##$PKNL= yes
##$PPARMOD= 0
##$PSCAL= 0
##$PSIGN= 0
##$REVERSE= no
##$SF= 200.130009397466
##$SI= 16384
##$SIGF1= 3
##$SIGF2= 2
##$SINO= 0.751879
##$SIOLD= 32768
##$SREGLST= <19F.Aceton>
##$SSB= 0
##$STSI= 16384
##$STSR= 0
##$SW_p= 3612.71676300578
##$SYMM= 0
##$S_DEV= 0
##$TDeff= 16384
##$TDoff= 0
##$TI= <>
##$TILT= no
##$TM1= 0
##$TM2= 0
##$TOPLEV= 0
##$USERP1= <user>
##$USERP2= <user>
##$USERP3= <user>
##$USERP4= <user>
##$USERP5= <user>
##$WDW= 1
##$XDIM= 16384
##$YMAX_p= 281365620
##$YMIN_p= -989707
$$ End of Bruker specific parameters
$$ ---------------------------------
##NTUPLES= NMR SPECTRUM
##VAR_NAME=  FREQUENCY,     SPECTRUM/REAL,   SPECTRUM/IMAG
##SYMBOL=    X,             R,               I
##VAR_TYPE=  INDEPENDENT,   DEPENDENT,       DEPENDENT
##VAR_FORM=  AFFN,          ASDF,            ASDF
##VAR_DIM=   16384,         16384,           16384
##UNITS=     HZ,            ARBITRARY UNITS, ARBITRARY UNITS
##FACTOR=    0.220516191357247, 1,           1
##FIRST=     3096.9598673033, 0,             0
##LAST=      -515.756895702478, 0,           0
##MIN=       -515.756895702478, -989707,     0
##MAX=       3096.9598673033, 281365620,     0
$$ Real data points
##PAGE= N=1
##DATA TABLE= (X++(R..R)), XYDATA
$$ [...]
$$ plain form
12022 483983 374776 381372 372987 399381 465725 538746 593885 503549 460753 412386 297986
12011 297986 419987 398366 429731 542027 447556 446250 508693 525934 504876 571697 453096
12000 453096 531888 500668 482005 497771 562180 509827 447003 445951 382382 448632 443011 553848
11988 553848 633363 590065 553380 531499 564154 557087 545004 441151 424512 447290 463026
11977 463026 500420 585154 607951 594364 454545 477783 532980 365207 502746 564816 487442
11966 487442 550136 458596 463309 484389 428273 436529 537076 480786 526751 558499 555140 515379
11954 515379 536016 490426 513236 572729 478351 381812 500142 569095 477655 408700 330290
11943 330290 199363 263138 440000 424506 514700 512054 539152 448304 455316 364869 567527
$$ packed form
12022D83983j09207O596q385K6394O6344P3021N5139r0336m2796m8367j14400
12011B97986J22001k1621L1365J12296r4471j306O2443J7241k1058O6821j18601
12000D53096P8792l1220j8663J5766O4409n2353o2824j052o3569O6250n621J10837
11988E53848P9515m3298l6685k1881L2655p067j2083j03853j6639K2778J5736
11977D63026L7394Q4734K2797j3587j39819K3238N5197j67773J37539O2070p7374
11966D87442O2694r1540M713K1080n6116Q256J00547n6290M5965L1748l359l9761
11954E15379K0637m5590K2810N9493r4378r6539J18330O8953r1440o8955p8410
11943C30290j30927O3775J76862j5494R0194k646K7098r0848P012r0447K02658
$$ plain form
11932 567527 599927 502744 495035 592956 545811 515348 514870 398956 340638 444240 493245 365757
11920 365757 409854 509326 633595 475266 495462 536274 564356 540050 482578 541758 495173
11909 495173 530843 437756 380758 324587 551692 604146 597484 587711 422590 389501 429586
11898 429586 527934 649063 652610 570891 473807 399075 516894 466688 516616 560578 474381
11887 474381 510751 518040 506999 565310 612183 540153 510472 467027 610452 652809 489079
11876 489079 345080 493927 565963 401403 478572 505352 439626 467091 578044 516683 565008
11865 565008 554195 567951 559554 514571 555102 535721 446664 536778 442267 367691 436993 567443
11853 567443 585886 590809 670409 598690 644491 688561 584598 585262 530532 637714 581110 633303
$$ packed form
11932E67527L2400r7183p709R7921m7145l0463m78j15914n8318J03602M9005j27488
11920C65757M4097R9472J24269j58329K0196M0812K8082k4306n7472N9180m6585
11909D95173L5670r3087n6998n6171K27105N2454o662r773j65121l3089M0085
11898D29586R8348J21129L547q1719r7084p4732J17819n0206M9928M3962q6197
11887D74381L6370P289j1041N8311M6873p2030k9681m3445J43425M2357j63730
11876D89079j43999J48847P2036j64560P7169K6780o5726K7465J10953o1361M8325
11865E65008j0813J3756q397m4983M0531j9381q9057R0114r4511p4576O9302J30450
11853E67443J8443M923P9600p1719M5801M4070j03963O64n4730J07182n6604N2193
$$ plain form
11841 633303 581128 506560 463442 450144 533971 585790 635769 573320 560421 576612 617433
11830 617433 624538 644671 511532 402175 529748 571419 563657 639605 633875 639479 691140 669661
11818 669661 567082 543951 523300 616208 639790 623294 585629 560430 578160 560985 637159
11807 637159 571037 548417 494523 527585 573505 591265 695083 689238 645759 555935 477803
11796 477803 500845 488194 386761 423195 426157 391953 607829 622859 533803 633406 458506
11785 458506 312056 322218 377709 528379 446681 425767 480914 497256 510703 506497 538515
11774 538515 628004 635988 592135 573007 524972 484434 406501 516117 535621 492372 351880
11763 351880 501793 524285 324511 253081 502966 427951 457822 641650 723106 574663
$$ packed form
11841F33303n2175p4568m3118j3298Q3827N1819M9979o2449j2899J6191M0821
11830F17433P105K0133j33139j09357J27573M1671p762P5948n730N604N1661k1479
11818F69661j02579k3131k0651R2908K3582j6496l7665k5199J7730j7175P6174
11807F37159o6122k2620n3894L3062M5920J7760J03818n845m3479q9824p8132
11796D77803K3042j2651j01433L6434K962l4204K15876J5030q9056R9603j74900
11785D58506j46450J0162N5491J50670q1698k0914N5147J6342J3447m206L2018
11774E38515Q9489P984m3853j9128m8035m0538p7933J09616J9504m3249j40492
11763C51880J49913K2492j99774p1430K49885p5015K9871J83828Q1456j48443
$$ plain form
11753 574663 549792 659835 538277 533973 535651 616272 543895 495327 554780 459340 511305
11742 511305 559339 510220 481800 476866 416290 442577 548718 493287 389575 525515 577259
11731 577259 487503 455172 503115 500949 519289 555594 628788 692475 579418 594150 618205
11720 618205 641647 663393 528544 523779 662299 529921 517041 566758 624497 577829 570225
11709 570225 490541 529367 598329 617136 481832 578595 558807 610520 709023 519070 537413
11698 537413 562875 581928 597152 697989 794515 738263 556401 611741 647564 563351 520031
11687 520031 490007 559320 561810 456567 400499 551480 689629 549239 480358 394238 330598
11676 330598 490823 606230 491744 481237 629433 579755 556767 586505 642081 755029
$$ packed form
11753E74663k4871J10043j21558m304J678Q0621p2377m8568N9453r5440N1965
11742E11305M8034m9119k8420m934o0576K6287J06141n5431j03712J35940N1744
11731E77259q9756l2331M7943k166J8340L6305P3194O3687j13057J4732K4055
11720F18205K3442K1746j34849m765J38520j32378j2880M9717N7739m6668p604
11709E70225p9684L8826O8962J8807j35304R6763j9788N1713R8503j89953J8343
11698E37413K5462J9053J5224J00837R6526n6252j81862N5340L5823q4213m3320
11687E20031l0024O9313K490j05243n6068J50981J38149j40390o8881q6120o3640
11676C30598J60225J15407j14486j0507J48196m9678k2988K9738N5576J12948
$$ plain form
11666 755029 699892 588860 571644 569540 536955 568478 522785 528824 548239 662755 732975
11655 732975 552639 466668 475621 585822 574541 596595 636490 519040 592988 646292 514485
11644 514485 456262 433612 496931 497436 400265 357538 435948 536769 700975 603924 385690
11633 385690 404213 530969 483109 549442 566112 510370 453218 508438 518720 402765 484657
11622 484657 498694 411202 453365 546694 535134 566385 740532 676945 511700 604755 458801
11611 458801 441159 537460 538670 485468 567234 566551 566068 543968 593064 640787 635100 631371 498879
11598 498879 358481 546940 726079 703890 785255 723163 591732 447169 491877 600000
11588 600000 568084 582286 593128 614160 636898 567556 524317 591747 575163 490667 624802
$$ packed form
11666G55029n5137j11032j7216k104l2585L1523m5693O039J9415J14516P0220
11655G32975j80336q5971Q953J10201j1281K2054L9895j17450P3948N3304j31807
11644E14485n8223k2650O3319N05r7171m2727P8410J00821J64206r7051k18234
11633C85690J8523J26756m7860O6333J6670n5742n7152N5220J0282j15955Q1892
11622D84657J4037q7492M2163R3329j1560L1251J74147o3587j65245R3055j45954
11611D58801j7642R6301J210n3202Q1766o83m83k2100M9096M7723n687l729j32492
11598D98879j40398J88459J79139k2189Q1365o2092j31431j44563M4708J08123
11588F00000l1916J4202J0842K1032K2738o9342m3239O7430j6584q4496J34135
$$ plain form
11577 624802 614598 583052 608943 535792 480819 514592 436840 417966 452857 515928 493389
11566 493389 485369 535622 471658 431784 577891 598531 588558 521633 414330 440512 460571
11555 460571 509017 490722 531947 488264 599591 578805 596318 649762 538738 480431 411350
11544 411350 429874 429919 487220 595635 677690 667594 599847 579067 575906 674450 649170 548832
11532 548832 633481 591413 586886 628846 653843 655232 593203 506975 590624 565789 427496 408998
11520 408998 292615 453857 527357 635164 616331 611490 741236 703418 550037 531517 453441
11509 453441 525011 628406 544128 446653 470060 546664 492073 518376 475496 470083 446101
11498 446101 417192 585591 735169 707550 609010 614612 683932 624023 687027 639052 579389
$$ packed form
11577F24802j0204l1546K5891p3151n4973L3773p7752j8874L4891O3071k2539
11566D93389q020N0253o3964l9874J46107K0640r973o6925j07303K6182K0059
11555D60571M8446j8295M1225m3683J11327k0786J7513N3444j11024n8307o9081
11544D11350J8524M5N7301J08415Q2055j0096o7747k0780l161R8544k5280j00338
11532E48832Q4649m2068m527M1960K4997J389o2029q6228Q3649k4835j38293j8498
11520D08998j16383J61242P3500J07807j8833m841J29746l7818j53381j8520p8076
11509D53441P1570J03395q4278r7475K3407P6604n4591K6303m2880n413k3982
11498D46101k8909J68399J49578k7619r8540N602O9320n9909O3004m7975n9663
$$ plain form
11487 579389 480539 554450 571299 420858 515899 558346 438825 428640 524359 517530 475986
11476 475986 604996 570153 484905 611119 503388 291418 410863 539589 444525 444460 467517
11465 467517 671598 705444 692777 777329 758110 582511 630618 533437 474315 501691 423564
11454 423564 440745 440744 448129 390902 436682 475803 490869 557836 545945 431659 284287 299412
11442 299412 403080 570508 675771 616570 592048 534302 639326 643360 581561 634373 606949
11431 606949 737318 781430 840775 639365 480918 685687 632606 578172 590310 557090 525764
11420 525764 527380 511468 635252 601487 673467 626870 697310 639231 554773 602871 515050
11409 515050 507981 692336 744846 604057 556952 613177 682223 496323 370558 470668 449899
$$ packed form
11487E79389r8850P3911J6849j50441R5041M2447j19521j0185R5719o829m1544
11476D75986J29010l4843q5248J26214j07731k11970J19445J28726r5064o5K3057
11465D67517K04081L3846j2667Q4552j9219j75599M8107r7181n9122K7376p8127
11454D23564J7181jP385n7227M5780L9121J5066O6967j1891j14286j47372J5125
11442B99412J03668J67428J05263n9201k4522n7746J05024M034o1799N2812k7424
11431F06949J30369M4112N9345k01410j58447K04769n3081n4434J2138l3220l1326
11420E25764J616j5912J23784l3765P1980m6597P0440n8079q4458M8098q7821
11409E15050p069J84355N2510j40789m7105N6225O9046j85900j25765J00110k0769
$$ plain form
11398 449899 472532 539886 502661 453739 381529 424179 612665 566521 568382 605276 514542
11387 514542 593336 624242 567452 698708 527032 388643 447013 386040 450759 519113 556619
11376 556619 419059 437641 485433 572458 596394 681683 715174 483790 466256 573821 549843
11365 549843 573850 625732 611168 491739 620272 700291 572896 436174 442306 542526 505198
11354 505198 487361 488902 627076 719949 638979 640505 586615 688279 593407 646046 637785 552884
11342 552884 694027 603205 534081 547871 589510 655952 665428 622624 640025 479204 493698
11331 493698 642026 682251 839172 726826 686072 740868 672599 731570 528971 527376 478258
11320 478258 420110 394959 399944 368088 497827 618446 546186 483714 679841 661161 581372
$$ packed form
11398D49899K2633O7354l7225m8922p2210M2650J88486m6144J861L6894r0734
11387E14542P8794L0906n6790J31256j71676j38389N8370o0973O4719O8354L7506
11376E56619j37560J8582M7792Q7025K3936Q5289L3491k31384j7534J07565k3978
11365E49843K4007N1882j4564j19429J28533Q0019j27395j36722O132J00220l7328
11354E05198j7837J541J38174R2873q0970J526n3890J01664r4872N2639q261q4901
11342E52884J41143r0822o9124J3790M1639O6442R476m2804J7401j60821J4494
11331D93698J48328M0225J56921j12346m0754N4796o8269N8971k02599j595m9118
11320D78258n8148k5151M985l1856J29739J20619p2260o2472J96127j8680p9789
$$ plain form
11309 581372 666101 747809 617632 574562 686201 814033 651979 401149 672057 774146
11299 774146 674496 535860 548238 496787 543853 656926 711635 676741 723819 671070 708940
11288 708940 538051 484206 464562 537266 601391 535211 563481 590108 663827 744204 679627
11277 679627 546161 468167 501035 590439 719901 773938 725114 681303 627345 609329 714457
11266 714457 705530 593001 668602 795464 610804 520591 470168 487948 498243 498205 535242 480999
11254 480999 433794 413295 414183 347049 461770 589004 570249 406383 556353 519990 474146
11243 474146 425010 540246 514383 445987 403833 528797 643212 605755 661553 462335 474296
11232 474296 542548 641127 496799 486513 623393 590537 649434 609829 596462 544796 673897
$$ packed form
11309E81372Q4729Q1708j30177m3070J11639J27832j62054k50830K70908J02089
11299G74146r9650j38636J2378n1451M7066J13073N4709l4894M7078n2749L7870
11288G08940j70889n3845j9644P2704O4125o6180K8270K6627P3719Q0377o4577
11277F79627j33466p7994L2868Q9404J29462N4037m8824m3811n3958j8016J05128
11266G14457q927j12529P5601J26862j84660r0213n0423J7780J0295l8L7037n4243
11254D80999m7205k0499Q88o7134J14721J27234j8755j63866J49970l6363m5844
11243D74146m9136J15236k5863o8396m2154J24964J14415l7457N5798j99218J1961
11232D74296O8252R8579j44328j0286J36880l2856N8897l9605j3367n1666J29101
$$ plain form
11221 673897 622939 682399 554486 615557 630079 602372 619327 582002 560343 532948 599510
11210 599510 676815 596272 615828 742999 614961 705692 759004 671710 605015 596296 612918
11199 612918 642386 580062 663983 749086 657841 619791 677415 836312 729887 531567 556397
11188 556397 463900 594474 565101 405784 426112 479500 458582 563608 603826 647797 639083
11177 639083 667204 625053 476998 413388 494108 559198 560107 590133 610930 611291 566894 428448
11165 428448 510115 567986 608276 574980 619317 540815 520808 540523 666771 662434 621715
11154 621715 622758 529476 630326 730842 667880 605021 679846 704649 634154 751682 704049
11143 704049 589100 640528 653101 547947 614795 579272 599279 612555 577657 649193 559603
$$ packed form
11221F73897n0958N9460j27913O1071J4522k7707J6955l7325k1659k7395O6562
11210E99510P7305q0543J9556J27171j28038R0731N3312q7294o6695q719J6622
11199F12918K9468o2324Q3921Q5103r1245l8050N7624J58897j06425j98320K4830
11188E56397r2497J30574k9373j59317K0328N3388k0918J05026M0218M3971q714
11177F39083K8121m2151j48055o3610Q0720O5090R09L0026K0797L61m4397j38446
11165D28448Q1667N7871M0290l3296M4337p8502k0007J9715J26248m337m0719
11154F21715J043r3282J00850J00516o2962o2859P4825K4803p0495J17528m7633
11143G04049j14949N1428J2573j05154O6848l5523K0007J3276l4898P1536q9590
$$ plain form
11132 559603 570038 648640 721224 604565 636290 631400 602802 573878 663057 482811 473052
11121 473052 502475 599886 701948 722777 600570 587294 538502 504417 516111 466833 565661
11110 565661 606647 615890 574207 449867 513842 499612 504573 458059 479016 570171 629262 613121
11098 613121 666124 659914 657684 636669 563946 495331 556942 625384 708619 766857 762587 697456
11086 697456 677114 651060 691954 618568 591788 544673 530006 477588 529106 674572 687527
11075 687527 607773 557848 598866 642090 759919 676892 613824 557863 616500 574598 737293
11064 737293 723893 690644 701973 661407 719021 702219 740390 647428 540240 477328 564588
11053 564588 541825 497548 611516 620777 616742 608047 570641 607969 833048 747137 690250 550533
$$ packed form
11132E59603J0435P8602P2584j16659L1725m890k8598k8924Q9179j80246r759
11121D73052K9423R7411J02062K0829j22207j3276m8792l4085J1694m9278R8828
11110E65661M0986R243m1683j24340O3975j4230M961m6514K0957R1155N9091j6141
11098F13121N3003o210k230k1015p2723o8615O1611O8442Q3235N8238m270o5131
11086F97456k0342k6054M0894p3386k6780m7115j4667n2418N1518J45466J2955
11075F87527p9754m9925M1018M3224J17829q3027o3068n5961N8637m1902J62695
11064G37293j3400l3249J1329m0566N7614j6802L8171r2962j07188o2912Q7260
11053E64588k2763m4277J13968R261m035q695l7406L7328K25079q5911n6887j39717
$$ plain form
11041 550533 474920 436818 458247 361919 439148 619205 758242 848117 776633 538162 506240
11030 506240 606664 672997 675115 680806 683667 624022 610409 538022 464642 403372 477972 501247
11018 501247 629739 694083 552383 587661 624777 760631 735724 730189 659090 500530 595653
11007 595653 690393 704713 745928 574883 516743 558200 643214 652837 652814 682882 715100 663037
10995 663037 530660 587292 576531 725192 646960 575614 687724 669560 560736 564532 584547
10984 584547 515667 456439 471716 446690 641278 789045 652481 684398 712122 592405 495824
10973 495824 569544 611224 642208 638118 558606 534663 588818 495986 403060 567773 414020
10962 414020 366288 594381 660718 587101 526902 582245 605606 588836 590874 623084 540325
$$ packed form
11041E50533p5613l8102K1429r6328P7229J80057J39037Q9875p1484k38471l1922
11030E06240J00424O6333K118N691K861n9645j3613p2387p3380o1270P4600K3275
11018E01247J28492O4344j41700L5278L7116J35854k4907n535p1099j58560R5123
11007E95653R4740J4320M1215j71045n8140M1457Q5014R623k3L0068L2218n2063
10995F63037j32377N6632j0761J48661p8232p1346J12110j8164j08824L796K0015
10984E84547o8880n9228J5277k5026J94588J47767j36564L1917K7724j19717r6581
10973D95824P3720M1680L0984m090p9512k3943N4155r2832r2926J64713j53753
10962D14020m7732K28093O6337p3617o0199N5343K3361j6770K038L2210q2759
$$ plain form
10951 540325 620355 550059 529612 585283 538623 678676 557520 524302 531309 553175 713356
10940 713356 638311 599087 628883 632460 732769 627674 602052 691101 767156 717472 688336
10929 688336 702916 674151 663379 756991 679268 574845 703281 622657 574580 618715 630174
10918 630174 589540 645173 775088 777004 770501 653462 639473 667648 603383 506823 564908
10907 564908 456764 446891 646854 718148 696416 675894 582068 597577 524901 502970 530844
10896 530844 523573 600899 658608 699320 792866 609608 723001 808428 633527 603765 685819
10885 685819 739543 690777 621211 572367 598151 520020 523776 470578 537097 612500 582860 578952
10873 578952 680685 740207 678127 812744 783969 777899 704547 634146 527939 469346 552208
$$ packed form
10951E40325Q0030p0296k0447N5671m6660J40053j21156l3218P007K1866J60181
10940G13356p5045l9224K9796L577J00309j05095k5622Q9049P6055m9684k9136
10929F88336J4580k8765j0772R3612p7723j04423J28436q0624m8077M4135J1459
10918F30174m0634N5633J29915J916o503j17039j3989K8175o4265r6560N8085
10907E64908j08144r873J99963P1294k1732k0522r3826J5509p2676k1931K7874
10896E30844p271P7326N7709M0712R3546j83258J13393Q5427j74901k9762Q2054
10885F85819N3724m8766o9566m8844K5784p8131L756n3198O6519P5403k9640l908
10873E78952J01733N9522o2080J34617k8775o070p3352p0401j06207n8593Q2862
$$ plain form
10862 552208 694239 810931 611092 534320 473622 540327 625532 739613 654929 590421 617396
10851 617396 698441 658635 652169 701917 812374 762323 812015 848442 772346 640476 608553
10840 608553 706419 654779 665270 707834 793197 658078 643447 708014 595394 516903 541291
10829 541291 624978 732408 738940 635717 604723 545434 547764 584646 602211 588397 655275
10818 655275 667110 624160 738562 775780 625669 577771 594738 623593 589755 571942 721729
10807 721729 741865 725242 689679 565416 563513 586165 570191 607830 598145 552109 674262
10796 674262 692576 658066 721731 759365 663215 634850 624006 523063 536206 530311 556368
10785 556368 592016 491327 588009 506636 432794 597306 734688 780946 710940 690594 694850
$$ packed form
10862E52208J42031J16692j99839p6772o0698O6705Q5205J14081q4684o4508K6975
10851F17396Q1045l9806o466M9748J10457n0051M9692L6427p6096j31870l1923
10840F08553R7866n1640J0491M2564Q5363j35119j4631O4567j12620p8491K4388
10829E41291Q3687J07430O532j03223l0994n9289K330L6882J7565j3814O6878
10818F55275J1835m2950J14402L7218j50111m7898J6967K8855l3838j7813J49787
10807G21729K0136j6623l5563j24263j903K2652j5974L7639r685m6036J22153
10796F74262J8314l4510O3665L7634r6150k8365j0844j00943J3143n895K6057
10785E56368L5648j00689R6682q1373p3842J64512J37382M6258p0006k0346M256
$$ plain form
10774 694850 668003 582367 535182 591581 659983 631024 617532 693355 632739 644196 655635
10763 655635 769740 737319 782411 726903 666406 704506 744431 791477 704175 740511 614159
10752 614159 604623 756672 732028 563329 545369 658299 648803 522677 618945 635235 636546
10741 636546 593091 531102 602756 659916 647986 713403 659030 647291 680871 689084 488124
10730 488124 576863 521823 526688 600157 734615 743318 641819 686310 648035 664568 729464
10719 729464 794979 640208 654587 741045 846955 821617 736974 721627 577642 601970 821481
10708 821481 845544 697921 685414 691193 672888 676641 652208 731396 807759 800175 775113 683178
10696 683178 667320 657170 573894 593042 727628 734190 610290 714214 728959 767795 673529
$$ packed form
10774F94850k6847q5636m7185N6399O8402k8959j3492P5823o0616J1457J1439
10763F55635J14105l2421M5092n5508o0497L8100L9925M7046q7302L6336j26352
10752F14159r536J52049k4644j68699j7960J12930r496j26126R6268J6290J311
10741F36546m3455o1989P1654N7160j1930O5417n4373j1739L3580Q213k00960
10730D88124Q8739n5040M865P3469J34458Q703j01499M4491l8275J6533O4896
10719G29464O5515j54771J4379Q6458J05910k5338q4643j5347j43985K4328K19511
10708H21481K4063j47623j2507N779j8305L753k4433P9188P6363p584k5062r1935
10696F83178j5858j0150q3276J9148J34586O562j23900J03924J4745L8836r4266
$$ plain form
10685 673529 760325 726259 686215 714243 786734 644790 631586 639067 674691 802905 606603
10674 606603 706517 825411 669932 487959 622137 566267 622334 790361 779118 586033
10664 586033 587750 693358 807380 867409 741740 750314 774884 677804 701685 846354 685772
10653 685772 663202 682698 560867 723517 589753 491566 572320 573916 481296 630323 683540
10642 683540 726602 714614 676824 790849 804968 742289 820750 732367 634174 656829 655983 803073
10630 803073 826125 629929 497642 603892 620442 759948 788357 723561 689787 642332 577307
10619 577307 634809 733233 641534 633663 743026 653748 608904 686300 661738 806050 708965
10608 708965 695763 691301 677500 759256 628794 528721 560146 580578 661937 823309 839699
$$ packed form
10685F73529Q6796l4066m0044K8028P2491j41944j3204P481L5624J28214j96302
10674F06603R9914J18894j55479j81973J34178n5870N6067J68027j1243j93085
10664E86033J717J05608J14022O0029j25669Q574K4570r7080K3881J44669j60582
10653F85772k2570J9496j21831J62650j33764r8187Q0754J596r2620J49027N3217
10642F83540M3062j1988l7790J14025J4119o2679P8461q8383r8193K2655q46J47090
10630H03073K3052j96196j32287J06250J6550J39506K8409o4796l3774m7455o5025
10619E77307N7502R8424r1699p871J09363q9278m4844P7396k4562J44312r7085
10608G08965j3202m462j3801Q1756j30462j00073L1425K0432Q1359J61372J6390
$$ plain form
10597 839699 722107 759902 774409 725000 741099 900320 1054141 736177 677626 694480 654877
10586 654877 790164 815108 635312 558325 722783 954236 903155 845570 693267 655089
10576 655089 719174 710105 658638 740831 711352 699723 770375 799273 716442 859285 898771
10565 898771 863377 801086 697626 677259 769610 834748 642330 574248 759932 741774 630664
10554 630664 618110 785484 752368 634227 686559 687935 753889 740900 593301 623410 643313
10543 643313 660010 747187 699639 572324 650334 736157 717779 750982 753843 718631 690018
10532 690018 857797 844893 750203 642538 719132 822473 895908 869822 771795 787239 786824
10521 786824 949460 961678 845087 875775 948642 962297 753535 743534 821442 820359 695895
$$ packed form
10597H39699j17592L7795J4507m9409J6099J59221J53821l17964n8551J6854l9603
10586F54877J35287K4944j79796p6987J64458K31453n1081n7585j52303l8178
10576F55089O4085r069n1467Q2193k9479j1629P0652K8898q2831J42843L9486
10565H98771l5394o2291j03460k0367R2351O5138j92418o8082J85684j8158j11110
10554F30664j2554J67374l3116j18141N2332J376O5954j2989j47599L0109J9903
10543F43313J6697Q7177m7548j27315P8010Q5823j8378L3203K861l5212k8613
10532F90018J67779j2904r4690j07665P6594J03341P3435k6086r8027J5444m15
10521G86824J62636J2218j16591L0688P2867J3655k08762j0001P7908j083j24464
$$ plain form
10510 695895 665650 677775 802804 817522 737967 635272 660964 715699 716890 704822 790932
10499 790932 781262 773286 776651 748880 697566 777125 799148 647476 613841 653740 742715 860877
10487 860877 773353 764978 846658 806288 812267 805918 642412 565040 616434 577882 679510 782130
10475 782130 737876 699836 695274 601660 681630 705216 699969 684496 733628 688307 720046 814275
10463 814275 799700 834639 911989 895096 868478 913013 846117 830123 777602 733630 729025 624020
10451 624020 592283 589250 674016 801928 666179 716660 678840 724532 835773 714174 690723
10440 690723 657439 623697 644769 700276 743040 911009 939012 831311 799511 778025 752530
10429 752530 678932 686989 639369 863504 837299 749792 776902 645772 648612 715434 710581 681795
$$ packed form
10510F95895l0245J2125J25029J4718p9555j02695K5692N4735J191j2068Q6110
10499G90932r670p976L365k7771n1314P9559K2023j51672l3635L9899Q8975J18162
10487H60877q7524q375Q1680m0370N979o349j63506p7372N1394l8552J01628J02620
10475G82130m4254l8040m562r3614P9970K3586n247j5473M9132m5321L1739R4229
10463H14275j4575L4939P7350j6893k6618M4535o6896j5994n2521m3972m605j05005
10451F24020l1737l033Q4766J27912j35749N0481l7820M5692J11241j21599k3451
10440F90723l3284l3742K1072N5507M2764J67969K8003j07701l1800k1486k5495
10429G52530p3598Q057m7620K24135k6205q7507K7110j31130K840O6822m853k8786
$$ plain form
10417 681795 738354 758930 717534 747180 809599 686465 643576 749428 746259 752729 771499
10406 771499 703443 828159 840181 756990 821991 752020 647297 597407 578847 569323 763624
10395 763624 780714 851461 804342 812250 799291 804475 760358 784766 872119 807326 868435 775574
10383 775574 746827 830647 795261 762681 834561 668826 695741 825446 797711 792627 861066
10372 861066 750637 808080 898482 951876 916438 881002 836235 916349 735867 624045 703394
10361 703394 771882 730962 737038 738666 819336 786133 793519 802583 737128 818281 836177 918638
10349 918638 991742 836732 888650 728602 659253 743800 722990 708127 673797 758526 862391
10338 862391 939716 806141 864603 844234 797771 681337 697078 776150 776046 948375 862748
$$ packed form
10417F81795N6559K0576m1396K9646O2419j23134m2889J05852l169O470J8770
10406G71499o8056J24716J2022q3191O5001o9971j04723m9890j8560r524J94301
10395G63624J7090P0747m7119P908j2959N184m4117K4408Q7353o4793O1109r2861
10383G75574k8747Q3820l5386l2580P1880j65735K6915J29705k7735n084O8439
10372H61066j10429N7443R0402N3394l5438l5436m4767Q0114j80482j11822P9349
10361G03394O8488m0920O076J628Q0670l3203P386R064o5455Q1153J7896Q2461
10349I18638P3104j55010N1918j60048o9349Q4547k0810j4863l4330Q4729J03865
10338H62391P7325j33575N8462k0369m6463j16434J5741P9072j04J72329q5627
$$ plain form
10327 862748 726247 783890 867356 850688 764584 842511 748068 765649 763579 809982 889251
10316 889251 873456 935026 866254 830270 819623 809573 822468 748941 575194 752607 798697
10305 798697 800414 828466 876778 934458 948250 956479 937699 857052 842525 821967 789879 745351
10293 745351 691923 825253 827216 846030 841047 901636 716999 705692 843465 966851 870458
10282 870458 857629 854302 923767 1006085 1041274 976592 933301 839919 710911 915304 949771
10271 949771 923500 1009742 1005186 946729 817027 789932 874953 826896 871773 929494 892098
10260 892098 818602 847401 899045 957874 885314 909327 874621 930492 988344 866297 655432
10249 655432 660129 793803 880288 1087174 1041043 955681 839796 869173 858720 938464 1080275
$$ packed form
10327H62748j36501N7643Q3466j6668q6104P7927r4443J7581k070M6403P9269
10316H89251j5795O1570o8772l5984j0647j0050J2895p3527j73747J77413M6090
10305G98697J717K8052M8312N7680J3792Q229j8780q0647j4527k0558l2088m4528
10293G45351n3428J33330J963J8814m983O0589j84637j1307J37773J23386r6393
10282H70458j2829l327O9465Q2318L5189o4682m3291r3382j29008K04393L4467
10271I49771k6271Q6242m556n8457j29702k7095Q5021m8057M4877N7721l7396
10260H92098p3496K8799N1644N8829p2560K4013l4706N5871N7852j22047k10865
10249F55432M697J33674Q6485K06886m6131q5362j15885K9377j0453P9744J41811
$$ plain form
10238 1080275 1090522 1078757 926223 853325 932340 898261 918496 954773 958679 1027315 1113410
10227 1113410 1088428 1025712 1107376 1036128 1074212 1090336 978351 990329 998901 1040010 975975
10216 975975 1018874 1043316 1082421 971336 981613 878486 898096 874932 848032 995792 974226
10205 974226 904524 918679 932556 911305 996089 1111736 987562 989804 993707 1035897 1001241
10194 1001241 972940 960340 866836 828825 887807 928204 980456 1111880 885804 879845 1056523
10183 1056523 1148176 1151876 982137 1004323 1085975 938437 886837 944032 937633 840236 801939
10172 801939 775630 976540 1030397 1051217 1011497 1034538 945250 923091 960307 930277 938132
10161 938132 940849 840788 849086 834212 784191 899611 1002450 1003267 970599 871188 984193
$$ packed form
10238A080275J0247j1765j52534p2898P9015l4079K0235L6277L906O8636Q6095
10227A113410k4982o2716Q1664p1248L8084J6124j11985J1978Q572M1109o4035
10216I75975M2899K4442L9105j11085J0277j03127J9610k3164k6900J47760k1566
10205I74226o9702J4155J3877k1251Q4784J15647j24174K242L903M2190l4656
10194A001241k8301j2600r3504l8011N8982M0397N2252J31424k26076n959J76678
10183A056523R1653L700j69739K2186Q1652j47538n1600N7195o399r7397l8297
10172H01939k6309K00910N3857K0820l9720K3041q9288k2159L7216l0030P855
10161I38132K717j00061Q298j4874n0021J15420J02839Q17l2668r9411J13005
$$ plain form
10150 984193 1090444 997124 1079664 1008329 865921 974695 982483 943261 828218 975278 995884
10139 995884 966668 1087684 1031421 1031834 1110587 1223635 1155327 898049 932110 981460 1042113
10128 1042113 1120146 1147629 1193331 1153712 1024709 969902 996932 1099618 1120819 1128974 984063
10117 984063 960846 1087242 1059641 1107347 1100948 979908 993920 958306 922277 961538 1079804
10106 1079804 1092808 1126177 1098255 1039540 1136974 987702 983521 1045078 1132107 1127820 1079827
10095 1079827 1076625 1080377 985529 986311 983607 894476 892911 938862 916652 989384 1024570 1046102
10083 1046102 1079067 1023192 948781 1024290 1159901 1176763 1093246 992233 1029689 1172977 1140278
10072 1140278 1120816 1037279 1046152 1093491 1059260 935573 849656 855737 955777 908034 856950
$$ packed form
10150I84193J06251r3320Q2540p1335j42408J08774P788l9222j15043J47060K0606
10139I95884k9216J21016n6263M13P8753J13048o8308k57278L4061M9350O0653
10128A042113P8033K7483M5702l9619j29003n4807K7030J02686K1201Q155j44911
10117I84063k3217J26396k7601M7706o399j21040J4012l5614l6029L9261J18266
10106A079804J3004L3369k7922n8715R7434j49272m181O1557Q7029m287m7993
10095A079827l202L752r4848P82k704q9131j565M5951k2210P2732L5186K1532
10083A046102L2965n5875p4411P5509J35611J6862q3517j01013L7456J43288l2699
10072A140278j9462q3537Q873M7339l4231j23687q5917O081J00040m7743n1084
$$ plain form
10061 856950 907484 997576 938129 968397 1106051 1034320 1027996 935132 962115 1022779 946038
10050 946038 978850 1039477 1009059 916122 940143 911049 894362 938458 973052 948970 1049702
10039 1049702 1107682 1065568 1028120 968221 993308 986159 847200 863609 1014132 1060757 1086657
10028 1086657 1117028 1099603 1055047 985232 1141546 1247676 1049489 929265 976205 1090330
10018 1090330 1088397 1104163 1144970 1016513 902881 865781 860178 970502 1042621 911286 932361
10007 932361 988253 1095710 1165970 1148548 1178939 1143034 979954 970996 994396 1127011 1119119
9996 1119119 1036620 1023881 1030195 1133764 1166918 1172641 1073387 1025297 1073158 1205678 1005087
9985 1005087 1035699 982042 998036 923422 913786 834230 851139 883561 887993 999855 1144738
$$ packed form
10061H56950N0534R0092n9447L0268J37654p1731o324r2864K6983O0664p6741
10050I46038L2812O0627l0418r2937K4021k9094j6687M4096L4594k4082J00732
10039A049702N7980m2114l7448n9899K5087p149j38959J6409J50523M6625K5900
10028A086657L0371j7425m4556o9815J56314J06130j98187j20224M6940J14125
10018A090330j933J5766M0807j28457j13632l7100n603J10324P2119j31335K1075
10007I32361N5892J07457P0260j7422L0391l5905j63080q958K3400J32615p892
9996A119119q2499j2739O314J03569L3154N723r9254m8090M7861J32520k00591
9985A005087L0612n3657J5994p4614r636p9556J6909L2422M432J11862J44883
$$ plain form
9974 1144738 1032605 994475 1035471 1112328 1080661 1005136 965428 1103293 1064880 1033241 1103767
9963 1103767 1087987 1193081 1076080 1038429 1081831 1096725 1085451 1097102 982283 1013926 961244
9952 961244 1031981 1011971 919324 879173 978499 1007494 968113 1023470 1122048 1118382 1208514 1079454
9940 1079454 988667 1096844 1067232 1062858 986510 984431 1009477 1023640 1006483 1022548 1001922 1050346
9928 1050346 1202101 1195184 1272939 1168021 1084035 1087882 1083802 1110849 1110177 1165173 1048296 1019738
9916 1019738 1016214 1039156 1162462 1108312 1075949 975032 1011544 1211113 1210108 940211 1049730
9905 1049730 1138124 1138752 1178803 1071154 1019938 1075874 1256490 1090264 942990 994503 1025275
9894 1025275 1127330 1120863 962449 974408 1092011 1132341 1232315 1102275 992870 1025113 1024334
$$ packed form
9974A144738j12133l8130M0996P6857l1667p5525l9708J37865l8413l1639P0526
9963A103767j5780J05094j17001l7651M3402J4894j1274J1651j14819L1643n2682
9952I61244P0737k0010r2647m0151R9326K8995l9381N5357R8578l666R0132j29060
9940A079454r0787J08177k9612m374p6348k079K5046J4163j7157J6065k0626M8424
9928A050346J51755o917P7755j04918q3986L847m080K7047o72N4996j16877k8558
9916A019738l524K2942J23306n4150l2363j00917L6512J99569j005k69897J09519
9905A049730Q8394O28M0051j07649n1216N5936J80616j66226j47274N1513L0772
9894A025275J02055o467j58414J1959J17603M0330R9974j30040j09405L2243p79
$$ plain form
9883 1024334 998707 956551 896820 973489 1058287 984759 980956 1042682 1074914 1094141 1061860 1097461
9871 1097461 1219260 1082575 1132400 1129163 1045284 937653 1047066 970819 1001484 1123874 1152507
9860 1152507 1077804 922770 893720 1009392 971833 883791 1081787 1080678 1079909 1205678 1183541
9849 1183541 1164278 1131856 1087692 993273 1117732 1055500 991679 982997 1098340 1137156 1104160
9838 1104160 1237904 1141338 1301144 1266300 1052256 1018543 1070769 1102658 1240882 1216206 1178981
9827 1178981 1168206 1129828 1141641 1238044 1170602 1102378 1126411 1149927 1093864 1108249 1215223
9816 1215223 1155228 1150426 1044317 1061806 1111876 1114707 1266595 1315287 1204588 1106865 1061265
9805 1061265 1124435 1172468 1230423 1186766 1123492 1137911 1143212 1221913 1220327 1157659 1213189 1148886
$$ packed form
9883A024334k5627m2156n9731P6669Q4798p3528l803O1726L2232J9227l2281L5601
9871A097461J21799j36685M9825l237q3879j07631J09413p6247L0665J22390K8633
9860A152507p4703j55034k9050J15672l7559q8042J97996j109p69J25769k2137
9849A183541j9263l2422m4164r4419J24459o2232o3821q682J15343L8816l2996
9838A104160J33744r6566J59806l4844k14044l3713N2226L1889J38224k4676l7225
9827A178981j0775l8378J1813R6403o7442o8224K4033K3516n6063J4385J06974
9816A215223n9995m802j06109J7489N0070K831J51888M8692j10699r7723m5600
9805A061265O3170M8033N7955m3657o3274J4419N301P8701j586o2668N5530o4303
$$ plain form
9793 1148886 1063675 1094633 1162330 1162242 1122664 1098133 1325450 1285886 1116878 1065712 1058044 1247152
9781 1247152 1220544 1150749 1111112 1166879 1021367 1022870 1125073 1057108 1037685 1072116 1069460
9770 1069460 1178010 1223562 1313849 1278952 1306756 1255244 1118962 1031129 1174701 1226190 1196878
9759 1196878 1225756 1240816 1251887 1144512 1081907 1088818 1211129 1229939 1252106 1336793 1353467
9748 1353467 1409347 1314357 1289316 1276776 1196734 1250594 1134445 1154172 1243490 1253008 1241521
9737 1241521 1245650 1319028 1283637 1313054 1264441 1323603 1407730 1299615 1251370 1287305 1246475
9726 1246475 1235976 1222297 1274136 1375735 1275876 1326075 1349113 1218743 1225857 1309697 1428537
9715 1428537 1363300 1219638 1221022 1271883 1351183 1265432 1268518 1347130 1400011 1406846 1452537 1354515
$$ packed form
9793A148886q5211L0958O7697q8l9578k4531K27317l9564j69008n1166p668J89108
9781A247152k6608o9795l9637N5767j45512J503J02203o7965j9423L4431k656
9770A069460J08550M5552R0287l4897K7804n1512j36282q7833J43572N1489k9312
9759A196878K8878J5060J1071j07375o2605O911J22311J8810K2167Q4687J6674
9748A353467N5880r4990k5041j2540q0042N3860j16149J9727Q9318R518j1487
9737A241521M129P3378l5391K9417m8613N9162Q4127j08115m8245L5935m0830
9726A246475j0499j3679N1839J01599r9859N0199K3038j30370P114Q3840J18840
9715A428537o5237j43662J384N0861P9300q5751L086P8612N2881O835M5691r8022
$$ plain form
9703 1354515 1220334 1308098 1334930 1333162 1264320 1388870 1452657 1301781 1215721 1159163 1273033
9692 1273033 1455773 1483686 1431404 1461840 1336683 1358989 1217005 1289373 1318555 1299844 1305204
9681 1305204 1227819 1258645 1446529 1382417 1367624 1539323 1496920 1399675 1320518 1431841 1354922
9670 1354922 1290009 1359157 1443078 1416524 1323280 1318873 1385660 1416433 1439576 1398591 1329595 1312405
9658 1312405 1383275 1471439 1441246 1395456 1395812 1425297 1228150 1324467 1399255 1244023 1257395
9647 1257395 1429842 1544317 1587826 1556739 1544234 1532398 1393235 1325123 1460748 1516336 1493356
9636 1493356 1573208 1646298 1698323 1556073 1531144 1569956 1611678 1664061 1530145 1617373 1543378
9625 1543378 1387270 1435043 1479702 1590256 1469172 1603849 1624548 1557000 1559845 1571209 1626386
$$ packed form
9703A354515j34181Q7764K6832j768o8842J24550O3787j50876q6060n6558J13870
9692A273033J82740K7913n2282L0436j25157K2306j41984P2368K9182j8711N360
9681A305204p7385L0826J87884o4112j4793J71699m2403r7245p9157J11323p6919
9670A354922o4913O9148Q3921k6554r3244m407O6787L0773K3143m0985o8996j7190
9658A312405P0870Q8164l0193m5790L56K9485j97147R6317P4788j55232J3372
9647A257395J72447J14475M3509l1087j2505j1836j39163o8112J35625N5588k2980
9636A493356P9852P3090N2025j42250k4929L8812M1722N2383j33916Q7228p3995
9625A543378j56108M7773M4659J10554j21084J34677K0699o7548K845J1364N5177
$$ plain form
9614 1626386 1723733 1790367 1642202 1542617 1630498 1661692 1682559 1620978 1640162 1746854 1713315
9603 1713315 1618502 1602393 1646060 1629149 1670259 1725913 1702799 1583782 1513496 1581716 1635200
9592 1635200 1577096 1601246 1618804 1700659 1596327 1517340 1527936 1427407 1450278 1596468 1687483
9581 1687483 1704831 1808709 1752706 1585550 1605308 1633936 1491877 1530954 1569923 1731998 1714912
9570 1714912 1599953 1537080 1522372 1583909 1672751 1618356 1633241 1653184 1674279 1733209 1806465
9559 1806465 1716676 1672866 1795079 1737219 1715851 1583567 1656366 1730500 1891647 1900648 1885314
9548 1885314 1911655 1776592 1634588 1701025 1894662 1926828 1906514 1872917 1743177 1771571 1831331
9537 1831331 1962686 1987183 1863496 1845089 1797011 1789042 1912550 1893642 1841847 1820137 1793709
$$ packed form
9614A626386R7347O6634j48165r9585Q7881L1194K0867o1581J9184J06692l3539
9603A713315r4813j6109M3667j6911M1110N5654k3114j19017p0286O8220N3484
9592A635200n8104K4150J7558Q1855j04332p8987J0596j00529K2871J46190R1015
9581A687483J7348J03878n6003j67156J9758K8628j42059L9077L8969J62075j7086
9570A714912j14959o2873j4708O1537Q8842n4395J4885J9943K1095N8930P3256
9559A806465q9789m3810J22213n7860k1368j32284P2799P4134J61147R001j5334
9548A885314K6341j35063j42004O6437J93637L2166k0314l3597j29740K8394N9760
9537A831331J31355K4497j23687j8407m8078p969J23508j8908n1795k1710k6428
$$ plain form
9526 1793709 1753321 1842141 1812112 1814315 1896676 1862878 1858557 2037290 1915673 1705169 1703474
9515 1703474 1837802 2008838 1903753 1952919 1929591 1916200 1951889 2025050 1996419 1965795 2136879
9504 2136879 2085765 1955713 1966671 1958748 1852603 1853988 1833283 1853473 2051042 1979636 1966146
9493 1966146 1993473 1993710 1994183 1960851 1874418 1954004 1958212 1973046 1978277 1984416 2049247 2102980 1960982
9480 1960982 1960892 2103020 2040507 1925689 1980588 2013614 2074944 2102999 2080859 2042634 2120501 2155508
9468 2155508 2156911 2161713 2142213 2011497 1992900 2130294 2180613 2117177 2123719 2058039 2108220 2155604
9456 2155604 2070441 2095424 2071182 2108732 2112145 2202165 2240940 2274432 2300201 2418879 2375606
9445 2375606 2248048 2205204 2235457 2150243 2245552 2363127 2291566 2253184 2103958 2078568 2052069
$$ packed form
9526A793709m0388Q8820l0029K203Q2361l3798m321J78733j21617k10504j695
9515A703474J34328J71036j05085M9166k3328j3391L5689P3161k8631l0624J71084
9504B136879n1114j30052J0958p923j06145J385k0705K0190J97569p1406j3490
9493A966146K7327K37M73l3332q6433P9586M208J4834N231O139O4831N3733j41998
9480A960982r0J42128o2513j14818N4899L3026O1330K8055k2140l8225P7867L5007
9468B155508J403M802j9500j30716j8597J37394N0319o3436O542o5680N0181M7384
9456B155604q5163K4983k4242L7550L413R0020L8775L3492K5769J18678m3273
9445B375606j27558m2844L0253q5214R5309J17575p1561l8382j49226k5390k6499
$$ plain form
9434 2052069 2104235 2159426 2142852 2140395 2246581 2328407 2298410 2249253 2312668 2354898 2254921
9423 2254921 2311449 2316801 2319623 2330730 2373625 2452652 2555998 2521583 2384522 2325020 2432123
9412 2432123 2632008 2633611 2498455 2582113 2537672 2382105 2482894 2626308 2555647 2505563 2576354
9401 2576354 2586624 2577635 2681600 2892883 2951390 2777844 2848626 2783087 2755802 2790615 2900816
9390 2900816 2987477 2961933 2823954 2742024 2725929 2878664 2740396 2696369 2721002 2742892 2741649
9379 2741649 2703449 2592769 2524903 2619371 2608197 2595366 2598643 2778272 2693711 2646117 2728128
9368 2728128 2719114 2786232 2844138 2774539 2875500 2893451 2846442 2800445 2832329 2889160 2895549 2860049
9356 2860049 2767087 2971816 3062364 2986370 2925903 3111394 3048918 2962890 3127324 3151348 3084017
$$ packed form
9434B052069N2166N5191j6574k457J06186Q1826k9997m9157O3415M2230r9977
9423B254921N6528N352K822J1107M2895P9027J03346l4415j37061n9502J07103
9412B432123J99885J603j35156Q3658m4441j55567J00789J43414p0661n0084P0791
9401B576354J0270q989J03965K11283N8507j73546P0782o5539k7285L4813J10201
9390B900816Q6661k5544j37979q1930j6095J52735j38268m4027K4633K1890j243
9379B741649l8200j10680o7866R4468j1174j2831L277J79629q4561m7594Q2011
9368B728128r014O7118N7906o9599J00961J7951m7009m5997L1884N6831O389l5500
9356B860049r2962K04729R0548p5994o0467J85491o2476q6028J64434K4024o7331
$$ plain form
9345 3084017 3056152 3119051 3227890 3098507 2992237 3077517 3175208 3379555 3526849 3635944
9335 3635944 3761345 3734663 3594919 3474677 3630387 3656764 3512287 3626323 3677625 3805057
9325 3805057 3810552 3873146 3862014 3852094 3861965 3870707 3733294 3550759 3606271 3591163 3521201 3549214
9313 3549214 3498271 3530559 3569643 3602323 3504793 3512052 3619531 3686923 3777713 3829444 3912482
9302 3912482 4072993 4084968 3860246 3881804 3910571 3823274 3824698 3838773 3954337 3941921 4110081
9291 4110081 4166811 4036066 4048096 4009506 3927534 3958800 4032469 4088443 4095074 4302299 4148460
9280 4148460 4130622 4177763 4178453 4186437 4267990 4350094 4435520 4723225 5106092 5171982 5485438
9269 5485438 5479277 5378095 5349430 5653165 6038153 6444015 6816018 7080551 6910716 6643695
$$ packed form
9345C084017k7865O2899J08839j29383j06270Q5280R7691K04347J47294J09095
9335C635944J25401k6682j39744j20242J55710K6377j44477J14036N1302J27432
9325C805057N495O2594j1132r920R871Q742j37413j82535N5512j5108o9962K8013
9313C549214n0943L2288L9084L2680r7530P259J07479O7392R0790N1731Q3038
9302C912482J60511J1975k24722K1558K8767q7297J424J4075J15564j2416J68160
9291D110081N6730j30745J2030l8590q1972L1266P3669N5974O631K07225j53839
9280D148460j7838M7141O90P984Q1553Q2104Q5426K87705L82867O5890L13456
9269E485438o161j01182k8665L03735L84988M05862L72003K64533j69835k67021
$$ plain form
9259 6643695 6351661 5883478 5806637 5898908 6121776 6286371 6423552 6333832 6121990 5933925
9249 5933925 5844802 5759556 5720853 5425455 5380560 5236715 5186002 5207585 5197445 5443606 5465842
9238 5465842 5506198 5647245 5704775 5631860 5555751 5479043 5488360 5606924 5537458 5703772 6100173
9227 6100173 6744197 7947888 9925411 11427247 11979951 11288456 9698006 8420913 7765502
9218 7765502 7582227 7953861 9053621 10823148 11986850 12031491 10782827 8887127 7419370
9209 7419370 6523377 5821457 5508008 5199168 5004649 4886394 4598310 4264112 4364894 4421384
9199 4421384 4333810 4451240 4370154 4311063 4438577 4345649 4211103 4280077 4335682 4252687 4184216
9188 4184216 4197088 4189174 4205249 4343899 4186427 4187906 4243907 4052623 4114098 4117753 4058472
$$ packed form
9259F643695k92034m68183p6841R2271K22868J64595J37181q9720k11842j88065
9249E933925q9123q5246l8703k95398m4895j43845n0713K1583j0140K46161K2236
9238E465842M0356J41047N7530p2915p6109p6708R317J18564o9466J66314L96401
9227F100173O44024J203691J977523J501836N52704o91495j590450j277093o55411
9218G765502j83275L71634J099760J769527J163702M4641j248664j895700j467757
9209G419370q95993p01920l13449l08840j94519j18255k88084l34198J00782N6490
9199D421384q7574J17430q1086n9091J27514r2928j34546O8974N5605q2995o8471
9188D184216J2872p914J6075J38650j57472J479N6001j91284O1475L655n9281
$$ plain form
9177 4058472 4240300 4125526 4148151 4161041 4270635 4303163 4341751 4303006 4336755 4337124 4235052
9166 4235052 4128395 4131043 4241366 4342049 4440896 4396891 4417831 4324901 4308456 4291224 4188109
9155 4188109 4167215 4285559 4263823 4267855 4355951 4443262 4611068 4541408 4496988 4555528 4565214
9144 4565214 4522897 4382661 4389724 4382688 4426266 4398229 4415606 4482419 4665964 4658075 4723270 4857359
9132 4857359 4818909 4741884 4721990 4953157 5123328 4996212 4904359 4882085 4955652 5097901 5389928
9121 5389928 5407711 5409516 5455565 5445610 5393835 5431527 5358542 5394755 5451256 5598292 5583587 5466293
9109 5466293 5452081 5458233 5450823 5449661 5415634 5600899 5625964 5656806 5629028 5595324 5637457 5704704
9097 5704704 5700307 5639407 5703656 5618247 5629082 5737733 5878638 5822712 5860570 5935745 6093212
$$ packed form
9177D058472J81828j14774K2625J2890J09594L2528L8588l8745L3749L69j02072
9166D235052j06657K648J10323J00683R8847m4005K0940r2930j6445j7232j03115
9155D188109k0894J18344k1736M032Q8096Q7311J67806o9660m4420N8540R686
9144D565214m2317j40236P063p036M3578k8037J7377O6813J83545p889O5195J34089
9132D857359l8450p7025j9894K31167J70171j27116r1853k2274P3567J42249K92027
9121E389928J7783J805M6049r955n1775L7692p2985L6213N6501J47036j4705j17294
9109E466293j4212O152p410j162l4027J85265K5065L0842k7778l3704M2133O7247
9097E704704m397o0900O4249q5409J0835J08651J40905n5926L7858P5175J57467
$$ plain form
9086 6093212 6323679 6627275 6652099 6351538 6197173 6124429 6211304 6357573 6346933 6154007
9076 6154007 6063091 5858825 5742725 5714990 5766380 5688657 5732294 5777705 5818764 5567792 5556441
9065 5556441 5746763 5900353 6022365 5885223 5826479 5984326 6088268 6062047 5943225 6062925
9055 6062925 6201836 6430464 6434253 6409666 6619726 6672698 6768277 6844970 6873429 6866774 6947163
9044 6947163 7089298 7038616 6996977 6993620 6968849 7070057 6966517 7061825 7067356 6926441 6891522
9033 6891522 7025288 7152626 7208726 7156700 7130414 7270907 7296592 7441429 7438917 7488728 7519637
9022 7519637 7635966 7670135 7706636 7913913 7902497 7971765 8006986 8151500 8317501 8442292
9012 8442292 8521086 8592565 8673138 8884449 9000992 9332032 9658260 9993378 10303283 10684127
$$ packed form
9086F093212K30467L03596K4824l00561j54365p2744Q6875J46269j0640j92926
9076F154007r0916k04266j16100k7735N1390p7723M3637M5411M1059k50972j1351
9065E556441J90322J53590J22012j37142n8744J57847J03942k6221j18822J19700
9055F062925J38911K28628L789k4587K10060N2972R5579P6693K8459o655Q0389
9044F947163J42135n0682m1639l357k4771J01208j03540R5308N531j40915l4919
9033F891522J33766J27338N6100n2026k6286J40493K5685J44837k512M9811L0909
9022G519637J16329L4169L6501K07277j1416O9268L5221J44514J66001J24791
9012H442292P8794P1479Q0573K11311J16543L31040L26228L35118L09905L80844
$$ plain form
9002 10684127 11489528 12209108 12536321 12542366 12253046 12187056 12496673 12923053 13524247 14209163
8992 14209163 14849737 15580835 16104882 16168435 15503797 14957586 14944477 15231510 15335374 15174710
8982 15174710 14709981 14306234 14136214 14423736 14378821 14643752 14980706 15244236 15514239 15684148
8972 15684148 16067099 16232988 16395604 16651904 16955002 17650282 18660807 19922474 21336163
8963 21336163 22687787 23217511 23770900 25204382 28088727 31265194 33830799 34483929 32243745
8954 32243745 29304745 27217102 25489711 24366960 23473344 23229362 23401601 23697728 24035448
8945 24035448 24521348 25023321 25555519 26334418 27671243 29163649 31121349 33657433 37140123
8936 37140123 40883271 44330196 46639712 48078204 49525713 52166113 57486292 67555511
$$ packed form
9002A0684127Q05401P19580L27213O045k89320o5990L09617M26380O01194O84916
8992A4209163O40574P31098N24047O3553o64638n46211j3109K87033J03864j60664
8982A5174710m64729m03747j70020K87522m4915K64931L36954K63530K70003J69909
8972A5684148L82951J65889J62616K56300L03098O95280J010525J261667J413689
8963B1336163J351624N29724N53389J433482K884345L176467K565605O53130k240184
8954C2243745k939000k087643j727391j122751q93616k43982J72239K96127L37720
8945B4035448M85900N01973N32198P78899J336825J492406J957700K536084L482690
8936C7140123L743148L446925K309516J438492J447509K640400N320179J0069219
$$ plain form
8928 67555511 86006758 113914027 141177701 152756485 146122015 124632393 102045678
8921 102045678 86208328 77183066 74868680 79951688 93974556 112449596 127107397
8914 127107397 130266118 116431363 94355059 75030861 61262757 52135566 45869578
8907 45869578 41659025 38632169 36586850 35551790 35187097 35034501 35392579 35916373 36774821
8898 36774821 37925562 39484986 41366819 43337511 45425359 48269265 51657299 56802192
8890 56802192 64551763 76247244 89692528 100895785 106279530 102912340 96021397 91450325
8882 91450325 91296162 96245167 108406347 132082662 166016537 198184273 217805326 212986201
8874 212986201 189732661 169059955 162711289 175247446 202257668 240259692 273202603
$$ packed form
8928F7555511J8451247K7907269K7263674J1578784o634470k1489622k2586715
8921A02045678j5837350r025262k314386N083008J4022868J8475040J4657801
8914A27107397L158721j3834755k2076304j9324198j3768104r127191o265988
8907D5869578m210553l026856k045319j035060l64693j52596L58078N23794Q58448
8898C6774821J150741J559424J881833J970692K087848K843906L388034N144893
8890E6802192P749571J1695481J3445284J1203257N383745l367190o890943m571072
8882I1450325j54163M949005J2161180K3676315L3933875L2167736J9621053m819125
8874B12986201k3253540k0672706o348666J2536157K7010222L8002024L2942911
$$ plain form
8867 273202603 281365620 267157533 226731952 180906320 147266835 127019670 122025370
8860 122025370 127420151 138594481 149927792 147660590 132368753 111244141 87115906
8853 87115906 68379580 54322584 44935653 37941220 33027691 28964970 26012983 23469678
8845 23469678 22006755 20882291 20061903 19328262 18817001 18224792 17727021 17340546 17220364
8836 17220364 16813751 16734661 16422101 16296879 16344069 16399102 16250676 15865465 15274086 14630154
8826 14630154 13960591 13521645 13190891 13147218 13057608 12853347 12657439 12297155 11811857 11308500
8816 11308500 10789106 10409120 10139074 9950612 9660296 9462519 9246406 9170468 9285957 9333467
8806 9333467 9415446 9415519 9427712 9608208 9828446 10095158 10147691 10125037 10325939 10500920 10682825
$$ packed form
8867B73202603Q163017j4208087m0425581m5825632l3639485k0247165m994300
8860A22025370N394781J1174330J1333311k267202j5291837k1124612k4128235
8853H7115906j8736326j4056996r386931o994433m913529m062721k951987k543305
8845B3469678j462923j124464q20388p33641n11261n92209m97771l86475j20182
8836A7220364m06613p9090l12560j25222M7190N5033j48426l85211n91379o43932
8826A4630154o69563m38946l30754m3673q9610k04261j95908l60284m85298n03357
8816A1308500n19394l79986k70046j88462k90316j97777k16113p5938J15489M7510
8806I333467Q1979P3J2193J80496K20238K66712N2533k2654K00902J74981J81905
$$ plain form
8795 10682825 10973406 11251259 11451757 11382495 11286901 10923988 10550111 10156643 9873581 9828361
8785 9828361 9814849 9841494 10155746 10491101 10570005 10337754 9917584 9649110 9214238 8960696
8775 8960696 8829151 8677988 8595834 8690334 8817866 9018755 9313452 9794766 10169896 10419967
8765 10419967 10441695 10676343 10874372 11319235 11996080 13068690 14201164 15381782 16723314
8756 16723314 17346084 16703353 15714730 15110455 14710281 14980098 16295522 18065647 19940530
8747 19940530 22324839 24201662 23650039 21769641 20171304 18586498 17094755 16358163
8739 16358163 16110866 16157664 16464127 16981850 17799842 18872216 20385536 22112770 23747980
8730 23747980 25215463 26667214 28062093 28741283 28903048 29268790 29138801 28671880 29299217
$$ packed form
8795A0682825K90581K77853K00498o9262r5594l62913l73877l93468k83062m5220
8785I828361j3512K6645L14252L35355P8904k32251m20170k68474m34872k53542
8775H960696j31545j51163q2154R4500J27532K00889K94697M81314L75130K50071
8765A0419967K1728K34648J98029M44863O76845J072610J132474J180618J341532
8756A6723314O22770o42731r88623o04275m00174K69817J315424J770125J874883
8747A9940530K384309J876823n51623j880398j598337j584806j491743p36592
8739A6358163k47297M6798L06463N17723Q17992J072374J513320J727234J635210
8730B3747980J467483J451751J394879O79190J61765L65742j29989m66921O27337
$$ plain form
8721 29299217 31019680 33852050 37084945 39744204 41135970 41501777 40893372 37071299
8713 37071299 30986574 26194590 22422157 19104687 16948028 15776177 14942049 14636354
8705 14636354 14456172 14157278 13554604 13116578 12541533 12007579 11764929 11343985 10925247
8696 10925247 10529628 10351471 10355658 10483100 10926949 11349302 11332499 10851160 10395604 10099654
8686 10099654 9917634 9584164 9264886 9050476 8826281 8734349 8689923 8658207 8907304 9088857
8676 9088857 9249054 9358428 9377866 9371715 9415802 9339761 9359363 9458517 9556327 9731608 9611183
8665 9611183 9725225 9586368 9509390 9287335 9112955 8837848 8716424 8581954 8424115 8457108
8655 8457108 8352500 8258776 8441505 8584875 8838285 9130065 9252104 9362535 9335932 9272878
$$ packed form
8721B9299217J720463K832370L232895K659259J391766L65807o08405l822073
8713C7071299o084725m791984l772433l317470k156659j171851q34128l05695
8705A4636354j80182k98894o02674m38026n75045n33954k42650m20944m18738
8696A0925247l95619j78157M187J27442M43849M22353j6803m81339m55556k95950
8686A0099654j82020l33470l19278k14410k24195r1932m4426l1716K49097J81553
8676I088857J60197J09374J9438o151M4087p6041J9602R9154R7810J75281j20425
8665I611183J14042j38857p6978k22055j74380k75107j21424j34470j57839L2993
8655H457108j04608r3724J82729J43370K53410K91780J22039J10431k6603o3054
$$ plain form
8645 9272878 9408068 9553930 9419922 9501637 9572517 9518294 9840539 10377347 10862249 11097385
8635 11097385 10866789 10410916 9979490 9583074 9367519 9138973 8977020 9005549 8950130 9009268
8625 9009268 8791108 8742050 8678010 8377119 8189299 8075622 7884570 7746518 7627551 7579999
8615 7579999 7617921 7615174 7632543 7583617 7370407 7164318 7049706 6946753 7063244 7144311 7075950
8604 7075950 7238094 7353412 7582465 7835152 8049344 8205987 8151385 8268612 8422610 8433457
8594 8433457 8110312 7951619 7742140 7760437 7974061 8143936 8226834 8444977 8650776 8675067
8584 8675067 8441627 8432015 8484374 8677348 8771106 8989506 9001301 9405164 9740981 9677062 9686995
8573 9686995 9745470 9903384 9896937 10160278 10484302 10653715 10907815 11314808 11648662 12357692
$$ packed form
8645I272878J35190J45862j34008Q1715P0880n4223L22245N36808M84902K35136
8635A1097385k30596m55873m31426l96416k15555k28546j61953K8529n5419N9138
8625I009268k18160m9058o4040l00891j87820j13677j91052j38052j18967m7552
8615G579999L7922k747J7369m8926k13210k06089j14612j02953J16491Q1067o8361
8604G075950J62144J15318K29053K52687K14192J56643n4602J17227J53998J0847
8594H433457l23145j58693k09479J8297K13624J69875Q2898K18143K05799K4291
8584H675067k33440r612N2359J92974R3758K18400J1795M03863L35817o3919R933
8573I686995N8475J57914o447K63341L24024J69413K54100M06993L33854P09030
$$ plain form
8563 12357692 13193952 14109176 15225690 16505789 17413532 18372945 19564164 20982399 22600243
8554 22600243 24048506 25037030 25409085 25444553 25474843 25871802 26903587 28458950 30221144
8545 30221144 32494082 35346721 39040646 44504880 52641799 64856993 83526095 109762363
8537 109762363 140705705 170859363 190735686 192600721 177633795 150288200 119111825
8530 119111825 91605528 70443710 55065406 44210586 36798602 31589840 28290025
8523 28290025 26282978 25510104 25226762 25130677 25037884 24809580 24630425 24689089 24809224 24973046
8513 24973046 25015647 24820419 24602656 24641577 24985380 25768262 26957403 28780181 31318792
8504 31318792 34971919 40326264 48347573 60679911 78825393 102354951 127873574 149270372
$$ packed form
8563A2357692Q36260R15224J116514J280099R07743R59413J191219J418235J617844
8554B2600243J448263R88524L72055L5468L0290L96959J031785J555363J762194
8545C0221144K272938K852639L693925N464234Q136919J2215194J8669102K6236268
8537A09762363L0943342L0153658J9876323J865035j4966926k7345595l1176375
8530A19111825k7506297k1161818j5378304j0854820p411984n208762l299815
8523B8290025k007047p72874k83342r6085r2793k28304j79155N8664J20135J63822
8513B4973046M2601j95228k17763L8921L43803P82882J189141J822778K538611
8504C1318792L653127N354345Q021309J2332338J8145482K3529558K5518623K1396798
$$ plain form
8496 149270372 158272985 152675137 134494169 108897487 83677871 62947859 47560901
8489 47560901 36571586 28790503 23327667 19569860 16929893 14840667 13359907 12512987
8481 12512987 11907464 11520106 11269575 11256600 10702029 10105392 9148230 8143821 7378804
8472 7378804 6778897 6313251 5979435 5555303 5126250 4770771 4466874 4257490 4220469 3992002
8462 3992002 3838839 3620353 3453734 3462897 3317435 3239648 3089592 2939795 2831314 2684478
8452 2684478 2740131 2712876 2783161 2830912 2890143 2861689 2767492 2736344 2598479 2480587 2334043
8441 2334043 2035370 1795640 1696287 1454120 1448933 1308355 1362892 1251617 1270698 1177029 1096163
8430 1096163 994313 902962 864566 782209 821701 827816 773845 779418 796132 729731 694855 675519
$$ packed form
8496A49270372R002613n597848j8180968k5596682k5219616k0730012j5386958
8489D7560901j0989315p781083n462836l757807k639967k089226j480760q46920
8481A2512987o05523l87358k50531j2975n54571n96637r57162j004409p65017
8472G378804n99907m65646l33816m24132m29053l55479l03897k09384l7021k28467
8462C992002j53163k18486j66619R163j45462p7787j50056j49797j08481j46836
8452B684478N5653k7255P0285M7751N9231k8454r4197l1148j37865j17892j46544
8441B334043k98673k39730r9353k42167n187j40578N4537j11275J9081r3669q0866
8430A096163j01850r1351l8396q2357L9492O115n3971N573J6714o6401l4876j9336
$$ plain form
8418 675519 557959 563885 621669 679000 692391 651397 487468 677268 873438 856437 924698
8407 924698 947138 842900 681412 626488 723047 607605 644331 608454 544794 550268 581010
8396 581010 635268 726467 772801 957793 975264 1015205 1336000 1584845 2068717 2741474 3281633
8385 3281633 3589638 3598935 3396665 3066543 2569743 1977716 1530108 1130073 797188 682309
8375 682309 564280 551917 469882 339398 304774 240203 276810 224425 155072 227374 224862
8364 224862 242979 223276 369109 313763 187972 177804 240336 357937 370535 248986 376467
8353 376467 454439 605553 802487 1253124 1668549 2140806 2597023 2983045 3313137 3266514
8343 3266514 3163212 2832219 2492731 2087234 1676563 1441392 1123234 982674 923922 827672
$$ packed form
8418F75519j17560N926N7784N7331J3391m0994j63929J89800J96170j7001O8261
8407I24698K2440j04238j61488n4924R6559j15442L6726l5877o3660N474L0742
8396E81010N4258R1199M6334J84992J7471L9941L20795K48845M83872O72757N40159
8385C281633L08005R297k02270l30122m96800n92027m47608m00035l32885j14879
8375F82309j18029j2363q2035j30484l4624o4571L6607n2385o9353P2302k512
8364B24862J8117j9703J45833n5346j25791j0168O2532J17601J2598j21549J27481
8353C76467P7972J51114J96934M50637M15425M72257M56217L86022L30092m6623
8343C266514j03302l30993l39488m05497m10671k35171l18158j40560n8752r6250
$$ plain form
8333 827672 765470 609709 455785 471261 290466 213520 215439 171474 151543 -65835 -73187
8322 -73187 44113 -86637 -58617 -44924 -90337 -135236 -295845 -221104 42444 -33227 -19088
8311 -19088 22936 3326 -2769 89129 308631 298865 244160 264119 275840 229785 384626 371274
8299 371274 400329 480346 477997 455351 386859 220706 137194 172560 345407 510044 780017
8288 780017 1058512 1409434 1693102 1839169 1970184 1972266 2034891 1950416 1674383 1490338
8278 1490338 1138164 721566 527168 510885 354690 264264 388502 532823 722284 927549
8268 927549 1093550 1062669 1013949 1011668 937225 940597 950690 987988 963872 943103 685350 630606
8256 630606 705943 738516 921930 1100258 1243362 1360975 1600828 1561740 1455399 1321486
$$ packed form
8333H27672o2202j55761j53924J5476j80795p6946J919m3965j9931k17378p352
8322g3187J17300j30750K8020J3693m5413m4899j60609P4741K63548p5671J4139
8311a9088M2024j9610o095R1898K19502r766n4705J9959J1721m6055J54841j3352
8299C71274K9055Q0017k349k2646o8492j66153q3512L5366J72847J64637K69973
8288G80017K78495L50922K83668J46067J31015K082O2625q4475k76033j84045
8278A490338l52174m16598j94398j6283j56195r0426J24238J44321J89461K05265
8268I27549J66001l0881m8720k281p4443L372J0093L7298k4116k0769k57753n4744
8256F30606P5337L2573J83414J78328J43104J17613K39853l9088j06341j33913
$$ plain form
8246 1321486 1122833 1144358 1198212 1181868 1210045 1171876 923000 614849 521283 448268 496132
8235 496132 540567 612310 616009 646913 690359 696032 681458 661499 628431 539436 522641 428988
8223 428988 297564 265824 125697 190218 194850 90016 98276 115380 -50525 -81991 100157
8212 100157 17649 4667 -2346 -90439 -109267 -138645 32061 43452 40006 144221 95501 39896
8200 39896 31368 24003 147758 139598 60894 229026 282923 543754 -391515 -608507 -46160
8189 -46160 71454 187725 74588 102425 68591 269798 285050 219295 279413 288787 284810
8178 284810 273454 281734 494378 462541 397438 622255 690851 763679 957697 1205503 1305686
8167 1305686 1254990 1208734 1234735 1103777 1048210 1126496 1061737 991381 1086841 1172187 1061191
$$ packed form
8246A321486j98653K1525N3854j6344K8177l8169k48876l08151r3566p3015M7864
8235D96132M4435P1743L699L0904M3446N673j4574j9959l3068q8995j6795r3653
8223D28988j31424l1740j40127O4521M632j04834Q260J7104j65905l1466J82148
8212A00157q2508j2982p013q8093j8828k9378J70706J1391l446J04215m8720n5605
8200C9896q528p365J23755q160p8704J68132N3897K60831r35269k16992N62347
8189d6160J17614J16271j13137K7837l3834K01207J5252o5755O0118R374l977
8178B84810j1356Q280K12644l1837o5103K24817O8596P2828J94018K47806J00183
8167A305686n0696m6256K6001j30958n5567P8286o4759p0356R5460Q5346j10996
$$ plain form
8156 1061191 1092493 1156489 1271351 1286257 1348503 1320502 1258533 1353656 1489586 1521141 1514684
8145 1514684 1579690 1690943 1867285 2104254 2238445 2331786 2446996 2740027 3028246 3155075
8135 3155075 3181587 3300710 3371233 3731112 4114781 4536777 5102727 6091241 7472606 9223257
8125 9223257 11097781 12950361 14778664 15817773 15307888 13228487 11172437 9153439
8117 9153439 7628096 6541973 5715925 5111538 4876235 4891850 4958525 4842049 4599708 4384578
8107 4384578 3943606 3614288 3326632 3265679 3206856 3077209 3149782 3438955 3652655 3823856
8097 3823856 4244294 4479620 4637974 4907483 5055373 4909014 4846341 4687799 4782257 5211642
8087 5211642 6086768 7318141 8830965 10685569 12762714 14488520 14632914 13532190 11477712
$$ packed form
8156A061191L1302O3996J14862J4906O2246k8001o1969R5123J35930L1555o457
8145A514684O5006J11253J76342K36969J34191R3341J15210K93031K88219J26829
8135C155075K6512J19123P0523L59879L83669M21996N65950R88514J381365J750651
8125I223257J874524J852580J828303J039109n09885k079401k056050k018998
8117I153439j525343j086123q26048o04387k35303J5615O6675j16476k42341k15130
8107D384578m40972l29318k87656o0953n8823j29647P2573K89173K13700J71201
8097C823856M20438K35326J58354K69509J47890j46359o2673j58542R4458M29385
8087E211642Q75126J231373J512824J854604K077145J725806J44394j100724k054478
$$ plain form
8078 11477712 9252697 7500857 6063387 4780645 3690878 2907730 2362223 1944251 1639437
8069 1639437 1412321 1251103 1111268 1023535 922159 699529 611616 656695 671417 691569
8059 691569 672087 670302 743661 709986 579012 514027 518661 667923 698869 541702 558072
8048 558072 562771 599345 777492 1096311 1321196 1360819 1236144 1199810 1010710 748936 511836
8037 511836 613754 468940 215103 173418 178000 237659 157170 104939 201059 196672 103380
8026 103380 36 109707 129616 162261 182493 172361 207342 189183 207446 54131 -44813
8015 -44813 -55994 54763 46641 131878 188920 300342 98146 334378 455435 380674 280601
8004 280601 159210 71773 119907 164840 92065 199189 224292 69922 87522 209938 187747
$$ packed form
8078A1477712k225015j751840j437470j282742j089767p83148n45507m17972l04814
8069A639437k27116j61218j39835q7733j01376k22630q7913M5079J4722K0152
8059F91569j9482j785P3359l3675j30974o4985M634J49262L0946j57167J6370
8048E58072M699L6574J78147L18819K24885L9623j24675l6334j89100k61774k37100
8037E11836J01918j44814k53837m1685M582N9659q0489n2231R6120m387r3292
8026A03380j03344J09671J9909L2645K0232j0132L4981j8159J8263j53315r8944
8015d4813j1181J10757q122Q5237N7042J11422k02196K36232J21057p4761j00073
8004B80601j21391q7437M8134M4933p2775J07124K5103j54370J7600J22416k2191
$$ plain form
7993 187747 180215 157039 172858 89034 -10686 -38740 -126634 -74353 -68286 -49814 12758 -7780
7981 -7780 -127516 -89195 -179 114852 178340 97201 39291 143951 177140 151531 241186
7970 241186 313841 349840 254281 163442 71245 84312 54198 53590 34676 47758 8732 -24995
7958 -24995 -21982 -26370 32279 -16614 -55055 -79906 -194932 -107824 -89256 -111954 -52790 -8597
7946 -8597 -23567 -86115 12066 -18054 20309 -17244 -162953 -57520 -82132 -109941 -66594 -18004
7934 -18004 -73145 -116601 -115952 -78714 -22515 -130226 -58915 81833 56685 109674 71755 141483
7922 141483 190549 50655 87770 81540 66440 127865 72415 196649 177459 86945 82857 131932
7910 131932 141155 280274 270237 257233 399436 393261 240393 189977 145499 208136 176327
$$ packed form
7993A87747p532k3176J5819q3824r9720k8054q7894N2281O067J8472O2572k0538
7981g780j19736L8321Q9016J15031O3488q1139n7910J04660L3189k5609Q9655
7970B41186P2655L5999r5559r0839r2197J3067l0114o08j8914J3082l9026l3727
7958b4995L013m388N8649m8893l8441k4851j15026Q7108J8568k2698N9164M4193
7946h597j4970o2548R8181l0120L8363l7553j45709J05433k4612k7809M3347M8590
7934a8004n5141m3456O49L7238N6199j07711P1311J40748k5148N2989l7919O9728
7922A41483M9066j39894L7115o230j5100O1425n5450J24234j9190r0514m088M9075
7910A31932R223J39119j0037j3004J42203o175j52868n0416m4478O2637l1809
$$ plain form
7899 176327 266611 333471 370456 292815 268716 313373 348737 534414 494841 583791 732472
7888 732472 1183024 1619751 1994130 2119504 2057816 1710846 1330751 1131198 1010796 847535
7878 847535 951602 1078621 1045549 1108755 1084378 1101894 1228803 999509 966944 1155247 1022367
7867 1022367 1055863 1033511 955772 981457 1102965 1171617 1284498 1327140 1362184 1209904 1203006
7856 1203006 1253670 1326520 1282863 1179758 1323052 1439039 1709734 1901230 2190130 2285450
7846 2285450 2370831 2353324 2080606 1666682 1230550 1015278 927448 836097 656289 700594
7836 700594 744983 752142 843671 804371 623230 591203 649693 547757 497283 421532 584137
7825 584137 662516 597805 535805 550813 432661 416543 406585 483947 543548 536926 466497 391402
$$ packed form
7899A76327R0284O6860L6985p7641k4099M4657L5364J85677l9573Q8950J48681
7888G32472M50552M36727L74379J25374o1688l46970l80095j99553j20402j63261
7878H47535J04067J27019l3072O3206k4377J7516J26909k29294l2565J88303j32880
7867A022367L3496k2352p7739K5685J21508O8652J12881M2642L5044j52280o898
7856A203006N0664P2850m3657j03105J43294J15987K70695J91496K88900R5320
7846B285450Q5381j7507k72718m13924m36132k15272q7830r1351j79808M4305
7836G00594M4389P159R1529l9300j81141l2027N8490j01936n0474p5751J62605
7825E84137P8379o4711o2000J5008j18152j6118r958P7362N9601o622p0429p5095
$$ plain form
7813 391402 464109 581722 670897 743593 774656 1365437 1132440 532122 546722 444437 386345
7802 386345 224474 233378 307039 337062 292182 214506 272992 337012 114776 142913 254806
7791 254806 298034 244255 185317 161586 298871 278768 265646 433828 473384 300499 366110
7780 366110 440825 366567 370104 316743 199194 98752 96659 254116 310097 276992 125243
7769 125243 265550 271235 229328 266094 318858 308441 336332 210951 282849 343861 269778
7758 269778 190227 306767 251656 141257 335711 384028 287215 172208 248102 197556 174265
7747 174265 197420 192000 255078 340100 197922 176988 265138 244996 296945 372797 305643 211720
7735 211720 251836 343579 396253 312814 324754 254804 272315 543903 433717 280156 323276
$$ packed form
7813C91402P2707J17613Q9175P2696L1063N90781k32997o00318J4600j02285n8092
7802C86345j61871Q904P3661L0023m4880p7676N8486O4020k22236K8137J11893
7791B54806M3228n3779n8938k3731J37285k0103j3122J68182L9556j72885O5611
7780C66110P4715p4258L537n3361j17549j00442k093J57457N5981l3105j51749
7769A25243J40307N685m1907L6766N2764j0417K7891j25381P1898O1012p4083
7758B69778p9551J16540n5111j10399J94454M8317r6813j15007P5894n0546k3291
7747A74265K3155n420O3078Q5022j42178k0934Q8150k0142N1949P5852o7154r3923
7735B11720M0116R1743N2674q3439J1940o9950J7511K71588j10186j53561M3120
$$ plain form
7724 323276 356953 394465 332815 122338 247023 382302 454100 589071 684509 529843 496826
7713 496826 449886 484156 630374 567977 600120 660611 633181 711811 784876 802170 878086
7702 878086 917667 923950 903787 851332 980172 900851 977422 1134608 1131385 1226307 1251691 1171888
7690 1171888 1286817 1350494 1417139 1417339 1524165 1742109 1848951 1884413 2002804 2159777 2214042
7679 2214042 2243623 2523790 2682653 2842423 3132010 3334448 3386877 3494759 3865196 4090946
7669 4090946 4370075 4681509 4998747 5278460 5406157 5767429 6119241 6417210 6625943 6723631
7659 6723631 6815944 6953215 6991039 6700644 6740979 6731660 6539717 6230068 6000604 5784903
7649 5784903 5444475 5208799 4942235 4514381 4330448 4074235 3747608 3490346 3152746 2904773
$$ packed form
7724C23276L3677L7512o1650k10477J24685J35279P1798J34971R5438j54666l3017
7713D96826m6940L4270J46218o2397L2143O0491k7430P8630P3065J7294P5916
7702H78086L9581O283k0163n2455J28840p9321P6571J57186l223R4922K5384p9803
7690A171888J14929O3677O6645K00J06826K17944J06842L5462J18391J56973N4265
7679B214042K9581K80167J58863J59770K89587K02438N2429J07882L70437K25750
7669D090946K79129L11434L17238K79713J27697L61272L51812K97969K08733R7688
7659F723631R2313J37271L7824k90395M0335r319j91943l09649k29464k15701
7649E784903l40428k35676k66564m27854j83933k56213l26627k57262l37600k47973
$$ plain form
7639 2904773 2743121 2585518 2410699 2320967 2136089 1987470 1829081 1666287 1501745 1305035
7629 1305035 1305058 1276551 1178498 1088314 1076171 1011021 913714 951334 950616 767371 888017 819780
7617 819780 551854 621647 656436 535900 561487 520527 550858 476562 504895 483770 405278
7606 405278 344395 498770 651191 581233 480292 426162 552917 695591 615310 427471
7596 427471 342640 266705 267704 229586 261129 243655 322077 344081 240622 185196 205228 222383
7584 222383 36889 -151726 8618 69573 119648 130282 57239 157786 244955 143980 226824
7573 226824 135727 -27210 10878 -5697 -208 103971 217612 181798 147521 158862 248637
7562 248637 356308 501383 429718 338693 165597 119004 280123 275980 165285 186811 127638
$$ packed form
7639B904773j61652j57603j74819q9732j84878j48619j58389j62794j64542j96710
7629A305035K3k8507r8053r0184j2143o5150r7307L7620p18j83245J20646o8237
7617H19780k67926O9793L4789j20536K5587m0960L0331p4296K8333k1125p8492
7606D05278o0883J54375J52421o9958j00941n4130J26755J42674q0281j87839
7596D27471q4831p5935R99l8118L1543j7474P8422K2004j03459n5426K0032J7155
7584B22383j85494j88615J60344O0955N0075J0634p3043J00547Q7169j00975Q2844
7573B26824r1097j62937L8088j6575N489J04179J13641l5814l4277J1341Q9775
7562B48637J07671J45075p1665r1025j73096m6593J61119m143j10695K1526n9173
$$ plain form
7551 127638 80605 160356 177481 169203 125318 98544 37285 65584 54960 112482 -56587 -235484
7539 -235484 -150151 29232 -72969 -150580 -114757 -82926 76147 109293 154327 22713 -23659
7528 -23659 33186 188003 115371 33184 44621 27994 56694 -37700 -90823 -145461 -191287 35234
7516 35234 59153 -75530 -50337 -45552 -1867 -55545 -75311 8981 51206 -110588 13950
7505 13950 44791 32428 -118729 -121325 27083 -6152 -59610 61148 147804 -86201 -88860
7494 -88860 148289 202289 66242 -74704 -82764 -133844 -67847 33405 15846 84356 -49523
7483 -49523 -170742 -36132 -2364 -50904 58963 22278 15638 105681 214057 115494 12771
7472 12771 -27944 -21394 -59700 15072 25717 -66091 35959 -19115 -57143 -10846 -20499 -144548
$$ packed form
7551A27638m7033P9751J7125q278m3885k6774o1259K8299j0624N7522j69069j78897
7539b35484Q5333J79383j02201p7611L5823L1831J59073L3146M5034j31614m6372
7528b3659N6845J54817p2632q2187J1437j6627K8700r4394n3123n4638m5826K26521
7516C5234K3919j34683K5193M785M3685n3678j9766Q4292M2225j61794J24538
7505A3950L0841j2363j51157k596J48408l3235n3458J20758Q6656k34005k659
7494h8860K37149N4000j36047j40946q060n1080O5997J01252j7559O8510j33879
7483d9523j21219J34610L3768m8540J09867l6685o640R0043J08376r8563j02723
7472A2771m0715O550l8306P4772J0645r1808J02050n5074l8028M6297r653j24049
$$ plain form
7460 -144548 -22374 -6326 -58802 5192 1022 40038 -22439 53565 -117481 -35824 149282
7449 149282 6195 -7089 -101448 -64971 -79272 -23550 4538 17861 27146 4328 26725 128758
7437 128758 49660 54506 46211 -153498 -153085 -21107 17194 -95276 -6525 233262 184942 -21864
7425 -21864 28723 24610 47561 192933 189386 3199 -42148 -927 -3444 -42128 -26345 -38174
7413 -38174 26887 95610 5049 11058 41922 65813 37003 72612 167620 56847 -9323 -39734
7401 -39734 -27507 11595 -986 -22012 14908 60926 67568 110827 169179 111199 -21614 107137
7389 107137 170232 -2955 -20345 29260 132550 145689 76177 52195 1950 30866 92888
7378 92888 147871 -10703 -108104 -24431 219542 216302 6222 -44365 -31928 61125 98711
$$ packed form
7460a44548J22174J6048n2476O3994m170L9016o2477P6004j71046Q1657J85106
7449A49282j43087j3284r4359L6477j4301N5722K8088J3323R285k2818K2397J02033
7437A28758p9098M846q295j99709M13J31978L8301j12470Q8751K39787m8320k06806
7425b1864N0587m113K2951J45372l547j86187m5347M1221k517l8684J5783j1829
7413c8174O5061O8723r0561O009L0864K3891k8810L5609R5008j10773o6170l0411
7401c9734J2227L9102j2581k1026L6920M6018O642M3259N8352n7980j32813J28751
7389A07137O3095j73187j7390M9605J03290J3139o9512k3982n0245K8916O2022
7378I2888N4983j58574r7401Q3673K43973l240k10080n0587J2437R3053L7586
$$ plain form
7367 98711 74435 68345 51415 89185 160878 80040 35259 163296 98426 35064 127372 88348
7355 88348 102581 79314 116205 62701 114099 63264 17433 69738 63668 47175 -43419 17285
7343 17285 49778 110531 120981 39814 3091 46908 128540 116590 137491 165392 56321 139296
7331 139296 140183 108514 196020 154553 130002 67988 153059 123747 172927 188286 184321 131885
7319 131885 144562 187576 37600 -9114 109532 86496 182516 120952 -52440 -142087 -127201
7308 -127201 -36423 13861 25266 -8419 61899 121396 140254 196976 186221 73159 235365
7297 235365 144622 28416 70405 115300 159355 226476 166733 140922 153473 149561 206221 107229
7285 107229 3243 -15127 -17382 37300 -3757 27208 43066 198070 180664 195721 197893 62322
$$ packed form
7367I8711k4276o090j6930L7770P1693q0838m4781J28037o4870o3362R2308l9024
7355H8348J4233k3267L6891n3504N1398n0835m5831N2305o070j6493r0594O0704
7343A7285L2493O0753J0450q1167l6723M3817Q1632j1950K0901K7901j09071Q2975
7331A39296Q87l1669Q7506m1467k4551o2014Q5071k9312M9180J5359l965n2436
7319A31885J2677M3014j49976m6714J18646k3036R6020o1564j73392q9647J4886
7308a27201R0778N0284J1405l3685P0318N9497J8858N6722j0755j13062J62206
7297B35365r0743j16206M1989M4895M4055O7121n9743k5811J2551l912N6660r8992
7285A07229j03986j8370k255N4682m1057L0965J5858J55004j7406J5057K172j35571
$$ plain form
7273 62322 123476 59164 33315 60157 65829 56101 60820 217019 289284 107229 13548 95038
7261 95038 -56712 -24933 -24062 42664 99826 114814 109092 73252 86631 -19296 125012 118250
7249 118250 93443 140369 168536 247482 68386 162567 118950 -34687 -41923 -5673 139829
7238 139829 125316 110481 106771 5350 -722 32721 142573 227315 177916 169765 52678 57808
7226 57808 109828 152484 192966 246509 140109 148706 125990 173887 134339 125285 74865 58059
7214 58059 117386 121248 31855 55700 252855 320862 332915 305828 186198 79810 220455
7203 220455 193938 167818 185699 111643 58341 78636 124479 -19609 -44719 100630 176518
7192 176518 207546 208581 250283 282452 199515 210004 239492 203005 306360 335046 326853 280476
$$ packed form
7273F2322O1154o4312k5849K6842N672r728M719J56199P2265j82055r3681Q1490
7261I5038j51750L1779Q71O6726N7162J4988n722l5840J3379j05927J44308o762
7249A18250k4807M6926K8167P8946j79096R4181m3617j53637p236L6250J45502
7238A39829j4513j4835l710j01421o072L3443J09852Q4742m9399q151j17087N130
7226E7808N2020M2656M0482N3543j06400Q597k2716M7897l9548r054n0420j6806
7214E8059N9327L862q9393K3845J97155O8007J2053k7087j19630j06388J40645
7203B20455k6517k6120J7881p4056n3302K0295M5843j44088k5110J45349P5888
7192A76518L1028J035M1702L2169q2937J0489K9488l6487J03355K8686q193m6377
$$ plain form
7180 280476 305921 248014 182656 178359 155577 142700 188300 153251 128301 284844 237204 99798
7168 99798 43762 54954 2185 98103 47114 72861 174761 142845 191333 223630 165049 177295
7156 177295 239736 140138 172931 174264 154354 265486 379822 379595 427120 463394 493976 569362
7144 569362 557815 560542 436706 387710 381333 172871 149127 255071 373535 300936 363370
7133 363370 341544 348815 414836 382040 349807 269220 107293 68132 137076 104098 138049 210001
7121 210001 185250 148333 231413 218487 178728 226443 272821 199208 124421 79516 39297 -24113
7109 -24113 -117462 -34641 136081 135284 70230 78884 92427 2301 225567 5206 -44270 149803
7097 149803 360591 398689 234978 223799 189488 179599 218267 173700 290247 328205 217272
$$ packed form
7180B80476K5445n7907o5358m297k2782j2877M5600l5049k4950J56543m7640j37406
7168I9798n6036J1192n2769R5918n0989K5747J01900l1916M8488L2297n8581J2246
7156A77295O2441r9598L2793J333j9910J11132J14336k27M7525L6274L0582P5386
7144E69362j1547K727j23836m8996o377k08462k3744J05944J18464p2599O2434
7133C63370k1826P271O6021l2796l2233q0587j61927l9161O8944l2978L3951P1952
7121B10001k4751l6917Q3080j2926l9759M7715M6378p3613p4787m4905m0219o3410
7109b4113r3349Q2821J70722p97o5054Q654J3543r0126K23266k20361m9476J94073
7097A49803K10788L8098j63711j1179l4311r889L8668m4567J16547L7958j10933
$$ plain form
7086 217272 245157 326876 192477 88333 160086 31410 66706 137471 73049 153230 234075
7075 234075 261837 228348 146739 165965 174475 177766 262574 282804 287343 236952 89062 45499
7063 45499 124887 175032 122158 272150 299148 196316 153742 55351 6568 -6964 64336
7052 64336 206365 301873 274213 119916 222812 263850 197927 101519 154119 291158 305053
7041 305053 144805 78703 140609 181341 186753 155084 142330 314360 442726 392213 200278
7030 200278 290776 398295 416564 370288 341472 329790 288610 292026 209791 193165 404637
7019 404637 458964 323372 218289 246627 350670 292137 358115 436578 353915 349394 284190
7008 284190 258182 289395 315344 360780 404223 354278 254147 346169 138548 37766 183548
$$ packed form
7086B17272K7885Q1719j34399j04144P1753j28676L5296P0765o4422Q0181Q0845
7075B34075K7762l3489q1609J9226Q510L291Q4808K0230M539n0391j47890m3563
7063D5499P9388N0145n2874J49992K6998j02832m2574r8391m8783j3532P1300
7052F4336J42029R5508k7660j54297J02896M1038o5923r6408N2600J37039J3895
7041C05053j60248o6102O1906M0732N412l1669j2754J72030J28366n0513j91935
7030B00278R0498J07519J8269m6276k8816j1682m1180L416q2235j6626K11472
7019D04637N4327j35592j05083K8338J04043n8533O5978P8463q2663m521o5204
7008B84190k6008L1213K5949M5436M3443m9945j00131R2022k07621j00782J45782
$$ plain form
6997 183548 325142 358735 364433 351115 209534 241364 349875 241064 251853 342298 408628
6986 408628 360473 214599 365968 341236 212541 179233 185957 315434 328893 305187 325634
6975 325634 217790 409596 527334 243719 163570 305778 374851 261776 267616 394341
6965 394341 333824 296177 329633 402783 368675 321581 311625 216001 380489 278840 176471
6954 176471 236175 186112 170758 277435 350574 217196 346106 352374 200042 260860 234058
6943 234058 297733 459211 509019 388754 358004 254253 318965 379699 424744 319962 287381
6932 287381 328408 354648 256606 182210 243848 335040 358395 300637 327594 256034 255569 136680
6920 136680 234643 382745 281736 266782 352343 373758 371757 356305 285917 283652 360021 272631
$$ packed form
6997A83548J41594L3593N698j3318j41581L1830J08511j08811J0789R0445O6330
6986D08628m8155j45874J51369k4732j28695l3308O724J29477J3459k3706K0447
6975C25634j07844J91806J17738k83615q0149J42208O9073j13075N840J26725
6965C94341o0517l7647L3456P3150l4108m7094r956r5624J64488j01649j02369
6954A76471N9704n0063j5354J06677P3139j33378J28910O268j52332O0818k6802
6943B34058O3675J61478M9808j20265l0750j03751O4712O0734M5045j04782l2581
6932B87381M1027K6240r8042p4396O1638R1192K3355n7758K6957p1560m65j18889
6920A36680R7963J48102j01009j4954Q5561K1415k001j5452p0388k265P6369q7390
$$ plain form
6908 272631 432174 427484 220312 278355 278431 221515 180810 236594 351483 326890 287335 302160
6896 302160 289257 331842 336386 349420 233668 309692 336135 311567 450492 378732 335198
6885 335198 238992 157691 127060 62671 84897 213048 153337 169536 188584 189291 194231 190516
6873 190516 332026 378202 341305 322406 369928 312661 254893 216815 223059 307710 277799 305851
6861 305851 379040 363524 419454 376453 330427 506603 493471 617766 624591 433989 344791
6850 344791 279044 305921 346191 393431 409165 318649 310751 338430 255713 285032 247935 303867
6838 303867 297082 255794 302384 252118 114215 169784 219634 182837 273047 332907 358343 283643
6826 283643 357108 403818 191935 193245 246468 255750 252029 298843 209379 273046 343006 310784
$$ packed form
6908B72631J59543m690k07172N8043P6n6916m0705N5784J14889k4593l9555J4825
6896C02160j2903M2585M544J3034j15752P6024K6443k4568J38925p1760m3534
6885C35198r6206q1301l0631o4389K2226J28151n9711J6199J9048P07M940l715
6873A90516J41510M6176l6897j8899M7522n7267n7768l8078O244Q4651k9911K8052
6861C05851P3189j5516N5930m3001m6026J76176j3132J24295O825j90602q9198
6850C44791o5747K6877M0270M7240J5734r0516p898K7679q2717K9319l7097N5932
6838C03867o785m1288M6590n0266j37903N5569M9850l6797R0210N9860K5436p4700
6826B83643P3465M6710k11883J310N3223R282l721M6814q9464O3667O9960l2222
$$ plain form
6814 310784 357547 370933 376288 270537 344306 309518 282510 184220 217342 232194 183064 319676
6802 319676 235996 304215 332331 415823 268082 70433 103100 317865 308988 367380 461486
6791 461486 306892 376633 254849 329061 361849 306515 258239 269164 284623 294195 231134
6780 231134 360052 492183 295874 281842 400105 431217 329381 309092 401303 290064
6770 290064 335438 322634 286872 320909 446571 362999 294708 333219 362843 293479 392940
6759 392940 427217 390885 273511 251235 311217 362335 390430 288219 298897 399349 508375
6748 508375 388129 452422 488248 402080 367588 393803 409023 413844 479349 495801 419542 514399
6736 514399 427922 432916 470796 487944 424983 298457 224122 304872 287753 248016 384537
$$ packed form
6814C10784M6763J3386N355j05751P3769l4788k7008r8290L3122J4852m9130J36612
6802C19676q3680O8219K8116Q3492j47741j97649L2667K14765q877N8392R4106
6791D61486j54594O9741j21784P4212L2788n5334m8276J0925J5459R572o3061
6780B31134J28918J32131j96309j4032J18263L1112j01836k0289R2211j11239
6770B90064M5374j2804l5762L4037J25662q3572o8291L8511K9624o9364R9461
6759C92940L4277l6332j17374k2276N9982N1118K8095j02211J0678J00452J09026
6748E08375j20246O4293L5826q6168l4492K6215J5220M821O5505J6452p6259R4857
6736E14399q6477M994L7880J7148o2961j26526p4335Q0750j7119l9737J36521
$$ plain form
6725 384537 396848 366022 515454 490690 445400 330898 401120 361429 440575 476165 338698
6714 338698 309567 383017 473406 447251 569286 638868 589641 403980 402190 348386 411790
6703 411790 374851 487236 392997 524224 520511 542823 366232 326901 463288 524572 619230
6692 619230 413447 417684 492332 465937 375522 433630 372793 310863 373676 425692 312170
6681 312170 289248 337271 435981 494408 512047 433610 393576 446316 609847 553551 506209
6670 506209 453896 354567 432778 444214 345196 385686 374467 399150 461322 480448 464467 441222
6658 441222 583668 522738 453403 529798 546829 545699 499448 528489 387160 298888 411177
6647 411177 410615 327891 296572 392748 524099 524869 471587 375902 597801 468747 388911 344039
$$ packed form
6725C84537J2311l0826J49432k4764m5290j14502P0222l9691P9146L5590j37467
6714C38698k9131P3450R0389k6155J22035O9582m9227j85661j790n3804O3404
6703D11790l6939J12385r4239J31227l713K2312j76591l9331J36387O1284R4658
6692F19230k05783M237P4648k6395r0415N8108o0837o1930O2813N2016j13522
6681C12170k2922M8023R8710N8427J7639p8437m0034N2740J63531n6296m7342
6670E06209n2313r9329P8211J1436r9018M0490j1219K4683O2172J9126j5981k3245
6658D41222J42446o0930o9335P6395J7031j130m6251K9041j41329q8272J12289
6647D11177n62q2724l1319R6176J31351P70n3282r5685K21899j29054p9836m4872
$$ plain form
6635 344039 416478 482081 481508 502876 390307 323220 321110 435026 443569 368294 465561 533914
6623 533914 440894 506535 568090 571649 374596 328739 339605 476225 432842 427641 473153 546703
6611 546703 528041 602566 604273 417282 430424 483439 454224 505819 600626 577099 528219 559447
6599 559447 392794 396706 538999 565532 631114 591465 552509 608782 632585 607326 577465
6588 577465 621187 600876 652933 668237 570086 599329 466632 507477 455479 488721 473261
6577 473261 380746 507334 533928 527962 486829 487499 510721 482595 596330 658058 587140 558671
6565 558671 385045 422703 455771 435366 463980 495449 592178 476853 293087 404749 370002
6554 370002 550736 409336 376479 540749 413479 486666 689648 525066 473348 599989
$$ packed form
6635C44039P2439O5603n73K1368j12569o7087k110J13916Q543p5275R7267O8353
6623E33914r3020O5641O1555L559j97053m5857J0866J36620m3383n201M5512P3550
6611E46703j8662P4525J707j86991J3142N3015k9215N1595R4807k3527m8880L1228
6599E59447j66653L912J42293K6533O5582l9649l8956N6273K3803k5259k9861
6588E77465M3722k0311N2057J5304r8151K9243j32697M0845n1998L3242j5460
6577D73261r2515J26588K6594n966m1133O70K3222k8126J13735O1728p0918k8469
6565E58671j73626L7658L3068k0405K8614L1469R6729j15325j83766J11662l4747
6554C70002J80734j41400l2857J64270j27270P3187K02982j64582n1718J26641
$$ plain form
6544 599989 605692 625238 623270 588816 539006 562646 523246 587142 458267 406479 525176 598366
6532 598366 641124 745877 727425 655397 628248 587443 526029 547444 744619 637081 572358
6521 572358 650209 573427 475273 523960 598665 709546 796034 707944 466517 469402 518793
6510 518793 582601 582962 457452 575556 590468 593485 664714 727372 621383 507399 533910
6499 533910 645444 539117 648430 768765 772752 708850 760282 741243 697768 683509 715649
6488 715649 759302 665187 713373 797454 782493 640120 627446 668640 617611 653957 647418 703629
6476 703629 705495 698686 686798 652652 611661 619293 545403 676143 797609 733404 894115 973831
6464 973831 796138 738429 725229 636336 799040 926294 784557 771351 830822 824419 894113
$$ packed form
6544E99989N703J9546j968l4454m9810K3640l9400O3896j28875n1788J18697P3190
6532E98366M2758J04753j8452p2028k7149m0805o1414K1415J97175j07538o4723
6521E72358P7851p6782r8154M8687P4705J10881Q6488q8090k41427K885M9391
6510E18793O3808L61j25510J18104J4912L017P1229O2658j05989j13984K6511
6499E33910J11534j06327J09313J20335L987o3902N1432j9039m3475j4259L2140
6488G15649M3653r4115M8186Q4081j4961j42373j2674M1194n1029L6346o539N6211
6476G03629J866o809j1888l4146m0991P632p3890J30740J21466o4205J60711P9716
6464I73831j77693n7709j3200q8893J62704J27254j41737j3206N9471o403O9694
$$ plain form
6453 894113 755514 694611 857460 923315 939516 1011008 957476 997736 972834 957371 998168
6442 998168 958608 894807 885683 933467 909766 1019138 1005874 1018767 1087715 1080734 1055892 1016536
6430 1016536 927432 1000327 1072037 1025172 815350 807184 835566 821697 865621 885557 834267
6419 834267 950422 801737 813650 871140 835502 948277 913395 1089680 935244 880602 889342
6408 889342 892963 906020 898445 856930 1057161 1062130 936175 968687 1086920 1147543 1165634 1274550
6396 1274550 1205337 1189745 1319817 1275658 1276210 1275515 1387894 1523614 1430373 1298461 1319517
6385 1319517 1395225 1313864 1303322 1243610 1214179 1220356 1321862 1282162 1193943 1381224 1495187
6374 1495187 1514122 1445052 1396087 1272402 1193910 1110450 1159667 1083339 1017330 1095539 1065279
$$ packed form
6453H94113j38599o0903J62849O5855J6201P1492n3532M0260k4902j5463M0797
6442I98168l9560o3801r124M7784k3701J09372j3264J2893O8948o981k4842l9356
6430A016536q9104P2895P1710m6865k09822q166K8382j3869M3924J9936n1290
6419H34267J16155j48685J1913N7490l5638J12775l4882J76285j54436n4642Q740
6408H89342L621J3057p575m1515K00231M969j25955L2512J18233O0623J8091J08916
6396A274550o9213j5592J30072m4159N52o95J12379J35720r3241j31912K1056
6385A319517P5708q1361j0542n9712k9431O177J01506l9700q8219J87281J13963
6374A495187J8935o9070m8965j23685p8492q3460M9217p6328o6009P8209l0260
$$ plain form
6363 1065279 856760 1048676 1153824 1102424 1114335 1139551 1140533 1160445 1113769 1023265 1018551
6352 1018551 1177258 1155667 1020835 1024248 960090 1118405 1078563 1008084 972762 960161 980436
6341 980436 966223 1035759 1085746 1078917 1098120 1306979 1279016 1183589 1325076 1410243 1429233
6330 1429233 1409994 1400965 1512354 1376582 1262315 1377738 1355619 1365207 1340723 1462885 1550786
6319 1550786 1742203 1806711 1794066 1612123 1587299 1542365 1396239 1422047 1487515 1494152 1594655
6308 1594655 1441570 1421610 1508934 1493070 1605257 1653766 1556735 1473560 1455372 1455645 1312056
6297 1312056 1320575 1517105 1576679 1603121 1629447 1640058 1691887 1642390 1628245 1592619 1632295
6286 1632295 1572483 1620954 1539435 1509324 1729625 1790250 1861564 1811571 1937844 2000878 2124212
$$ packed form
6363A065279k08519J91916J05148n1400J1911K5216R82J9912m6676r0504m714
6352A018551J58707k1591j34832L413o4158J58315l9842p0479l5322j2601K0275
6341I80436j4213O9536M9987o829J9203K08859k7963r5427J41487Q5167J8990
6330A429233j9239r029J11389j35772j14267J15423k2119R588k4484J22162Q7901
6319A550786J91417O4508j2645j81943k4824m4934j46126K5808O5468O637J00503
6308A594655j53085j9960Q7324j5864J12187M8509r7031q3175j8188K73j43589
6297A312056Q519J96530N9574K6442K6326J0611N1829m9497j4145l5626L9676
6286A632295n9812M8471q1519l0111K20301O0625P1314m9993J26273O3034J23334
$$ plain form
6275 2124212 2111515 2152537 2220452 2096774 1961214 2062739 1986213 1861504 1855043 1904001 2084985
6264 2084985 1996569 1989099 1933034 1914385 1989969 1884360 1952771 2034541 2103580 2093830 2119048 2164176
6252 2164176 2125386 2167262 2253620 2276457 2225354 2240792 2428788 2463515 2475051 2396360 2429867
6241 2429867 2357126 2179441 2144267 2121516 2201953 2232223 2079900 1948314 1985527 1933394 2061381
6230 2061381 2176447 2193303 2171805 2179166 2290495 2364683 2484111 2376920 2494075 2535565 2479173
6219 2479173 2593888 2594722 2673796 2577249 2562392 2676576 2732302 2658989 2727706 2816297 2724443
6208 2724443 2773932 2685445 2717405 2872035 2699043 2832350 2899462 2835805 2997968 2884068
6198 2884068 3004642 3152227 3084222 3100971 3208198 3213996 3321794 3348014 3429260 3453069 3536220
$$ packed form
6275B124212j2697M1022O7915j23678j35560J01525p6526j24709o461M8958J80984
6264B084985q8416p470n6065j8649P5584j05609O8411Q1770O9039r750K5218M5128
6252B164176l8790M1876Q6358K2837n1103J5438J87996L4727J1536p8691L3507
6241B429867p2741j77685l5174k2751Q0437L0270j52323j31586L7213n2133J27987
6230B061381J15066J6856k1498P361J11329P4188J19428j07191J17155M1490n6392
6219B479173J14715Q34P9074r6547j4857J14184N5726p3313O8717Q8591r1854
6208B724443M9489q8487L1960J54630j72992J33307O7112o3657J62163j13900
6198B884068J20574J47585o8005J6749J07227N798J07798K6220Q1246K3809Q3151
$$ plain form
6187 3536220 3767241 3872457 3891914 3898368 3938695 3980491 4092495 4191580 4342552 4446504 4509611
6176 4509611 4653724 4966250 5117020 5466554 5850615 6054917 6221839 6438571 6613726 6980465
6166 6980465 7231267 7581484 7963737 8432880 8967972 9591122 10440735 11421315 12746702
6157 12746702 14310466 16536030 19334382 22951655 27419183 32173100 36445521 38867989
6149 38867989 38966877 37131953 34139866 30880204 28518195 27617436 28279189 30505370 33790537
6140 33790537 36956973 38731870 38305309 35582015 31247702 26399438 21819065 17848010
6132 17848010 14847483 12793117 11088831 9887635 9034140 8231040 7767542 7235015 6935215
6123 6935215 6872605 6603485 6367911 6297463 6173228 6078054 5997112 5928043 5937078 6117585 6195023
$$ packed form
6187C536220K31021J05216J9457O454M0327M1796J12004R9085J50972J03952O3107
6176D509611J44113L12526J50770L49534L84061K04302J66922K16732J75155L66739
6166F980465K50802L50217L82253M69143N35092O23150Q49613R80580J325387
6157A2746702J563764K225564K798352L617273M467528M753917M272421K422468
6149C8867989R8888j834924k992087l259662k362009r00759O61753K226181L285167
6140C3790537L166436J774897m26561k723294m334313m848264m580373l971055
6132A7848010l000527k054366j704286j201196q53495q03100m63498n32527k99800
6123F935215o2610k69120k35574p0448j24235r5174q0942o9069R035J80507P7438
$$ plain form
6112 6195023 6151748 6112996 6202040 6296499 6362757 6617482 6841271 6957273 7099886 7389128
6102 7389128 7652029 7904269 8246922 8619592 8981445 9362005 9720961 10013724 10401093 10958822
6092 10958822 11658930 12542705 13478366 14735977 16161221 18033599 20435062 23505584 27921021
6083 27921021 33448300 39969328 46551304 51706293 54027624 53194088 49847152 45306717
6075 45306717 41205592 38739360 38230681 39978340 43370420 47667766 51402899 52724285
6067 52724285 51031303 46454618 39990478 33212028 27033821 21924578 18091172 15263701
6059 15263701 13117154 11347780 9961938 8889421 7975729 7458957 6829168 6340804 6066073
6050 6066073 5699874 5484858 5175974 4937062 4781107 4674215 4465064 4295557 4115507 4075849
$$ packed form
6112F195023m3275l8752Q9044R4459O6258K54725K23789J16002J42613K89242
6102G389128K62901K52240L42653L72670L61853L80560L58956K92763L87369N57729
6092A0958822P00108Q83775R35661J257611J425244J872378K401463L070522M415437
6083B7921021N527279O521028O581976N154989K321331q33536l346936m540435
6075D5306717m101125k466232n08679J747659L392080M297346L735133J321386
6067E2724285j692982m576685o464140o778450o178207n109243l833406k827471
6059A5263701k146547j769374j385842j072517r13692n16772o29789m88364k74731
6050F066073l66199k15016l08884k38912j55955j06892k09151j69507j80050l9658
$$ plain form
6040 4075849 3997162 3904730 3978253 3907530 3903684 3801777 3727385 3690296 3618820 3701948 3742215
6029 3742215 3802257 3744591 3609413 3703590 3668359 3638480 3649279 3600816 3625264 3627324 3546135
6018 3546135 3355574 3317558 3237999 3153219 3129203 3034931 2900064 2785610 2738565 2705620 2688978
6007 2688978 2581118 2662133 2721518 2746054 2851650 2726041 2792812 2978992 2935657 2960674 3018592
5996 3018592 2871353 2725646 2654737 2562333 2638856 2620359 2474221 2313932 2343566 2451897
5986 2451897 2340508 2343480 2310654 2153445 2069222 2204690 2233248 2155646 2176667 2204981 2217235
5975 2217235 2158601 2083158 2043307 2133110 2051009 2161749 2346238 2303802 2471864 2496652 2578496
5964 2578496 2655878 2763145 2805739 2760376 2741081 2685808 2705801 2746316 2661921 2666982 2616604
$$ packed form
6040D075849p8687r2432P3523p0723l846j01907p4392l7089p1476Q3128M0267
6029C742215O0042n7666j35178R4177l5231k9879J0799m8463K4448K060q1189
6018C546135j90561l8016p9559q4780k4016r4272j34867j14454m7045l2945j6642
6007B688978j07860Q1015N9385K4536J05596j25609O6771J86180m3335K5017N7918
5996C018592j47239j45707p0909r2404P6523j8497j46138j60289K9634J08331
5986B451897j11389K972l2826j57209q4223J35468K8558p7602K1021K8314J2254
5975B217235n8634p5443l9851Q9803q2101J10740J84489m2436J68062K4788Q1844
5964B578496P7382J07267M2594m5363j9295n5273J9993M0515q4395N061n0378
$$ plain form
5953 2616604 2534084 2391505 2373785 2342375 2389077 2415763 2371127 2262287 2305745 2195857 2320395
5942 2320395 2400843 2304318 2544292 2706828 2857969 2988901 2930440 2949183 2866441 2859031 2886283
5931 2886283 2847480 2919768 2865136 2880943 2911198 2925397 2851480 2896470 2827589 2642427 2639806
5920 2639806 2725043 2621725 2598821 2686965 2681784 2718921 2829976 2807827 2587718 2590415 2683919
5909 2683919 2713768 2868349 2940597 3096287 3169459 3292453 3322528 3347136 3261410 3185153 3212370
5898 3212370 3282191 3070331 3096670 3120780 3152909 3314456 3284282 3441043 3316586 3371372 3487790
5887 3487790 3493007 3567593 3556752 3666216 3822495 3698325 3737558 3716069 3824890 3883963 3871893
5876 3871893 3882840 3930354 4189486 4286179 4457973 4522701 4568265 4690399 4868966 4961543 5065115
$$ packed form
5953B616604q2520j42579j7720l1410M6702K6686m4636j08840M3458j09888J24538
5942B320395Q0448r6525K39974J62536J51141J30932n8461J8743q2742p410K7252
5931B886283l8803P2288n4632J5807L0255J4199p3917M4990o8881j85162k621
5920B639806Q5237j03318k2904Q8144n181L7137J11055k2149k20109K697R3504
5909B683919K9849J54581P2248J55690P3172J22994L0075K4608q5726p6257K7217
5898C212370O9821k11860K6339K4110L2129J61547l0174J56761j24457N4786J16418
5887C487790N217P4586j0841J09464J56279j24170L9233k1489J08821N9073j2070
5876C871893J0947M7514K59132R6693J71794O4728M5564J22134J78567R2577J03572
$$ plain form
5865 5065115 5032956 5177451 5380533 5586908 5664881 5862746 6124346 6466213 6770403 6936983
5855 6936983 7073375 7135195 7042322 6968303 6956633 6944248 6942768 7077985 7229132 7401601 7576500
5844 7576500 7645948 7577993 7775068 7810086 7727900 7869487 7934767 7920031 8062926 8138128 8196040
5833 8196040 8175602 7932012 7612612 7476209 7577223 7672625 7580255 7780919 7877088 7900011
5823 7900011 7913047 7872911 8050363 7901685 7762660 7603031 7568191 7373534 7278102 7075713
5813 7075713 6847548 6516484 6449072 6310318 6136603 6034301 6064055 5936606 5966163 5999884
5803 5999884 5969917 5818392 5714566 5536757 5430778 5455972 5334872 5323870 5311470 5343840
5793 5343840 5462447 5427303 5452507 5603960 5775504 5933713 6165374 6368780 6652931 6706894
$$ packed form
5865E065115l2159J44495K03082K06375P7973J97865K61600L41867L04190J66580
5855F936983J36392O1820r2873p4019j1670j2385j480J35217J51147J72469J74899
5844G576500O9448o7955J97075L5018q2186J41587O5280j4736J42895P5202N7912
5833H196040k0438k43590l19400j36403J01014R5402r2370K00664R6169K2923
5823G900011J3036m0136J77452j48678j39025j59629l4840j94657r5432k02389
5813G075713k28165l31064o7412j38754j73715j02302K9754j27449K9557L3721
5803E999884k9967j51525j03826j77809j05979K5194j21100j1002j2400L2370
5793E343840J18607l5144K5204J51453J71544J58209K31661K03406K84151N3963
$$ plain form
5783 6706894 6854318 7172087 7327900 7468338 7591906 7923419 8261719 8700435 9107562 9622521
5773 9622521 10465005 11248984 12161906 13285023 14680901 16709491 19201072 22580664 27094123
$$ packed form
5783F706894J47424L17769J55813J40438J23568L31513L38300M38716M07127N14959
5773I622521Q42484P83979R12922J123117J395878K028590K491581L379592M513459
$$ [...]
##END NTUPLES=NMR SPECTRUM
##END=
