##TITLE=1H_DE-80H_X3
 200.13MHz, d2o
 8 sc
 
 19ns.26.2.2025
##JCAMPDX= 6.0         $$ Bruker NMR JCAMP-DX V2.0
##DATA TYPE= NMR SPECTRUM
##DATA CLASS= NTUPLES
##ORIGIN= UXNMR, Bruker Analytische Messtechnik GmbH
##OWNER= pz
$$ XWIN-NMR		Version 3.5
$$ Thu Dec 11 10:40:04 2025 Russian Standard Time (UT+4h)  Yarkov@DPX200
##.OBSERVE FREQUENCY= 200.1313
##.OBSERVE NUCLEUS= ^1H
##.ACQUISITION MODE= SIMULTANEOUS
##.ACQUISITION SCHEME= undefined
##.AVERAGES= 8
##.DIGITISER RES= 18
##SPECTROMETER/DATA SYSTEM= spect
##.PULSE SEQUENCE= zg30
##.SOLVENT NAME= CDCl3
##.SHIFT REFERENCE= (INTERNAL, CDCl3, 0, 15.4781)
##AUDIT TRAIL= $$ (NUMBER, WHEN, WHO, WHERE, WHAT)
$$ ##TITLE= Audit trail, XWIN-NMR		Version 3.5
$$ ##JCAMPDX= 5.01
$$ ##ORIGIN= Bruker BioSpin GmbH
$$ ##OWNER= Yarkov
$$ C:/Bruker/XWIN-NMR/data/yarkov2/nmr/H-C/1/pdata/1/auditp.txt
$$ ##AUDIT TRAIL=  $$ (NUMBER, WHEN, WHO, WHERE, WHAT)
(   1,<2025-12-11 10:39:10.62 +0400>,<Yarkov>,<DPX200>,
      <created by zg, POWCHK disabled, PULCHK disabled
       configuration hash MD5:
       00 E9 B6 7A A2 85 ED C7 34 08 36 98 17 FE 4E 26
       data hash MD5: 16K
       47 A6 B1 D5 06 39 A4 DE 97 C6 40 EA 19 9B C3 F0>)
(   2,<2025-12-11 10:39:20.01 +0400>,<Yarkov>,<DPX200>,
      <Start of raw data processing
       efp BC_mod = 2 LB = 0.25 FT_mod = 6 PKNL = 1 PHC0 = -5306.083 PHC1 = 17.82193 SI = 16K 
       data hash MD5: 16K
       E0 CF 40 F6 ED BE FF AA 41 F0 AC 76 DD 29 0B B8>)
$$ ##END=
$$ 
$$ hash MD5
$$ 8E 9C D9 06 48 E9 A0 27 A0 53 AF 17 CF 59 5B DF
##$RELAX= 
##$RELAX= 
##$RELAX= 
##$RELAX= 
##$RELAX= 
##$RELAX= 
$$ Bruker specific parameters
$$ --------------------------
##$DU= <C:/Bruker/XWIN-NMR>
##$EXPNO= 1
##$NAME= <H-C>
##$PROCNO= 1
##$TYPE= <nmr>
##$USER= <yarkov2>
##$AMP= (0..31)
100 100 100 100 100 100 100 100 100 100 100 100 100 100 100 100 100 100 
100 100 100 100 100 100 100 100 100 100 100 100 100 100 
##$AQSEQ= 0
##$AQ_mod= 1
##$AUNM= <au_zg>
##$AUTOPOS= <>
##$BF1= 200.13
##$BF2= 200.13
##$BF3= 200.13
##$BF4= 200.13
##$BF5= 200.13
##$BF6= 200.13
##$BF7= 200.13
##$BF8= 200.13
##$BYTORDA= 1
##$CFDGTYP= 0
##$CFRGTYP= 5
##$CHEMSTR= <none>
##$CNST= (0..31)
1 1 145 1 1 1 1 1 1 1 1 1 1 1 1 1 1 1 1 1 1 1 1 1 1 1 1 1 1 1 1 1 
##$CPDPRG= <>
##$CPDPRG1= <>
##$CPDPRG2= <>
##$CPDPRG3= <>
##$CPDPRG4= <mlev>
##$CPDPRG5= <mlev>
##$CPDPRG6= <mlev>
##$CPDPRG7= <mlev>
##$CPDPRG8= <mlev>
##$CPDPRGB= <>
##$CPDPRGT= <>
##$D= (0..31)
0 0.7 0 0 0 0 0 0 0 0 0 0.03 0 0 0 0 0 0 0 0 0 0 0 0 0 0 0 0 0 0 0 0 
##$DATE= 1765435150
##$DBL= (0..7)
120 120 120 120 120 120 120 120 
##$DBP= (0..7)
150 150 150 150 150 150 150 150 
##$DBP07= 0
##$DBPNAM0= <>
##$DBPNAM1= <>
##$DBPNAM2= <>
##$DBPNAM3= <>
##$DBPNAM4= <>
##$DBPNAM5= <>
##$DBPNAM6= <>
##$DBPNAM7= <>
##$DBPOAL= (0..7)
0.5 0.5 0.5 0.5 0.5 0.5 0.5 0.5 
##$DBPOFFS= (0..7)
0 0 0 0 0 0 0 0 
##$DE= 6
##$DECBNUC= <off>
##$DECIM= 32
##$DECNUC= <off>
##$DECSTAT= 4
##$DIGMOD= 1
##$DIGTYP= 9
##$DL= (0..7)
0 120 120 120 120 120 120 120 
##$DP= (0..7)
$$ [...]
##$SUBNAM2= <"">
##$SUBNAM3= <"">
##$SUBNAM4= <"">
##$SUBNAM5= <"">
##$SUBNAM6= <"">
##$SUBNAM7= <"">
##$SUBNAM8= <"">
##$SUBNAM9= <"">
##$SW= 18.0517328524113
##$SWIBOX= (0..15)
0 0 2 0 0 0 0 0 0 0 0 0 0 0 0 0 
##$SW_h= 3612.71676300578
##$TD= 16384
##$TD0= 1
##$TE= 0
##$TE2= 300
##$TE3= 300
##$TEG= 300
##$TL= (0..7)
0 120 120 120 120 120 120 120 
##$TP= (0..7)
150 150 150 150 150 150 150 150 
##$TP07= 0
##$TPNAME0= <>
##$TPNAME1= <>
##$TPNAME2= <>
##$TPNAME3= <>
##$TPNAME4= <>
##$TPNAME5= <>
##$TPNAME6= <>
##$TPNAME7= <>
##$TPOAL= (0..7)
0.5 0.5 0.5 0.5 0.5 0.5 0.5 0.5 
##$TPOFFS= (0..7)
0 0 0 0 0 0 0 0 
##$TUNHIN= 0
##$TUNHOUT= 0
##$TUNXOUT= 0
##$USERA1= <user>
##$USERA2= <user>
##$USERA3= <user>
##$USERA4= <user>
##$USERA5= <user>
##$V9= 5
##$VALIST= <valist>
##$VCLIST= <CCCCCCCCCCCCCCC>
##$VD= 0
##$VDLIST= <DDDDDDDDDDDDDDD>
##$VPLIST= <PPPPPPPPPPPPPPP>
##$VTLIST= <TTTTTTTTTTTTTTT>
##$WBST= 1024
##$WBSW= 4
##$XGAIN= (0..3)
0 0 0 0 
##$XL= 0
##$YL= 0
##$YMAX_a= 125105
##$YMIN_a= -88857
##$ZGOPTNS= <>
##$ZL1= 120
##$ZL2= 120
##$ZL3= 120
##$ZL4= 120
##$ABSF1= 0
##$ABSF2= 0
##$ABSG= 0
##$ABSL= 0
##$ALPHA= 0
##$AQORDER= 0
##$ASSFAC= 0
##$ASSFACI= 0
##$ASSFACX= 0
##$ASSWID= 0
##$AUNMP= <proc_1d>
##$AZFE= 0.1
##$AZFW= 0.1
##$BCFW= 0
##$BC_mod= 2
##$BYTORDP= 0
##$COROFFS= 0
##$CY= -3
##$DATMOD= 1
##$DC= 0
##$DFILT= <>
##$DTYPP= 0
##$F1P= 0
##$F2P= 0
##$FCOR= 1
##$FTSIZE= 16384
##$FT_mod= 6
##$GAMMA= 0
##$GB= 0
##$INTBC= 1
##$INTSCL= 3.241238e-09
##$ISEN= 128
##$LB= 0.25
##$LEV0= 0
##$LPBIN= 0
##$MAXI= 10000
##$MC2= 0
##$MEAN= 0
##$ME_mod= 0
##$MI= 1.114404
##$NCOEF= 0
##$NC_proc= -8
##$NLEV= 6
##$NOISF1= 3.799351
##$NOISF2= 2.8
##$NSP= 0
##$NTH_PI= 0
##$NZP= 0
##$OFFSET= 15.47805
##$PC= 1
##$PHC0= -5306.083
##$PHC1= 17.82193
##$PH_mod= 1
##$PKNL= yes
##$PPARMOD= 0
##$PSCAL= 0
##$PSIGN= 0
##$REVERSE= no
##$SF= 200.130008736152
##$SI= 16384
##$SIGF1= 3
##$SIGF2= 2
##$SINO= 0.751879
##$SIOLD= 32768
##$SREGLST= <19F.Aceton>
##$SSB= 0
##$STSI= 16384
##$STSR= 0
##$SW_p= 3612.71676300578
##$SYMM= 0
##$S_DEV= 0
##$TDeff= 16384
##$TDoff= 0
##$TI= <>
##$TILT= no
##$TM1= 0
##$TM2= 0
##$TOPLEV= 0
##$USERP1= <user>
##$USERP2= <user>
##$USERP3= <user>
##$USERP4= <user>
##$USERP5= <user>
##$WDW= 1
##$XDIM= 16384
##$YMAX_p= 451877912
##$YMIN_p= -1206825
$$ End of Bruker specific parameters
$$ ---------------------------------
##NTUPLES= NMR SPECTRUM
##VAR_NAME=  FREQUENCY,     SPECTRUM/REAL,   SPECTRUM/IMAG
##SYMBOL=    X,             R,               I
##VAR_TYPE=  INDEPENDENT,   DEPENDENT,       DEPENDENT
##VAR_FORM=  AFFN,          ASDF,            ASDF
##VAR_DIM=   16384,         16384,           16384
##UNITS=     HZ,            ARBITRARY UNITS, ARBITRARY UNITS
##FACTOR=    0.220516191357247, 1,           1
##FIRST=     3097.62232813547, 0,            0
##LAST=      -515.094434870311, 0,           0
##MIN=       -515.094434870311, -1206825,    0
##MAX=       3097.62232813547, 451877912,    0
$$ Real data points
##PAGE= N=1
##DATA TABLE= (X++(R..R)), XYDATA
$$ [...]
11922h3630M6842K06165M4711J5304J24401l48964J30477j29973K7099K58894
11912B91326K66146M7933k67024j69866J71250k5753p1628m0375m4632Q1610L6540
11901B75527o1766j79822k5448J66854K36143k95340J48881k1981M3686j54974
11891A31760N6535k853J95908J30922l39777m6838L67665o0275j89321k78470
11881c4744J49587j471j24224M29085p3579n8373L7001J91120n9503n84910Q2791
11870d7220M2793J25425J45593L0655o1579K27333Q1286j19055M4045k15576k01708
11859E1992J17285j2261r3503J9745k39623L07587q038o0225P2862j18301R8559
11848A36079j22504P7510k05113K62794J5486j237p0187n4067K990L87905L3897
$$ y = [-83630, -36788, 169377, 214088, 229392, 353793, 4829, 135306, 5333, 32432, 291326, 557472, 605405, 338381, 168515, 339765, 314012, 242384, 202009, 157377, 238987, 275527, 213761, 33939, 8491, 175345, 411488, 116148, 265029, 243048, 286734, 131760, 188295, 185442, 381350, 512272, 172495, 125657, 493322, 433047, 243726, -34744, 114843, 113372, -10852, 418233, 344654, 286281, 323282, 514402, 454899, -130011, -47220, -4427, 120998, 266591, 297246, 235667, 463000, 544286, 425231, 469276, 253700, 51992, 169277, 157016, 63513, 83258, -156365, 151222, 143184, 82959, 155821, 37520, 136079, 13575, 91085, -114028, 148766, 164252, 163015, 92828, 38761, 41751, 429656, 463553]
11837D63553N5198j73947j65106M9302K912j63049K95574J36485l39442Q315k03409
11826c3614K80740j70069J27686J14539L224k0429o7415k96874J52936k55407
11816a64683J10544J84062O9422n5539o573J5657r8399J87763j01716l582N2760
11805A89716k59919k6653J45957P7988j62106N0775K74154J74282j37556l5713
11795B90925j15223n9890M7031K11053k63094R6629M8741K17833j16170n18355
11785a60520P8569K69676N9095m29581J08596L09084J24823j89065P6403k92370
11775d5290l10228L10973R1195J13492j69005j8310N73904Q2256m74169j9352
11765A35466r4552K74850J2513k58272J42320l7219q4641J06880J80993j42202
$$ y = [463553, 518751, 344804, 179698, 229000, 231912, 68863, 364437, 500922, 161480, 169795, -33614, 247126, 77057, 204743, 319282, 322506, 302077, 234662, -62212, 90724, -164683, -54139, 129923, 199345, 143806, 137233, 152890, 54491, 242254, 140538, 136956, 189716, -70203, -96856, 49101, 127089, -35017, 15758, 289912, 464194, 326638, 290925, 175702, 115812, 162843, 373896, 110802, 207431, 256172, 474005, 357835, -160520, -81951, 187725, 246820, -182761, -74165, 234919, 359742, 170677, 247080, -45290, -355518, -44545, 46650, 160142, -8863, -27173, 546731, 628987, 154818, 135466, 40914, 315764, 328277, 70005, 212325, 175106, 90465, 197345, 378338, 236136]
11755B36136l2562k05270O0667J49216j38247j83489K52903J54670j11922k89517
11745a07415K63276J43728k8782l09710q3361M1287K51088K46337m4432r0915
11735B81101k0042r1129J6056J41112k27302N2905p0624K12664j95853J37202
11725B36090j41232o8848R7229L4570J20227J46967k08377n151J48316r6911L99714
11714F62594j29901J9917j17732Q42J35865N3772l86813P6580l7605k83252j88210
11703a93943J13110J84257R8571j8909K9710j51870N4514M23490m5174J90199
11693F83955R8403j00060k44588K563K94548m00721o2175K73679j43492k39063
11683A63049k48277J43831O3421k4583Q0220o843j32635n0937J42744j27363K9017
$$ y = [236136, 203574, -1696, 58971, 208187, 69940, -113549, 139354, 294024, 182102, -107415, 155861, 299589, 270807, -38903, -122264, -80977, 170111, 416448, 372016, 281101, 261059, 169930, 185986, 327098, 99796, 152701, 82077, 294741, 98888, 236090, 94858, 26010, 123239, 157809, 278036, 425003, 216626, 211475, 359791, 262880, 662594, 532693, 552610, 434878, 435720, 571585, 625357, 238544, 315124, 277519, -5733, -193943, -80833, 103424, 201995, 183086, 212796, 60926, 115440, 538930, 493756, 683955, 782358, 682298, 437710, 440273, 734821, 334100, 271925, 545604, 402112, 163049, -85228, 58603, 122024, 97441, 177661, 170818, 38183, -12754, 129990, 2627, 31644]
11672C1644J71810L5879k00849J04444J71831K8704j15972J67168j42438J9405
11662B71626J2260k52356K7252J94908J49158p7232m0834P520k24207K10160J88542
11651D66797J08199j5957j34177j17057Q7965J0853m82006J83958J13058K35755
11641D57388j47660n2075j64411L5123j42456K6673J02614J80242j60223j39829
11631d614J1955L37147O9988o9910k06806l471R7209J59568J50714j97636K9399
11620C73543l1996n6539L0637J09994J21135J89069k96831l57188j33275J99612
11610A48161P2445p8625K56184l7785O3395l15053J35218r5637Q8028P9259j26682
11599A88908J18987j52967k46734J24989J41396j32542K42007L8933K8238N637
$$ y = [31644, 203454, 239333, 38484, 142928, 314759, 343463, 227491, 394659, 252221, 271626, 283886, 31530, 58782, 253690, 402848, 325616, 284782, 292302, 68095, 278255, 466797, 574996, 559039, 424862, 307805, 395770, 406623, -75383, 108575, 221633, 457388, 309728, 257653, 93242, 128365, -14091, 12582, 115196, 295438, 135215, -4614, 7341, 344488, 414476, 344566, 137760, 134289, 231498, 391066, 541780, 344144, 373543, 341547, 285008, 315645, 425639, 546774, 735843, 439012, 81824, -51451, 148161, 220606, 141981, 398165, 360380, 423775, 108722, 243940, 148303, 236331, 315590, 188908, 307895, 154928, -91806, 33183, 174579, 42037, 284044, 322977, 351215, 356852]
11589C56852n3877R100K17589n3074k9018j41713J47304j16428q379O5133j43865
11578B49624J54584j47689j32692O9256k9405K48162K28186l57304j72387K29489
11568C39824M7905j75537J40963k3144j48169K13652J79090l58625k35426K29614
11558B10147j21190J80472J33569J02876j1937J25776o6094k77385J4089j55897
11548A34426p3128j87944k2731K11696K93776m2062P1589J5528j73816K1013K00110
11537D48457j7569k2214j15823k12919J07232l017K90969k92719J40437L1320
11527C54154J19093m3379p0659J1683K70801k74804k14662n4063J47114j11145
11517A34133J85394O9238J8389n8368j37873J9998r2816J41633j77879P9937J18051
$$ y = [356852, 302975, 312075, 529664, 476590, 447572, 305859, 453163, 336735, 328356, 393489, 249624, 404208, 256519, 123827, 193083, 163678, 411840, 640026, 282722, 110335, 339824, 387729, 212192, 353155, 330011, 181842, 395494, 574584, 215959, -19467, 210147, 88957, 269429, 402998, 505874, 493937, 619713, 553619, 276234, 290323, 134426, 61298, -126646, -149377, 62319, 356095, 314033, 385622, 401150, 227334, 248347, 448457, 430888, 408674, 292851, 79932, 187164, 184147, 475116, 182397, 322834, 354154, 473247, 429868, 359209, 370892, 641693, 366889, 152227, 98164, 245278, 134133, 319527, 388765, 407154, 348786, 210913, 230911, 138095, 279728, 101849, 181786, 299837]
11506B99837J24981m35129J82907k6495P1301M8377R53j1804N8369k1416l4418
11495B57463J71518k00978K53960r9717r4517j51825J57657R061J1514j23805
11485A90331q4592p7903J20734L71538j89253k6776j48611K2613j31063J72555
11475B19573j94148l4397j1510J41732M6424J96029k944k62420l2305J03104j69804
11464f66n9895J25445J29545L9959l4420P9229j25298j13269J72160k69724k6079
11453h3013J87792L5487J1265J81732J71690k08460j44136j7953M5371l14059
11443a34284P5664j42777M13289K11743o4464k0118j45096K3859J45818q2192
11433B81442r7235j89273j0377L35127J3335l23738J98422L8590o3982Q7676l82650
$$ y = [299837, 424818, -10311, 172596, 146101, 217402, 265779, 266732, 254928, 313297, 291881, 257463, 428981, 228003, 481963, 382246, 287729, 135904, 293561, 302622, 314136, 190331, 105739, 27836, 148570, 520108, 330855, 304079, 155468, 178081, 47018, 219573, 25425, -8972, -20482, 121250, 167674, 363703, 360759, 98339, 66034, 169138, -666, -60561, 64884, 194429, 234388, 199968, 279197, 153899, 40630, 212790, -56934, -83013, 104779, 140266, 151531, 333263, 504953, 296493, 152357, 134404, 179775, -134284, -58620, -201397, 211892, 423635, 359171, 339053, 193957, 217816, 363634, 281442, 184207, -5066, -15443, 319684, 333019, 9281, 207703, 246293, 182311, 269987, -112663]
11422a12663L9299J77593L96763M8234j65902l0046K43477j01164j51525m67187
11412a23121O2332q5146K89570M8168k59420j5384n7073Q3572q843J14515J52944
11401B02114J27160K1464l2539M6670o1674l1305N6612j29368n6018j52572j48015
11390a57471J64371J80003L07496j92020J24530l01697j23532N00800K47032j82815
11380E66697k80405K49433l0527l46167J4515j98259J06282L00650j02354j62196
11370A17669N3831k4534j77806M31700k37361l3972r9108n0611K1678L34731J5357
11359C51574O6267j43964Q6371K6451j14674k03538k887J40248J20492j09337
11349B17003J32292m3374k71239p0642J38753k00501J82734j36246K83917j51105
$$ y = [-112663, -73364, 104229, 500992, 549226, 383324, 353278, 596755, 495591, 344066, -123121, -60789, -145935, 143635, 191803, -67617, -83001, -140074, -56502, -65345, 49170, 202114, 329274, 350738, 318199, 364869, 303195, 271890, 328502, 199134, 143116, -9456, -157471, 6900, 186903, 494399, 302379, 426909, 125212, 1680, 502480, 749512, 566697, 286292, 535725, 505198, 159031, 173546, -24713, 81569, 382219, 279865, 117669, 171500, 146966, -30840, 400860, 163499, 129527, 30419, -20192, 1486, 336217, 351574, 417841, 273877, 360248, 386699, 272025, 68487, 65600, 205848, 326340, 217003, 349295, 305921, 34682, -35960, 102793, -97708, 85026, -51220, 232697, 81592]
11339H1592N8219O090k12963K85220K27662J02157j70682J12662j76810O4630
11329C77777j59816Q2531k00234N974j26298J72456P3324j24397k24559n6715
11319a79957K05064J65511R9214l0325j07781l81094l2487O9600J63940k4584
11309e2899P2354k17866R6707M08306p375J03614q7619K0011J23427K22126n5341
11298F25445k59129r7456R0340j14853k4245M3368L16659n0043k14778J13548
11288D28856p3387j73691j23619k37958L5455J69890Q4319k76774L3577J00970
11278c2362j41701L07832L5486R2366o791j53754J7263p1932J07592r6660j62230
11267a04891L6839r9666K13134K08239P7333M1909J27937j56475L2R7954j35916
$$ y = [81592, 139811, 145901, -67062, 218158, 445820, 547977, 377295, 489957, 313147, 377777, 217961, 300492, 100258, 106232, -20066, 152390, 225714, 101317, -123242, -179957, 25107, 190618, 289832, 259507, 151726, -229368, -261855, -192255, -28315, -52899, 19455, -198411, -101704, 306602, 299227, 402841, 315222, 335233, 458660, 680786, 625445, 366316, 268860, 359200, 244347, 220102, 263470, 580129, 530086, 315308, 428856, 355469, 181778, 58159, -179799, -144344, 25546, 109865, -166909, -133332, -32362, -174063, 133769, 169255, 261621, 254830, 101076, 118339, 46407, 153999, 57339, -104891, -68052, -167718, 45416, 253655, 330988, 372897, 500834, 344359, 344391, 442345, 306429]
11256C06429n3457J25596l09782J71958J84065k90724R1642j54810n9339Q1558
11246I3136j2668J758j4040J3917L14486j23267N7450m2160J40566k17158M5975
11235B57995N8673L598j93920R4248j01465J49535j81320L4373K15325j22865
11225B14177j4413Q1885n0210k54240J30713R4732J06969l62400J05364J41292
11215A93869R4649l44781o2331j21612K0827K62531L96691o1257j49759J31723
11205C60550k8478j01014r4488j10538J5671j6787N4485L61720K6708j63554l8481
11194B65794m8662p4046L53606n6357J3883R0689k57174l1917k23182J40202K49220
11183D22056m0549k99082k8974m6487J98861L1922j07828Q0811L7468j28349J74561
$$ y = [306429, 252972, 378568, 68786, 240744, 424809, 134085, 225727, 70917, 11578, 93136, 80468, 82226, 68186, 82103, 396589, 273322, 330772, 288612, 429178, 212020, 257995, 316668, 320266, 126346, 220594, 119129, 268664, 87344, 121717, 337042, 214177, 199764, 281649, 231439, -22801, 107912, 202644, 309613, -52787, 52577, 193869, 288518, -56263, -118594, -240206, -219379, 43152, 439843, 378586, 228827, 360550, 332072, 231058, 136570, 26032, 41703, 24916, 79401, 441121, 467829, 304275, 265794, 217132, 143086, 496692, 440335, 454218, 544907, 287733, 255816, 32634, 172836, 422056, 381507, 82425, 53451, 6964, 205825, 237747, 129919, 210730, 248198, 119849, 294410]
11172B94410J02486r8437R1401o3407K8382j90093k36551M05472R8975o8718j57010
11161B06910J51856M0205j94126K00833r2056L8811j36738m260J40445l72727
11151b0847j62963M39168K83063j9431k06900L933j70811l9762J88254j13543
11141A80161j22867K94497l2522K7151q5600n7259j01778O0838r2830L11742j38393
11130B43140j0492O1004o3285J92915o2910p8965k0948J81629k17547K62560q4667
11119D02434m2190k0836k77997j79873K74028o463J03202l50536l6682M14713
11109B79800j47088k3319N5467R0014k5471q0156k0675K39581j57393n2261j79586
11098b1087M7587J15755l4628j05660j19125J16648L8452L26753R5303l7715m40930
$$ y = [294410, 396896, 298459, 389860, 326453, 354835, 164742, -71809, 333663, 432638, 363920, 206910, 358766, 398971, 204845, 405678, 313622, 352433, 215695, 211435, 351880, -20847, -183810, 255358, 538421, 518990, 312090, 316023, 145212, 105450, 293704, 180161, 57294, 351791, 319269, 346420, 260820, 203561, 101783, 162621, 69791, 381533, 243140, 232648, 293652, 230367, 423282, 360372, 281407, 260459, 442088, 224541, 487101, 402434, 360244, 339408, 61411, -118462, 155566, 149103, 252305, -98231, -134913, 279800, 132712, 109393, 164860, 254874, 229403, 149247, 128572, 368153, 210760, 158499, -21087, 26500, 142255, 107627, 1967, -117158, -510, 37942, 364695, 459998, 422283, -18647]
11087a8647J26103K38226J84650j3278j23960p9632j12783n4663J52418M1985
11077C40419J29999O1675q3697k15189j27330J72762j42911l09278l3358L07456
11067A00548N1956J17341k21214M7656K17284r0071q7571K28282L4426q1633L21901
11056F38905p4687K2371k50518m29168M42157K9493J40291p6985j53102j21829
11046A66928k530m7934K17758M945R7104n5745j81205L27743r2224L4558P7662
11035E47060j54840M9583k40772j61216J49591k66985M3421m5904K31994K0036
11025A71968l8920o4922j47079R7417L92125j12359L4986N2944r3030J03885k74289
11014A22726K83156J28112r5890l52318L4573J78546r0414l3106J92250j1206
$$ y = [-18647, 107456, 345682, 530332, 517054, 393094, 313462, 200679, 146016, 298434, 340419, 470418, 532093, 448396, 233207, 105877, 278639, 135728, -173550, -206908, 100548, 152504, 269845, 48631, 96287, 313571, 223500, 135929, 364211, 398637, 317004, 638905, 564218, 586589, 336071, -93097, 349060, 378553, 518844, 441859, 288757, 166928, 164398, 116464, 334222, 339167, 436271, 380526, 199321, 527064, 434840, 469398, 547060, 392220, 441803, 201031, 39815, 189406, -77579, -34158, -80062, 151932, 171968, 133048, 68126, -78953, 18464, 410589, 298230, 333216, 386160, 293130, 397015, 122726, 405882, 533994, 438104, 85786, 120359, 298905, 208491, 175385, 367635, 356429]
11004C56429L8310j03356j34672p9891J91006J53590k66994j82011k15524J55568
10994h7545q9683N0995J79438L58837m7489K54752n5913l22375k4884K97271l38459
10983A74945q8179K12225j01633J23230P4545j1957m0612m4443j07079J94522
10973C85564l09627J09027p487Q5754j71113j60205K0766L41751J22701J56779
10963E73910j13652o1750o9207k30895L03265n8975k726K52327j7645k75322l2380
10952B66950P7297o8718k05672j48864J75374J78870l86176o2004J94485K33573
10942B55115j96627J01652J14319J2971k67603K25335J25176K92123k44627p0417
10932C47417o3506J13815R1584k03643K24737k97043K04068l11374J5870P4796
$$ y = [356429, 394739, 291383, 156711, 76820, 267826, 421416, 154422, -27589, -243113, -87545, -177228, -126233, 53205, 412042, 364553, 619305, 563392, 241017, 216133, 513404, 174945, 86766, 298991, 197358, 320588, 395133, 383176, 342564, 298121, 191042, 385564, 75937, 184964, 177477, 263231, 92118, -68087, -47321, 294430, 417131, 573910, 460258, 398508, 329301, 98406, 401671, 342696, 339970, 592297, 574652, 299330, 266950, 344247, 275529, 69857, -79007, 96367, 275237, -110939, -172943, 21542, 255115, 58488, 160140, 274459, 287430, 19827, 245162, 370338, 662461, 417834, 347417, 283911, 397726, 489310, 285667, 510404, 213361, 417429, 106055, 121925, 196721]
10922A96721K33776k05835J14664l5414p221k68501k22327L5694R9839O1260j30043
10911a27387j76258L36677p2444J75113m1796K16458K82242k12241J26477j68793
10901C38048J75254L5420O7650k51477J6999P9067j58225j97642J96087j47356
10891A53825J06222r9493o7775N8605M8995J71139j13452k36390j63493M14869
10881B73052K49236j70490k12204J07253K41053L3008q09o8274J2017j76439j55704
10870A31699j81600J52536l3747M6615R3803J76716l7908L7454j11499k54148
10860A9921L7317K3848K60006l3682N0003J99894j69355o2549j18689J73035J16053
10849D95802j62296l0522J10927j59742j87045j92182K22471P0223k06437J90114
$$ y = [196721, 430497, 224662, 339326, 303912, 296691, 28190, -194137, -158443, -58604, 2656, -127387, -303645, 33032, -39412, 135701, 93905, 310363, 592605, 380364, 506841, 338048, 513302, 548722, 616372, 364895, 381894, 460961, 302736, 105094, 301181, 153825, 260047, 160554, 92779, 151384, 200379, 371518, 258066, 21676, -141817, 273052, 522288, 351798, 139594, 246847, 487900, 520908, 520099, 451825, 463842, 287403, 131699, -49901, 102635, 68888, 115503, 209306, 386022, 348114, 385568, 274069, 19921, 57238, 81086, 341092, 307410, 357413, 557307, 387952, 325403, 206714, 379749, 495802, 333506, 302984, 413911, 254169, 67124, -125058, 97413, 167636, -38801, 151313]
10839A51313r5747Q2722N01263r134m23473Q7792l91407J91246L8291j8998Q100
10828A21968M01611L6815q0172m0554N1534j38911j43624J30828j67646j13256
10818E8593K39311n8384k79528K13003J8109L03674k48032j28533J1095R7853
10808B27161k0487M167j73067j0717p2006o3481O0933M48985k4769n392J11433
10797D82760m51849K87708P2882j40571j88040L14661R8753k88517k0178J34838
10787C02447j91969q4408L17812q1426j11329J33639O6392j51408K3240l24550
10777a01560Q2622L5155j613J64445l1744k415j28296J49268j12463J09795J85603
10766C48797m4923q5227K17795j46177j88311j62661m1855J27332O0078j93026
$$ y = [151313, 55566, 138288, 639551, 630417, 206944, 294736, -96671, 94575, 132866, 113868, 121968, 523579, 560394, 480222, 439668, 491202, 352291, 208667, 339495, 171849, 58593, 297904, 239520, -40008, 172995, 191104, 494778, 246746, 118213, 129308, 227161, 206674, 210841, 37774, 27057, -44949, -108430, -47497, 401488, 376719, 371327, 482760, 30911, 318619, 391501, 250930, 62890, 377551, 476304, 187787, 167609, 302447, 110478, 26070, 343882, 262456, 151127, 284766, 351158, 199750, 222990, -101560, -18938, 16217, 14604, 179049, 147305, 144890, 16594, 165862, 53399, 163194, 348797, 303874, 218647, 436442, 290265, 101954, -60707, -102562, 24770, 84848, -108178]
10756a08178R0221J5024O1530J90115p5144J91644K7825k19632r5804O2084K32358
10745C72043j61834R5755J7046j62911N5338M1618j442j22897j3422P5799J9327
10734B14420k492J02609j69453j0756k0706N9141J5242j26510J03706R4312k37990
10723B1523K071j72624K59418m834O3874N4746Q2273J73582k029K39901N5701
10712G73602m91629q0870j8942o4157M12125k69565j08918J17105M84482k52720
10702E00513m30120R7126j8477n5548J49191j35526L978l38124L77633K92835
10692D43481m09032P5011K5774K87190p3828J2535m7834J20663L1470k75831K2743
10681B12342j06068k2881K43237k83436J00258j41072p4921J57419j4982J02115
$$ y = [-108178, -17957, -2933, 58597, 248712, 173568, 365212, 393037, 173405, 77601, 139685, 372043, 210209, 305964, 323010, 160099, 215437, 257055, 255613, 132716, 119294, 195093, 214420, 211928, 314537, 145084, 134328, 113622, 172763, 188005, 61495, 165201, 259513, 21523, 23594, -149030, 110388, 105554, 169428, 224174, 306447, 480029, 478000, 717901, 773602, 281973, 201103, 182161, 118004, 530129, 260564, 151646, 268751, 753233, 500513, 70393, 167519, 149042, 93494, 242685, 107159, 111137, -226987, 150646, 443481, 34449, 109460, 135234, 422424, 348596, 361131, 313297, 433960, 465430, 189599, 212342, 106274, 83393, 326630, 43194, 143452, 2380, -72541, 84878, 69896, 172011]
10671A72011j92876J73829J27939J16679q9002l37838j72935M13571M9996l29122
10661f7748J07115N19868o5561k07481j9387j57089j67287K24872K20636o2561
10651C25377J09202Q8359J67652k20062o4166J20715k82434k14127K65381J7895
10641C13792O1578K3390J7813p9119R8306J45264j07545l20199l38596J96000
10631A0684J37521k42383M7419J78745J29029L1163n4874o5164K10169M7436l22498
10620A07247q6357K26074k19126m6702L88765J75399m3408N3332Q4728p8174m8668
10609E13110j18267J1303M0261j54588j04052J59161M8931o2436J80840j70145
10599C44118j16081j36000Q8141k4540j36027j60514L0764q1385j77347K29228
$$ y = [172011, -20865, 152964, 280903, 397582, 308580, -29258, -202193, 211378, 261374, -67748, 39367, 559235, 493674, 286193, 266806, 109717, -57570, 167302, 387938, 325377, 434579, 522938, 690590, 470528, 406362, 527077, 244643, 30516, 295897, 313792, 375370, 398760, 416573, 337454, 435760, 581024, 473479, 153280, -185316, 10684, 148205, -94178, -46759, 131986, 261015, 292178, 237304, 172140, 382309, 429745, 107247, 20890, 246964, 27838, -18864, 369901, 545300, 501892, 555224, 639952, 561778, 513110, 394843, 406146, 446407, 291819, 187767, 346928, 395859, 333423, 514263, 344118, 228037, 92037, 180178, 155638, 19611, -140903, -110139, -191524, -368871, -139643]
10589a39643K96806J23809p5593n9105p6437p7553J79053Q2440m7889m6769r5125
10578F3994K63134j5409m768j49986j6895k914K30916K1071K71010P6286k12731
10567E23708l4201j42681p2045R8770J47817l81776J2502R5684j46007M4121Q5089
10556B30981l14335J38297K55685k64277P1471j74709J99654Q4386R9953L8432
10546C65538Q7390j83316L3087l8691q6953K39717R7373j9100k06112Q4605k7911
10535C45627j05288K2073J65779j8542j03111l3815m08146k4869O60025J67536
10525F67269m26127J26564J87523j25145j18112n0560o6131K20463J40737O6754
10515F23235k51781k2482o0660R1249J35410N7566j90385J46049M7860k7583L4767
$$ y = [-139643, 157163, 280972, 205379, 146274, 69837, -7716, 171337, 253777, 205888, 159119, 63994, 327128, 311719, 306951, 156965, 140070, 137156, 368072, 389143, 660153, 736439, 523708, 489507, 346826, 274781, 373551, 521368, 139592, 152094, 247778, 101771, 145892, 230981, -83354, 54943, 310628, 46351, 117822, -56887, 142767, 227153, 327106, 365538, 452928, 269612, 302699, 264008, 177055, 416772, 514145, 495045, 288933, 373538, 345627, 240339, 262412, 428191, 409649, 306538, 272723, -135423, -160292, 499733, 667269, 241142, 367706, 555229, 430084, 311972, 261412, 195281, 415744, 556481, 623235, 371454, 348972, 288312, 379561, 514971, 572537, 382152, 528201, 576061, 548478, 583245]
10504E83245n0074K45053k69776m451n06829r4132K12574J40197p6448J41755
10494C21114r1044J48540l1743L0670p9356L23008q8104k53292K63736j63198
10484C80331J08050J9337l58721j9987K9021o6614J86235L6310R5780q7672k73989
10473D8081M4592K07804K00430O0469n1473j13004j29665m8916J43009j43895
10463B17432o5968p9234N8702p6166J13846J35188k13951l6637K5480J14839O3930
10452B57461K34434k96664M6690Q7989J54738M7616j43928j90912q7415j34878
10442b4869L09386J09058L6221k22592q6210J55377J05452j28056n5843J64967
10432C62891k00486K66554k14182J5601j69555L13500l0166o3069J533J52556
$$ y = [583245, 533171, 778224, 508448, 503997, -2832, -96964, 115610, 255807, 179359, 321114, 230070, 378610, 346867, 377537, 298181, 621189, 533085, 279793, 543529, 380331, 488381, 507718, 148997, 129010, 158031, 91417, 277652, 313962, 409742, 322070, 48081, 92673, 300477, 500907, 561376, 509903, 396899, 267234, 218318, 361327, 217432, 151464, 72230, 130932, 54766, 168612, 303800, 89849, 53212, 78692, 193531, 257461, 491895, 195231, 241921, 329910, 484648, 532264, 388336, 197424, 110009, -24869, 284517, 393575, 429796, 207204, 120994, 276371, 381823, 253767, 197924, 362891, 162405, 428959, 214777, 230378, 60823, 374323, 344157, 281088, 282621, 435177]
10422D35177J87158l95079O7518K55666j5090m2871l7553j62406M2j02420j39090
10411E1052q21Q627J13398M9091J87874j40838k05264L14423N2704l4186Q980
10400D05040j11366j09256k00188j0075L45013M2299j58608m4014K381m20702
10390b59476N78651M9754j24681m833j99069O734J82393Q5041J20353n1256j24770
10379B58841J631J29718k8732k18378J14755K31j95795j34027K03246J08566p5343
10368A64713J49921Q3477j41234q7491N8732k27389N5025O2114j71982K50958
10358A96844K0282O0200r1924J17523J34538m3528j26441K04722J21723k39278
10348C54661k00909m5267J20038m3302l86394K21958k7373M49904Q4110L9267
$$ y = [435177, 622335, 227256, 294774, 550440, 535350, 492479, 454926, 292520, 292562, 190142, 51052, 50231, 58858, 172256, 221347, 409221, 268383, 63119, 377542, 430246, 396060, 405040, 293674, 184418, -15770, -25845, 319168, 361467, 202859, 158845, 161226, -259476, 319175, 368929, 244248, 239415, 40346, 47080, 229473, 314514, 434867, 383611, 258841, 260472, 390190, 361458, 143080, 257835, 258066, 62271, -71756, 131490, 240056, 164713, 314634, 398111, 256877, 169386, 228118, 729, 55754, 117868, -54114, 196844, 217126, 277326, 185402, 302925, 437463, 393935, 267494, 472216, 593939, 354661, 153752, 108485, 228523, 185221, -201173, 20785, -6588, 443316, 527426, 566693]
10338E66693q0364k49934M1400L9510k42404j38459K48363K31153K65330p5079
10328F06209j00755l11830J6666O1331K43851j53635K490j17316k38947j76380
10318a68316J90760K92774K42976n9119k4332k01029j49990J7599J22798m6282
10308B17839M1336r7192k7218J17625j92755L06308K54220m3637R548J12516k48106
10297D50484L6385j77245j53423J12096J16193m70m7088l9836J20429k50214q7794
10286G9517L4434J09437J50840l26532k31Q9443K5947L02118k95741J4139J26514
10275C09885J09651J30040j4659k01090k60474Q5750J56218m7548K14939J92417
10265F75129k20379k32321k47279K50291j77868o3457L72755J28713J79577j98857
$$ y = [566693, 486329, 236395, 277795, 317305, 74901, -63558, 184805, 415958, 681288, 606209, 505454, 193624, 210290, 271621, 515472, 361837, 364327, 247011, 8064, -168316, 22444, 315218, 558194, 499075, 474743, 273714, 123724, 141323, 264121, 217839, 259175, 161983, 134765, 252390, 59635, 365943, 620163, 576526, 586074, 698590, 450484, 486869, 309624, 156201, 268297, 384490, 384020, 336932, 297096, 417525, 167311, 79517, 113951, 223388, 374228, 47696, 47465, 136908, 162855, 464973, 169232, 183371, 309885, 419536, 549576, 534917, 333827, 73353, 159103, 315321, 267773, 482712, 675129, 454750, 222429, -24850, 225441, 47573, -15884, 356871, 485584, 665161, 466304]
10255D66304j35462q5158J82479p4135j9584L4792N0759p0611o6846l5795k00947
10244D5796J22611M1611n3924j15209J1096O5647Q4980R6220J67286j02043N3584
10233D17655J54745j25733k06363K31412j19542K01306k62385J552j10528p6277
10223A05842J75418J4771q5410J62652j96191k1080J66650j09837j12952K19164
10213C19027k2849j91120J59737n7819J62735M3804J20493J76347J2399k96514
10203D26240j36750l1458j32140J17760O1458Q6330o8714J96156K53409Q7619
10193H59910j47795r7493m8611j95451j13947O0051K7850K2454K26185m31098
10183A62055J13595J67980L303m3241j7393k9545J58875J27277r6338k09755J71891
$$ y = [466304, 330842, 245684, 428163, 354028, 334444, 369236, 419995, 349384, 282538, 246743, 45796, 168407, 210018, 156094, 40885, 51981, 117628, 202608, 298828, 466114, 364071, 417655, 572400, 446667, 240304, 471716, 352174, 553480, 291095, 292647, 182119, 105842, 281260, 296031, 210621, 373273, 177082, 156002, 322652, 212815, 99863, 319027, 296178, 105058, 264795, 206976, 369711, 413515, 534008, 710355, 722754, 426240, 289490, 258032, 125892, 243652, 305110, 391440, 322726, 518882, 772291, 859910, 712115, 614622, 566011, 370560, 256613, 316664, 344514, 366968, 593153, 162055, 275650, 443630, 446933, 403692, 386299, 356754, 515629, 642906, 546568, 336813, 508704]
10172E08704p5203j90482L35794k38533K11785J24141l97523p6688L31596K05093
10162G38684j15883n29458l1969L00895K86904j7204j98224Q6491o5940J17292
10152E71588l70715L6120K857J07929j36238j23462R785K55943j61583J04042
10142B96266K51354n1631K0290J78628R4099k38614p7512n9033R6736k50053K81294
10131E41824K5828m9899q7290K89774J62985k43801J7718k77848K51463q5598
10121E45156j28548m02784L9769J10922J45895k8114M9939K7063r5674N2784j0235
10110C06173J28202L04259j11953L2402n7821j65862j2985L05139J49077k38165
10100F38466q7388M3429r0077K68191P3415k02847K7310j56147j70136j2971K49051
$$ y = [508704, 433501, 243019, 578813, 340280, 552065, 676206, 278683, 201995, 533591, 738684, 622801, 93343, 61374, 362269, 649173, 631969, 433745, 520236, 454296, 571588, 200873, 236993, 239850, 347779, 211541, 88079, 97864, 353807, 192224, 296266, 547620, 495989, 516279, 694907, 789006, 550392, 472880, 413847, 510583, 260530, 541824, 567652, 517753, 430463, 720237, 883222, 639421, 657139, 379291, 630754, 545156, 416608, 13824, 53593, 164515, 310410, 282296, 332235, 359298, 263624, 316408, 306173, 434375, 738634, 626681, 659083, 601262, 435400, 422415, 727554, 876631, 638466, 551078, 594507, 504430, 772621, 846036, 643189, 670499, 514352, 344216, 331245, 580296]
10089E80296l41261J05837j16703J25277J17514K0907L4498j2438k53896L22362
10079E82393n1906J22395j46335k20910P1238P2513K6094j2255J5689N7689K13474
10068G30079q4265j49838j10948J45677J04134J8339m685K0605k28315M2911j26535
10057C57159R8728J02554p9476m6823L8775J12733j46980P1567k23107m0796k53610
10046i276P7580J13684O9097l28237R9358Q3265J24327J01500Q6278r3969o6630
10035B56977l3852j84136k24776K50420N08443j16291o3668j53616K2697j67606
10025I4592J97984r7235K2626Q3353K32439j92063J49978J86245k52115j51690
10015B74114k5700J68178M8319l26537K24284K76652l53729m6225K80729J48480
$$ y = [580296, 239035, 344872, 228169, 353446, 470960, 491867, 526365, 513927, 260031, 582393, 530487, 652882, 506547, 285637, 356875, 429388, 455482, 443227, 458916, 516605, 730079, 645814, 495976, 385028, 530705, 634839, 653178, 648493, 669098, 440783, 483694, 357159, 455887, 558441, 478965, 432142, 470917, 583650, 436670, 508237, 285130, 244334, -9276, 68304, 181988, 251085, -77152, 22206, 105471, 229798, 331298, 417576, 323607, 256977, 223125, 38989, -185787, 64633, 573076, 456785, 393117, 239501, 262198, 94592, 292576, 195341, 217967, 301320, 533759, 341696, 491674, 677919, 425804, 274114, 248414, 416592, 464911, 138374, 362658, 639310, 285581, 239356, 520085, 668565]
10005F68565j00434l2102j04477q6490N547J11453Q8018r7463q6939J74461J3809
9994E53948O6057j33341R2232O3916o8994P8844J80614j23820k81845j7970o5504
9983C44137J48138j7472j05818K4252j07209J03314p5788R6263K96146n37365
9973A68598M4440J6538J83928M8246q6552j14224J21184N189N0295j17599o1243
9962B58800P3822n8609J98892j81260k15739O23J17749K2933J58985N9601K01512
9951F37309j01710J01523j24280k65475O0186j4705n2698j155J70884J82876j18732
9940D74023j15696J41689P3390j93431M27279j4421l40825j54256j21641K48151
9930D24262N0761l2964m3840n2355P2629M8384k69306O2259j85347M9818L74390
$$ y = [668565, 568131, 536029, 431552, 345062, 350609, 462062, 550080, 452617, 365678, 540139, 553948, 620005, 486664, 578896, 642812, 573818, 652662, 833276, 709456, 427611, 409641, 344137, 492275, 474803, 368985, 393237, 286028, 389342, 313554, 409817, 705963, 168598, 213038, 229576, 413504, 461750, 375198, 260974, 382158, 387347, 437642, 320043, 258800, 332622, 274013, 472905, 291645, 75906, 76529, 194278, 217211, 376196, 435797, 637309, 535599, 637122, 512842, 247367, 307553, 292848, 240150, 238995, 409879, 592755, 474023, 358327, 500016, 573406, 379975, 807254, 792833, 452008, 297752, 176111, 424262, 475023, 442059, 398219, 345864, 418493, 466877, 197571, 259830, 74483, 124301, 498691]
9919D98691Q4153l42052n1330M8955n326R0131J02301j4767j44067J14041Q3270
9908D64000J46399k26732J64838j36159j41092O9766K02588k16810p3726K19149
9898D72221j95248K33267R153J92078k53876m8674l06860N8804R2046K4296j89278
9887H7929J38230j50709O9624J34058l0006K28506r6482L4566r8475K4012J07270
9876D48523N0355o9805r10M249l8723j35689k6091N1838J21534p8917j14945k39549
9864b8130Q0621K66265K10511m67337J38890K02715K55577O7192k82562o5868
9854C77874j84523o074K63260k14880M9749M9696j66193L7747l7177K67544n547
9843D31476N731l00141J11614R2440J67190j07528L2977N4722l72102Q3608J71704
$$ y = [498691, 582844, 240792, 189462, 238417, 233091, 323222, 425523, 410756, 266689, 380730, 464000, 610399, 383667, 548505, 412346, 271254, 341020, 543608, 326798, 253072, 472221, 276973, 510240, 519393, 711471, 457595, 408921, 102061, 160865, 252911, 277207, 87929, 226159, 75450, 145074, 279132, 249126, 477632, 381150, 415716, 317241, 341253, 448523, 498878, 429073, 428163, 432412, 393689, 258000, 231909, 283747, 405281, 326364, 211419, -28130, 52491, 318756, 529267, 61930, 200820, 403535, 659112, 726304, 443742, 377874, 193351, 187277, 450537, 235657, 285406, 335102, 168909, 206656, 169479, 437023, 431476, 437207, 137066, 248680, 341120, 508310, 400782, 433759, 488481, 116379, 199987, 371691]
9832C71691K04725r2650J6054k0274j07179n277j27726N1623Q2175n3271J07281
9821D27172j64428J75894k0368P5568j50632K0463M4341M5492n1919J63247j01866
9810D62964k67617J68989j46647q0969J54131r2628J66654R8196J53112q1912
9800E34273o8932K44127l67564L7311k31893j53010N2886N45317j15532j47j06389
9789C70447J19409L2106j36056N6707o0014n6202j89271L29796j05414J11610
9779D73118M8756J42178k01824M952j30942K2446j56269k03224J22604P5157K11470
9768D08422J76639O3055q6936r2678m0792k8758l18155N9609K43015J31796q0171
9757D35046J86639M922j3836O8458J5099j62681J06370j64227l1779j26156K00739
$$ y = [371691, 576416, 483766, 499820, 479546, 372367, 367090, 239364, 290987, 373162, 319891, 427172, 262744, 438638, 418270, 493838, 343206, 363669, 408010, 453502, 401583, 564830, 462964, 195347, 364336, 217689, 136720, 290851, 198223, 364877, 463073, 616185, 534273, 465341, 709468, 341904, 379215, 147322, -5688, 47198, 592515, 476983, 476836, 370447, 489856, 521962, 385906, 442613, 382599, 326397, 137126, 466922, 361508, 473118, 521874, 664052, 462228, 467180, 336238, 358684, 202415, -809, 121795, 196952, 408422, 585061, 648116, 561180, 468502, 427710, 398952, 80797, 140406, 383421, 515217, 435046, 621685, 626607, 612771, 681229, 696328, 533647, 640017, 475790, 444011, 317855, 518594]
9746E18594N5112j78198j20205N3023J72251J83603O4652m37629L580j7874K25122
9735E22031k4317k50981O3382K75707m54706Q9146P4165J07930J19080J35908
9725F57345Q2843R4210k78437j94198J77217j36895o1480R7130J86342q835J88324
9714H03566m08444Q7064m7815K95902m35340q5502K22893J66870K25522R9146
9704I23862J94413k08980k71658j03140M09846q3686j68687J56282K1570J6694
9694H86516R3091O8356J38113k55422J27783j80243k82162J01049J44124j47316
9684F93889Q6424J56268o4745r650J24471q0884k00182k08343j92059L8706K7652
9673C71547k6833J83465K46651l15974J16560k0340L12689q9355m2688k36595
$$ y = [518594, 573706, 395508, 275303, 328326, 500577, 684180, 748832, 311203, 314783, 296909, 522031, 497714, 246733, 310115, 585822, 131116, 220262, 294427, 402357, 521437, 657345, 740188, 834398, 555961, 361763, 538980, 402085, 340605, 437735, 624077, 615242, 803566, 395122, 482186, 434371, 730273, 294933, 209431, 432324, 599194, 824716, 923862, 1118275, 909295, 637637, 534497, 944343, 860657, 691970, 848252, 869822, 886516, 979607, 1047963, 1186076, 930654, 1058437, 878194, 596032, 697081, 841205, 693889, 780313, 936581, 871836, 862186, 986657, 905773, 705591, 497248, 305189, 343895, 371547, 344714, 528179, 774830, 458856, 575416, 555076, 867765, 778410, 735722, 499127]
9663D99127L18241J47897r9123l7877k35905j4722j22423K24803J8709M8062j57212
9652E89577m7691O2119K58083j8948j24815J18162q0652r7346J8312n0983L0375
9641F56193J74128j66234n8964q991n8321P4040K85638O9310r5773K02741j44733
9630I29034j63868l83718l9511K18909J18053K60243J00601j83422N3214J18556
9620A028091L2960j17167J61925m1828j91215K76725j51321j86487j7367O9101
9610H63417O623N4755j70003O6681K00612k52467k2932Q9596K6567j43088J12041
9599H31802j52292K80617k8616J40521k23827m13884N2J42494Q0949l9777R8794
9588G16833M451k01378J1525J9539l2480J32639j82775R6822J2413L38248m5057
$$ y = [499127, 817368, 965265, 866142, 828265, 592360, 577638, 455215, 680018, 698727, 746789, 589577, 541886, 604005, 862088, 843140, 718325, 836487, 755835, 658489, 676801, 625818, 656193, 830321, 664087, 605123, 596132, 537811, 611851, 897489, 966799, 871026, 1073767, 929034, 765166, 381448, 341937, 560846, 678899, 939142, 1039743, 856321, 909535, 1028091, 1061051, 943884, 1105809, 1063981, 872766, 1149491, 998170, 811683, 794316, 863417, 870040, 924795, 754792, 821473, 1022085, 769618, 746686, 836282, 862849, 719761, 831802, 679510, 960127, 931511, 1072032, 848205, 434321, 434373, 576867, 657816, 618039, 716833, 721284, 519906, 531431, 550970, 518490, 651129, 468354, 565176, 577589, 915837, 870780]
9577H70780O3910j76613p8513K09255j5480N2677o8847N7619Q8785j52768j46982
9566G03823J09999J31490N9953l1571O4314Q1614o2161l31448K81312j27803j62822
9555G16700K324m5932K19294J31542n34264k01233K91909L33927n4527M1175K58722
9544A159637q8960o7689j97703L12207l0521k67708p4378K16756J0986j20226
9534H52401R8921J10159p0933j46647O7803k06392K59229J35568j65952q8110
9524H46047J17747r8051l4426p9200J6004J97669n6413p4358l8756M86366o4989
9513A217640k5224j05610O6786Q7346J47188j47057k98302J86819R748j27119
9503A012215r7294L5981j05394P598K15590N6164r2600O5324J00547r7373Q4945
$$ y = [870780, 934690, 758077, 679564, 888819, 873339, 926016, 857169, 914788, 1003573, 850805, 703823, 813822, 945312, 1005265, 973694, 1038008, 1119622, 1057461, 726013, 1007325, 879522, 716700, 719024, 673092, 892386, 1023928, 489664, 288431, 580340, 914267, 859740, 900915, 1159637, 1070677, 1002988, 805285, 1117492, 1086971, 819263, 744885, 961641, 972627, 852401, 951322, 1061481, 990548, 843901, 911704, 705312, 964541, 1100109, 934157, 846047, 963794, 865743, 831317, 752117, 768121, 965790, 909377, 835019, 796263, 1282629, 1217640, 1192416, 1086806, 1153592, 1240938, 1388126, 1241069, 942767, 1129586, 1139334, 1012215, 914921, 950902, 845508, 853106, 1068696, 1124860, 1032260, 1097584, 1198131, 1100758, 1185703]
9492A185703j53093J56750o9099P6357j29774O4495o0759J24963K1175N2765O887
9481A276370O8204l5874K21044K08337k87108M594j9158k23480j07410K92319
9471A397838k53962M191n0719k2152p2039r1700p8448K21551J30306j64152P9995
9460A100709J17857n6777M047k69223J09658J53844o9733P8625K34298k01939
9450A201366Q5598K26114r3479K33580J88041k25036m9408j45786j61211J97418
9440A457197q7184Q7176Q3246M1453k12065k2010K52845P0005J24578o7720P6842
9429A804363j72346l96787K58191J3571J72923k14957q377Q2059J9309K40961
9419A798910L0739Q0845k40429K25905r8151j14413k13363J77556L88698j82500
$$ y = [1185703, 1032610, 1189360, 1120261, 1196618, 1066844, 1131339, 1070580, 1195543, 1216718, 1269483, 1276370, 1344574, 1308700, 1529744, 1738081, 1450973, 1455567, 1436409, 1212929, 1105519, 1397838, 1143876, 1148067, 1097348, 1075196, 1003157, 911457, 833009, 1054560, 1184866, 1020714, 1100709, 1218566, 1161789, 1165836, 896613, 1006271, 1160115, 1090382, 1169007, 1403305, 1201366, 1286964, 1513078, 1419599, 1653179, 1841220, 1616184, 1566776, 1420990, 1259779, 1457197, 1370013, 1457189, 1540435, 1581888, 1369823, 1347813, 1600658, 1670663, 1795241, 1727521, 1804363, 1632017, 1235230, 1493421, 1506992, 1679915, 1464958, 1456581, 1538640, 1557949, 1798910, 1829649, 1910494, 1670065, 1895970, 1797819, 1683406, 1470043, 1647599, 2036297, 1853797]
9409A853797o3022j15470Q9308p9913J55696J16733N4397k3214K82895M30222
9399B701429j2643K72265J06582n3531l9298j95922J4601J0408o7476m53951m77194
9388A805270L47041L784J0409K07806j48053J43895R1742k31024K22431M7603
9378B500904l21540l35916j10596N21169M0252k82868O050m6673J16990N245r0928
9367B002089J84173J99405j06344r7912M4577k49293m9334k1497o413K97539L70241
9356B567231j04882j17164m0620m5952m056J97529J07045k81386K22701K28818
9346B729264k1506j88873M51024J88415j92570j84236J01631L75995R0105L83890
9336C733139J71456L9493j23245j26909J75833N4573j9881N9587M08467J08934
$$ y = [1853797, 1790775, 1675305, 1764613, 1684700, 1840396, 1957129, 2011526, 1988312, 2271207, 2701429, 2688786, 2961051, 3067633, 3014102, 2974804, 2778882, 2793483, 2803891, 2736415, 2282464, 1805270, 2152311, 2156095, 2166504, 2374310, 2226257, 2370152, 2461894, 2230870, 2453301, 2500904, 2179364, 1843448, 1732852, 2254021, 2294273, 2011405, 2017455, 1970782, 2087772, 2093017, 2002089, 2186262, 2385667, 2279323, 2181411, 2225988, 1976695, 1927361, 1905864, 1899451, 2196990, 2567231, 2462349, 2345185, 2304565, 2258613, 2254557, 2452086, 2559131, 2277745, 2500446, 2729264, 2707758, 2518885, 2969909, 3158324, 2965754, 2781518, 2883149, 3259144, 3349249, 3733139, 3904595, 3944088, 3820843, 3693934, 3869767, 3924340, 3904459, 3964046, 4372513, 4481447]
9326D481447j14663L3044l19507j16165j57577l43632k08082j89018Q6466k55943
9316B896370K03837K5724q5935n302L96293j73759N053j2945j33388j26843J26897
9305C116002J07219o6889L88548K45877K227Q4110j39395j01996K19057l05225
9295C549535J06333J21662J28613j55616j29671m8736R8576l0338M2003K49564
9285C931925N5459n4735r7096M02894J10112M72812N86422L17949j53858K06943
9275E778827K242o445O61191N75469j73674j75925J00130L6679M76051J055580
9265H330125J051893M11717O92527m96648n75733p23251o53666k77844P10291
9256H469411N47440O9979k56680m89730k74141k93990p08260o17061l13509r1297
$$ y = [4481447, 4366784, 4399828, 4080321, 3964156, 3806579, 3462947, 3254865, 3065847, 3152313, 2896370, 3100207, 3125931, 3039996, 3034694, 3430987, 3257228, 3262281, 3249336, 3115948, 2989105, 3116002, 3223221, 3156332, 3544880, 3790757, 3792984, 3877094, 3737699, 3635703, 3854760, 3549535, 3655868, 3777530, 3906143, 3750527, 3620856, 3572120, 3670696, 3640358, 3682361, 3931925, 3987384, 3932649, 3835553, 4238447, 4348559, 4821371, 5407793, 5725742, 5571884, 5778827, 5781069, 5774624, 6435815, 7011284, 6837610, 6661685, 6761815, 6798494, 7274545, 8330125, 9382018, 9793735, 10486262, 9989614, 9413881, 8690630, 8036964, 7759120, 8469411, 9016851, 9086830, 8830150, 8340420, 8066279, 7772289, 7064029, 6446968, 6133459, 6042162]
9246F042162J65188O1452n0859M8683L07459P245r0693J88982N4337q1263j92510
9235F460183q7154K44406j37254L9074L73201J58235J138689J892552L122005
9226A3203937M018724M064513R06253r60610k468540l384204j769390r11566O21357
9217A3320474K430935L903637L048218L24640j569483l343289l649462k339115
9209A2126555j928130j363810j005651m75782o47322m44973l32219m44381J24593
9200E608880l29174J01425J11731J0344m61624j09196k49572p1489O0746j05856
9190D566215j79723j78290K76567k55337j00789j7312N0592m32738J14110m9506
9180C793789k13527R3967J32849j64987q7865L16873L32046l99862k5578R5940
$$ y = [6042162, 6207350, 6268802, 6217943, 6266626, 6574085, 6581330, 6490637, 6679619, 6733956, 6652693, 6460183, 6373029, 6617435, 6480181, 6519255, 6892456, 7050691, 8189380, 10081932, 13203937, 17222661, 21287174, 22193427, 21232817, 18764277, 15380073, 13610683, 12699117, 13320474, 15751409, 19655046, 22703264, 23027904, 21458421, 18115132, 14465670, 12126555, 10198425, 8834615, 7828964, 7353182, 6705860, 6260887, 5928668, 5484287, 5608880, 5279706, 5381131, 5492862, 5503206, 5041582, 4932386, 4682814, 4611325, 4672071, 4566215, 4386492, 4208202, 4484769, 4229432, 4128643, 4111331, 4161923, 3729185, 3843295, 3793789, 3580262, 3674229, 3807078, 3642091, 3554226, 3871099, 4203145, 3803283, 3777705, 3873645]
9170C873645J70899n5195m92564r9088K33838K14188r268q9998J97040M66078
9160D409575k00722k09060j22985j06278J24677q1554j76585j78420J5470n773
9150C468345L71162k61490M2911M6362j0382R8057o7494J55878L8566j31552q5536
9139C664827J53226J02847j39660j04451p4837M7628K25181O1502L21437M8288
9129D305988p5111O4355J51138K34927J12995o4246L04506N58201p8524K02585
9119E716814P7575l8745j66694J3853L24079K59758J64741k05804j00640l61458
9109E683479k99084N2915p3329r7578j49380K76313K08906K42200Q8500J46677
9099F079619p8526q6061k24732J07146j65723J396L36069K55366L6153M57557
$$ y = [3873645, 4044544, 3989349, 3496785, 3397697, 3631535, 3845723, 3836455, 3746457, 3943497, 4409575, 4208853, 3999793, 3876808, 3770530, 3895207, 3813653, 3637068, 3458648, 3474118, 3468345, 3839507, 3578017, 3620928, 3667290, 3656908, 3754965, 3687471, 3843349, 3881915, 3750363, 3664827, 3818053, 3920900, 3781240, 3676789, 3601952, 3649580, 3874761, 3936263, 4257700, 4305988, 4230877, 4295232, 4446370, 4681297, 4794292, 4730046, 5034552, 5592753, 5514229, 5716814, 5794389, 5755644, 5588950, 5602803, 5926882, 6186640, 6351381, 6145577, 6044937, 5683479, 5384395, 5437310, 5363981, 5266403, 5117023, 5393336, 5602242, 5844442, 5932942, 6079619, 6001093, 5915032, 5690300, 5797446, 5631723, 5633119, 5969188, 6224554, 6260707, 6718264]
9089F718264J88599P3133N33159L62784K00477j95810j19594l6794n24935o9572
9079G129711L02217k36124K2371k01177n79153l60691K3296r8580k83941P0719
9069E788648L14565J93368N2578j29148K89072Q1237K01803K0378j6534l53945
9059F442022P0229n8347J64999P121Q4175L37962k67569j18327K40527L18620
9049G221412K61919P3375k40351J33080J6721j20960J9464n7274k93573j44670
9039F869143M76526m3669k2865L84633K6405L40435J76753L91270J93684j36172
9029H656143o7679n2437J60238K21438J41098M109N24623L8261L91609m66859
9019I550544K6939L6821R6635K00860L3253l6269O60224P9440N3548J86734Q9553
$$ y = [6718264, 6906863, 6979996, 7513155, 7875939, 8076416, 7880606, 7761012, 7724218, 7199283, 7129711, 7431928, 7195804, 7218175, 7016998, 6437845, 6077154, 6100450, 6001870, 5717929, 5788648, 6103213, 6296581, 6349159, 6220011, 6509083, 6590320, 6792123, 6812501, 6795967, 6442022, 6512251, 6453904, 6618903, 6626024, 6710199, 7048161, 6780592, 6662265, 6902792, 7221412, 7483331, 7556706, 7316355, 7449435, 7466156, 7345196, 7364660, 7307386, 7013813, 6869143, 7345669, 7302000, 7279135, 7663768, 7690173, 8030608, 8207361, 8598631, 8792315, 8656143, 8588464, 8536027, 8696265, 8917703, 9058801, 9062910, 9587533, 9625794, 10017403, 9550544, 9577483, 9614304, 9710939, 9911799, 9945052, 9908783, 10569007, 10648447, 10701995, 10888729, 10978282]
9008A0978282L21814P66729O86865J257193J828713J608859R82954M99931L33763
8999A9265103k0235M8744P26851P42490J141560K205630J589917P05511j61549
8990B6244022j102145q34715n16374R2282m11222o81389q60712r48364p59681
8981B0221702M2457K75932O42187K75764P39934O00270J40930L91734K55211M58777
8971B4044898N28455J007385J353675K826499L391329K831801J937117K120720
8963D0041879J676054M196811O668396Q411403M259823l72114l568795o525576
8955E4787881o171140m659605l303241k507403j224454m01032k54626J67721N98874
8946C7032975N12318J023546J523249J933275K909014L800937N337965P301513
$$ y = [10978282, 11300096, 12066825, 12753690, 14010883, 15839596, 17448455, 18431409, 18931340, 19265103, 19244868, 19293612, 20020463, 20762953, 21904513, 24110143, 25700060, 26405571, 26244022, 25141877, 24307162, 23790788, 23883070, 23471848, 22790459, 21929747, 20981383, 20221702, 20264159, 20540091, 21182278, 21458042, 22197976, 22798246, 22939176, 23330910, 23586121, 24044898, 24573353, 25580738, 26934413, 29760912, 33152241, 35984042, 37921159, 40041879, 41717933, 45914744, 52583140, 60994543, 65254366, 64882252, 61313457, 54787881, 48616741, 43957136, 40653895, 38146492, 36922038, 36521006, 36266380, 36434101, 37032975, 37545293, 38568839, 40092088, 42025363, 44934377, 48735314, 54073279, 61374792]
8938F1374792Q708282O342014L469510J600385J557131L359883Q792725J6536399
8930A11741121L0428917M9933913P1539685P3291522M9212852o959278l9840849
8923C39347883n9606708n7957095l2730891j2791020Q770707J9215840J2379146
8916B16627862p725571j9464217l1577159k9053001k2424286j5652216j1521143
8909G9210269q287481o624248m603746k990065j826667j064307l89937J09638
8901E3533456Q21250Q94089J378311J520751J557674K002677L454709M545826
8893F9708743P695554J2601645J7782881K0421159J4804150L976382k579119q348803
8885A36062592o434572p33879Q118874K1092161M0250252N5997487N0663233J9678403
$$ y = [61374792, 70083074, 76425088, 79894598, 81494983, 83052114, 86411997, 95204722, 111741121, 142170038, 192103951, 263643636, 336935158, 386148010, 379188732, 339347883, 279741175, 221784080, 189053189, 176262169, 185032876, 204248716, 216627862, 208902291, 189438074, 157860915, 128807914, 106383628, 90731412, 79210269, 70922788, 64298540, 59694794, 56704729, 54878062, 53813755, 53423818, 53533456, 54354706, 55248795, 56627106, 58147857, 59705531, 61708208, 65162917, 69708743, 77404297, 90005942, 107788823, 128209982, 143014132, 146990514, 144411395, 136062592, 129628020, 128894141, 137013015, 158105176, 198355428, 254352915, 305016148, 324694551]
8877C24694551n448784k2485853k0181983P929464L7452585N5979561M8622582
8870D26562123K5315789k3569581n1940310o3901028n9272327l6889063j4308817
8863B01996786P042436J8632698J1879459p78743j7861291l2976088l3215902
8856A54719355l0952503k2896756j6964314j1716214r421953o796670n560299
8849E0410646m025418l349069k613873k179792j844113j849032j438192j632617
8841C1478540j327364p89479p60617l80337k73361k07975q3773J20563l60984
8832B7415213q7422r52513j247924q16520n65930l51495l91513o2479k89621l64776
8822B2285020p27372o85508j161783p41864l96937k05550j38759q9165j79710
$$ y = [324694551, 319245767, 296759914, 276577931, 284507395, 321959980, 377939541, 426562123, 451877912, 428308331, 376368021, 312466993, 253194666, 216305603, 201996786, 209039222, 227671920, 239551379, 238772636, 220911345, 187935257, 154719355, 123766852, 100870096, 83905782, 72189568, 62767615, 55970945, 50410646, 46385228, 43036159, 40422286, 38242494, 36398381, 34549349, 33111157, 31478540, 30151176, 29361697, 28601080, 28220743, 27947382, 27739407, 27655634, 27776197, 27415213, 27327791, 26375278, 25127354, 24310834, 23744904, 23393409, 23001896, 22939417, 22649796, 22285020, 21557648, 20872140, 19710357, 18968493, 18571556, 18366006, 18227247, 18138082, 17958372]
8813A7958372n75648l37609n72284k57151k05625k1616R6538K93801J6858N45011
8803A6940647J10724L73487M67717L9379J93904P62713J008655P66963O54249
8794B1318438K63176n20695p46138q79443p78431l40980m44751J6412K66307L80341
8784A8534236L13958j31939n35195p83467q51713n17502j70217n38320M771K86281
8774A5610893J71396J33089M68583N76741M48562L20945N91465R56639Q28766
8765B0107079J617239K195839K934663K750184J934236M36467r82252j614736
8757B9378719j203604j86571J212851K870401M048043M232767K654123N63543
8749D3570272j642103l043565l110833k363424j492304j062693p77224N22846
$$ y = [17958372, 17382724, 17045115, 16472831, 16215680, 16010055, 15988439, 16084977, 16378778, 16395636, 16940647, 17051371, 17424858, 17892575, 17931954, 18125858, 18888571, 19897226, 20664189, 21318438, 21581614, 21060919, 20314781, 19435338, 18656907, 18315927, 17871176, 17887588, 18153895, 18534236, 18848194, 18716255, 18181060, 17397593, 16545880, 16028378, 15858161, 15319841, 15324612, 15610893, 15782289, 15915378, 16383961, 16960702, 17409264, 17730209, 18321674, 19278313, 20107079, 21724318, 23920157, 26854820, 29605004, 31539240, 31975707, 30993455, 29378719, 28175115, 27988544, 29201395, 32071796, 36119839, 40352606, 43006729, 43570272, 41928169, 38884604, 35773771, 33410347, 31918043, 30855350, 30078126, 30600972]
8741C0600972N17098J122145J621010K724072L811418N086684O758496O631740
8733E8873635M839642K080553q39726k657736k423597o47717J542379L683810
8725F4451243N731678O469172N505757L542086K77242l734070p442662r372998
8717F5427448j0172462q807552o596113m940155k942417j615582o44279n53443
8709B9155445n63747o98715r36890j002253p64204n00459O8900j63846K12394
8700B4806625m03124q42609r35229m68491N80527P78699Q56706J80369q7684r53425
8690B3512364r10028q09098q20651q39348p81573p09438k15496n31859m54255
8681A7440618j88140k8928L33769j0604J34422J14590L18634j88236j07731j37497
$$ y = [30600972, 31118070, 32240215, 33861225, 36585297, 40396715, 45483399, 52241895, 58873635, 63713277, 65793830, 64954104, 62296368, 59872771, 59225054, 60767433, 64451243, 70182921, 76652093, 82157850, 85699936, 85977178, 82243108, 74800446, 65427448, 55254986, 46447434, 39851321, 34911166, 31968749, 30353167, 29708888, 29155445, 28591698, 27892983, 26956093, 25953840, 25189636, 24689177, 24758077, 24594231, 24806625, 24403501, 23560892, 22625663, 22157172, 22737699, 23516398, 24373104, 24553473, 24465789, 23512364, 22602336, 21793238, 20972587, 20133239, 19351666, 18642228, 18426732, 17894873, 17440618, 17252478, 17223550, 17557319, 17546715, 17681137, 17795727, 18114361, 17926125, 17818394, 17680897]
8671A7680897k47351n07255j51717k63757j41789k98551J56l50287r0663l38719
8661A5290964n48349n8316l06560j37388j31074N87828K70796L50028O97584M12814
8651A6428327M59419J91378K68472L00193m88255L03318O5790j05658R7208O13514
8641A8133706O77553M90883L13165k25980o27107q67340o01234p57158o91435
8632A5845053l85839J38554J52325k28252m63083k81423k54460J09598Q4954j22294
8622A4595133k79606o51892n39593o41593k20643J29796K00675L72193L84957
8613A3349427k16163k47441m00438o78990p1507K04014P0308P2909M24266N24030
8603A3030415M67937j72895J22411n1694q9486l2304k77130n96464l77862n8485
$$ y = [17680897, 17433546, 16926291, 16774574, 16510817, 16369028, 16070477, 16070633, 15720346, 15629683, 15290964, 14742615, 14684299, 14377739, 14240351, 14109277, 14697105, 14967901, 15317929, 16015513, 16428327, 16887746, 17079124, 17347596, 17647789, 17159534, 17462852, 17528642, 17422984, 17520192, 18133706, 18811259, 19302142, 19615307, 19389327, 18762220, 17894880, 17293646, 16536488, 15845053, 15459214, 15597768, 15750093, 15521841, 15058758, 14777335, 14522875, 14632473, 14717427, 14595133, 14315527, 13663635, 13124042, 12482449, 12261806, 12391602, 12592277, 12964470, 13349427, 13133264, 12885823, 12485385, 11806395, 11734888, 11938902, 12009210, 12082119, 12506385, 13030415, 13498352, 13325457, 13447868, 13396174, 13306688, 13274384, 12997254, 12400790, 12022928, 11964443]
8593A1964443J27920K48915R2520M31051J52850N5940k4165N15326J80756n8646
8583A3686910k56964j47K45953K33532j51124M70826K61931m97513J5426P0218
8573A4079048M71601Q4491K67839M43570N04724J22615K35405O53066J116497
8564A7978856R52363R56877J141522J256267J575976K157705K739398K405878
8556C1164842K182459J171069O34438L58703M04418P79188J912276K396576L025094
8547D4029063L809779N207908P321195J1106323J8035463K8479212M1181954M9821586
8539B08992483M6662144L1491748P957222j9569104l6036598m3623846m1222311
8532A54651738l3358146k4888001j8350895j3578690r239375o791308m329561
$$ y = [11964443, 12092363, 12341278, 12433798, 12864849, 13017699, 13073639, 13049474, 13564800, 13745556, 13686910, 13429946, 13429799, 13675752, 13909284, 13758160, 14228986, 14490917, 13993404, 14008830, 14079048, 14550649, 14635140, 14902979, 15346549, 15851273, 15973888, 16209293, 16862359, 17978856, 18931219, 19888096, 21029618, 22285885, 23861861, 26019566, 28758964, 31164842, 33347301, 34518370, 35152808, 35511511, 35915929, 36695117, 38607393, 41003969, 44029063, 47838842, 53046750, 60367945, 71474268, 89509731, 117988943, 159170897, 208992483, 255654627, 287146375, 295103597, 275534493, 239497895, 195874049, 154651738, 121293592, 96405591, 78054696, 64476006, 55236631, 48445323, 44115762]
8525D4115762k344098j122889p02304k47959o01185J06485r6705J51185J94086
8516C9452378J60743J54243R4272l27466j96362N76977J193199K108889L031416
8507D6248289M753682O841364J1746306J8687997K8915521L7949015M0456764
8500A95598938L2477703J6039267o636774k5613061l4857143l6838159l1174267
8493A08996504k4280791j7476989j2766718r306324o363894m690693l371949k469126
8485B8270020j937205j108007q51890l34728l48415n96972j166477j489124j472860
8476A8964342j413675j365319q40614j102952j238499p00833o03323q51023o49717
8467A0198387l18527j79587m77251o05241l57042j19461k77035J89066m42832
$$ y = [44115762, 41771664, 40648775, 39946471, 39698512, 39097327, 39203812, 39107107, 39258292, 39452378, 39613121, 39767364, 39861636, 39534170, 39337808, 39914785, 41107984, 43216873, 46248289, 51001971, 57843335, 69589641, 88277638, 117193159, 155142174, 195598938, 228076641, 244115908, 237479134, 211866073, 177008930, 140170771, 108996504, 84715713, 67238724, 54472006, 45165682, 38801788, 34111095, 30739146, 28270020, 26332815, 25224808, 24372918, 24038190, 23689775, 23092803, 21926326, 20437202, 18964342, 17550667, 16185348, 15344734, 14241782, 13003283, 12302450, 11699127, 10848104, 10198387, 9879860, 9700273, 9223022, 8617781, 8260739, 8141278, 7864243, 8053309, 7610477]
8458G610477j65216r8638P164j53158J6408m9882j74551L45976L37112j794j64351
8447G509547q2102n95390p86555n06252j77696l0313K1019j7098j36854R3369
8437E291675p6547K70k63263l04694k29773m75969j46163J33226M6108O0459j43456
8426C891873J40894j53119j73345K75685k31587Q9943J683q8779K19687j35031
8416C837904k58943K12632k32728m9199L6633q7340l62679J26230J63746j98321
8406C187935k6254j30775j98377j74437L22920j57076j1244R9908L9861K59095
8396C211556K25677J98856K07771M11243M47599Q25613J039646R75708O37078
8387H180747L40784l61310p77749r28695q18425o58928n83494m85682j20839o08248
$$ y = [7610477, 7445261, 7346623, 7353787, 7200629, 7217037, 7167155, 6992604, 7338580, 7675692, 7673898, 7509547, 7427445, 6832055, 6045500, 5539248, 5361552, 5331239, 5352258, 5335160, 5198306, 5291675, 5215128, 5215398, 4952135, 4647441, 4417668, 3941699, 3795536, 3928762, 3974870, 4035329, 3891873, 4032767, 3879648, 3706303, 3981988, 3750401, 3840344, 3842027, 3753248, 3972935, 3837904, 3578961, 3791593, 3558865, 3509666, 3546299, 3458959, 3096280, 3222510, 3386256, 3187935, 3161681, 3030906, 2832529, 2658092, 2981012, 2823936, 2812692, 2912600, 2952461, 3211556, 3437233, 3636089, 3843860, 4255103, 4702702, 5528315, 6567961, 7543669, 8180747, 8521531, 8160221, 7382472, 6453777, 5635352, 4976424, 4392930, 3907248, 3786409, 3178161]
8377C178161l69489R066o11p2078K1244J03417j62996l13645o4683j0907P9638
8366B397117l88245K77403k2952o7385l06475K02482Q543J03727J32320O64483
8356C001018J32293O7095L7009J52002Q36902R83547J091142R79974M76692j56219
8346G601455n31440n90228o46666n38513m48325l18421l88263l86747j55104l06674
8336C291074m07494l89342j07935l45945K79056k60010q0951k14263N87M3682
8326A808459j92338K00231N1377O4884q866n7863j08332j16257L82535j80256
8316A843574r0008o7308k59229J7077K93702K26700J50109o6937J72314j98071
8306B021923J35552L92202j7931m5798J62123q2692k61021q8540N525o4445J66806
$$ y = [3178161, 2808672, 2817738, 2817127, 2745049, 2766293, 2869710, 2706714, 2393069, 2328386, 2317479, 2397117, 2008872, 2286275, 2263323, 2195938, 1889463, 2091945, 2100488, 2204215, 2336535, 3001018, 3133311, 3200406, 3237415, 3389417, 4226319, 5209866, 6301008, 7280982, 7757674, 7601455, 7070015, 6479787, 5833121, 5294608, 4846283, 4527862, 4139599, 3752852, 3597748, 3291074, 2883580, 2494238, 2386303, 2040358, 2319414, 2059404, 1978453, 1764190, 1764777, 1808459, 1616121, 1816352, 1867729, 1932613, 1923747, 1865884, 1757552, 1641295, 2023830, 1843574, 1753566, 1686258, 1427029, 1444106, 1737808, 1964508, 2114617, 2047680, 2219994, 2021923, 2157475, 2549677, 2531746, 2485948, 2648071, 2565379, 2304358, 2215818, 2221343, 2156898, 2323704]
8295B323704K57839N61133L69723P93809O82736K81935M18521M41262k621K7541
8285F155582j33581o43748p19201m86159k24913m92045m88588k8730k23575j18290
8275B596752K50152L92672K90172N6293j07186J3107p9932J5423n5084k6276j85213
8264C160880l55100J01020M00659j39755P7189K51725O4985L70530K29466P84553
8254D946152m6939q9435j73616j30592K6732J4596j06512L9665K88725m37511
8244D331265n87546k37711j36100l36644j8818j81478L24917p8446q7267K74404
8234C266576L42308Q7879J10340r8893o13209j96621n84807n6504l97817J04810
8224A964062k65175o184p6622o9041K6332k51540J57821K7427j93561L4676K25083
$$ y = [2323704, 2581543, 3142676, 3512399, 4306208, 4988944, 5270879, 5689400, 6130662, 6128041, 6155582, 6022001, 5378253, 4659052, 4172893, 3947980, 3455935, 2967347, 2938617, 2715042, 2596752, 2846904, 3239576, 3529748, 3586041, 3478855, 3491962, 3412030, 3427453, 3372369, 3346093, 3160880, 2805780, 2906800, 3307459, 3167704, 3244893, 3496618, 3561603, 3932133, 4161599, 4946152, 4899213, 4809778, 4636162, 4505570, 4532302, 4546898, 4440386, 4480051, 4768776, 4331265, 3743719, 3506008, 3369908, 3033264, 3014446, 2832968, 3157885, 3079439, 2992172, 3266576, 3608884, 3696763, 3807103, 3708210, 3095001, 2898380, 2313573, 2257069, 1859252, 1964062, 1698887, 1692703, 1616081, 1547040, 1573372, 1321832, 1479653, 1507080, 1313519, 1348195, 1573278]
8213A573278N365J38269k68640J06011j14702J59295O6168j9116j82622m5168
8203A418138L86910q786j35874K27686J39808K38966N1613L49477K69838N4835
8193B992611m84997o57172R20022j4308q1362l93942k54163J58656k15665p2733
8183A896947p5964J16090R9400R448k2570J77144J41914N18325P9434J12398J86018
8172C238584K22306J58607J58314N7676k864l65918j13753K05226j87115m7413
8162C323650K67461J97556J60107M93443J1051K44682j0830N81553o1644Q1915
8152E288944N382L01770j39146K75589N45047j53933J12868K26604K72602J77114
8142F912841j86558J8518P46583L85902O52195J017076J402487J797670K771072
$$ y = [1573278, 1578643, 1716912, 1448272, 1554283, 1439581, 1598876, 1665044, 1645928, 1463306, 1418138, 1805048, 1796262, 1660388, 1888074, 2027882, 2266848, 2318461, 2667938, 2937776, 2992611, 2507614, 1850442, 2770464, 2756156, 2674794, 2280852, 2026689, 2185345, 1969680, 1896947, 1820983, 1937073, 2036473, 2045921, 2023351, 2200495, 2342409, 2860734, 2940168, 3052566, 3238584, 3460890, 3619497, 3777811, 3835487, 3832623, 3466705, 3352952, 3558178, 3371063, 3323650, 3591111, 3788667, 3948774, 4442217, 4453268, 4697950, 4687120, 5268673, 5207029, 5288944, 5294326, 5596096, 5456950, 5732539, 6277586, 6123653, 6236521, 6463125, 6735727, 6912841, 6726283, 6744801, 7491384, 7877286, 8529481, 9546557, 10949044, 12746714, 15517786]
8133A5517786L888468M983926N248640L926862J229541j685562l849196n120580
8125B4139885m317445l325502k605804j618962j121712m49169M1465K10835J35748
8116A1089339n55391p09927n15848m87804n99366o63530m95068l67820J07081
8107F801666N94993O95886P48022N90791J056393P12832N8393q9808m03711o75714
8097A0089743k66254K58406M32322J209889K377876L578144M453232M913720K911383
8088B9958461L79184k146972l626118l444557k802600k468554k172577k232224
8080A1444043j940610j469605j385512j043860m71394l36044m53360k54209l58121
8071C731328k65996J4216l05678k61597J23865k0803O4674p7325j65167m21808
$$ y = [15517786, 19406254, 24390180, 29638820, 33565682, 34795223, 33109661, 29260465, 24139885, 19822440, 16496938, 13891134, 12272172, 11150460, 10701291, 10742756, 10953591, 11089339, 10533948, 9824021, 9308173, 8820369, 8221003, 7557473, 7062405, 6694585, 6801666, 7396659, 8092545, 8840567, 9431358, 10487751, 11200583, 11258976, 11169168, 10765457, 10089743, 9823489, 10081895, 10514217, 11724106, 14101982, 17680126, 22133358, 27047078, 29958461, 30337645, 28190673, 24564555, 21119998, 18317398, 15848844, 13676267, 11444043, 9503433, 8033828, 6648316, 5604456, 5133062, 4797018, 4343658, 4089449, 3731328, 3465332, 3479548, 3173870, 2912273, 3036138, 3015335, 3080009, 3002684, 2837517, 2415709]
8061B415709J30451O1113j59225K3386j44675k18936O6734K27030j94398R3209
8051B300398o9327o7614N0416J82353K11807N90815Q55032O06947L33930P5016
8041E069773n39057n81044j055422k09045k33704m37737k01149j02482m5024j88241
8031A476868L6206j22202l06231J96758J78238j72165k08969Q4683O5844K9375
8021A258405l8487J04436J73330O9766P1296M1241J61763J86016J47911K68812
8011B444489L84921J84148j38500k92521j78002k99691j72817j26715n13113l29143
8001I63056K4576K39303L0423k54051q7054L3569J18079J13437O5335l9745K05028
7990A411956N1456k45752q3660P7730j62743Q5912J92991p4612P5132M38867p3851
$$ y = [2415709, 2546160, 2607273, 2448048, 2471434, 2326759, 2107823, 2174557, 2401587, 2207189, 2300398, 2231071, 2163457, 2213873, 2396226, 2608033, 3198848, 4053880, 4660827, 4994757, 5069773, 4530716, 3949672, 2894250, 2685205, 2451501, 2013764, 1812615, 1710133, 1665109, 1476868, 1513074, 1390872, 1084641, 1281399, 1459637, 1287472, 1078503, 1163186, 1229030, 1258405, 1219918, 1324354, 1497684, 1567450, 1638746, 1679987, 1841750, 2027766, 2175677, 2444489, 2829410, 3013558, 2875058, 2582537, 2404535, 2104844, 1932027, 1805312, 1292199, 963056, 987632, 1226935, 1257358, 1003307, 916253, 949822, 1067901, 1181338, 1246673, 1206928, 1411956, 1463412, 1217660, 1134000, 1211730, 1048987, 1134899, 1327890, 1253278, 1328410, 1767277, 1693426]
7979A693426M64016K09900j67128j407J79658R4377K67839P6193j81158m27634
7969B208082j68879k8872l31286m21886k15485J55720l2214j56758m2638N3033
7959A018817p5186J17948j27899m5384L13347m3394j75820K79865P0039k55564
7949A076769j44927K66625K3448k00283M04233j30252j92017L05424J54058j90520
7939A372558k23182J5739M2415j86926j69616J78690k4139K2420j35477N362K91967
7928A189811N4372J6184j07426o973J27053r8660L23762j53313l13722J50929
7918A182017l70138n0434O4225J52179j09491J29357k07570n1628J84216J25365
7908A048098J38407j01592Q852k31056j68314L05808j04617Q397l6672J20319
$$ y = [1693426, 2157442, 2367342, 2200214, 2198807, 2378465, 2472842, 2740681, 2816874, 2635716, 2208082, 2039203, 2010331, 1679045, 1257159, 1041674, 1197394, 1165180, 1008422, 965784, 1018817, 943631, 1061579, 933680, 888296, 1201643, 1158249, 982429, 1262294, 1332333, 1076769, 931842, 1198467, 1221915, 1021632, 1425865, 1295613, 1103596, 1409020, 1563078, 1372558, 1149376, 1165115, 1207530, 1020604, 850988, 1029678, 1005539, 1027959, 892482, 897844, 1189811, 1244183, 1260367, 1152941, 1145968, 1273021, 1174361, 1498123, 1344810, 1031088, 1182017, 811879, 761445, 825670, 977849, 868358, 997715, 790145, 738517, 922733, 1048098, 1186505, 1084913, 1093765, 862709, 694395, 1000203, 895586, 903983, 867311, 987630]
7898I87630j4577k3114L56323J46241k76686j76526K57882J16061L57114K79434
7888B009782M64982N54501L76100N16573m29294m17465l83176P3445j73254q7394
7878B504800k29410M3114J88665K4381K23677j5535l23464j17106j33909l77639
7868A787574J54783R0956P3895k5878J36986O6560O07970n01549j25215j57000
7858B109082K00281k120j57464o252K23221k7149L86010M11448L27280P39022
7848D203359L76664N74124J80552n5246o72863m15600m19813m90659n33722l31113
7838B415683L86545J66333M65036N1686L25665O1740J30976l46850k38387o05528
7828B812899k34388k54425N5045m40593k63983J44788k65714J75399Q6502j43977
$$ y = [987630, 973053, 949939, 1306262, 1452503, 1175817, 999291, 1257173, 1373234, 1730348, 2009782, 2474764, 3029265, 3405365, 3921938, 3492644, 3075179, 2692003, 2765448, 2592194, 2504800, 2275390, 2318504, 2507169, 2531550, 2755227, 2739692, 2416228, 2299122, 2165213, 1787574, 1942357, 2033313, 2107208, 2081330, 2218316, 2284876, 2892846, 2391297, 2266082, 2109082, 2309363, 2307243, 2149779, 2143527, 2366748, 2339599, 2725609, 3137057, 3464337, 4203359, 4580023, 5154147, 5334699, 5279453, 4606590, 4190990, 3771177, 3280518, 2746796, 2415683, 2802228, 2968561, 3433597, 3485283, 3810948, 3872688, 4003664, 3656814, 3418427, 2812899, 2578511, 2324086, 2379131, 1938538, 1674555, 1819343, 1553629, 1729028, 1815530, 1671553]
7818A671553j95203l70353L26904K91506p8154J77194j8293j50270L42048O2589
7808B059521M70088n06399j123281P92840k84478r1013l51884M8023J79374K25484
7798A418275o0578M6859K35447N12121M6291J57111K20958j78362l04187k09397
7788A884538j53664q6935j42123k15751j52132j88938K04543J02569J07185j94375
7778A164917k50593K14041L9505m4358o8973p4049M9973J79228m652l512j22015
7767A079512Q7179n0177o8787j30394K95167J49566J01271m50238K45144j3472
7757A244771J86389M3936k40820j35206j26756J53219k68745J63673p353O7662
7747A080770J91856j42428n7742K29463k04172J3424q6162R877m3828J53654j44327
$$ y = [1671553, 1476350, 1105997, 1432901, 1724407, 1646253, 1823447, 1805154, 1654884, 1996932, 2059521, 2529609, 2023210, 899929, 1692769, 1408291, 1317278, 965394, 1013417, 1192791, 1418275, 1357697, 1404556, 1640003, 2152124, 2198415, 2355526, 2576484, 2398122, 2093935, 1884538, 1730874, 1643939, 1501816, 1286065, 1133933, 944995, 1149538, 1252107, 1359292, 1164917, 914324, 1128365, 1167870, 1123512, 1054539, 980490, 1030463, 1209691, 1205039, 1201527, 1079512, 1166691, 1116514, 1047727, 917333, 1212500, 1362066, 1463337, 1013099, 1258243, 1244771, 1431160, 1475096, 1234276, 1099070, 972314, 1125533, 856788, 1020461, 1013108, 1080770, 1272626, 1130198, 1072456, 1301919, 1097747, 1111171, 1025009, 1034886, 991058, 1144712, 1000385]
7736A000385K23893K07843j14724j06329m12569L8653J61360j1891J31646K20031
7726A338298K5952q3863k63980J15915J96176j10714J00616Q9803N1908k81148
7716A178963J53603R3843n688k10821q5896P7383K92698n4902j64519R4056L85777
7705A754497K6588k58068K28862j50081j12665O0412L65676J5237J17845j19919
7695A928384j33692K18376j2445n8851K60061L48947p0665M765K230l9684J58278
7684B605704K34902j05438k3846n3248K80274J45563K88264J96103L04888L55900
7674D229066N20311L72345L2076K49982J02916K21638J42005L11159M2106M32918
7664F656522L07771P49569N72640O19492M95895P03910Q24001K87667P61172O50965
$$ y = [1000385, 1224278, 1432121, 1317397, 1211068, 798499, 837152, 998512, 986621, 1118267, 1338298, 1364250, 1280387, 1016407, 1132322, 1328498, 1217784, 1318400, 1408203, 1460111, 1178963, 1332566, 1426409, 1420721, 1209900, 1124004, 1201387, 1494085, 1439183, 1274664, 1368720, 1754497, 1781085, 1523017, 1751879, 1601798, 1489133, 1549545, 1915221, 1930458, 2048303, 1928384, 1794692, 2013068, 2000623, 1941772, 2201833, 2550780, 2480115, 2484880, 2487110, 2447426, 2605704, 2840606, 2735168, 2711322, 2658074, 2938348, 3083911, 3372175, 3568278, 3873166, 4229066, 4749377, 5121722, 5153798, 5403780, 5506696, 5728334, 5870339, 6181498, 6223604, 6656522, 6964293, 7713862, 8286502, 8905994, 9401889, 10105799, 10929800, 11217467, 11978639, 12629604]
7654A2629604P08752J98989M26868K32638j78514l47614j85565k59694j93419
7645A3032045l36751o28397o53210o49099n21470l53359o70857m83343m12118
7636H323441m73257j43929m07377l34392l86197n94396k22410m90861o33785q1023
7626D555814m47998j5456l19528l17213Q6373k79757j34306j40054l9833j73286
7616B774756p8212R4321n1582L7599m7348j49305k88927j44575J5355k92292p1531
7605A798259K74952j66036K56953j32746p0041K63057o6370l6001N14898J30996
7595B767921o16K00668k96189m81556k2793j84897l35228j58307k17419P5051
7585A346635J89104J3413j45630p5841j28325k21161q4068K13369o9715J4908
$$ y = [12629604, 13338356, 13537345, 13964213, 14196851, 14018337, 13670723, 13485158, 13225464, 13032045, 12695294, 12066897, 11413687, 10764588, 10243118, 9889759, 9218902, 8735559, 8323441, 7850184, 7706255, 7298878, 6964486, 6578289, 5983893, 5761483, 5270622, 4636837, 4555814, 4107816, 4092360, 3772832, 3455619, 3541992, 3262235, 3127929, 2987875, 2948042, 2774756, 2696544, 2790865, 2739283, 2776882, 2729534, 2580229, 2291302, 2146727, 2162082, 1869790, 1798259, 2073211, 1907175, 2164128, 2031382, 1961341, 2224398, 2158028, 2122027, 2636925, 2767921, 2767305, 2967973, 2671784, 2190228, 2167435, 1982538, 1647310, 1489003, 1271584, 1346635, 1535739, 1549152, 1403522, 1327681, 1199356, 978195, 894127, 1107496, 1037781, 1052689]
7575A052689k40817l66658K13691K02947J11415n6358n3262J22758m2972J49352
7565A092785j71973P9893J10551j25251J46753N5620J89245N7560L80861J55889
7555A971933K17955J07915l53640J4067j56433k0178l41060l49062k28095k43779
7545F19623J13449K15811l11618l59403O9365J33343J78989K17107k42407l2498
7535F01761j4597K3803q9537k04342L25765Q8829k44744l4605k26156j3238k06303
7524F636K94930L5785o0563q3676J09620L28386j74967m0466l47987R7165R9692
7513B64555K83301R1752J9571k32786r5396j3284J26430j87618K9300J24334J09600
7502E19759J18924k90078k36740K39434J97591j15874K20204K6885l52275j74173
$$ y = [1052689, 811872, 445214, 658905, 861852, 973267, 916909, 863647, 986405, 943433, 1092785, 920812, 1000705, 1111256, 986005, 1132758, 1188378, 1377623, 1435183, 1816044, 1971933, 2189888, 2297803, 1944163, 1958230, 1801797, 1781619, 1440559, 1091497, 863402, 619623, 733072, 948883, 637265, 277862, 347227, 480570, 659559, 876666, 634259, 601761, 587164, 610967, 521430, 317088, 642853, 731682, 486938, 452333, 226177, 212939, 6636, 301566, 337351, 276788, 193112, 302732, 631118, 456151, 415685, 67698, 164863, 264555, 547856, 639608, 659179, 426393, 330997, 317713, 444143, 256525, 285825, 410159, 519759, 638683, 348605, 111865, 351299, 548890, 433016, 653220, 680105, 327830, 153657]
7492A53657J43123j6774L22711q9791r3965j78543J40828j70818r7385M8896n545
7481A56394L54172l2446j57793j05087o0640n4127M2319j239k0530j09683J41239
7470A52579n5541O0817j60965K4363J39787K51769k7683J7471L7119L9279M4242
7459E23237n25290J42547L73999m08152l53702K30350J29466l1954J12087K82359
7449D74947j92723r2606J73431n08045J41731K29090q1736N8045K34795r5579
7439C41350m99555L25536j58651J70171J57016k40974j10769k8036L37624j02195
7429A91517J58273j05853j95629M1765Q075j06664o4184N9206N5351j17491P5750
7418A16j46310Q7466m5715l1805J03372K3161J25625k15516J21495m493K3382
$$ y = [153657, 296780, 280006, 602717, 512926, 418961, 240418, 381246, 210428, 113043, 161939, 156394, 510566, 478120, 320327, 215240, 154600, 100473, 142792, 141553, 121023, 11340, 152579, 97038, 157855, -3110, 21253, 161040, 412809, 385126, 402597, 439716, 478995, 523237, -2053, 140494, 514493, 106341, -247361, -17011, 112455, 80501, 192588, 474947, 282224, 189618, 363049, -144996, -3265, 225825, 144089, 202134, 436929, 341350, -158205, 167331, 8680, 178851, 335867, 94893, -15876, -43912, 293712, 191517, 349790, 243937, 48308, 90073, 98148, -8516, -72700, -13494, 41857, -75634, 116, -146194, -58728, -104443, -136248, -32876, -9715, 115910, -99606, 21889, 17396, 40778]
7407D0778J03986K10738J02396J00658k96894J93824q0816n3286j70563K42931
7397C93752j2851J52089L0311J20608j19314j1453J4265j79618J30951l93848
7387A24892M71393k09897J28751q3204l54739j48102K28401L109J72735o2362
7377B70977l08400L6290Q5297J03129j29028l4432j67077r9788j5678L12776Q0361
7366A34427j30908J28630M5496J8929n7779j14944J81033N4906l41945L35327
7356B53172j82055J04691K16605j71395J49107J81096j02864l99747k64600J69662
7346d6328K70957J7789j72097J01010J02620l69199J50692j47316N6943K7729
7336g200p2916L7556p7581J14242m2471L32753K30170m671P4928K02076j90508
$$ y = [40778, 144764, 355502, 457898, 558556, 261662, 455486, 374670, 321384, 150821, 393752, 380901, 532990, 563301, 683909, 564595, 553142, 567407, 387789, 518740, 124892, 596285, 386388, 515139, 431935, 77196, -70906, 157495, 160604, 333339, 270977, -37423, -1133, 84164, 187293, 58265, 23833, -143244, -243032, -258710, 54066, 134427, 3519, 132149, 177645, 196574, 138795, 23851, 204884, 259790, -82155, 253172, 71117, 175808, 392413, 221018, 370125, 551221, 448357, 48610, -215990, -46328, 224629, 242418, 70321, 171331, 273951, -95248, 55444, -91872, -34929, -7200, -80116, -42560, -120141, -5899, -48370, 284383, 514553, 509882, 584810, 786886, 596378]
7325E96378j93655j7133j4042P9696k75015j16104O1307j88078k69372N44033
7315B08015K02252R2546l85749n7468O2471r9149J08726O0095l33604M7791J37218
7304D3144o1985j69401Q3575J08303J55216l7713O1501L19300k65968j59155j39242
7293f2425O9900j10325j6974j0644K74675n4492p7326J60231K26846O3270k49853
7282B12883j79294j39266L5213k6008o8333K74545j5479j54483J54946j7885J66004
7271B42843j18785J40208J04054K877r4945j303k4092k12549M4829K5818k32338
7260a23383j11048K72520K01709M4337m4065m643j87245l6274J16224L8472j31469
7249C5135R9948J70002j43512m18467Q4791j44586J08937p7491K94036N5681o941
$$ y = [596378, 402723, 385590, 371548, 451244, 176229, 60125, 121432, -66646, -336018, 208015, 410267, 502813, 117064, 59596, 122067, 22918, 131644, 191739, -141865, -94074, 43144, -18841, -188242, -104667, 3636, 158852, 121139, 182640, 501940, 235972, 76817, -62425, 7475, -102850, -119824, -130468, 144207, 89715, 12389, 172620, 399466, 462736, 212883, 33589, -105677, -70464, -96472, -164805, 109740, 94261, -60222, 94724, 76839, 242843, 124058, 264266, 368320, 371197, 276252, 274949, 250857, 38308, 83137, 108955, -123383, -234431, 38089, 239798, 284135, 240070, 235427, 48182, 11908, 128132, 166604, 35135, 135083, 305085, 161573, -256894, -172103, -316689, -207752, -285243, 8793, 64474, 57533]
7238E7533J13527j03766K82055k22956n5960Q5273K9691J38905J04064J57901
7228E86267k70946k80907J88657k7049q9026J66023k21894k29318J04172L12532
7218B38511M9332R886j29014j60237m9260J27409J69175j42397J54071R4312l2733
7207C29055M5564k09957J31145k38262l6399K12976N7173J88930o5292l7840r79
7196C76114P7068j74684J58389J24537k02816o8142J48350R1334J1071j07015
7186D34206l0938o9981r1188O1508N070j92258N5969j03777q6324N5349K17708
7175B55344P947j92264j34918K63963P2397O855K03255R6618k5682L4427q2900
7164E05042l37728k22142n3622L97131j03126O0297J6159R8124k8111o1774j01150
$$ y = [57533, 171060, 67294, 349349, 126393, 70433, 155706, 185397, 324302, 428366, 586267, 315321, 34414, 223071, 196022, 106996, 273019, 51125, -178193, -74021, 238511, 287843, 297729, 168715, 8478, -40782, 86627, 255802, 113405, 267476, 361788, 329055, 374619, 164662, 295807, 57545, 21146, 234122, 291295, 480225, 414933, 377093, 376114, 453182, 278498, 436887, 561424, 358608, 290466, 438816, 530150, 541221, 434206, 403268, 333287, 242099, 303607, 308677, 116419, 172388, 68611, -17713, 37636, 255344, 263291, 71027, -63891, 200072, 272469, 279324, 482579, 579197, 553515, 587942, 505042, 167314, -54828, -108450, 288681, 185555, 245852, 262011, 360135, 332024, 270250, 169100]
7153A69100J75663K12413j66855K02623p0887J1090j96376l6365N2601L63671
7143G16678J3439q5429j97669j21002j09295K57774q8420j08758J50209k55386
7133A72141j7253o9440N2553m2199p6497J78493J18675l3621j49626j27663K91606
7122B97169J24836m7782l6819q9700k54034j67512N37758K2156l01053j72947
7112h7928L90472L47649m10997j00425K17542R5118k75003J07213j55890j11649
7102A6102m2594k00302R1087L88048M1392l7760k51848n4319K42380N6820K14222
7091D63228k611J07761J66193o3185j48050n9481p0459J85103o082j98046k39657
7080A34714j34144K71239j5566J65398k59952j78453J94625K71857j68152J23232
$$ y = [169100, 344763, 557176, 390321, 592944, 522057, 533147, 336771, 300406, 353007, 716678, 730117, 644688, 447019, 326017, 216722, 474496, 386076, 277318, 427527, 172141, 154888, 85448, 138001, 95802, 19305, 197798, 316473, 282852, 133226, 5563, 297169, 422005, 374223, 337404, 247704, -6330, -173842, 363916, 386072, 85019, -87928, 302544, 650193, 239196, 138771, 356313, 451431, 176428, 283641, 127751, 16102, -26492, -226794, -135707, 252341, 293733, 255973, 4125, -50194, 192186, 249006, 463228, 460617, 568378, 734571, 671386, 523336, 463855, 393396, 578499, 572417, 374371, 134714, 570, 271809, 256243, 421641, 161689, -16764, 177861, 449718, 281566, 404798]
7070D04798k51655O5244R3669j76771j7714J86691k12103j8786P0218O8991J12976
7059C25558j33426L86705l39987J6451j56571L07203k71734j03908K43981J02762
7049C77034m35313K92666J26192j79517j0799P5645J28388j63093m0177k19436
7039d8410L28932K01959L9955m3389P1727j2776K9430K1582P9077j59299j19016
7028C89772j90291K8930j094k27754J32421R369J37360N8669j28318J46444P9089
7017D34597J50683l97484k53091L97350J11086j47051Q3974m65101J79434J15631
7007B10028j02748J87367j37794n4706J66114J94566p7161o4733J0641R8741j09315
6996C21000r7738m02535J86760k53361Q3404L45531j36305K01966j91701J81282
$$ y = [404798, 153143, 218387, 312056, 135285, 117571, 304262, 92159, 73373, 143591, 212582, 325558, 192132, 578837, 238850, 255301, 98730, 405933, 134199, 30291, 274272, 377034, -58279, 234387, 360579, 181062, 170263, 245908, 374296, 211203, 171026, -48410, 280522, 482481, 522436, 479047, 550774, 537998, 567428, 589010, 668087, 508788, 389772, 199481, 228411, 227317, -437, 131984, 141353, 278713, 337382, 209064, 355508, 434597, 585280, 187796, -65295, 332055, 443141, 296090, 380064, -85037, 94397, 210028, 107280, 294647, 156853, 102147, 268261, 462827, 385666, 320933, 331574, 430315, 321000, 223262, -179273, 7487, -245874, -162470, 183061, 46756, 248722, 57021, 238303]
6986B38303j04781j6586J12334K4188j39442L28749K7132j36206j68881j33713
6976C1097J17823p8340P8347k85547J06344J30630J33580m8668l8269Q3734J3445
6965B44176l14977R1207K55479k37084J16762K31506k25781K9806J16372n3447
6955B54019p0817Q9625l06424r7317M3637O0639K26258R6045J30053j39019l44737
6944e8038K93977P7296j18066j13795j90359K39920j04406o7528L24171q7551
6934A95621m3055J66377k07241o522R8094Q077J58445J31465n49651j70532J36982
6923h1940J77901p97j72223P3850P5888L02217J680k34309l6036r6902m2076K07895
6911A75148j19872p5152P9688J96221l35221J27063J54479k13069L2539L913R5629
$$ y = [238303, 133522, 116936, 229270, 253458, 114016, 442765, 469897, 333691, 164810, 31097, 148920, 70580, 148927, -136620, -30276, 100354, 233934, 185266, 146997, 230731, 244176, -70801, 20406, 275885, 38801, 155563, 387069, 161288, 191094, 307466, 254019, 183202, 272827, -33597, -130914, -87277, -26638, 199620, 295665, 425718, 286699, -58038, 235939, 313235, 195169, 81374, -108985, 130935, 26529, -40999, 283172, 195621, 152566, 318943, 111702, 105180, 203274, 211351, 369796, 501261, -48390, -218922, -81940, 95961, 95164, -77059, -3209, 72679, 374896, 376576, 142267, 106231, 9329, -32747, 175148, 55276, -19876, 59812, 256033, -79188, 47875, 202354, -10715, 21824, 25737, 121366]
6900A21366k39926k13071K9358q144n4559L8326J09486L85257K75992k10279l11213
6889g7407R4154j20066j20224K32833P2267j38955k3389J84041n163l25521O6496
6878a60934Q8430K82102l42862r9135L77336N6088j40508o3250N3137o4149K10482
6867A96737j04323j69287l5488J79806k11290k40629m9825K15612K79440J30180
6857A90933J83329k43978L1550j21599l4143n2435J87713j85461J2277j7009K84922
6846B36099r6279K4586K9845j58321k91758L32063K15032j37464M1990m1575k1602
6835A32616j586j80153J55446M02060k12146k49652K5467M12489k68104q6222
6825A30215J7154q9534P4550K54462k67929J66089J01914J42814k00860l196j95454
$$ y = [121366, -118560, -331631, -302273, -310417, -364976, -326650, -217164, 168093, 444085, 233806, -77407, 16747, -103319, -223543, 9290, 81557, -57398, -80787, 103254, 98091, -227430, -160934, -72504, 209598, -133264, -232399, 144937, 201025, 60517, -2733, 50404, -13745, 196737, 92414, -76873, -112361, 67445, -143845, -384474, -434299, -218687, 60753, 190933, 374262, 130284, 161834, 40235, 6092, -46343, 141370, -44091, -31814, -48823, 236099, 139820, 164406, 194251, 35930, -255828, 76235, 291267, 153803, 195793, 154218, 132616, 131030, -49123, 106323, 508383, 296237, 46585, 72052, 484541, 216437, 130215, 147369, 57835, 132385, 386847, 118918, 285007, 386921, 529735, 328875, 325679, 130225]
6814A30225l90666P9322Q8863O5037L46587p013q7396j02958L018k28827R9515
6803d293J04575K1475J51873p0094m2500j2269O6551J90326J75110l5068k31666
6792C14020j08000L609o9664k5972p2286J58838k9494l7709j37857Q5864J88008
6781B69357k21089L777M82591j4999m38398M0294r6009J24648j69124j02879n2903
6770a74734J84096o6817n1875l3761J21798K4117K30469j26684K4865m9186k12377
6759a30089Q3735j90494J96660l48027K65965L07221J62211Q8460J25520j34365
6749D26797O3161k73059J84171j25779k61283N16505R7848M6815k03277k32761
6739B39138j81810R3776l2441r5370O2573K70662K7742j11483q5061L810J26870
$$ y = [130225, -260441, -181119, -92256, -27219, 319368, 312355, 224959, 122001, 125019, -103808, -4293, 100282, 121757, 273630, 203536, 161036, 148767, 215318, 405644, 580754, 545686, 314020, 206020, 209629, 139965, 113993, 41707, 200545, 171051, 133342, -4515, 81349, 269357, 48268, 52045, 534636, 519637, 81239, 121533, 25524, 150172, -18952, -121831, -174734, 9362, -57455, -109330, -143091, -21293, 2824, 233293, 106609, 131474, 82288, -130089, -46354, -236848, -40188, -388215, -122250, 184971, 347182, 435642, 561162, 426797, 489958, 216899, 401070, 275291, 14008, 530513, 628361, 675176, 471899, 239138, 57328, 151104, 118663, 23293, 85866, 356528, 384270, 272787, 187726, 191536, 318406]
6728C18406j892n467O5157K81281l51803J06727j88713j16545P172j52558K43113
6717B04878p2331j15512K11664q2283l368K09883j60192m21049L35946K71447
6707C79083k70968m7526J39725Q4694R3064k57420K03114j49167k5970j25810
6697B2819J930j13205j81414N18099J36953k58116K28745R073k05495M2940q3021
6686A19308L1120K356J39062j59700J33181n6327J74222k70641j75638q754J78822
6675A07011j36606N1404J19650J98401K83519l54971J7323m6928J31909j17568
6665B53144P6535o161O5860J94411M1442l58192q4353j16832K18427l8507j58655
6654H7119r3233J14272K08378k16955L55462M3401l28579k37404L45411l23684
$$ y = [318406, 316514, 311047, 376204, 657485, 305682, 412409, 223696, 107151, 114323, -38235, 204878, 132547, 17035, 228699, 146416, 143048, 352931, 192739, -228310, 107636, 379083, 108115, 60589, 200314, 285008, 378072, 120652, 323766, 174599, 148629, 22819, 24749, -88456, -269870, 248229, 385182, 127066, 355811, 364884, 159389, 202329, 119308, 150428, 152784, 291846, 132146, 265327, 209000, 383222, 112581, -63057, -71811, 107011, -29595, 21809, 141459, 339860, 623379, 268408, 285731, 238803, 370712, 253144, 329679, 323518, 389378, 583789, 625231, 267039, 182686, 65854, 284281, 245774, 87119, -6114, 108158, 316536, 99581, 455043, 498444, 169865, -67539, 277872, -45812]
6644d5812J85485M00042m260l52930p1450J37306M7528k98779J08454J22577J56793
6633C84954j46158k40316J3850K09780n579M2092l00945j20093K87094j31969
6623g290J67975J06929K65596k75618j7389j54226J50730j2343K97264k22235
6613B99393O3864J20099j08277j9281k16239J15697N4935j78584J45348J31460
6603D08415k38022M3788N0807J39642K53927O8823m05012K96275n6110j96793
6593C65740j62066K74487j15416K7514r4551o4847j10253K2783Q8081J67597j01526
6582B97543p468J55895N4337r8484m12559k8977J81649J50392k09315j7029J59586
6571B25570j91865K17403L6413K9477K89424m90423j9544o5754o7412L26758k32037
$$ y = [-45812, 139673, 539715, 535455, 182525, 111075, 248381, 295909, -2870, 105584, 228161, 384954, 238796, -1520, 12330, 222110, 216531, 258623, -42322, -162415, 124679, -7290, 160685, 267614, 533210, 257592, 240203, 85977, 236707, 224364, 521628, 299393, 363257, 483356, 375079, 355798, 139559, 255256, 310191, 131607, 276955, 408415, 170393, 214181, 264988, 404630, 658557, 727380, 322368, 618643, 562533, 365740, 203674, 478161, 362745, 390259, 295708, 230861, 120608, 143391, 231472, 399069, 297543, 290075, 445970, 500307, 401823, -10736, -39713, 141936, 292328, 83013, 65984, 225570, 33705, 251108, 287521, 316998, 606422, 115999, 96455, 30701, -36711, 290047, 58010]
6560E8010j8710J60085P9231j7708K4490R9079p1398J53719j00161l87388M6573
6549B5822L12791l9159r7942J54395n898l6674K7081J34407L5998j42648j4109
6538C54064j56264j00628n9441l1305l2584R5318o5908R6911q6949L92622k04180
6527B01656J09613k69940L8238P0281R7826j82663J93069p2859m4175Q8989k26192
6516C843K18178O4944m6207p2244J62432k37948k1243M6581K68341j02685N1129
6505C35121l9235l7573p3968j10898J29102n416R1714L42609l09313p4891J31458
6494C78710n9766O1162j94626q8693k14921O5358K93112J67514j37470l2758j88339
6483D9283K32211L77327k58464j52572n6843m799J88376J08762J12613j58757
$$ y = [58010, 39300, 199385, 278616, 260908, 285398, 384477, 313079, 466798, 366637, -20751, 25822, 338613, 299454, 201512, 355907, 350009, 313335, 340416, 474823, 510821, 368173, 354064, 197800, 97172, 37731, 6426, -26158, 69160, 3252, 100163, 13214, 405836, 201656, 311269, 41329, 79567, 149848, 247674, 65011, 258080, 185221, 141046, 230035, 3843, 222021, 286965, 240758, 168514, 330946, 92998, 71755, 118336, 386677, 283992, 335121, 295886, 258313, 184345, 73447, 202549, 197133, 288847, 631456, 322143, 247252, 378710, 318944, 380106, 185480, 96787, -118134, -52776, 240336, 407850, 270380, 237622, 49283, 281494, 658821, 400357, 247785, 190942, 186143, 374519, 483281, 595894, 437137]
6473D37137j33135L098o1672K08207K05204j39730K44137j07633j56164J19294
6463F18743j03970j7408k66218n0344R9299J44107j13506J26557l69086L12753
6453C80927j26141J93643L44020R6823N293j80571n8854k87031j61712K5023R6704
6442C28124k0492L48264l84931j05797N0713L87977q9255P6709P1403k30054j8108
6431D14553j70813K56242L6975O645j09147O6177p4711J38815k29612J14729j21328
6420C28525J64141R5052o9378K9432r738J82827P8608j89843j87272L03637j46545
6409E79446J18445r888l9739j89156q8731K97937J7461M2963M8003p2863K89447
6398I93325P617k400K08221J02593p7114N040K25240J37491M4133J3371M03529
$$ y = [437137, 304002, 307100, 245428, 453635, 658839, 519109, 763246, 655613, 499449, 618743, 514773, 497365, 231147, 180803, 280102, 424209, 310703, 437260, 68174, 380927, 254786, 448429, 792449, 889272, 894565, 713994, 655140, 368109, 206397, 231420, 328124, 307632, 655896, 270965, 165168, 215881, 603858, 514603, 591312, 662715, 432661, 414553, 243740, 499982, 536957, 543602, 434455, 500632, 425921, 564736, 335124, 449853, 328525, 492666, 587718, 518340, 547772, 538034, 720861, 799469, 609626, 422354, 725991, 579446, 697891, 688003, 648264, 459108, 370377, 668314, 685775, 728738, 776741, 703878, 993325, 1000942, 998542, 1206763, 1309356, 1232242, 1237282, 1462522, 1600013, 1644146, 1657517, 2061046]
6387B061046L33999K27353k24187l22809K47056m25342j89303l4592m8791N808
6377A630238j0841K57572K21055K21447o4466q5760l36632j09797k89405j66667
6367A266744K379j50736m1148K0421k18825q8799l6313J74153Q2654j79010J66405
6356I97925J73193K7418m93779q9111O8853L48877j8454J60222m93548k9101O4275
6345G16770N0054Q570p4160N00997j31649k23817K55668J39352j59521L94134
6335A476398L28380K83818N53124L28650R3168m8271o17003k90116k29832j88437
6325A689879k06959O0894j8392J2443K51070L69376N99946L51661n6091l33524
6315B720303j45665m68631k18879r7991l17203k65752K0561M83926j60196K5162
$$ y = [2061046, 2395045, 2622398, 2398211, 2075402, 2322458, 1897116, 1707813, 1673221, 1624430, 1630238, 1619397, 1876969, 2098024, 2319471, 2255005, 2169245, 1832613, 1722816, 1433411, 1266744, 1269123, 1118387, 1077239, 1097660, 878835, 790036, 753723, 927876, 1010530, 831520, 997925, 1171118, 1198536, 704757, 615646, 684499, 1033376, 1014922, 1175144, 681596, 652495, 716770, 766824, 775394, 701234, 1202231, 1070582, 846765, 1102433, 1241785, 1082264, 1476398, 1804778, 2088596, 2641720, 2970370, 3063538, 3015267, 2398264, 2108148, 1878316, 1689879, 1482920, 1543814, 1525422, 1537865, 1788935, 2158311, 2758257, 3109918, 3053827, 2720303, 2574638, 2106007, 1887128, 1789137, 1471934, 1206182, 1226743, 1710669, 1550473, 1575635]
6305A575635J0441k08413k8128J44610J68125R5650k19425o7313p0300k52341
6295A148541o2260L92768O4998n7189J34166J79735p3733r7813J9628j71818p9789
6284A397234P9133j68511j2083K73991K69107J7599J87582J05224j646o8338L5868
6273B115160J7812m8464Q8227r0371j92601n7730P2924j19383Q0174j8263M751
6262A852236o3471q5972R8797J57700j03721J35588J9927l6184R9707J26663J3405
6251B214675L48735j48126n0788k78042r3251L59557K22665j2732k14151q9413
6241B259129K1612j26700K07004J2556M6710J15974k21377j37817k8104n6719
6231B092268K21208K78919j34462J54830J14113O5638p3296r5299J95054n4343
$$ y = [1575635, 1586076, 1377663, 1349535, 1494145, 1662270, 1757920, 1538495, 1471182, 1400882, 1148541, 1086281, 1479049, 1544047, 1486858, 1621024, 1800759, 1727026, 1629213, 1648841, 1477023, 1397234, 1476367, 1307856, 1295773, 1569764, 1838871, 1856470, 2044052, 2149276, 2147630, 2079292, 2115160, 2132972, 2084508, 2172735, 2082364, 1889763, 1832033, 1904957, 1785574, 1865748, 1847485, 1852236, 1788765, 1702793, 1801590, 1959290, 1855569, 1991157, 2011084, 1974900, 2074607, 2201270, 2214675, 2563410, 2415284, 2364496, 2086454, 1993203, 2352760, 2575425, 2562693, 2348542, 2259129, 2280741, 2154041, 2361045, 2373601, 2420311, 2536285, 2314908, 2177091, 2148987, 2092268, 2313476, 2592395, 2457933, 2612763, 2726876, 2792514, 2719218, 2623919, 2818973, 2764630]
6221B764630L8927L5465R0649j30991K51656K23024l61917J24932j28259k03256
6211B704860J15247o2912M734L51597M18603l9247k50195K0477L21978k83000
6201C302142L4757J58378p4621O6839K06426K43842p5742J73560J53628l9285
6191D149924k37347K40878P4877J65000L34449K12309K69516j35265P2543m7433
6181E099451o9240R0048J36701L46893P4201L52608M96926L79597J93003K53650
6171G353838L57232M51196M69224L26051N98753O07656P46875J360323Q40784
6162A3111932J386838J898036K540489L626504M786376O715792P596211P602904
6154D9265082N726989K984838p34655l376263m635181m531998k469042p16778
$$ y = [2764630, 2803557, 2839022, 2929671, 2798680, 3050336, 3273360, 2911443, 3036375, 2908116, 2704860, 2820107, 2757195, 2761929, 3113526, 3532129, 3492882, 3242687, 3263164, 3585142, 3302142, 3336899, 3495277, 3420656, 3487495, 3693921, 3937763, 3862021, 4035581, 4189209, 4149924, 3912577, 4153455, 4228332, 4393332, 4727781, 4940090, 5209606, 5074341, 5146884, 5099451, 5030211, 5120259, 5256960, 5603853, 5678054, 6030662, 6527588, 6907185, 7100188, 7353838, 7711070, 8162266, 8631490, 8957541, 9556294, 10163950, 10910825, 12271148, 13111932, 14498770, 16396806, 18937295, 22563799, 27350175, 34065967, 41662178, 49265082, 54992071, 57976909, 57242254, 53865991, 49230810, 44698812, 42229770, 41512992]
6146D1512992J908882M400962N775081M286205K116351j822159m675258o489522
6138D7013534p066652o811421n636773m153717l312057k425022k251039j646384
6130A3710469j222170r23050o23145l76507q26324j66549l32505j74111J7436
6121I083544k63083J8239j12757J53254n7485L049P6119m4965l66914K5882j2490
6110H502393J27008K51842K58088J15473J83973J47906K33154N58036K49051M21540
6100A1048464P73642M19322O7179P40834O92092J241318J385875J281381J978188
6091A9628295K637804K956205L677281N565224P405886R774208J0744797R941322
6083G2331022O850472K263044k408074n399350o257823n335439k589958L49323
$$ y = [41512992, 43421874, 47822836, 53597917, 57884122, 60000473, 58178314, 53503056, 47013534, 39946882, 33135461, 27498688, 23344971, 20032914, 17607892, 15356853, 13710469, 12488299, 11565249, 10942104, 10565597, 9739273, 9572724, 9240219, 9066108, 9083544, 8820461, 8838700, 8725943, 8879197, 8821712, 8824761, 8900880, 8855915, 8489001, 8514883, 8502393, 8629401, 8881243, 9139331, 9254804, 9438777, 9586683, 9819837, 10377873, 10626924, 11048464, 11822106, 12241428, 12308607, 13049441, 13741533, 14982851, 16368726, 17650107, 19628295, 22266099, 25222304, 28899585, 34464809, 41870695, 51644903, 62389700, 72331022, 79181494, 81444538, 79036464, 73637114, 67379291, 62043852, 59453894, 59803217]
6075E9803217L848170O164778O467768M710457R63379m034289p145400r746513
6067F1031567r714995q876813p220407n728914m009411l449779k793533k057105
6059A7180610j606613j517266j315065p23412o04592n32977r07123k38120m36334
6050I299108m27499m24839k89985m65034l41292k73879r3439j17335q4415j65634
6040F615757J6347O9112m05908L8080r9476j95612k55946K85271m8546K14756
6030F233835K17001n8301k03981K37037Q8936r0930j78795k05206j53047k91268
6020E595281r5569k48510m1693k09539N0196j330j61112j60224K10516r3925j13156
6009D730935K4932K19571j62453K21639k4116r5161l4000j26578K10290m1172
$$ y = [59803217, 63651387, 69816165, 76283933, 80994390, 81957769, 77923480, 70778080, 61031567, 51316572, 42439759, 35219352, 29490438, 25481027, 22031248, 19237715, 17180610, 15573997, 14056731, 12741666, 12018254, 11413662, 10880685, 9973562, 9735442, 9299108, 8871609, 8446770, 8156785, 7691751, 7350459, 7076580, 6983141, 6865806, 6781391, 6615757, 6632104, 6701216, 6295308, 6333388, 6233912, 6038300, 5782354, 6067625, 6019079, 6233835, 6450836, 6392535, 6188554, 6425591, 6514527, 6423597, 6244802, 6039596, 5886549, 5595281, 5499712, 5251202, 5209509, 4999970, 5050166, 5048836, 4887724, 4727500, 4938016, 4844091, 4730935, 4755867, 4975438, 4812985, 5034624, 5010508, 4915347, 4881347, 4754769, 4965059, 4923887]
5999D923887M5467R2176k62369m3197k11510j76056o9467J64902j57761j46836
5989D159236m0210k73228r5962m38688L06584J66664j71462J55091K57828k26103
5979C799750m4265J55234Q7602k41103P6185J90789K12837j42773q2772K84694
5969D296178J58039J60495J68629J14632n6312J99857j97588J02077M7780k02974
5959D790813k96578j63118J08230k08793l3182j10759J23582q121n1167o745r0648
5948D053514J34392J85275m2696p8068J42472o0386J61932L98751K68748k26353
5938D937581K02865J32642m3722l98003j21000N2279n7481L54810R1618O8292
5928E219881r6854j3086r3627L5156K6397n6572k62681k86243K26586K23735L3901
$$ y = [4923887, 4969354, 5061530, 4799161, 4755964, 4544454, 4368398, 4298931, 4463833, 4306072, 4159236, 4119026, 3845798, 3749836, 3311148, 3617732, 3784396, 3612934, 3768025, 4025853, 3799750, 3755485, 3910719, 3998321, 3757218, 3833403, 4024192, 4237029, 4094256, 4011484, 4296178, 4454217, 4614712, 4783341, 4897973, 4841661, 5041518, 4843930, 4946007, 4993787, 4790813, 4494235, 4331117, 4439347, 4230554, 4197372, 4086613, 4210195, 4202074, 4150907, 4144162, 4053514, 4187906, 4373181, 4330485, 4252417, 4394889, 4334503, 4496435, 4895186, 5163934, 4937581, 5140446, 5273088, 5229366, 4831363, 4710363, 4762642, 4705161, 5059971, 5151589, 5219881, 5123027, 5109941, 5016314, 5051470, 5077867, 5021295, 4758614, 4472371, 4698957, 4922692, 4956593]
5917D956593L1449R3019N28850K59893j01638M60962l23910n1329k50295j35356
5907E468238J454N38716R0445M7806q4119L57076M4646m12566k51141j45494K67658
5896E922719j71911L43965q763R1715K05487K29996j18241o4764K37545O13780
$$ y = [4956593, 4988042, 5081061, 5609911, 5869804, 5768166, 6229128, 5905218, 5853889, 5603594, 5468238, 5469692, 6008408, 6098853, 6146659, 6062540, 6419616, 6464262, 6051696, 5800555, 5655061, 5922719, 5750808, 6094773, 6086010, 6177725, 6383212, 6613208, 6494967, 6430203, 6667748, 7281528]
$$ [...]
##END NTUPLES=NMR SPECTRUM
##END=
