##TITLE=1H_DE-80H_X3
 200.13MHz, d2o
 8 sc
 
 19ns.26.2.2025
##JCAMPDX= 6.0         $$ Bruker NMR JCAMP-DX V2.0
##DATA TYPE= NMR SPECTRUM
##DATA CLASS= NTUPLES
##ORIGIN= UXNMR, Bruker Analytische Messtechnik GmbH
##OWNER= pz
$$ XWIN-NMR		Version 3.5
$$ Tue Dec 16 11:28:23 2025 Russian Standard Time (UT+4h)  Yarkov@DPX200
##.OBSERVE FREQUENCY= 200.1313
##.OBSERVE NUCLEUS= ^1H
##.ACQUISITION MODE= SIMULTANEOUS
##.ACQUISITION SCHEME= undefined
##.AVERAGES= 8
##.DIGITISER RES= 18
##SPECTROMETER/DATA SYSTEM= spect
##.PULSE SEQUENCE= zg30
##.SOLVENT NAME= DMSO
##.SHIFT REFERENCE= (INTERNAL, DMSO, 0, 15.4957)
##AUDIT TRAIL= $$ (NUMBER, WHEN, WHO, WHERE, WHAT)
$$ ##TITLE= Audit trail, XWIN-NMR		Version 3.5
$$ ##JCAMPDX= 5.01
$$ ##ORIGIN= Bruker BioSpin GmbH
$$ ##OWNER= Yarkov
$$ C:/Bruker/XWIN-NMR/data/yarkov2/nmr/H-C/1/pdata/1/auditp.txt
$$ ##AUDIT TRAIL=  $$ (NUMBER, WHEN, WHO, WHERE, WHAT)
(   1,<2025-12-16 11:27:30.79 +0400>,<Yarkov>,<DPX200>,
      <created by zg, POWCHK disabled, PULCHK disabled
       configuration hash MD5:
       00 E9 B6 7A A2 85 ED C7 34 08 36 98 17 FE 4E 26
       data hash MD5: 16K
       48 56 09 5C F9 59 67 D1 B7 0D D9 3C D9 85 0E 5D>)
(   2,<2025-12-16 11:27:37.31 +0400>,<Yarkov>,<DPX200>,
      <Start of raw data processing
       efp BC_mod = 2 LB = 0.25 FT_mod = 6 PKNL = 1 PHC0 = -5301.728 PHC1 = 12.22193 SI = 16K 
       data hash MD5: 16K
       72 4F 79 67 0A 1C 8B 55 1A 47 86 39 63 40 8C E0>)
(   3,<2025-12-16 11:27:44.35 +0400>,<Yarkov>,<DPX200>,
      <abs ABSG = 5 
       data hash MD5: 16K
       F7 98 D0 A1 51 D0 84 C0 A6 6B EE ED 5C 1F C6 39>)
$$ ##END=
$$ 
$$ hash MD5
$$ 87 11 F8 72 DC CB F2 BF 9E ED DE 13 52 2A 41 1B
##$RELAX= 
##$RELAX= 
##$RELAX= 
##$RELAX= 
##$RELAX= 
##$RELAX= 
$$ Bruker specific parameters
$$ --------------------------
##$DU= <C:/Bruker/XWIN-NMR>
##$EXPNO= 1
##$NAME= <H-C>
##$PROCNO= 1
##$TYPE= <nmr>
##$USER= <yarkov2>
##$AMP= (0..31)
100 100 100 100 100 100 100 100 100 100 100 100 100 100 100 100 100 100 
100 100 100 100 100 100 100 100 100 100 100 100 100 100 
##$AQSEQ= 0
##$AQ_mod= 1
##$AUNM= <au_zg>
##$AUTOPOS= <>
##$BF1= 200.13
##$BF2= 200.13
##$BF3= 200.13
##$BF4= 200.13
##$BF5= 200.13
##$BF6= 200.13
##$BF7= 200.13
##$BF8= 200.13
##$BYTORDA= 1
##$CFDGTYP= 0
##$CFRGTYP= 5
##$CHEMSTR= <none>
##$CNST= (0..31)
1 1 145 1 1 1 1 1 1 1 1 1 1 1 1 1 1 1 1 1 1 1 1 1 1 1 1 1 1 1 1 1 
##$CPDPRG= <>
##$CPDPRG1= <>
##$CPDPRG2= <>
##$CPDPRG3= <>
##$CPDPRG4= <mlev>
##$CPDPRG5= <mlev>
##$CPDPRG6= <mlev>
##$CPDPRG7= <mlev>
##$CPDPRG8= <mlev>
##$CPDPRGB= <>
##$CPDPRGT= <>
##$D= (0..31)
0 0.7 0 0 0 0 0 0 0 0 0 0.03 0 0 0 0 0 0 0 0 0 0 0 0 0 0 0 0 0 0 0 0 
##$DATE= 1765870050
##$DBL= (0..7)
120 120 120 120 120 120 120 120 
##$DBP= (0..7)
150 150 150 150 150 150 150 150 
##$DBP07= 0
##$DBPNAM0= <>
##$DBPNAM1= <>
##$DBPNAM2= <>
##$DBPNAM3= <>
##$DBPNAM4= <>
##$DBPNAM5= <>
##$DBPNAM6= <>
##$DBPNAM7= <>
##$DBPOAL= (0..7)
0.5 0.5 0.5 0.5 0.5 0.5 0.5 0.5 
##$DBPOFFS= (0..7)
0 0 0 0 0 0 0 0 
##$DE= 6
$$ [...]
##$SUBNAM3= <"">
##$SUBNAM4= <"">
##$SUBNAM5= <"">
##$SUBNAM6= <"">
##$SUBNAM7= <"">
##$SUBNAM8= <"">
##$SUBNAM9= <"">
##$SW= 18.0517328524113
##$SWIBOX= (0..15)
0 0 2 0 0 0 0 0 0 0 0 0 0 0 0 0 
##$SW_h= 3612.71676300578
##$TD= 16384
##$TD0= 1
##$TE= 0
##$TE2= 300
##$TE3= 300
##$TEG= 300
##$TL= (0..7)
0 120 120 120 120 120 120 120 
##$TP= (0..7)
150 150 150 150 150 150 150 150 
##$TP07= 0
##$TPNAME0= <>
##$TPNAME1= <>
##$TPNAME2= <>
##$TPNAME3= <>
##$TPNAME4= <>
##$TPNAME5= <>
##$TPNAME6= <>
##$TPNAME7= <>
##$TPOAL= (0..7)
0.5 0.5 0.5 0.5 0.5 0.5 0.5 0.5 
##$TPOFFS= (0..7)
0 0 0 0 0 0 0 0 
##$TUNHIN= 0
##$TUNHOUT= 0
##$TUNXOUT= 0
##$USERA1= <user>
##$USERA2= <user>
##$USERA3= <user>
##$USERA4= <user>
##$USERA5= <user>
##$V9= 5
##$VALIST= <valist>
##$VCLIST= <CCCCCCCCCCCCCCC>
##$VD= 0
##$VDLIST= <DDDDDDDDDDDDDDD>
##$VPLIST= <PPPPPPPPPPPPPPP>
##$VTLIST= <TTTTTTTTTTTTTTT>
##$WBST= 1024
##$WBSW= 4
##$XGAIN= (0..3)
0 0 0 0 
##$XL= 0
##$YL= 0
##$YMAX_a= 142919
##$YMIN_a= -122791
##$ZGOPTNS= <>
##$ZL1= 120
##$ZL2= 120
##$ZL3= 120
##$ZL4= 120
##$ABSF1= 15.47915
##$ABSF2= -2.5727
##$ABSG= 5
##$ABSL= 3
##$ALPHA= 0
##$AQORDER= 0
##$ASSFAC= 0
##$ASSFACI= 0
##$ASSFACX= 0
##$ASSWID= 0
##$AUNMP= <proc_1d>
##$AZFE= 0.1
##$AZFW= 0.1
##$BCFW= 0
##$BC_mod= 2
##$BYTORDP= 0
##$COROFFS= 0
##$CY= -3
##$DATMOD= 1
##$DC= 0
##$DFILT= <>
##$DTYPP= 0
##$F1P= 0
##$F2P= 0
##$FCOR= 1
##$FTSIZE= 16384
##$FT_mod= 6
##$GAMMA= 0
##$GB= 0
##$INTBC= 1
##$INTSCL= 3.241238e-09
##$ISEN= 128
##$LB= 0.25
##$LEV0= 0
##$LPBIN= 0
##$MAXI= 10000
##$MC2= 0
##$MEAN= 0
##$ME_mod= 0
##$MI= 1.114404
##$NCOEF= 0
##$NC_proc= -6
##$NLEV= 6
##$NOISF1= 3.799351
##$NOISF2= 2.8
##$NSP= 0
##$NTH_PI= 0
##$NZP= 0
##$OFFSET= 15.4957
##$PC= 1
##$PHC0= -5301.728
##$PHC1= 12.22193
##$PH_mod= 1
##$PKNL= yes
##$PPARMOD= 0
##$PSCAL= 0
##$PSIGN= 0
##$REVERSE= no
##$SF= 200.130005203022
##$SI= 16384
##$SIGF1= 3
##$SIGF2= 2
##$SINO= 0.751879
##$SIOLD= 32768
##$SREGLST= <19F.Aceton>
##$SSB= 0
##$STSI= 16384
##$STSR= 0
##$SW_p= 3612.71676300578
##$SYMM= 0
##$S_DEV= 0
##$TDeff= 16384
##$TDoff= 0
##$TI= <>
##$TILT= no
##$TM1= 0
##$TM2= 0
##$TOPLEV= 0
##$USERP1= <user>
##$USERP2= <user>
##$USERP3= <user>
##$USERP4= <user>
##$USERP5= <user>
##$WDW= 1
##$XDIM= 16384
##$YMAX_p= 359857651
##$YMIN_p= -237070
$$ End of Bruker specific parameters
$$ ---------------------------------
##NTUPLES= NMR SPECTRUM
##VAR_NAME=  FREQUENCY,     SPECTRUM/REAL,   SPECTRUM/IMAG
##SYMBOL=    X,             R,               I
##VAR_TYPE=  INDEPENDENT,   DEPENDENT,       DEPENDENT
##VAR_FORM=  AFFN,          ASDF,            ASDF
##VAR_DIM=   16384,         16384,           16384
##UNITS=     HZ,            ARBITRARY UNITS, ARBITRARY UNITS
##FACTOR=    0.220516191357247, 1,           1
##FIRST=     3101.15449811066, 0,            0
##LAST=      -511.562264895122, 0,           0
##MIN=       -511.562264895122, -237070,     0
##MAX=       3101.15449811066, 359857651,    0
$$ Real data points
##PAGE= N=1
##DATA TABLE= (X++(R..R)), XYDATA
$$ [...]
8809C1743333m385444l983260l154876k469966j748346j316794q98999n34637
8801A3251011l72265j99062o1944j7355K02544L07485L51455O74237P73534J042293
8791A5951933J256236J556340K033484K310106K336689K100066K006388K366976
8783C1918218L322440M669300O856874R883978J4065067J7892487J8662581J5080326
8775A22351271Q413881L57279o994865j2071270j4014046j3126801j0638445p542399
8767F6734605n104307l769884l594476m204637m838859n197434n173227m553826
8759C0297955l920539l121199k523176k080509j690585j283066j098967q50302
8751A3729612o65002n07232m24093l50905n15892m95479n37188o24744n84499
$$ y = [31743333, 27357889, 23374629, 20219753, 17749787, 16001441, 14684647, 13785648, 13251011, 12878746, 12679684, 12617740, 12600385, 12802929, 13110414, 13461869, 14136106, 14909640, 15951933, 17208169, 18764509, 20797993, 23108099, 25444788, 27544854, 29551242, 31918218, 35240658, 39909958, 46766832, 56650810, 70715877, 88608364, 107270945, 122351271, 130765152, 131122431, 124127566, 112056296, 98042250, 84915449, 74277004, 66734605, 61630298, 57860414, 54265938, 50061301, 45222442, 40025008, 34851781, 30297955, 26377416, 23256217, 20733041, 18652532, 16961947, 15678881, 14579914, 13729612, 13064610, 12557378, 12133285, 11782380, 11266488, 10771009, 10233821, 9609077, 9024578]
8742I024578n34715m85198m20884k68989k57057l09274k63715j37984j40811j36918
8732F069033j65504j50245j47685k61238k29219r4624j27472j48347j07635r0738
8722D546326j39402j06398n7616n7557j07961j33992q0393j26118q2440r796l7600
8711C607053M259l3592M1251K8229J07532O3663N0646m0144j28150k47558j60787
8700C292402j85272j11286o2139o0418n0203j50916q1113l8319m9308m8042p2254
8689B383132k3863o0068K8822J4233r308m3830O242l0697j3776k9777m960q5030
8677B131120k9213M7496J3570o31l6751l0498P602l8453l6518n1453p6156M4056
8665A944171Q3205K5587n1482q1976k3814m0819p7588N796j24645r0250o8330
$$ y = [9024578, 8489863, 8004665, 7583781, 7314792, 7057735, 6748461, 6484746, 6346762, 6205951, 6069033, 5903529, 5753284, 5605599, 5344361, 5115142, 5020518, 4893046, 4744699, 4637064, 4546326, 4406924, 4300526, 4242910, 4185353, 4077392, 3943400, 3863007, 3736889, 3654449, 3644653, 3607053, 3611312, 3577720, 3618971, 3647200, 3754732, 3818395, 3869041, 3828897, 3700747, 3453189, 3292402, 3107130, 2995844, 2933705, 2873287, 2823084, 2672168, 2591055, 2552736, 2503428, 2455386, 2383132, 2359269, 2299201, 2328023, 2342256, 2332948, 2289118, 2295360, 2264663, 2250887, 2221110, 2216150, 2131120, 2101907, 2149403, 2162973, 2162342, 2125591, 2095093, 2102695, 2064242, 2027724, 1976271, 1900115, 1944171, 2027376, 2052963, 2001481, 1919505, 1895691, 1854872, 1777284, 1783080, 1658435, 1568185, 1499855]
8654A499855k1296n5808o7596J3330O2785n0905j9511m3423L8561q975k2076l3987
8642A290954j1892K5309N9652p426m769N9026N1942n2033k2478o8718M6329r42
8630A364954k3479M3670J4320j9590q6015l7259o7914o4568p5886N280Q362o1275
8618A000600l2039J01806o0126K8488j3879n3523r889o6661j6376K5727q279K4048
8606I19897Q0415j7525J8100J8208P0447o633L4459L458K3879L8244l4618n4953
8594A093378j5224j0367p3888q4261n2968n7476l6528M7342j37182J4004N4419
8583G41249l2783P3857o7549K03813p8599l7986j5498J2315O8968P9262P0565
8572A017614O2472J66560L3311L1639P636J1058N789j6934j4451m3230o7400n2371
$$ y = [1499855, 1478559, 1422751, 1355155, 1368485, 1431270, 1380365, 1360854, 1317431, 1355992, 1347017, 1324941, 1290954, 1279062, 1304371, 1364023, 1356597, 1351828, 1410854, 1462796, 1410763, 1388285, 1319567, 1365896, 1364954, 1341475, 1385145, 1399465, 1379875, 1293860, 1256601, 1188687, 1124119, 1048233, 1053513, 1061875, 1000600, 968561, 1070367, 1010241, 1038729, 1024850, 971327, 961438, 894777, 878401, 904128, 895849, 919897, 1000312, 982787, 1000887, 1019095, 1089542, 1082909, 1117368, 1120826, 1144705, 1182949, 1148331, 1093378, 1078154, 1067787, 993899, 909638, 856670, 799194, 762666, 810008, 672826, 686830, 741249, 708466, 782323, 714774, 918587, 839988, 802002, 786504, 798819, 867787, 947049, 1017614, 1080086, 1246646, 1279957, 1311596, 1319232, 1330290, 1336079, 1319145, 1304694, 1261464, 1194064, 1141693]
8560A141693p5653p4346m3834j06898r8666L599p2802l5432j3097l531o281l5497
8548E79255q6291L3524L6821j6798K443o384k4442k3289m5738j1188m9615J4563
8536D02861O704o1613p5379P6248R4286O1381j7701m5618n1215M1045l2073j4625
8524C84301m0698j4500M460O0910M8302K4028r3096L973k5975L9257o386m9969
8512C34607K3522L508P8626j854l6580j0297l9699l4623l705O9553j2637L5710
8500D06131l8565m2073J39377m1760O695n0691K1893M2642M0410K5146J04882
8489F14087J9865J3934N4935L194L2688l4584l0215J6867J15000J8704j45538
8478F78937J3737J5951o4848o7060M250M1472p5137o29J4108l5136N9544L7740
$$ y = [1141693, 1066040, 991694, 947860, 840962, 742296, 745895, 673093, 637661, 624564, 621033, 614752, 579255, 492964, 526488, 563309, 546511, 548954, 542570, 518128, 494839, 449101, 437913, 388298, 402861, 409565, 347952, 272573, 348821, 443107, 504488, 486787, 441169, 389954, 430999, 398926, 384301, 343603, 329103, 333563, 394473, 442775, 466803, 373707, 377680, 351705, 390962, 384576, 334607, 358129, 361637, 440263, 438409, 401829, 391532, 351833, 317210, 313505, 383058, 370421, 406131, 367566, 325493, 464870, 423110, 429805, 379114, 401007, 443649, 484059, 509205, 614087, 633952, 647886, 702821, 706015, 738703, 704119, 673904, 690771, 805771, 824475, 678937, 692674, 708625, 643777, 576717, 580967, 622439, 547302, 546673, 560781, 525645, 585189, 622929]
8466F22929k7112k5741L8256N5520m4027J3978K0584n441K7827J9289N0931J8977
8454G65970Q8630J4811J48245M8812J1882N006q905O864K9660q7949k99n9519
8442I63208q0411J2065o4005K5204N7669k5153o2012J3369O0869k3912O2740L9729
8430I79360k6753J944r7684P0825k4129n1097p3459R28L6177l5139J7723L753
8418H02449K596J321k3707P0190K7752J7951M7289J387P005L2829j00187J42271
8406A029146J45788K134N5085j1502L7595K1775P0311R2273M5744N1100M6351
8395A585800Q0636M160j021R5562J3649M5142L4051K8564p5516m5675N8513m9360
8383A774505m5715o1112r1965j20347L3470l5770k6830J3158l7497J696m9080
$$ y = [622929, 595817, 570076, 608332, 663852, 619825, 633803, 654387, 648946, 676773, 696062, 746993, 765970, 854600, 869411, 1017656, 1066468, 1078350, 1083356, 1074451, 1081315, 1110975, 1023026, 1022727, 963208, 882797, 894862, 830857, 856061, 913730, 888577, 826565, 839934, 900803, 876891, 939631, 979360, 952607, 954551, 856867, 927692, 903563, 852466, 779007, 779935, 816112, 780973, 798696, 802449, 805045, 806366, 782659, 852849, 880601, 898552, 945841, 947228, 954233, 987062, 886875, 1029146, 1174934, 1177068, 1232153, 1220651, 1258246, 1280021, 1350332, 1442605, 1488349, 1539449, 1585800, 1666436, 1670596, 1669575, 1765137, 1778786, 1823928, 1857979, 1886543, 1811027, 1765352, 1823865, 1774505, 1728790, 1667678, 1575713, 1455366, 1488836, 1453066, 1426236, 1439394, 1401897, 1403593, 1354513]
8372A354513N3391L3471l748P1682J44449j2844L0537J624r170J8653Q3061J28567
8360A894186J686l885Q1249J04135J49805L1222J4298N1469J05327J02780R0603
8349B622875O9572N1967J01640J29676J80381O9613M6738J93615J25307J39139
8339C730523K34305K32505L20690L02583K59997M82156O06434O19800P88817Q45190
8329H423000R52940R02630R98715R98106J065825J254768J679555K191621L152609
8320B1619769M358212N734533O509186N870884M252423K024764o94961l249049
8312D6425761m965565n709301n666647m985919m017605l204260k452505j858430
8304A3565529j489962j093099p40362o33730l52907k64804j75177j2963k2243
$$ y = [1354513, 1407904, 1441375, 1437627, 1509309, 1653758, 1640914, 1671451, 1673075, 1663905, 1682558, 1765619, 1894186, 1895872, 1891987, 1973236, 2077371, 2227176, 2258398, 2272696, 2324165, 2429492, 2532272, 2622875, 2692447, 2744414, 2846054, 2975730, 3156111, 3225724, 3272462, 3466077, 3591384, 3730523, 3964828, 4197333, 4518023, 4820606, 5080603, 5562759, 6169193, 6788993, 7577810, 8423000, 9375940, 10278570, 11277285, 12275391, 13341216, 14595984, 16275539, 18467160, 21619769, 25977981, 31712514, 38221700, 44092584, 48345007, 50369771, 49674810, 46425761, 41460196, 35750895, 30084248, 25098329, 21080724, 17876464, 15423959, 13565529, 12075567, 10982468, 10242106, 9608376, 9255469, 8990665, 8815488, 8802525, 8780282]
8295H780282M6527J63714K27264K84068K96719L80489O78269R65790J259455J574000
8285A4656577K169892L022186M073773N181654N394186M779733L696493J714360
8277D4688854q60251l117421m596317n139243m960584m160857l395753k527999
8269A5930429j825551j354339j159284r52897q94742q74117q41308p14532o06832
8260F706827n12460m08570m05112l70452l19414k37555j61844k54541k00112m6595
8250C790172j39099j90248j31428j07385j49214j19900j72408j35730j31002m2625
8240B471133l2411j3187j27232m7258j01517m8291k3442q0512j26373j6305l0295
8229A824310l1671r1713j08446L5518K2989m7850j04864k9295j7039m9325p6714
$$ y = [8780282, 8826809, 8990523, 9217787, 9501855, 9798574, 10179063, 10857332, 11823122, 13082577, 14656577, 16826469, 19848655, 23922428, 29104082, 34498268, 39278001, 42974494, 44688854, 43828603, 40711182, 36114865, 30975622, 26015038, 21854181, 18458428, 15930429, 14104878, 12750539, 11591255, 10638358, 9743616, 8869499, 8028191, 7313659, 6706827, 6194367, 5785797, 5380685, 5010233, 4690819, 4453264, 4291420, 4036879, 3836767, 3790172, 3651073, 3460825, 3329397, 3222012, 3072798, 2952898, 2780490, 2644760, 2513758, 2471133, 2438722, 2425535, 2298303, 2251045, 2149528, 2101237, 2077795, 1997283, 1870910, 1854605, 1824310, 1792639, 1700926, 1592480, 1627998, 1650987, 1603137, 1498273, 1468978, 1451939, 1402614, 1325900]
8218A325900k902j6381k9593l2522j5096L0376p9552l6923l3583N3089k2813r5580
8206A044420k9608j1046J2570m1609N2585o4703m6877M7926l4611j259n4984j31059
8194G41745N8204k7978K47690l4818j17724K3667j26071M739o7823k9271L2266
8183G04626J003K0754j3057j2726p469n0033L0853q302L6534j1461o6946N416
8171F29192l4706J8825L4411n5276k0576j6204j586j17271L490N8458l894p1541
8159D23322m373M0124m8720J2062L4110K460p5409K8377n3831j7256M8226j1596
8147C77496O2507j911q9758L4466R902k7074j4607J4916P7810l1532M150q7237
8135C29128l1787L9255n8289K5105O2590m7634l506M4k2684K2704l2843m8574
$$ y = [1325900, 1322998, 1306617, 1277024, 1244502, 1229406, 1259782, 1180230, 1143307, 1109724, 1162813, 1140000, 1044420, 1014812, 1003766, 1016336, 974727, 1027312, 962609, 915732, 963658, 929047, 927788, 872804, 741745, 799949, 771971, 1019661, 984843, 867119, 890786, 764715, 769454, 701631, 672360, 704626, 705629, 726383, 713326, 700600, 693131, 643098, 673951, 665649, 702183, 690722, 623776, 629192, 594486, 613311, 647722, 592446, 571870, 555666, 554080, 436809, 440299, 498757, 494863, 423322, 418949, 459073, 410353, 422415, 456525, 458985, 383576, 411953, 358122, 340866, 389092, 377496, 440003, 438092, 348334, 382800, 392702, 365628, 351021, 365937, 443747, 412215, 416365, 329128, 297341, 336596, 278307, 303412, 366002, 318368, 314862, 314906, 292222, 314926, 282083, 233509]
8123B33509j2496Q0383N508L4602l4546k24M5681l1377l6910k3278j3572j513
8111B45767L518j4687j4757L213K2449M6574m4235l330j6547l9367P9177k0260
8099B47515l6919J7957j5779m423k3157J03878r536j142K8954n9629k4294M8558
8087B71983P5863l8125L0083m0528R250j9146m7694L05K0917j1827m2605k1676
8075A86800L5316J1562J1306n5389r2419J7519M0226P2571k7168m3402r06n1525
8063A04491K9384Q1211j1405M5119m0777n9934L3411l063m449L1489l4627j9523
8051A51327K8013j2132m0993l2798P7776K2700m6130K7592L13p796o2804N0587
8039A55655k6448m9845O2986j1895k410J4838K7258q4786N2306j7364K741O226
$$ y = [233509, 221013, 301396, 306904, 341506, 306960, 306736, 352417, 321040, 284130, 260852, 247280, 245767, 249285, 234598, 219841, 223054, 245503, 292077, 247842, 244512, 227965, 188598, 267775, 247515, 210596, 228553, 212774, 208351, 185194, 289072, 279536, 278394, 307348, 247719, 223425, 271983, 347846, 309721, 339804, 299276, 308526, 289380, 241686, 241991, 262908, 251081, 208476, 186800, 222116, 233678, 244984, 189595, 97176, 114695, 154921, 227492, 200324, 156922, 156016, 104491, 133875, 215086, 203681, 248800, 208023, 148089, 181500, 178437, 173988, 205477, 170850, 151327, 179340, 167208, 126215, 93417, 171193, 193893, 147763, 175355, 175668, 167872, 105068, 155655, 129207, 79362, 142348, 130453, 128043, 142881, 170139, 85353, 137659, 120295, 123036, 129262]
8027A29262m791L6728L5413j2966n6793m3550J9361L7772Q606q5383o3861O6264
8015F6062Q9422J9632r6572K4538L439K2445K3265r9506m1117O5836J19978l3532
8003A63890k8431k6222P6350O5092l7069o4417p178L9729q6904n6645N6946N4960
7991A50101o1778J133L1625O2982P7078o5198n1811q7440J9211n413O1619k1430
7979A10679J4134O5643k3814L6643j4546J537l2377j7622j6473O523k2939m6204
7967F1184l3239N950J00123Q4986r8083K5494Q897J3380Q7480k6192n6432O9419
7955B42967o6669o277J3749K301N3965L9456k2195j2336J8714K3890L6765k0498
7943C03832o2068R82L6081j9671K0335K9614j5579p3076k5600P421M1792J3708
$$ y = [129262, 124471, 161199, 196612, 183646, 126853, 83303, 102664, 140436, 149042, 63659, -202, 66062, 155484, 175116, 78544, 103082, 106521, 128966, 152231, 52725, 11608, 77444, 197422, 163890, 135459, 109237, 185587, 250679, 213610, 149193, 142015, 181744, 94840, 38195, 95141, 150101, 88323, 89456, 121081, 184063, 261141, 195943, 144132, 56692, 75903, 70490, 132109, 110679, 124813, 190456, 166642, 203285, 188739, 190276, 157899, 140277, 123804, 130327, 107388, 61184, 27945, 33895, 134018, 219004, 120921, 146415, 155312, 168692, 256172, 229980, 173548, 242967, 176298, 170021, 183770, 186071, 240036, 279492, 257297, 244961, 263675, 287565, 324330, 303832, 241764, 242746, 278827, 259156, 279491, 309105, 293526, 220450, 194850, 202271, 244063, 257771]
7931B57771p0655J8205J1104m2305j9023M7695l1996m2887K9834m382L7931M2182
7919B33474n0457J4699L8326R870l2667N1153J13831k8016m1855l3085K436j3920
7907B63789J596P1644j551m0496o0502l0421P025l8459K9455M459M496K1613r8141
7894A34507J2786N0389K981o1935k5412P1465M7650L8072m4556k4618j2172q512
7882A80645K4177R6741K3198j2557j674l967k3292J3736l78o5120q6012j3730
7870A31767M8279q0620J9832m07j6147j9519L0399O0650l8637K2858p8183l2007
7858D8265m3318N9284P5272k2864P3384l953n8066N9113k70o8276M9041P321J4285
7845A89218O600k2790R164j6935Q1029n291O009P1658l367m6953n7208j9299j6584
$$ y = [257771, 187116, 205321, 216425, 174120, 155097, 202792, 170796, 127909, 157743, 153361, 191292, 233474, 183017, 197716, 236042, 245912, 213245, 264398, 378229, 350213, 308358, 275273, 277709, 263789, 265385, 337029, 335478, 294982, 234480, 204059, 211084, 172625, 202080, 206539, 211035, 232648, 134507, 147293, 197682, 200663, 138728, 113316, 184781, 232431, 270503, 225947, 201329, 189157, 180645, 204822, 301563, 324761, 312204, 310530, 306563, 283271, 297007, 296629, 231509, 145497, 131767, 180046, 99426, 119258, 118851, 102704, 83185, 113584, 174234, 135597, 158455, 80272, 48265, 4947, 64231, 139503, 116639, 190023, 186070, 128004, 187117, 186847, 118571, 167612, 174933, 189218, 195818, 173028, 182192, 165257, 246286, 240995, 247004, 318662, 315295, 268342, 211134, 191835, 175251]
7832A75251n9309J7215k0716P590J3636n5504J1718N8178n4442l953K9346K6287
7820A45297l8673j3398j822J7338J3387k6212J5206k0941q454J8002k6755m9514
7808B3461R499K2622k5210k67442K14822J72998r5980j6846J2601o762J1313P0805
7796A25881l8114K4080J7941m0850l8711N3761M4404o9535q939m3035P75N3925
7784H1583k2686J933N653k5376P370j7322M4792J4089K216l799k1823j0294J2012
7771F8348L0840K1489n000O0627o7424p4919L0589K6619M3386k0742K3642p4855
7759F2600M975l5168P5026k6277q908j6060L6253J0603p927j2813n2502m7735
7747a7933J2014R7712J2850l3379j1229k406O554m9177p4362J54755p676J4354
$$ y = [175251, 115942, 133157, 112441, 120031, 133667, 78163, 89881, 148059, 93617, 89664, 119010, 145297, 106624, 93226, 91404, 108742, 122129, 95917, 111123, 90182, 81728, 99730, 72975, 23461, 32960, 55582, 30372, -237070, -22248, 150750, 54770, 37924, 50525, 43763, 55076, 125881, 87767, 111847, 129788, 88938, 50227, 103988, 148392, 78857, 69918, 26883, 27658, 81583, 58897, 60830, 66483, 41107, 48477, 31155, 75947, 90036, 92252, 88453, 66630, 56336, 68348, 99188, 120677, 115677, 176304, 108880, 33961, 64550, 91169, 134555, 113813, 137455, 62600, 67575, 32407, 107433, 81156, 72248, 56188, 92441, 103044, 95117, 82304, 29802, -17933, -5919, 91793, 104643, 71264, 60035, 57629, 64183, 15006, -59356, 95399, 87723, 102077]
7735A02077K6964l3584j2974j5133L6542k9448o6120J1442N4661k7892K4219j4953
7723E5801k3373L1716m859j3597l317J7072J4998K9052k2419o103P751J012P1578
7710A55312j07025k9755M8464k5119K2795k8998L8304L4836n6955p7916K8043
7699A986j1070J0067N2411r678M7818k0889K4499L2644l3350m0855k3411K2928
7687E3100n2921N7854m436J9044L5069j04305r323L3492p134l3945M4561K0464
7675E1520j0452K0957j5487j7184L0155N0951k4951p8677j8910J5109k7367P8318
7663E3982N5600K6384K7942N193l1745J1748l3971m1431o149K183m164J3966n9563
7650A9975q404N916N8077l1612l2621J9270L1810n5054l178N3819J4613p4499
$$ y = [102077, 129041, 95457, 82483, 67350, 103892, 74444, 8324, 19766, 74427, 46535, 70754, 55801, 32428, 64144, 59285, 45688, 42371, 59443, 74441, 103493, 81074, 74971, 82722, 83734, 155312, 48287, 18532, 66996, 41877, 64672, 35674, 73978, 108814, 51859, -26057, 1986, -9084, 983, 53394, 43716, 91534, 70645, 95144, 127788, 94438, 53583, 30172, 53100, 179, 58033, 53597, 72641, 107710, 3405, -5918, 27574, 20440, -13505, 31056, 51520, 41068, 62025, 46538, 29354, 59509, 110460, 85509, 6832, -12078, 3031, -24336, 53982, 109582, 135966, 163908, 169101, 137356, 149104, 115133, 73702, 67553, 69736, 65572, 79538, 19975, 11571, 17487, 75564, 43952, 11331, 30601, 62411, 7357, 4179, 57998, 72611, -1888]
7638a888J4169N9205l5595k047k3708P0258L3605K680l2501r607M0039m3608k0666
7625E0336L8152J9800k2671J0728K0059O9938k1176p7657l9830J1212O2404p3451
7613D7844n5526J007O6880J5069L8960l2698j9832L3461K3578n7896Q1302J6795
7601A58944l6791M592K7251o0850R745j3939J0318r989l7535r5906M6317R5265
7589I7422M2650m0783j8975l5527P599o888O1323N2838r8319l8106P7047O4997
7577A65278o4420j8896o1993R6839l9597k8379l4430M0531L4167k5678N5186l2541
7565H6067j3985K7629L2129J5324N79p04l2990J6113J0036m5417Q028k631N5230
7552A55408m8021m2840m4373J9579Q0640J1699J6854l9660m917L9973J14701M0798
$$ y = [-1888, 12281, 71486, 35891, 33844, 10136, 80394, 113999, 116679, 84178, 74571, 114610, 71002, 50336, 88488, 108288, 85617, 96345, 116404, 186342, 165166, 87509, 47679, 58891, 121295, 47844, -7682, -6675, 60205, 75274, 114234, 81536, 61704, 95165, 118743, 60847, 142149, 158944, 122153, 126745, 153996, 93146, 102891, 88952, 99270, 89281, 51746, -44160, 2157, 97422, 140072, 99289, 80314, 44787, 52386, 45498, 106821, 159659, 61340, 23234, 100281, 165278, 100858, 81962, 19969, 116808, 77211, 48832, 14402, 54933, 89100, 63422, 118608, 86067, 72082, 99711, 131840, 147164, 147743, 147039, 114049, 130162, 140198, 94781, 102809, 100178, 155408, 107387, 64547, 20174, 39753, 120393, 132092, 148946, 109286, 104369, 144342, 259043, 299841]
7540B99841R2142J75417K89573J99841O0093j20547j56752j69512j62500q8853
7530D18743n6052m546q7942O132q9114j07912K3573K9128j1118r806P7599J3054
7518B01739n6596o1790r2263O633J6607L8659j9508j307Q8034m0790N6808M6378
7506A82604o2629q6r397o4495j3330M7246L1672m810p357k4293k3080K0920K735
7493G5700l6304l6625K5908M7713l363O0334o0671q2865O6677k7135m6609O1787
7481D4547N5595n0330m4217L4061m7412M6731K5506j5623p0152o200J353j9886
7469d6027M2413L0262L4533q8722J4604P0315n4580n654K8538l1231N0361O9237
7457A14049j012p82r8785J7589J7424n0672j2918L927j2417L0801j8615K0929
$$ y = [299841, 391983, 567400, 856973, 1056814, 1116907, 996360, 839608, 670096, 507596, 418743, 362691, 358145, 270203, 276335, 187221, 79309, 102882, 132010, 120892, 111086, 188685, 201739, 145143, 83353, -8910, -2277, 14330, 52989, 33481, 32174, 120208, 79418, 136226, 182604, 119975, 119889, 110492, 45997, 32667, 79913, 111585, 106775, 99418, 75125, 52045, 72965, 75700, 39396, 2771, 28679, 76392, 73029, 133363, 72692, -10173, 56504, 29369, -17240, 44547, 100142, 49812, 5595, 39656, -7756, 38975, 64481, 48858, -21294, -27494, -26141, -46027, -3614, 26648, 61181, -27541, -12937, 57378, 2798, -2856, 25682, -5549, 44812, 114049, 113037, 112255, 13470, 31059, 48483, -2189, -15107, -11180, -23597, 7204, -11411, 9518]
7445I518o7402N554L6936N9096J05949k8574l9687m3567K5157r128N1252N9385
7433A64489k3997r9551K4321k7004L3904k2875O614j7217J5270N0373o6349q912
7421B9066L1634N3046n6275K1469l1893o6825j4892L1039m4188P774K5155J4315
7409e75L1614o265m1148l460L3183J3250M0565m6067L5834R293p331m0517J3846
7396C2222l195l440N9861k3688k5943J5201m5958l9113l620Q278l5288K0549K765
7383d1369K4267J4849J7264J9205m4214J987M5396O843n9284m2254N5836k3764
7371b5238m943L0926K0895k774L461m1173L8301J2845j6599k7907j4042N5515
7359B9267J3016n4424m7O1569o0248J055N5618m2323K3880N4181J4468O555k6382
$$ y = [9518, -57884, -52330, -15394, 43702, 149651, 121077, 81390, 37823, 62980, 53852, 105104, 164489, 140492, 40941, 65262, 38258, 72162, 49287, 55901, 38684, 53954, 104327, 37978, 29066, 60700, 113746, 57471, 78940, 47047, -19778, -34670, -3631, -47819, -40045, -14890, -575, 31039, 24774, -16374, -19834, 13349, 26599, 67164, 21097, 56931, 66224, 58893, 18376, 32222, 29027, 25587, 85448, 61760, 35817, 51018, 5060, -34053, -37673, -29395, -64683, -44134, -41369, -17102, -2253, 15011, 34216, -9998, -8011, 37385, 44228, -15056, -57310, -1474, -25238, -30181, 745, 21640, 18866, 22327, -18846, 19455, 32300, 15701, -12206, -26248, 29267, 42283, -12141, -12188, 49381, -10867, -9812, 45806, 3483, 27363, 81544, 96012, 102567, 76185]
7346G6185k6994m8666p7369m6628M3618M1313J4863l5757J7466j4123L0405j4233
7334c9920M7681m2233L7234j7365o870n1044l0901O8970M1145N8864n8329m7072
7322c9840M3345J3707M1262J3471l846L172j0230K858p6861n3276P594N8609m2211
7309d2246M4952k989K3012M765o751l4794j7697O4885j4173q4811P8693L4785
7297D7631m5133O241N4831K9049q4543Q2718m9569j0915M0041j4149j7619Q585
7285D7168N846l0405o6926l8603P4629J1841O580O9321k3m4359J5595j3377n6241
7272a8954l0756p168M039K1500M080L9662K1265l137n8616J7218J3887N4812Q055
7259F5887m1211k651k3193k2480m7077P4063P064l2974j858N5645j9093M1324
$$ y = [76185, 49191, 525, -76844, -123472, -79854, -38541, -23678, -59435, -41969, -56092, -25687, -39920, 7761, -34472, 2762, -14603, -21473, -72517, -103418, -34448, 6697, 65561, 7232, -39840, 3505, 17212, 58474, 71945, 68099, 71271, 61041, 63899, -12962, -66238, -58644, -35, -42246, 2706, -283, 22729, 27494, 20743, -14051, -31748, 33137, 18964, -65847, 12846, 47631, 2498, 8739, 63570, 92619, 8076, 90794, 41225, 30310, 70351, 56202, 38583, 47168, 53014, 22609, -44317, -82920, -8291, 3550, 10130, 79451, 79428, 35069, 50664, 37287, -18954, -49710, -56878, -52839, -31339, -27259, 12403, 33668, 30531, -28085, -10867, 3020, 57832, 65887, 24676, 22025, -1168, -23648, -70725, 3338, 10402, -22572, -24430, 31215, 12122, 53446]
7247E3446J4218k1202m3005l7541R75L0412k3320j2442O867K1403k2287k8759
7235f1235O2890M2126j0819n3515j4785r179J1089M92J2558K2220k1483j0751
7223c0392j9676M5244l7604M4760Q2786j06041J2053k004L9247k0837n1k9106
7211b1621J2277k1016L4079q766m5360N1763L4058l2711j5899k148q184l8902
7199f2430L3410L4785j6848J1869j1669l435L664P0385J8273j9715n4735m1199
7187c7645J9623L2568j0351l363O945j8019o8749L5656P5024j1608O735k0816
7175F000l1961p3689K571P4365j960P3380L4495k5455o7327L2594k785J612n5490
7162c3650m7659R6142m820j1248M4862k9311j9714l883p6069K8573L5786N4036
$$ y = [53446, 67664, 46462, 3457, -34084, -33109, -2697, -26017, -38459, -31592, -10189, -32476, -61235, 1655, 43781, 32962, -20553, -35338, -44517, -33428, -32936, -20378, 1842, -19641, -30392, -50068, -4824, -42428, 2332, 85118, -20923, -8870, -10874, 28373, 7536, 7485, -21621, -9344, -30360, 3719, -5047, -50407, 1356, 35414, 2703, -13196, -15344, -23528, -62430, -29020, 5765, -11083, 786, -10883, -14318, -10654, 59731, 78004, 58289, 3554, -37645, -18022, 14546, 4195, 832, 7777, -10242, -78991, -43335, 31689, 20081, 26816, 6000, -25961, -99650, -97079, -22714, -24674, 48706, 83201, 57746, -9581, 23013, 20228, 21840, -33650, -81309, 14833, 10013, -1235, 43627, 14316, -5398, -9281, -85350, -56777, -20991, 33045]
7150C3045J9307q6305L0086p1920j4762m2929J5083M4294N2368n7471J0257Q0589
7138A1642l04l2580l9910N6124j8989j5103J1293K1164N05p8119K0875J39384
7126G5982p3650j7942M7854K5268k3635j3675j0534q990o4373L8016L3449Q15
7114H585j3935l5431n2722M8735Q5764p503l0394J4166m3196O0810l5017L5304
7102C5166j4370o2965L6784n3518p176O7843J273J6410K6000o4186K8764J4106
7090B4131j272J0544L2531m1989j01816j6837o527J4832L5099K5908r153n153
7078c9702K2823O9578M04r7608J1397m1782k9869K2754Q8735K8652K4755l5355
7066B4782r899l4995j813k4758K3558J7110l1101R529o0121K8242N898l0733L4412
$$ y = [33045, 52352, -33953, -3867, -75787, -90549, -133478, -118395, -74101, -21733, -79204, -68947, 11642, 11338, -21242, -61152, -5028, -24017, -39120, -27827, -6663, -6158, -84277, -63402, 75982, 2332, -15610, 32244, 57512, 33877, 20202, 9668, 678, -63695, -25679, 7770, 8585, -5350, -40781, -93503, -44768, 40996, 33493, 3099, 17265, -25931, 34879, -138, 35166, 20796, -42169, -5385, -58903, -66079, 1764, 3037, 19447, 45447, -18739, 10025, 24131, 22859, 33403, 65934, 23945, -77871, -94708, -101235, -86403, -51304, -25396, -34549, -39702, -16879, 52699, 53103, -44505, -33108, -74890, -104759, -82005, 6730, 35382, 60137, 24782, 14883, -20112, -21925, -46683, -23125, -6015, -37116, -27587, -87708, -59466, -53568, -84301, -49889]
7053d9889P6822k3393Q35P9353L6038n5254l5957k8098j5587N9390m1528k5378
7041b2646n427n7230K5935K9865L546J9265o642m5146Q8139J318J8585O6505n9927
7028E6140m1254m857J9269j5956K8668j1395J6047J6359n7439j4234N2924J5159
7016E9431j9390n4081P01L8277K8206n6078n1678L367k8778P873P9931j1806k2358
7003b6383K7840j0380k2489n787r367L2548j0278L9069m7323o044L0670J289k2530
6990b9165k3457l7773L8809Q4120k6058j0648m3897O3168l9555N846K3069J3446
6978A7905j7436l8194N4086j4944K9732M5784j9689K0704q872n8708l4455k4899
6966d8986k3541k6407O3532m8665P2291L5903k1976M0388l3693l0110n8712K4959
$$ y = [-49889, 26933, 3540, 4375, 83728, 119766, 64512, 28555, 457, -15130, 44260, 2732, -22646, -28073, -85303, -59368, -29503, -25957, -6692, -13334, -58480, 29659, 30977, 49562, 116067, 56140, 14886, 10029, 29298, 13342, 42010, 30615, 46662, 63021, 5582, -8652, 44272, 59431, 40041, -14040, -13339, 24938, 53144, -2934, -54612, -51245, -80023, -72150, 7781, -4025, -26383, 1457, -8923, -31412, -37199, -46566, -14018, -24296, 14773, -32550, -38594, -7924, -6635, -29165, -52622, -90395, -51586, 32534, 6476, -4172, -48069, 15099, -24456, -18610, 4459, 17905, 469, -37725, 16361, 1417, 31149, 76933, 57244, 77948, 69076, 10368, -24087, -48986, -72527, -98934, -35402, -84067, -11776, 24127, 2151, 42539, 8846, -21264, -79976, -55017]
6954e5017J6393l4481k5474M7782L7064L3685j9152P8203K1111m8704j0032j8193
6942B3185n5016l6330K4310K7945L1899n778K3447P4202o7894l6326l9952k2715
6930e9023l519J3590m7362j1534N9922K0317j1206L5063J0642q9886L9924j7582
6918f0654J1386N1850P200J7400J3248K577o3703p4452R648L3690q912P658Q9376
6905C6312q5387n2346K876K0754N3956K2961m8414Q254M7469j2606l3010K5793
6893a3388R787n3249P3516l9809n9591K9563P9147k3254j7811j3511M5095k6119
6881i624K3132j529p0511K137Q1682k7915m8837m0174J4894P8398J9400j9229
6869A824j7303k5655l8706K6669L3890J1068K1620l3381K6545k7008m4286L3722
$$ y = [-55017, -38624, -73105, -98579, -50797, -13733, 19952, 800, 79003, 100114, 51410, 41378, 23185, -31831, -68161, -43851, -15906, 15993, 10215, 33662, 107864, 39970, 3644, -36308, -59023, -62542, -48952, -96314, -107848, -47926, -27609, -38815, -3752, 6890, -82996, -43072, -60654, -49268, 2582, 9782, 27182, 40430, 43007, -20696, -95148, -85500, -51810, -60722, -53064, 36312, -49075, -101421, -98545, -77791, -23835, -874, -49288, -41034, 6435, -6171, -39181, -13388, -3601, -56850, 16666, -23143, -82734, -53171, 25976, 2722, -15089, -28600, 16495, -9624, 13508, 11979, -58532, -56395, 25287, -2628, -51465, -91639, -76745, 1653, 21053, 1824, -15479, -41134, -79840, -53171, -19281, -8213, 13407, -19974, 6571, -20437, -64723, -31001]
6857c1001l8221j163O4634Q8544l3001o0036j6731N0862l2528n0491K4112R685
6845b5335O03n3280n066O5705k1237n4110k8687K8934n205K2314J4677k4912n6343
6832a41942Q7882M1477P513J1030m337J9346r0327n7836J0716L9431K3067P858
6820d6122J9069j1303M988J2794P1633k8821n2258R80k0840J690m4970J7397P4116
6807a647N030m820o6319O3799k5761L4148J6547J4406k3143l4322R150N9061m6461
6794c32l9856M6142k0080n5177j856J03498l7995m3184K4482j3119r6976R7476
6782c6977m390j7337m1997q472L5955K2255L5032k5530J0353K1832l0869N6378
6770A6233l2206M90K9886l4163m1652r2336Q609J11539J07129j6309n3887k3170
$$ y = [-31001, -69222, -70385, -5751, 82793, 49792, -10244, -26975, 23887, -8641, -59132, -35020, -25335, -24732, -78012, -83078, -17373, -38610, -92720, -121407, -92473, -97678, -75364, -60687, -85599, -141942, -54060, -12583, -5070, 5960, 1623, 20969, -69358, -127194, -116478, -77047, -53980, -46122, -27053, -38356, -33368, -20574, 51059, 22238, -30020, -29040, -49880, -48190, -93160, -75763, -1647, 3383, -1437, -67756, -3957, -29718, 4430, 20977, 35383, 12240, -22082, -12932, 46129, -332, -40188, 5954, -14126, -69303, -71159, 32339, -5656, -48840, -24358, -37477, -134453, -36977, -41367, -58704, -100701, -109173, -73218, -50963, -15931, -41461, -31108, -9276, -40145, 16233, -15973, -15483, 14403, -19760, -61412, -153748, -145139, -33600, 73529, 57220, 3333, -19837]
6758a9837P460o6909K5834p580j7872Q3334k4740k2075j1631m7917M6352n2071
6746a07652R0187P3615n9800n6647p8192Q6896J7930J1664k9339k2496K5241M5075
6734c518M9258K0152q4351K84k6373m2742L3546P0742n1260j0251L0994k2482
6722c6001N873l4764J2238m4926j5492O5715P1831L9536r3307m1020M4094k4751
6710e0974m6840K0397k532l9829r840L694M8694L0027K8118M3642j9461l5379
6698c0283K2797p438K82P172r291j755m4126k6537K9930m262M8994n3534J7600
6685e0451J0558q5881K4999P0052N1843l6378K197N575m5617q968j6224N1411
6673b6884m3134L0925K3483r4745M2376K2514J7044m1247J5830m4151L1387N7462
$$ y = [-19837, -12377, -79286, -53452, -61032, -78904, 4430, -20310, -42385, -54016, -101933, -55581, -107652, -17465, 56150, -3650, -60297, -138489, -51593, -33663, -21999, -51338, -73834, -48593, -3518, 45740, 65892, -18459, -18175, -44548, -87290, -53744, 16998, -34262, -44513, -13519, -36001, -30128, -64892, -52654, -97580, -113072, -47357, 24474, 64010, -29297, -70317, -26223, -50974, -97814, -77417, -79949, -119778, -129618, -125924, -77230, -47203, -19085, 24557, 5096, -30283, -7486, -14924, -14642, -7470, -16761, -18516, -62642, -89179, -59249, -63511, -14517, -68051, -50451, -39893, -125774, -100775, -30723, 21120, -15258, -13061, -7486, -53103, -62071, -78295, -26884, -70018, -39093, -15610, -110355, -67979, -45465, -28421, -69668, -53838, -97989, -66602, -9140]
6661i140p58k7114m2408K9170J7958n311P5574m2010K7045q56m2090R779j37639
6648a47800L9356K4718j1444J00385Q3555j05548m9352K4932r643m7048k0061
6637a17950L8489r27l3531m1422O6657N2843J5417l152k8375j5645k9617N1026
6625d6187l3451M287L2733L4335K6302p6093p7536R7834L9896K0752p176o5625
6613d9929L2168K171P175n8516j1613l1317k4080N8946N9406o8426J0396N5627
6601a7992N889K4529m7551n0482o6445j7710J607K3009Q0456j092n5130K3067
6589i7845j1842K0371M9846N186j7302r2510P2306K5073l7605M8358L7159k9563
6577b8368l0591J0674k003L4453j4643l3389Q452m7854q416m703J8826L0377K024
$$ y = [-9140, -9898, -37012, -79420, -50250, -32292, -37603, 37971, -4039, 23006, 22150, -19940, -10161, -147800, -108444, -83726, -95170, 5215, 88770, -16778, -66130, -41198, -50841, -97889, -117950, -79461, -80388, -113919, -155341, -88684, -35841, -20424, -23576, -51951, -67596, -97213, -46187, -79638, -75351, -42618, -8283, 18019, -58074, -135610, -37776, 2120, 22872, 15696, -49929, -17761, -15590, -8415, -66931, -78544, -109861, -133941, -74995, -15589, -84015, -73619, -17992, -12103, 12426, -35125, -85607, -152052, -169762, -168155, -145146, -64690, -65782, -120912, -97845, -109687, -89316, -39470, -34284, -51586, -144096, -71790, -46717, -84322, -35964, 1195, -28368, -58959, -48285, -50288, -15835, -30478, -63867, -55415, -103269, -111685, -116388, -97562, -67185, -65161]
6564f5161O0515n9746K5372N0498j18542p1788M6390N3196Q766p99J5982j2797
6552f8114N0981N2042j9718K2609K7217j06336n4142J4075K3161l3870o969L4476
6540f4588l8208l253l9463Q1274K6341L7463q8515k3733O8318q1885O648Q5144
6528c4457j4382p6873N0608R0373N031q4708L8653O64j226j9147k0039O911m6140
6515a04732m0202K5261M1319J9598k8976M6702M449j6254M5049m2223m4335O9158
6503b5186L702m49o599m652J1649m4205L6268K2773q4503J0298l8732q93L5018
6490h5511L5293k2655j7458K7373K0J9359l702k4379J5968O3490L0534O348l2142
6477A2538l9613p6347L0673O6102O549n7870L2891K1435k6115n6874M6346N2866
$$ y = [-65161, -4646, -64392, -39020, 11478, -107064, -178852, -132462, -79266, -70500, -71299, -55317, -68114, -17133, 34909, 15191, 37800, 65017, -41319, -95461, -81386, -58225, -92095, -99064, -64588, -102796, -106049, -145512, -64238, -37897, -434, -88949, -112682, -44364, -126249, -119601, -34457, -48839, -125712, -75104, 15269, 20300, -64408, -25755, -25091, -26317, -45464, -65503, -58592, -104732, -144934, -119673, -78354, -58756, -87732, -41030, -36581, -52835, -7786, -50009, -94344, -25186, -21484, -21933, -28532, -33184, -21535, -65740, -29472, -6699, -91202, -80904, -119636, -120529, -85511, -50218, -72873, -90331, -62958, -62938, -43579, -47281, -71660, -55692, 7798, 38332, 44680, 12538, -27075, -103422, -72749, -6647, -98, -57968, -25077, -3642, -29757, -86631, -40285, 12581]
6465A2581n0938K7184J5182N165m1782k6671J2759m976J6813m0255L163k3872
6453i5647O351j9134O9711J308K4416l749o5161m724o852n8523K3504Q8026M5358
6440D884K1558p3869m1458k4166J7995J1335K1308K807k5678P616j7145K9601
6428f5212L3624j8343n1136j2895j4303N6400k1243j0674k1581P6380r869r9966
6416a58818J0140M7783k8189J7403O8191l9858K5798K5382k5668p3051m2491L7013
6404a36365J5367m901Q880j158K1171Q932M6566p9609Q454N7422j2583K6814o8597
6391a09607j2924J2369J3788m4032l7405N1144M4790J7937K127n9888k3249Q4760
6379f0190j3101K272J6907l9471K7486J4306o031M014o1911L5844p4502J00854
$$ y = [12581, -38357, -11173, 4009, 9174, -32608, -59279, -46520, -51496, -34683, -74938, -71775, -95647, -89296, -108430, -38719, -37411, -12995, -16744, -81905, -86629, -93481, -152004, -128500, -40474, 4884, 26442, -47427, -88885, -113051, -95056, -83721, -62413, -59606, -85284, -77668, -94813, -65212, -31588, -49931, -101067, -113962, -128265, -71865, -93108, -103782, -125363, -48983, -58852, -158818, -148678, -100895, -129084, -111681, -43490, -83348, -57550, -32168, -57836, -130887, -173378, -136365, -120998, -125899, -117019, -118177, -97006, -88074, -41508, -121117, -112663, -55241, -67824, -41010, -109607, -122531, -110162, -96374, -140406, -177811, -126667, -81877, -63940, -61813, -121701, -144950, -60190, -73291, -71019, -54112, -93583, -66097, -51791, -57822, -53808, -115719, -79875, -154377, -53523]
6367e3523J5669k2526Q39j4831j5882N087k0217K6704M6211J9692m2211n706N3977
6354f717P519K2182r4861J5376L7573l2344j7418r3500M0775L5762R341m1865
6342a18177J3163L6975M0944l0587k4652J7562N309p8377K0655l136k4860K8929
6330a16252j1344j7663q63J1114m3558L1552P1739K0234j4180L9537o4302o1681
6318a55667p1875J02242N4128M8602p7848L8994K3509l9830j2626k3101N8995
6307e4477M402l0339j3445P497M2854K5279q3L3519m8033m4024k1980J1993N3349
6294c3488j8541K5422L455m1777J3241j9122N2384o954j150j5058k8899L8080
6282c2407m5735Q710m494J6112k2206n0346J3913M2467j4968N756J1032j2053
$$ y = [-53523, -37854, -60380, -59541, -74372, -90254, -85167, -105384, -78680, -32469, -12777, -54988, -60694, -6717, 802, 22984, -71877, -56501, -18928, -51272, -68690, -162190, -121415, -85653, -76312, -118177, -105014, -68039, -27095, -57682, -82334, -64772, -59463, -137840, -117185, -120321, -145181, -116252, -127596, -145259, -146122, -135008, -178566, -147014, -75275, -55041, -69221, -29684, -93986, -155667, -227542, -125300, -71172, -22570, -100418, -61424, -37915, -77745, -90371, -113472, -54477, -50075, -80414, -93859, -86362, -43508, -18229, -18312, 15207, -32826, -76850, -98830, -86837, -33488, -52029, -26607, -23152, -64929, -51688, -70810, -18426, -25380, -26530, -41588, -70487, -32407, -78142, -69432, -73926, -57814, -80020, -130366, -116453, -73986, -88954, -83198, -72166, -84219]
6270h4219k6952o19k1668J796M6442L4945p3561o5825J2684L4653N722K4568L3864
6257g8170n4375m196P6364O6790n9976m134n4305J3582K4909l02O5077m9096N4208
6244c624r219j4329K0320k8684k4855J4577O383n528n1148q038J2134l1325L3386
6231h9950l1726P557P1394J3095q0917n5042J00135l91j3917L598n980K2743J3385
6218d6016j4131l4019L755j4959l4468n2115P4461L9659M115L7193J5731q1161
6206a01955o4153R6062q920q8179K0002N5854j0612P265O5417k4911K5934P5421
6194D7225j19301o3634L6534k6097r549k4201M7438M3431k0466j4875m7190l8629
6182a89314Q0951R350j3971L7834M3507R092K3037j03392l2883o061O4092J0697
$$ y = [-84219, -111171, -111790, -133458, -131662, -85220, -50275, -123836, -189661, -176977, -142324, -136602, -112034, -78170, -132545, -136741, -60377, 6413, -53563, -57697, -112002, -98420, -73511, -73813, -8736, -57832, -3624, -12843, -27172, -6852, -35536, -60391, -45814, -39431, -44959, -96107, -104145, -92011, -123336, -89950, -121676, -114119, -42725, -29630, -110547, -165589, -65454, -65845, -79762, -76164, -82144, -59401, -46016, -60147, -94166, -90411, -105370, -139838, -191953, -117492, -77833, -73718, -36525, -20794, -101955, -166108, -70046, -78966, -167145, -147143, -91289, -101901, -94636, -29219, -54130, -28196, 47225, -72076, -135710, -99176, -125273, -134822, -159023, -111585, -68154, -88620, -103495, -150685, -189314, -108363, -99013, -112984, -75150, -31643, -22551, 486, -102906, -135789, -141850, -77758, -67061]
6170f7061K0471K6562o4550j9979J4586M9455J7469o8812N5788r785o0987K9199
6158g7644K1005N3968K8291L11m3707n3397M172l5806k3022L303Q498L5218M1077
6145c7733m0985n7225P8849K4546k7037L2966k8309q4838M1616K5279M0603k063
6133c4331m3378m3112J6261p1485M6882O74N0978j1133k4730l8416L2325N0111
6121f9354m4447J8580P4978n2074j3670k140R032q098J0914K8554L535m0954l8023
6108a23167Q556m9172J8135Q0507J2567l7512k3228K6802M0237n4007M8395O377
6096d5510j5741k0845k5284r066O6406O9865l232q8268m8382o4621N152J06678
6084g2848L6740m0227L6788N830k3357j06089O1477K7780J206j4332n5228m9642
$$ y = [-67061, -46590, -20028, -84578, -104557, -89971, -40516, -23047, -91859, -36071, -45856, -106843, -77644, -56639, -2671, 25620, 25931, -17776, -71173, -67001, -102807, -125829, -122526, -114028, -78810, -37733, -78718, -135943, -57094, -32548, -59585, -26619, -54928, -139766, -98150, -72871, -32268, -34331, -77709, -120821, -104560, -176045, -129163, -128489, -77511, -88644, -113374, -151790, -119465, -69354, -113801, -95221, -20243, -72317, -85987, -88127, -79095, -87193, -76279, -47725, -44190, -85144, -123167, -114611, -163783, -145648, -65141, -52574, -90086, -113314, -86512, -46275, -100282, -51887, -45510, -61251, -82096, -107380, -116446, -50040, 19825, 16593, -71675, -120057, -184678, -179526, -72848, -36108, -76335, -39547, -33717, -57074, -163163, -101686, -73906, -72700, -87032, -142260, -191902]
6072a91902R925O9822k1795l1763N3390O744R2419p7238r0846Q4634R0282m9255
6060e5583n0438p831n1673L7663K7586O6792l2361k6777j3061K2787n3754K0550
6048a16100l742m2861j2498k1325J6725O6092M1753n982k6095J1099P2319j7886
6036c8501L2045N1232p5623m9349J933K6125J5252n6620j1529P657M9625M0992
6024f761p3390o4864O289K0278j5439M0964J3082n2261N4741M1221l5520J6502
6012e5158k9271m664j3270O6895k2329o0077o3429M0724P2113K722m6445q626
6000a20815K2551P950K5152L3250o9933n1272K3537L3592N4982j4760O1639q4327
5988g8454n1703P5878k4618j793n399J9544M0645j0359K4129N0914l8883L136
$$ y = [-191902, -181977, -112155, -133950, -165713, -112323, -105579, -13160, -90398, -181244, -96610, -6328, -55583, -106021, -113852, -165525, -127862, -100276, -33484, -65845, -92622, -105683, -82896, -136650, -116100, -119842, -162703, -175201, -196526, -179801, -113709, -71956, -77938, -104033, -92934, -20615, -38501, -6456, 44776, -30847, -80196, -78263, -52138, -36886, -93506, -105035, -97378, -47753, -6761, -80151, -145015, -138726, -118448, -133887, -92923, -79841, -132102, -77361, -36140, -71660, -55158, -84429, -89093, -102363, -35468, -57797, -117874, -181303, -140579, -68466, -65744, -112189, -120815, -98264, -90314, -65162, -31912, -101845, -153117, -129580, -95988, -41006, -55766, 5873, -78454, -130157, -54279, -78897, -80690, -86089, -66545, -25900, -36259, -12130, 38784, -99, 3037]
5976C037K6772L35k6370k4194k2908Q4860J9785p976q114o2097L5326n7495P324
5963c1715L2048q8057O684J3627m8128K3535m146k2806R7857N0225k4979n6468
5951e2323K823O0588j3824m0569j7640K0691k4748m014o6056O333P8696O523j275
5938d4795J9592k0540J5379j9837m4455m741O238n8036Q0618K7166p682K2716
5926b8377p7677J0325q492k8739J6182j1620L7789M7513K4778k5168L5037k0693
5914b9142k46J4824j5400L5776q1477m0972N4704J9706p9160o217N0771R252j192
5901f8773K7430l0343J3155Q0966j3221n5361K7075M2011k5932K6150k7862Q772
5889D067P714o3412J5357J0992L947K1897l8149Q117L6628l6952m9365Q7472k1447
$$ y = [3037, 29809, 30144, 3774, -20420, -43328, 41532, 61317, 53341, 45227, -16870, 18456, -39039, -31715, 333, -87724, -81040, -67413, -115541, -92006, -96152, -118958, -21101, 29124, 4145, -52323, -49500, 11088, -2736, -43305, -60945, -40254, -65002, -69016, -135072, -128739, -50043, -43520, -44795, -25203, -45743, -30364, -50201, -94656, -99397, -93159, -151195, -70577, -43411, -51093, -28377, -106054, -95729, -104221, -132960, -116778, -128398, -90609, -43096, -18318, -43486, -8449, -29142, -29388, -14564, -29964, 5812, -75665, -116637, -61933, -42227, -121387, -127604, -76833, -67581, -68773, -41343, -71686, -58531, 22435, 9214, -46147, -19072, 22939, -2993, 23157, -4705, 4067, 11781, -51631, -36274, -25282, -21335, 562, -37587, -29470, 7158, -29794, -79159, 8313, -13134]
5876a3134l57L9644L6453o0637r3774K6220J2107K6541l9901N8118k5630j9321
5864e3671N9990n286k2916k2406Q782N7790l026K7060o1405l680L4778L0019n5985
5851i956l2238P8435l4396O784p0378O6018J0255n9672p839p596L7361l1384l245
5838e7851O3653n6191N951N5219M9270J5590j9704p7394R240M7703l4531j6612
5826a5657J0703O6150J1600n9903N5012L0007o5597L1470n0980M0048M4628j8178
5814G9303P349K2308K1217p5314P446M0251q14j1036M5283P850K0484J3443k6551
5801A51219p6408l7866M5110n2440M9714L963L7840l6008J4844M6377l13r9444
5789D6588L142M3169L6277K021J157M462J4626l442J0134n739L2528J1670l9130
$$ y = [-13134, -13491, 26153, 62606, 1969, -91805, -65585, -53478, -26937, -66838, -8720, -34350, -53671, 6319, 1033, -21883, -44289, -35507, 22283, 19257, 46317, -15088, -18768, 16010, 46029, -9956, -42194, 36241, 1845, 8629, -61749, 4269, 14524, -45148, -52987, -60583, -23222, -54606, -57851, 5802, -50389, -44438, 10781, 60051, 75641, 55937, -21457, -12217, 35486, 955, -15657, -4954, 61196, 72796, 12893, 67905, 97912, 32315, 63785, 12805, 52853, 97481, 79303, 86652, 108960, 130177, 54863, 62309, 102560, 101746, 90710, 135993, 143843, 164327, 177770, 151219, 74811, 36945, 82055, 29615, 79329, 83292, 121132, 85124, 99968, 146345, 146032, 46588, 49730, 92899, 129176, 131197, 132354, 136816, 151442, 148000, 158134, 152395, 184923, 196593, 157463]
5776A57463M1513K6927m5878n4895M6755l2469m6929K7566K1484O275q437K5364
5764A64739R869L3261q173K0556l3042K7664L6971K412J1579L237J1462l9571
5752B40964N2109p003K0960l8203r689K3208R026j6022M559J1539K0961K2361
5740C34770K9792j171J6837l956q946J0766l8898m6391k07O0162k7181j4250J3305
5727C24632j9239N2N3315L9011M3975q541m3775M6517j1860J1679m806m0276N8891
5714D49575M8763L2486N790m1244p962K3384K1317m7306K8116l5896j0628j30
5702D66265l230R1022K4913n0113n1203Q1095j1567J2347J1006k9587O1822J3440
5690F16210O121n768Q60n4047L6626P693J5828J4953k7005l1367N5361K572J00788
$$ y = [157463, 198976, 225903, 180025, 125130, 171885, 139416, 92487, 120053, 141537, 147812, 139375, 164739, 174608, 207869, 199696, 220252, 187210, 214874, 251845, 254257, 265836, 269073, 280535, 240964, 293073, 286070, 307030, 268827, 259138, 282346, 291372, 275350, 279909, 291448, 312409, 334770, 364562, 363391, 380228, 376272, 367326, 378092, 339194, 292803, 292596, 352758, 325577, 311327, 324632, 305393, 305445, 358760, 397771, 441746, 433205, 389430, 435947, 424087, 435766, 430960, 390684, 449575, 498338, 530824, 536614, 495370, 487408, 510792, 532109, 484803, 512919, 477023, 466395, 466265, 463035, 554057, 578970, 528857, 477654, 558749, 547182, 559529, 570535, 540948, 602770, 616210, 622331, 616563, 617423, 563376, 600002, 607695, 623523, 638476, 611471, 580104, 635465, 638037, 738825]
5677G38825M9937J2892j24946m4924P0820K9284J2856l9029M8137r836M6497N5805
5665H46318q222o8412r760Q1067J8056J9252P2189J8268k2110o103M9672j3003
5653I77212l8303R0258j8057o502Q0544P678k5772M939k5734o1934K0923J10752
5641A116004j6896l0869N1072L1385L4753O8526M1793O790l3786M0655j1188K0655
5629A318894O1478J7606M6724J4997O7188M4415k6246K7744P5836k1711K283j5956
5617A613252P203k8433R2053Q8024M4221O5503N8791j9690O5820k0925P5197k0692
5605B020324j5154N1124J850p9293O7278K6689R6553J0185q298N3594N5901k0825
5593B259928K7164J4228n1096K2500P0055P2125J2974N1789K0525J02592O3065
$$ y = [738825, 788762, 801654, 676708, 631784, 702604, 731888, 744744, 705715, 753852, 744016, 790513, 846318, 838096, 769684, 759924, 840991, 859047, 878299, 950488, 968756, 946646, 940543, 990215, 977212, 938909, 1029167, 1011110, 1004608, 1085152, 1092830, 1067058, 1071997, 1046263, 984329, 1005252, 1116004, 1099108, 1068239, 1119311, 1150696, 1185449, 1253975, 1295768, 1302558, 1268772, 1309427, 1298239, 1318894, 1380372, 1397978, 1444702, 1459699, 1526887, 1571302, 1545056, 1572800, 1648636, 1626925, 1629208, 1613252, 1620455, 1592022, 1684075, 1772099, 1816320, 1881823, 1940614, 1920924, 1986744, 1965819, 2041016, 2020324, 2005170, 2056294, 2058144, 1978851, 2046129, 2072818, 2169371, 2179556, 2171258, 2224852, 2280753, 2259928, 2287092, 2301320, 2250224, 2272724, 2342779, 2414904, 2427878, 2479667, 2500192, 2602784, 2665849]
5582B665849O1915N8509Q3650q0668M3963J49747R8465J4780k6380P3672O8265
5571C211767M6475J31509M8188R2497R8784L3264J8052M9741J31806N2345L7580
5560C952008P4709P6662K6613L395P1175O1779P7545J23213J05415O7734R7113
5549D737361N7635M7642J05085P4664O1789P4112O3520P4189P4529J25238J67880
5538E663644J34275J90736P5586Q2911P2114N8645K08990J58434J92359J56555
5528F994249J20738J34705K20696K00881J34251J78637K40923J89389K09433L01888
5518H925790K12313J83259K97741L10584J75372K38336K92091K88833L46590L56926
5508A1627835K84471L40750M06167L58301L60637L29110M23030M06419M46886
$$ y = [2665849, 2727764, 2786273, 2869923, 2789255, 2833218, 2982965, 3081430, 3096210, 3069830, 3143502, 3211767, 3258242, 3389751, 3437939, 3530436, 3629220, 3662484, 3680536, 3730277, 3862083, 3914428, 3952008, 4026717, 4103379, 4129992, 4133387, 4204562, 4266341, 4343886, 4467099, 4572514, 4640248, 4737361, 4794996, 4842638, 4947723, 5022387, 5084176, 5158288, 5221808, 5295997, 5370526, 5495764, 5663644, 5797919, 5988655, 6064241, 6147152, 6219266, 6277911, 6486901, 6645335, 6837694, 6994249, 7114987, 7249692, 7470388, 7671269, 7805520, 7984157, 8225080, 8414469, 8623902, 8925790, 9138103, 9321362, 9619103, 9929687, 10105059, 10343395, 10635486, 10924319, 11270909, 11627835, 11912306, 12253056, 12659223, 13017524, 13378161, 13707271, 14130301, 14536720, 14983606]
5499A4983606M16680M72094M89380N22936N68290O01099O55876N41659O65541
5490A9917161P87593P01530Q47384P77931R32911Q96546R22241J060041J060544
5481B7903882J158504J266384J363894J413673J552977J629992J747266J932197
5473C9968769K122994K226859K407325K601222K864326L198694L476104L744530
5465F2610823M140312M511878N055336N526523O165251O852248P607806Q457297
5457A10927474R468409J0599997J1954373J3459631J4876623J6571792J8412487
5450B06270786K0064382K1388028K2391750K2472668K1326405J8752188J4691977
5443C47358184R281111L218356l232944r143546j3963514j7794345k0104446k1195395
$$ y = [14983606, 15400286, 15872380, 16361760, 16884696, 17452986, 18054085, 18709961, 19251620, 19917161, 20704754, 21406284, 22253668, 23031599, 23964510, 24861056, 25783297, 26843338, 27903882, 29062386, 30328770, 31692664, 33106337, 34659314, 36289306, 38036572, 39968769, 42091763, 44318622, 46725947, 49327169, 52191495, 55390189, 58866293, 62610823, 66751135, 71263013, 76318349, 81844872, 88010123, 94862371, 102470177, 110927474, 120395883, 130995880, 142950253, 156409884, 171286507, 187858299, 206270786, 226335168, 247723196, 270114946, 292587614, 313914019, 332666207, 347358184, 356639295, 359857651, 356624707, 347481161, 333517647, 315723302, 295618856, 274423461]
5435B74423461k1260119k0576195j9371279j7954346j6371798j4697650j3210424
5428A50981650j1849900j0488006r466969q546677p502361o792640o142923n486892
5420H4705282m937147m513203m161361l727772l424568l211365k847843k670015
5412E5212008k494546k253702k156074k006587j848458j723797j625003j542017
5404C9561824j455547j377814j277681j206177j149001j067889j076703j084502
5396B9866510r46885r24294q64081p52608q41656p67122p35957o88834o43080
5387B2701993o86106o43301n86651n70301n42033n74960m85605m44999m88355
5378A7679682l95300l37634m02258l94059m34218l04076k74051l97797l26101
$$ y = [274423461, 253163342, 232587147, 213215868, 195261522, 178889724, 164192074, 150981650, 139131750, 128643744, 119176775, 110630098, 103127737, 96335097, 90192174, 84705282, 79768135, 75254932, 71093571, 67365799, 63941231, 60729866, 57882023, 55212008, 52717462, 50463760, 48307686, 46301099, 44452641, 42728844, 41103841, 39561824, 38106277, 36728463, 35450782, 34244605, 33095604, 32027715, 30951012, 29866510, 28919625, 27995331, 27131250, 26378642, 25536986, 24769864, 24033907, 23345073, 22701993, 22015887, 21372586, 20785935, 20215634, 19673601, 19098641, 18613036, 18168037, 17679682, 17284382, 16946748, 16544490, 16150431, 15716213, 15412137, 15138086, 14740289, 14414188]
5369A4414188l16879l51144l33360l10217k09362l06499k64835k43339k68629
5360A1809924k25612j30698j90075k96483k38757k28729j99199j69382j74908
5351I956081j74243j63492j10465j75460j59228j74151j81438j86056j83029j44912
5341H303607j51343j88418j21520j26076j43993q0799r3227j68961j63251j70820
5331F895199j66057j10324j01131j06641j23355r3372j45663r3857j01396p8460
5321E774943q8188q2547j40179n3906k1465j75276p4237o0594j02665n145k5154
5310D945587l8062r7084l8270o8806k6779o1633Q617o9061o8350n4625q7995k9101
5298D314438o0805j08853r46j784q9827j07442p9522l4783l4041m0882o1880p9227
$$ y = [14414188, 14097309, 13746165, 13412805, 13102588, 12893226, 12586727, 12321892, 12078553, 11809924, 11584312, 11453614, 11263539, 10967056, 10728299, 10499570, 10300371, 10130989, 9956081, 9781838, 9618346, 9507881, 9332421, 9173193, 8999042, 8817604, 8631548, 8448519, 8303607, 8152264, 7963846, 7842326, 7716250, 7572257, 7491458, 7398231, 7229270, 7066019, 6895199, 6729142, 6618818, 6517687, 6411046, 6287691, 6194319, 6048656, 5954799, 5853403, 5774943, 5686755, 5604208, 5464029, 5410123, 5388658, 5213382, 5139145, 5078551, 4975886, 4970741, 4945587, 4907525, 4810441, 4772171, 4703365, 4676586, 4614953, 4623570, 4554509, 4486159, 4431534, 4343539, 4314438, 4253633, 4144780, 4143834, 4142050, 4052223, 3944781, 3865259, 3830476, 3796435, 3755553, 3693673, 3614446]
5286C614446o3314J7526l6299j07339l5200m3924j15081p2433m4297q7291j0567
5275C016227l5043o2766P4023l2858n4674n4893n8622J1748l888k6597l7115R38
5263B736480m1072n1048J5639k5086r7605n374m882r3196l7218q451m1695o0695
5251B285797k0282L3544N5644j5506m1885k8725k6006O141n8005M8791Q316n4570
5239B193254m2466J6956j6507o5079L183n2144k1572J6707p4214J925l1876m448
5227A923719l0117j7697j3138J7856N2082o8824m6601l9495J8913L4563n193l0400
5215A795668l6329j07457k308m6009K8196K5132k4162J3532J7771n4558J7484
5204A626960l1097m6415p393j5553q3150k7405P2035k6060j0181M2086m6749m2901
$$ y = [3614446, 3551132, 3568658, 3532359, 3425020, 3389820, 3345896, 3230815, 3158382, 3114085, 3026794, 3016227, 2981184, 2918418, 2992441, 2959583, 2904909, 2850016, 2791394, 2803142, 2799254, 2772657, 2735542, 2736480, 2695408, 2644360, 2659999, 2634913, 2537308, 2531934, 2527052, 2433856, 2396638, 2388187, 2346492, 2285797, 2265515, 2299059, 2354703, 2339197, 2297312, 2268587, 2242581, 2248722, 2190717, 2239508, 2247824, 2193254, 2150788, 2167744, 2151237, 2086158, 2089341, 2037197, 2015625, 2032332, 1958118, 1960043, 1928167, 1923719, 1893602, 1875905, 1862767, 1880623, 1932705, 1863881, 1817280, 1777785, 1796698, 1831261, 1826068, 1795668, 1759339, 1651882, 1649574, 1603565, 1631761, 1656893, 1632731, 1646263, 1664034, 1609476, 1626960, 1595863, 1549448, 1542055, 1526502, 1443352, 1415947, 1487982, 1461922, 1451741, 1493827, 1447078, 1404177]
5192A404177l217M2464l032k3637n999k5798L1129j14439M5626J458j03567L0441
5180A275606k0366M899j6758J2039k4145m2605k4879K5515o2721M810K3769L7204
5168A192368k6286K4721J0093j2481k6876J7581n3516j2552M3529o9939R883K1948
5156A118473K2381l4114l0193J6775n3819m996k5302o5532l040K0926P0892l933
5144A028518l0391r65N9295n5886O891j22201m2171J753N9871r304l1521M8837
5132I12726L8175k9819L796M6966m8331k4604j2610Q405j3163l3063m7577L6793
5120H37694M8232k4681o7254l331M8440J1949q2241k6672K9825M3036J8383k4867
5108H08513l6490k9925j3556J0091J5485J7733j2822L3552K6097p9837J4630o9271
$$ y = [1404177, 1400960, 1443424, 1440392, 1416755, 1410756, 1384958, 1416087, 1301648, 1347274, 1348732, 1245165, 1275606, 1255240, 1260139, 1243381, 1255420, 1231275, 1188670, 1163791, 1189306, 1126585, 1131395, 1155164, 1192368, 1166082, 1190803, 1200896, 1188415, 1161539, 1179120, 1125604, 1113052, 1156581, 1086642, 1096525, 1118473, 1140854, 1106740, 1076547, 1093322, 1039503, 1034507, 1009205, 943673, 940633, 961559, 1032451, 1028518, 998127, 997162, 1056457, 1000571, 1007462, 885261, 843090, 844843, 904714, 895410, 863889, 912726, 950901, 921082, 924878, 971844, 923513, 898909, 886299, 894704, 881541, 848478, 800901, 837694, 885926, 861245, 793991, 790660, 839100, 851049, 768808, 742136, 771961, 814997, 833380, 808513, 772023, 742098, 728542, 738633, 754118, 771851, 759029, 792581, 818678, 738841, 753471, 684200]
5096F84200j6188Q2780N0277q5132l6891K5678P5691j2434m9244K261m310P239
5084G23927K4028J5647n3289p6815q934L0436M5046M2774J3410n3301k5214l2260
5072F45455L0007N2999R550M8801o2155R808O026k4514J8227k4364j5974K8917
5060G22783j4654o6460j8407K1904L1163M0994L3607m4947n7294k8365m8079L5982
5048F08227J6731j7325O7222P0383l5745n8599k9055j6023P3041k5032m470L9877
5036F89232k7056K3430j0102K3740j2090n3523k4794j876L440K8196O531j1467
5024F33661k8194Q0222L2994r238l312q7813N8358K1521m3627k2023m5954Q4493
5012F71088k1756m13L6095K5628p8024j5747J5524N2822P3695j7316q4113P392
$$ y = [684200, 668012, 750792, 801069, 715937, 679046, 704724, 780415, 767981, 718737, 720998, 716688, 723927, 747955, 763602, 710313, 633498, 624564, 655000, 700046, 742820, 756230, 702929, 677715, 645455, 675462, 728461, 738011, 786812, 724657, 734465, 740491, 715977, 734204, 709840, 693866, 722783, 708129, 641669, 623262, 645166, 676329, 717323, 750930, 705983, 648689, 620324, 572245, 608227, 624958, 607633, 674855, 745238, 709493, 650894, 621839, 605816, 678857, 653825, 649355, 689232, 662176, 685606, 675504, 699244, 687154, 633631, 608837, 606961, 610401, 638597, 645128, 633661, 605467, 685689, 718683, 709445, 706133, 618320, 676678, 698199, 654572, 632549, 586595, 671088, 649332, 648919, 685014, 710642, 632618, 616871, 632395, 685217, 758912, 741596, 657483, 664875]
5000F64875k8167K1814q6119j8995k522k0434N2271r35Q873M4855K9681J8242
4988F83439J7638o2631j1521q729L343m2436K6797K2340j2323r50r001R311k0608
4975E94669j8249Q5499l4557j2534l0264N341k6707j5804K8712O607l6546J7050
4963E63217m0444R1385O0633o9567l092L4254n4669R1729J8478l8757m8306q475
4951E96386k0935K9954N4226N550J4793K8554M452M0155L5349M6953J26886J4552
4939I76875J11534J92578K63244L80668M68644L88371K35819m3270l02817l51534
4929B320112l65896l05605k58794j91490j42885p4143r4002n2004Q603o5113j1983
4918G66800j4980j838r188L8202k8582q4822K0106j3245m0647J05946n9747j658
$$ y = [664875, 636708, 658522, 572403, 553408, 550886, 530452, 582723, 581788, 590661, 635516, 665197, 683439, 701077, 638446, 626925, 618196, 621539, 579103, 605900, 628240, 615917, 614967, 605966, 615277, 594669, 576420, 661919, 627362, 614828, 584564, 589905, 563198, 547394, 576106, 582713, 546167, 563217, 522773, 614158, 674791, 605224, 602132, 636386, 581717, 673446, 691924, 653167, 604861, 596386, 575451, 605405, 659631, 665181, 679974, 708528, 712980, 753135, 788484, 835437, 962323, 976875, 1088409, 1280987, 1544231, 1924899, 2393543, 2781914, 3017733, 2974463, 2671646, 2320112, 1954216, 1648611, 1389817, 1198327, 1055442, 981299, 887297, 835293, 843896, 778783, 766800, 751820, 749982, 740794, 778996, 750414, 665592, 685698, 672453, 631806, 737752, 678005, 676347]
4906F76347N9514K4131J6451k6621N0230L9591q6659j0899J2117N3967n6566m082
4894G47521j8159p2897j91L9351O787k3786o1442O8305l122J755l6882o5352o20
4881E81268J0159l6637K366J6718k6099L979j2221l9529j3905L8123j8485r2534
4869D13203m1718N5295m7186m3086j7609R3873m051O4937N212k2497j8456L6496
4857D74413l5412l782n9396K8034j9853j3059J02514J5138J850p9072k1817M6735
4845D36293l1027m7547L2866n3325L6676L3K7508j8962m3195M679O4921L1905
4833D40825K0504m2154N0877k6538q3651n9517K401R0547J1695l0658M8003K5950
4821D48284m4930N1082k1081l1843K8871n2526j0688L7222o2459Q2300n649n9100
$$ y = [676347, 735861, 759992, 776443, 749822, 800052, 839643, 752984, 742085, 754202, 808169, 751603, 747521, 729362, 656465, 656274, 695625, 702412, 678626, 617184, 685489, 682367, 684122, 647240, 581888, 581268, 591427, 554790, 557156, 573874, 547775, 551754, 539533, 500004, 486099, 524222, 505737, 413203, 371485, 426780, 379594, 336508, 318899, 412772, 408721, 473658, 478870, 456373, 437917, 474413, 439001, 435219, 375823, 403857, 384004, 370945, 473459, 488597, 490447, 411375, 389558, 436293, 405266, 357719, 390585, 337260, 373936, 373969, 401477, 382515, 339320, 343999, 408920, 440825, 461329, 419175, 470052, 443514, 359863, 300346, 302747, 393294, 404989, 374331, 422334, 448284, 403354, 454436, 433355, 401512, 430383, 377857, 367169, 404391, 341932, 424232, 418583, 359483]
4809C59483o820J06047Q9440m2297M9612N0724n2369J8201j9402M7994O2948O1991
4797G25552J13304J11853J02789J85888L50490L11760M02570L55017L7422p5332
4787B621313k47917k71348l62833l61463k02859j63903j29483m9789o8212m8536
4777G14970n0675o9350L8118J2823j1368L206o5877M52M9575N8176p0335j3672
4765E96043P139j1352j5683k9069K206j2312N0435O7835j7617J29626O7949N1819
4753H87019o2207p9603m2860l575k0688m3646M4988j51688l9092L0535J7514P2487
4741F09184k3924p7783M7764m3170l5348k8003J4019K3406Q662m1330M9552M478
4729E07507m1702j7058R3308O8270k9215q4250m4909K8572j7449J9388M1280k7266
$$ y = [359483, 352663, 458710, 548150, 505853, 555465, 606189, 553820, 572021, 552619, 600613, 663561, 725552, 838856, 950709, 1053498, 1239386, 1589876, 1901636, 2304206, 2659223, 2696645, 2621313, 2373396, 2102048, 1739215, 1377752, 1174893, 1010990, 881507, 831718, 763506, 714970, 664295, 594945, 633063, 645886, 634518, 637724, 571847, 572299, 621874, 680050, 609715, 596043, 603182, 591830, 576147, 547078, 549284, 536972, 587407, 655242, 637625, 767251, 835200, 887019, 824812, 745209, 702349, 698774, 678086, 634440, 679428, 527740, 488648, 519183, 536697, 609184, 585260, 507477, 555241, 512071, 476723, 448720, 462739, 486145, 494807, 453477, 503029, 507507, 465805, 448747, 542055, 610325, 581110, 496860, 451951, 480523, 463074, 482462, 523742, 496476]
4717D96476P4603K3353N947m519k1601k667L56L791j2322k9152N4538K1449M9636
4704F59888m2972J6460K4499l0209J7316P4179k2232n3255N1285M7006k5083m3398
4692F73484M8186J5279o590K8788k754m3904j4156J8937K1170K5888o041j1051
4680G47236N8111j2200P5338j7278j0804J4114n64M8794N2868j1756m9168L5511
4668I30202J13921O397J138j7863P489N1027K395k0470P5297J17044N8807l7811
4656A287573K8880N5997j2067O4070J43907j484Q131J5181L3641J10764P7632
4645A812225R7019p482R6192M2218J89405J88690P3690J67497J85586K18628K02475
4634C266143K65933L26966L88885N61759P84699J300714K207962L425734L783138
$$ y = [496476, 571079, 594432, 600379, 595860, 574259, 571592, 571948, 575739, 563417, 534265, 588803, 610252, 659888, 616916, 633376, 657875, 627666, 644982, 719161, 696929, 643674, 694959, 741965, 716882, 673484, 721670, 736949, 730359, 759147, 756393, 712489, 698333, 717270, 738440, 764328, 758287, 747236, 805347, 793147, 868485, 851207, 840403, 854517, 853953, 902747, 955615, 943859, 894691, 930202, 1044123, 1050520, 1051658, 1033795, 1041284, 1092311, 1094706, 1074236, 1149533, 1266577, 1325384, 1287573, 1316453, 1372450, 1360383, 1424453, 1568360, 1566876, 1575007, 1590188, 1623829, 1734593, 1812225, 1909244, 1901762, 1997954, 2040172, 2229577, 2418267, 2491957, 2659454, 2845040, 3063668, 3266143, 3532076, 3859042, 4247927, 4809686, 5594385, 6895099, 9103061, 12528795, 16311933]
4625A6311933K415797N16740j080185k154881k399485k076714j580020j156004
4617H797181o50124m75558j22281J39675L95289M50710P45855J166618J471739
4608A1919104J754677J697810J503592J195355R89809R45396J286573J925715
4600B3218031K586838K720805K346413J440755N66358R5793K87000R40601J923099
4591C6125693K510162K114526R42310m13218j555179k018372j743079j009250
4583C4953593l56350k5961m50765j256250k046231k470856k450540k060526j649734
4574B2186380j198090j132540j284502j496091j611026j721408j643299j631612
4566A0467812j260960j003960q84652o30037m93819m15480l77306l36071k70634
$$ y = [16311933, 18727730, 19244470, 18164285, 16009404, 13609919, 11533205, 9953185, 8797181, 8147057, 7671499, 7549218, 7688893, 8084182, 8534892, 9280747, 10447365, 11919104, 13673781, 15371591, 16875183, 18070538, 19060347, 20005743, 21292316, 23218031, 25804869, 28525674, 30872087, 32312842, 32879200, 32974993, 33261993, 34202594, 36125693, 38635855, 40750381, 41692691, 41279473, 39724294, 37705922, 35962843, 34953593, 34597243, 34571282, 34120517, 32864267, 30818036, 28347180, 25896640, 23836114, 22186380, 20988290, 19855750, 18571248, 17075157, 15464131, 13742723, 12099424, 10467812, 9206852, 8202892, 7318240, 6688203, 6194384, 5778904, 5401598, 5065527, 4794893]
4557D794893k64195k58424k12480j85496j02194r8224j22675j20544j65644j49512
4547C115505r5135p2199j07468m8621l5123j02921l7877j13655p2900q0514j2793
4536B336299p5637m9182r0539n1419q4595l8349j4312l6780q5625j8887o5199
4525A725775o0495k078m265o3042l2033l3132l1559p3086o0523J7700J743l5725
4513A349280K325j9055j3104j7669o45j03119K3550l857K3523K6831M636k2104
4501A250592m6519m9204j3476O949j2871J8725q2289k6757o1216J8708l613o9932
4489I29097m5787N772l1646O2797K2033n7709j8434K6383L950k6004j6966n2242
4477H01244j8467K9699K499L313O0487q491q6614j4935L9723k3089Q111m4413
$$ y = [4794893, 4530698, 4272274, 4059794, 3874298, 3772104, 3673880, 3551205, 3430661, 3265017, 3115505, 3020370, 2948171, 2840703, 2792082, 2756959, 2654038, 2616161, 2502506, 2429606, 2349092, 2336299, 2260662, 2211480, 2120941, 2069522, 1984927, 1946578, 1932266, 1895486, 1809861, 1790974, 1725775, 1665280, 1663202, 1658937, 1595895, 1563862, 1530730, 1499171, 1426085, 1365562, 1383262, 1385005, 1349280, 1351605, 1332550, 1319446, 1301777, 1301132, 1198013, 1221563, 1217706, 1241229, 1268060, 1272696, 1250592, 1204073, 1154869, 1141393, 1148342, 1135471, 1154196, 1071907, 1045150, 983934, 1002642, 999029, 929097, 883310, 889082, 857436, 920233, 942266, 884557, 866123, 892506, 896456, 870452, 853486, 801244, 782777, 812476, 814975, 818288, 878775, 870284, 783670, 768735, 808458, 785369, 793480, 749067]
4465G49067K1309L986m2068o6194l5199K8612M2804J1305l3414J3013K8640l2754
4453F89107l6858j6230Q4178o4625j6896l7822J9411N2953m6360j9001o4628j3006
4441E30223L0505k6981J8045j1087j3497J2064l1961M8737j2990L0426k1721p0339
4429D81424K8620P1664o048K050p8932q065N1997J0001p7994N0977J640m5909
4417D81425j0295j05926k4011P2053r453J8848n2549O3012p899m4370J3309R5026
4405D89170o2303l7772q750J6642j538o0909o1037M4209Q2217K4054Q0977o4117
4393D40843k9807o9392L5659L6921j5930j5458l1808k2058O2445m4952j3744L1033
4381C63752m1128J4017P6488J0691l2773N509n3429K0664k7955N6163o9864n0894
$$ y = [749067, 770376, 774362, 732294, 666100, 630901, 659513, 702317, 713622, 680208, 693221, 721861, 689107, 652249, 636019, 720197, 655572, 638676, 600854, 620265, 673218, 626858, 607857, 543229, 530223, 560728, 533747, 551792, 540705, 527208, 539272, 507311, 556048, 543058, 573484, 551763, 481424, 510044, 581708, 575660, 577710, 498778, 490713, 542710, 552711, 474717, 525694, 527334, 481425, 471130, 365204, 341193, 413246, 403793, 422641, 370092, 433104, 425205, 380835, 394144, 489170, 426867, 389095, 380345, 396987, 395449, 334540, 273503, 317712, 399929, 423983, 504960, 440843, 411036, 341644, 377303, 414224, 398294, 382836, 351028, 328970, 391415, 346463, 332719, 363752, 322624, 336641, 413129, 423820, 391047, 396556, 343127, 363791, 335836, 391999, 322135, 271241]
4369B71241K2777K0636O9236M331j9554o1477j4645K2890Q426N3690p4352j1632
4357B91567K9971k4717N4766r1846j2456K0662K9016Q776K7704P3502J0750l7124
4345C80571q2338K4867R3203m0701J2610R855k176m5738J5326J8330j4666k5954
4333C43189j4273L1640j2896m9978j5294J1163k082L933L938M7478N0149J4176
4321D11143j13328l5816J18681O496j00771k4565M5080Q3324p8216j8156L3321
4310C27193R7092n5539l4994j299J9553L5045o9979L1173j2740K232K8974N2511
4298D19222k3542K567p1O761j1638k2876M8760J7187o5595k395l0402Q0360O052
4285D24390K8930m6133N9086o235m0616L9564P3523J3651K1937J084k6223j9211
$$ y = [271241, 294018, 314654, 383890, 388221, 368667, 307190, 292545, 315435, 323861, 377551, 303199, 291567, 321538, 296821, 351587, 259741, 247285, 267947, 296963, 305739, 333443, 406945, 417695, 380571, 298233, 323100, 416303, 375602, 388212, 398067, 395891, 350153, 365479, 383809, 369143, 343189, 328916, 360556, 347660, 297682, 282388, 293551, 291469, 295402, 299340, 346818, 396967, 411143, 297815, 261999, 380680, 387176, 286405, 261840, 306920, 390244, 312028, 293872, 327193, 424285, 368746, 333752, 332453, 352006, 387051, 317072, 348245, 335505, 337737, 366711, 419222, 395680, 398247, 398176, 404937, 393299, 370423, 419183, 436370, 370775, 368380, 337978, 418338, 424390, 453320, 407187, 466273, 460038, 419422, 458986, 532509, 546160, 568097, 569181, 542958, 523747]
4273E23747r470l3243m2628J7262K9423K4423p4740L155P69K5180O0234q0173
4261D43939q3478J5641K6413k0719O699j1689l6469N2007K6831K7944o1122j3300
4249C72697j1393K1018l2975m9970k5016K588M7200L525n1772R011J5621L7167
4237C37701J8819K402K0605l5529P77J4350M2366q3092n6330L6940k5060L0084
4225C04033l8632K3481N0140n215j3920K1030q1664k5398M3587K1276l8502K5863
4213B86079J3056k0300L0849J7802K3450l6484J04918K5298J6089r559k378K1328
4201D70148l5103n9777n3683l8873L8119J2042m849N3261r0723j9026L9626O539
4189C17701o3306k9132Q2749k4074r239n154J0001k8336j8682K0837R855N6354
$$ y = [523747, 514277, 481034, 438406, 455668, 485091, 509514, 434774, 437929, 438698, 463878, 524112, 443939, 360461, 376102, 402515, 381796, 388495, 376806, 340337, 392344, 419175, 447119, 385997, 372697, 361304, 382322, 349347, 299377, 274361, 276949, 324149, 327674, 275902, 284913, 300534, 337701, 356520, 358922, 379527, 343998, 344775, 359125, 401491, 318399, 262069, 299009, 273949, 304033, 265401, 288882, 339022, 333807, 319887, 340917, 259253, 233855, 277442, 298718, 260216, 286079, 299135, 278835, 309684, 327486, 350936, 314452, 419370, 444668, 460757, 451198, 448820, 470148, 435045, 375268, 321585, 282712, 320831, 332873, 328024, 381285, 290562, 271536, 311162, 317701, 254395, 225263, 308012, 283938, 274699, 269545, 279546, 251210, 232528, 253365, 263220, 319574]
4177C19574j06586m7042M3588P0284O4416l8118P809K2412J6708j7902j1323K1013
4165C44833l2064J1733L8865O7058M25m2004J7907Q9336J2570m7299p3731m5176
4153C42453n3780l274n800M453n7766m3158J29785M4023n2696j9244M4638k7420
4141C02214k7314K746m3926P5747O3704l5851j2254Q840k925l0429L9185k7152
4129C12585J6288j4783J5491k5054M025k9609q415K0152k2512K1763K1968P6580
4117C88479m4266L1176q5147m2665j5478k8996K7782L7635j8316j1109J3627J5053
4105B67775l7875N9868R6311j6518m8752j562K9845O7465k9100q3852J2989k4507
4093B92087N6795l210M2627P053k1095L5158K1985O23K4774K0519P9734J7985
$$ y = [319574, 212988, 165946, 209534, 279818, 344234, 306116, 313925, 336337, 353045, 335143, 323820, 344833, 312769, 324502, 363367, 430425, 430850, 388846, 406753, 496089, 508659, 461360, 387629, 342453, 288673, 285399, 279599, 284052, 226286, 183128, 312913, 356936, 304240, 284996, 329634, 302214, 274900, 277646, 233720, 309467, 373171, 337320, 325066, 333906, 330981, 300552, 339737, 312585, 328873, 314090, 329581, 304527, 308552, 278943, 270528, 290680, 268168, 289931, 311899, 388479, 344213, 375389, 290242, 247577, 232099, 203103, 230885, 268520, 250204, 239095, 252722, 267775, 229900, 289768, 386079, 369561, 320809, 319247, 349092, 416557, 387457, 303605, 316594, 292087, 348882, 345672, 388299, 395352, 374257, 409415, 431400, 432023, 456797, 477316, 557050, 575035]
4081E75035q4769p1785k1014O2573L6670M1663N2149j4021m2L1985N3225N0914
4069G12583K2667J6254P2855P6199J24115Q2978J210J04291J83780J49387N6536
4058A602855J84966L04624L92946N47226Q58083J437794K394963K770178J846960
4049A2340595N96694o68463j599003j916487j682369j460546j082572p59040n36292
4040C232517k25087j90020j34600j44153k03495j28654k29268p2326n6953k1753
4030A826208j04482m3783L0229p7896n5340p6727j87186j26598q8389j15146r9731
4019H81159j0766m1002q2442J2840m9661k9539j4435K3436M5039k0536r3494q741
4007F11858l0793M961l9364m6119O517J8791j4915j0723P160K212R524N3217N783
$$ y = [575035, 490266, 418481, 397467, 460040, 496710, 538373, 590522, 576501, 576459, 608444, 661669, 712583, 735250, 751504, 824359, 900558, 1024673, 1107651, 1108861, 1213152, 1396932, 1546319, 1602855, 1787821, 2092445, 2485391, 3032617, 3890700, 5328494, 7723457, 10493635, 12340595, 12937289, 12268826, 10669823, 8753336, 7070967, 5610421, 4527849, 3768809, 3232517, 3007430, 2817410, 2682810, 2538657, 2335162, 2206508, 1977240, 1904914, 1847961, 1826208, 1721726, 1677943, 1708172, 1630276, 1574936, 1498209, 1311023, 1184425, 1096036, 980890, 881159, 870393, 829391, 746949, 759789, 710128, 680589, 666154, 689590, 734629, 714093, 620599, 611858, 581065, 586026, 546662, 500543, 507060, 525851, 510936, 500213, 507373, 509585, 519109, 572326, 578109]
3994E78109J3299m9546m4315n6715J3427k3949l4157M760j8200J2037m4073m1008
3982C09669o3284R0659J6508l4812J9645n926O3160l2484o81K4026r60j5282K2060
3969C92298k8137q3430O0100m683j9214Q286K2154K2317m3958J5794m7822j1637
3957B82068m5908L563L6716m1307P345O6632k771P466j0809m5239k9474o2432
3945A65850O1769L1649J7688j1434M3825M0022n0596j01097M802K3258k1754j0052
3933A93930P98n178l1989N5250L1011Q82M096M4729k6675m4186p0859O4498K2359
3920B38666j5563Q1944k5111L7844K1630L992m3668j1243J6668q7142j09083L0598
3908A39532M2454L109N2530K1627n1727j04687l5338J00672P2244m9632p2324
$$ y = [578109, 591408, 541862, 497547, 440832, 454259, 430310, 396153, 400913, 382713, 394750, 350677, 309669, 246385, 337044, 353552, 318740, 338385, 332459, 395619, 363135, 362454, 386480, 385520, 370238, 392298, 364161, 280731, 340831, 336148, 316934, 325220, 347374, 369691, 325733, 341527, 293705, 282068, 236160, 239723, 276439, 235132, 242477, 309109, 306338, 313804, 302995, 257756, 228282, 165850, 227619, 259268, 276956, 265522, 309347, 349369, 298773, 197676, 202478, 225736, 203982, 193930, 194728, 189550, 157561, 212811, 243822, 244704, 248800, 293529, 266854, 222668, 151809, 216307, 238666, 223103, 305047, 279936, 317780, 339410, 343402, 299734, 288491, 305159, 218017, 108934, 139532, 181986, 185095, 237625, 259252, 207525, 102838, 67500, 168172, 240416, 190784, 118460]
3897A18460O9047L197l9513M7622J713N3983l3091l4462K7919o263n2129K7584
3885A84067O8655j4540p1432n4057k983L3019K7544O7992m2582l119Q69N9887
3873B53320n689L8212p72l4192p9475m1120N6138N97O884l9894J929n474K3963
3860A74427J1655n7354M1922k3255K0383Q1757l1455m8965K615L6750N912n0782
3848A63610o8912N538k1499O9581l2950K1256j2865M2310l7054l6750L437M9647
3836A45349M1206k3753l2426J8072L5800p7158k0990J21886j0664j1007k0971
3825A65344L5512M6256k4274m3723L7197k952l3973R816q7517L9246l4206j6129
3813I0597P5835K8620j8413o0973M9736j034j3253L9115k5757k6743j7477K1089
$$ y = [118460, 187507, 190704, 151191, 198813, 200526, 254509, 221418, 186956, 214875, 208612, 156483, 184067, 252722, 238182, 166750, 112693, 109710, 142729, 170273, 238265, 195683, 192564, 193433, 253320, 247631, 285843, 285071, 250879, 171404, 130284, 186422, 187019, 193903, 154009, 155938, 150464, 174427, 186082, 128728, 170650, 147395, 167778, 249535, 218080, 169115, 171730, 208480, 214392, 163610, 94698, 100236, 78737, 148318, 115368, 136624, 123759, 166069, 129015, 92265, 95702, 145349, 186555, 162802, 130376, 148448, 184248, 107090, 86100, 207986, 197322, 186315, 165344, 200856, 247112, 222838, 179115, 216312, 213360, 179387, 189203, 101686, 140932, 106726, 90597, 166432, 195052, 176639, 115666, 165402, 164368, 151115, 190230, 164473, 137730, 120253, 141342]
3801A41342m295K7456L7448m0652J7082j10785N2698O0831N550L5973m0208j9396
3789A63044M1496j013k4953j1050k5640P852O54K463J0045K8050l7119r542n561
3776A38726K3585J3692j2370M3174O5503n9453j5868L6121j9259m3419o3459m89
3764A06484L4377m444R033J1104M4899j232J1153J2538L5949m6356m313l2040
3752A77152o1213K742L6690l5229l4912o664O1133M5452K546N889m899o1344J5510
3739A42853N5717J240k3292m4537O2196n3101M4394J1286p9302J8209n512P7841
3727B07992k5809K6521J3609j8777R215J4138k0453o5078o6052N547M9868J9744
3715A50465L1042l2338M5597O8210j5090p1576M5157j9851M74L3975j2091Q262
$$ y = [141342, 137047, 164503, 201951, 161299, 178381, 67596, 120294, 181125, 186675, 222648, 182440, 163044, 204540, 203527, 178574, 167524, 141884, 149736, 150390, 152853, 162898, 190948, 153829, 144287, 138726, 162311, 176003, 163633, 206807, 272310, 212857, 196989, 233110, 213851, 170432, 106973, 106484, 140861, 136417, 145450, 156554, 201453, 200221, 211374, 223912, 259861, 213505, 209192, 177152, 115939, 118681, 155371, 120142, 85230, 78566, 139699, 185151, 187697, 193586, 188687, 127343, 142853, 198570, 199810, 176518, 131981, 194177, 141076, 185470, 196756, 117454, 135663, 130151, 207992, 182183, 208704, 222313, 203536, 212751, 226889, 206436, 141358, 75306, 80853, 130721, 150465, 181507, 149169, 194766, 262976, 247886, 176310, 221467, 201616, 202090, 236065, 223974, 232236]
3703B32236K529n7215o4727l0697M8442L3326K80K9558l591p728k0007L9921m1142
3690A61185O395m6819Q668j4669J7052P075m2803Q3032r6460k4888L1244M2225
3678A31237J7017L752O882J405k2105p80q534r202J7008L219m882K1939J5781
3665A72737q864j766q4K3562n7629m0695J3335j0732l014R047M0995N6624j0988
3652A82528q0486l5019K7888j6107L7191P410O401L0701K4048m6454k148k9481
3640A06472L7775r061m8111l685O2899M4914J2404J3722n6228K4227l2293L8084
3628A91119l5101j0048J9742K0857L7512n0693p1785Q139M189j9684r181M565
3616H9631j5981j6965j0143J1957K3515P3026n025q671K6357k5138j511l6485
$$ y = [232236, 234765, 177550, 112823, 82126, 130568, 163894, 164174, 193732, 190141, 182413, 162406, 202327, 161185, 167580, 120761, 129429, 114760, 131812, 138887, 96084, 179116, 82656, 57768, 89012, 131237, 148254, 152006, 158888, 160293, 138188, 137408, 128874, 119672, 136680, 139899, 135017, 156956, 172737, 163873, 162107, 162023, 185585, 127956, 87261, 100596, 89864, 86850, 95897, 136892, 193516, 182528, 102042, 67023, 94911, 78804, 115995, 123405, 129806, 160507, 184555, 138101, 135953, 106472, 144247, 135186, 87075, 83390, 146289, 191203, 203607, 217329, 161101, 185328, 153035, 191119, 156018, 145970, 165712, 186569, 224081, 173388, 101603, 109742, 113931, 94247, 85066, 89631, 73650, 56685, 46542, 58499, 82014, 155040, 150015, 141344, 167701, 142563, 141052, 104567]
3604A04567N4114r981o2272l6374k8560M5969J7773M3793j9850K9140Q105J9342
3592A65766n1033K1785j084p8098r664M4032O7678p3416J8777N0090N1829l15
3580B06347j0633j699k6559j949j6583k9162O6927k4581k6125m6546J0984R111
3568A09532l4118N9316M3361J220n9798m436L9377L7186l097J0459L807O41n4456
3555A48994J3591M7513L7991j9072m2549k0957J7637l9633o6117Q3626p132k2251
3543A31641N5179k9877j9337k3469j1760J7321N3553J0163n4100r867L3924N9074
3531B12445R71n4621l1444J8123M5082L396L6248k0873k0493M5232l9131l4671
3519A60264K6294m4544j4303l259k6455J6122J4047L2883j4864k4343N6988O7199
$$ y = [104567, 158681, 148700, 86428, 50054, 21494, 67463, 85236, 129029, 109179, 138319, 146424, 165766, 114733, 136518, 135434, 57336, 47672, 91704, 159382, 85966, 104743, 154833, 206662, 206347, 195714, 194015, 167456, 165507, 148924, 119762, 186689, 162108, 135983, 89437, 100421, 109532, 75414, 134730, 178091, 179311, 119513, 115077, 154454, 191640, 188543, 199002, 202809, 203450, 148994, 162585, 210098, 248089, 229017, 186468, 165511, 183148, 143515, 77398, 161024, 153892, 131641, 186820, 156943, 137606, 114137, 102377, 119698, 173251, 183414, 129314, 119447, 153371, 212445, 213416, 158795, 127351, 145474, 190556, 193952, 230200, 209327, 188834, 234066, 194935, 160264, 186558, 142014, 127711, 124452, 97997, 114119, 128166, 161049, 146185, 121842, 178830, 246029]
3507B46029n4297j9599J0418P748J1878k3402M0436L106K0150m9557q6109K0106
3495A26907M2479N4417J4309j6394m8288r22M6097m8496n1567J6820K3005K4419
3483A82786p512R3287l3121j0606K8450m598O599r4796j4907j828j8721M2215
3471A67248l7944l6923K875M6709L4658K2972k542l6701o057K8068j7019j782
3459A63562l0684k5378j4790P1729J3830j1697P9858j2814J337O3114k4730l5767
3447B37570k819p8047K0379K3211M4038M3720j1914k2778k5586O8250n1915k1720
3435B22389M236P2036j7302K6466R600k3788Q256l1436K5885L6407j7981L2070
3423C46838K7404m8200Q204K9880j3793J3948N0468J4556J3411M0093n3425l083
$$ y = [246029, 191732, 172133, 182551, 190299, 202177, 178775, 219211, 222317, 242467, 192910, 106801, 126907, 169386, 223803, 238112, 221718, 173430, 172508, 218605, 170109, 118542, 135362, 158367, 182786, 175274, 268561, 235440, 224834, 253284, 248686, 255285, 160489, 145582, 143754, 125033, 167248, 129304, 92381, 95256, 141965, 176623, 199595, 197053, 160352, 154295, 182363, 165344, 163562, 132878, 107500, 92710, 164439, 178269, 166572, 246430, 233616, 234953, 298067, 273337, 237570, 234751, 156704, 177083, 200294, 244332, 288052, 276138, 253360, 227774, 296024, 244109, 222389, 226625, 298661, 281359, 307825, 317425, 293637, 301893, 270457, 296342, 332749, 314768, 346838, 374242, 326042, 334246, 364126, 350333, 364281, 414749, 429305, 442716, 482809, 429384, 426301]
3411D26301N3645N6470P0433J4597k7247K9243j3577j6253j4583l2886o9679k1919
3399D54545M2977k1263l8414o0898l0951P0435k4393l2879j6283J2431k4676n5394
3387B75237m7201p406J23053n3604l7259l6803L9040m8841K5105K4463M2494n8730
3375B39548L4467o8980J489k9291n518O5791P928q0753L2631m979o875r984J11143
3362B86617K4074k0705n3692L4348O6442R5204L3150k9165K2432m6722k9433l2906
3350C49644P9680l1996n2664m3480j0482j0554n7640J4040m8506P0059m0376j10956
3338A06769K7271Q7147J9611j05880k2503J2185l5096O829Q0025K3383M4391p8500
3326A65632k2570n1464L6823O8943L1350K5786j0030j27685P995M7082j8085j3483
$$ y = [426301, 479946, 536416, 606849, 621446, 594199, 623442, 609865, 593612, 579029, 546143, 476464, 454545, 497522, 476259, 437845, 376947, 345996, 416431, 392038, 359159, 342876, 355307, 330631, 275237, 228036, 220630, 343683, 290079, 252820, 216017, 255057, 206216, 231321, 255784, 298278, 239548, 274015, 205035, 206524, 177233, 171715, 237506, 245434, 164681, 197312, 192333, 185458, 175474, 286617, 310691, 289986, 236294, 270642, 337084, 432288, 465438, 436273, 458705, 411983, 382550, 349644, 429324, 397328, 344664, 301184, 290702, 280148, 222508, 236548, 188042, 258101, 217725, 106769, 134040, 221187, 240798, 134918, 112415, 124600, 89504, 96333, 176358, 199741, 244132, 165632, 143062, 91598, 128421, 197364, 228714, 254500, 244470, 116785, 124780, 171862, 153777, 140294]
3314A40294P6791L7504l6358q8125j1333n1324O835J487L7708L0856M9908n6149
3302A38094j6012J0716l931L5913j08071O0864N4755o3822R289j5233L6603O4917
3290B04082m9196o643K7304K5546m3747l8884L8452o1241k6604N5498p58k945
3278A20864O2815j7179J4236o334L9070k5304j8839L438K946P171n5469L3084
3266A60499j9741K0474L3171O745J3689m5442J2001j7243p0673k3166j1360k3047
3254C5907N487O5749P258L5051L5536m6702n6663M2527l3081q012Q0082o0883
3242A02256k5092L2481O4236J9995K610M821J5963K4594j10707K2306j5259k2053
3230A16151k8449L676O681P219M0285q4055J6062O7774j8302l4168m580k6637
$$ y = [140294, 217085, 254589, 218231, 130106, 118773, 67449, 74284, 75771, 113479, 144335, 194243, 138094, 122082, 132798, 128867, 164780, 56709, 117573, 172328, 108506, 117795, 102562, 139165, 204082, 154886, 148243, 175547, 201093, 157346, 118462, 156914, 95673, 69069, 124567, 123809, 120864, 183679, 166500, 180736, 174402, 213472, 188168, 169329, 172767, 175713, 182884, 127415, 160499, 140758, 161232, 194403, 201148, 214837, 169395, 181396, 164153, 93480, 70314, 58954, 35907, 41394, 107143, 114401, 149452, 184988, 138286, 81623, 124150, 91069, 83057, 163139, 102256, 77164, 109645, 173881, 193876, 196486, 201307, 217270, 241864, 131157, 153463, 138204, 116151, 87702, 91378, 98059, 105278, 145563, 61508, 77570, 145344, 127042, 92874, 88294, 61657]
3218F1657J2993o3882k110M5416L3947P1327J2289k5230m37o6146n3847N5170
3206H1147K7037m7535J256L4773L2442l0073K887L6102L0237K4803j8621m0010
3194A34445o4938k1005l483J9428L8645K4760k4588J0764l4058K3415k5444M9604
3182A27545k1368M553l8368l3394N9687k6845k5249Q568q80n0219K7888l0671
3170A247L3144L7725J9214J5607K0161J745q2216l6344J6639n3581J8061K3046
3158A4448K5246K2515J6812K6105K6471j942m8588k3721j3336O0325J6404K4177
3146A44916j9099p8995M0072J1205j8387K0275J3178K3747n1498N7718o1135J8618
3134A00615j0997P2305k6466l0449j638K9643L6204n0935m735N072Q3707k805
$$ y = [61657, 74650, 10768, 8658, 54074, 88021, 159348, 171637, 146407, 145970, 79824, 25977, 81147, 108184, 60649, 61905, 96678, 129120, 99047, 101934, 138036, 168273, 193076, 174455, 134445, 69507, 48502, 45019, 64447, 103092, 127852, 103264, 114028, 79970, 103385, 77941, 127545, 106177, 110730, 72362, 38968, 98655, 71810, 46561, 55129, 54249, 4030, 31918, 1247, 34391, 72116, 91330, 106937, 127098, 128843, 46627, 10283, 26922, -26659, -8598, 14448, 39694, 62209, 79021, 105126, 131597, 129655, 81067, 57346, 44010, 104335, 120739, 144916, 125817, 46822, 86894, 98099, 79712, 99987, 113165, 136912, 85414, 143132, 81997, 100615, 89618, 161923, 135457, 105008, 103370, 133013, 169217, 118282, 113547, 118619, 202326, 199521]
3122A99521p3301K0310M7196l0582m6856l0044l2101K8334M3715k4672P732M8547
3110A57799R43k4867J2913J5947j4055K5744J780J6893n8336M6223J4752n1772
3098A43964N2290k9571p1805p545N8317O4055K1473k1752L9333M2314n7723k8474
3086B04876n718q218O5648p4416J1608J934J0995M5196J5017l4342n6433m6891
3074A29256J05120K8213K5922k9127p8441j3841O3166l457J0962N7830n8446q7597
3062A49560k3068k0195M3284k163m3598N870M7223J9403m8278K3014M6954k900
3050A95106J5735k4708N869M652n6351K8042K6549O034m3522l9842M0179j6188
3038A41555K386L0486l3210o2019L706M6878J08514M4661o4659m3463k1468l5898
$$ y = [199521, 126220, 146530, 193726, 163144, 116288, 86244, 54143, 82477, 126192, 101520, 109252, 157799, 158742, 133875, 146788, 162735, 148680, 174424, 176204, 193097, 134761, 180984, 195736, 143964, 196254, 166683, 94878, 87333, 145650, 209705, 231178, 209426, 248759, 291073, 233350, 204876, 199158, 190940, 256588, 182172, 193780, 195714, 206709, 251905, 266922, 232580, 176147, 129256, 234376, 262589, 288511, 259384, 180943, 167102, 230268, 226811, 237773, 295603, 237157, 149560, 126492, 106297, 149581, 147418, 103820, 109690, 156913, 176316, 128038, 151052, 198006, 195106, 210841, 186133, 192002, 196654, 140303, 168345, 194894, 200928, 157406, 117564, 157743, 141555, 143941, 174427, 141217, 79198, 82904, 129782, 238296, 282957, 218298, 174835, 153367, 117469]
3026A17469J0800J9232p187q1184M2360N7668K3412j1541j9255j9510l8634Q250
3014A01880k4121j6446R1255Q359m7092J1801n043l8919l112N20k3760N7550J1869
3001A24741K1940R879k5394m0882j6703k0236k840M6811j4457o600J0879p7785
2989I353P5135K6248p84P697o3694K9380L7275R064m6710n1891K816k6369P1531
2976G9051m929n5739J6883O0592J5696j7709l4745l4836L540K4644n2226k1076
2964b0854L8500j3448J2164O0608j4913j8795J0034l2757o982L6206P7483j3008
2952A14238m0738k8594j1735O4920l7059J3467L0238m9349j7930k0470L6615j1400
2940D2203j3283L471J7004o892q2344O7533N9505n0148R243K9581j3914J7162
$$ y = [117469, 128269, 147501, 140314, 59130, 101490, 159158, 182570, 171029, 151774, 132264, 93630, 101880, 77759, 61313, 152568, 160927, 113835, 125636, 120593, 81674, 78562, 79082, 55322, 112872, 124741, 146681, 156560, 131166, 90284, 73581, 53345, 50505, 97316, 82859, 76259, 87138, 9353, 84488, 110736, 109952, 117649, 53955, 83335, 120610, 129674, 82964, 31073, 33889, 7520, 79051, 74122, 18383, 35266, 95858, 111554, 93845, 59100, 24264, 27804, 52448, 222, -20854, 17646, 4198, 16362, 76970, 62057, 43262, 53296, 20539, 13557, 49763, 127246, 114238, 73500, 44906, 33171, 98091, 61032, 74499, 104737, 55388, 37458, 16988, 53603, 42203, 28920, 32391, 49395, 42503, -39841, 27692, 87197, 37049, 46292, 75873, 61959, 79121]
2928G9121o2008L0525q8759M2485J1374J0889k4660J0132K4529k3035l5237N070
2916a9574K3678J5119l4715r133P6774k5365J4050j2358l7862K4124r658O7482
2904G2562N9280q5103l1757l1049N3815k1546M6125m380o6514j6372M7813K973
2892B5847q254n629Q745K0872K8856k5611j5479l8423k627q2035K8529P7035O3577
2879G5403j9504l2231J419m7361k7515M283K7984K4304p546l6563M221J2493K1808
2866A195l0526L8494L3071K2198k6145L6213l8960n0826P543K4237R296n4435
2854b8645k3628L4483k813K4762O0608j8144R0043r007o4610o4332n7582L9663
2842a9202O4766L0812m7840k0789M4813j4034N843k1255J357K2704k101L3492
$$ y = [79121, 17113, 47638, -41121, 1364, 12738, 23627, -1033, 9099, 33628, 10593, -24644, -19574, 4104, 19223, -15492, -24625, 52149, 26784, 40834, 28476, -9386, 14738, 5080, 72562, 131842, 46739, 14982, -16067, 37748, 16202, 62327, 57947, -8567, -24939, 22874, 25847, 17593, 11964, 20709, 41581, 70437, 44826, 29347, -9076, -11703, -93738, -65209, 11826, 75403, 55899, 23668, 25087, -22274, -49789, -45506, -17522, 6782, -764, -37327, -33106, -20613, 1195, -29331, 9163, 42234, 64432, 38287, 74500, 35540, -15286, -7743, 16494, 25790, -28645, -52273, -17790, -20603, 4159, 64767, 46623, 136666, 127659, 63049, -1283, -58865, -19202, 45564, 76376, 28536, 7747, 52560, 38526, 44369, 23114, 24471, 47175, 45074, 78566]
2830G8566r184l2597O6098L572n1293L3955j3792j4380n6859p134K7960N8815
2818H3727m1679l4277K0786q1167K4259P3879L4428j0696l3822k3321J9714p794
2806B4037m5403O0425p8448k2278O8917n4430L9819K9764k160l2214l753j7560
2794c3284Q8084O0125n0479j1717l0924o9404K0412l638N4834L0048J8652m662
2782F8047K8914j2177j4648m0467j01373p150K0870L3476P469P347K3344l0965
2770a7313M8662J39811l0321m3792m3343k5542L8360P360l0187l4091L9742k7078
2758B2268J8323K0951l2900L0206o5897J588m8505M3969M9426R283N7271n7750
2746D8233O160k6773M6035J1947n6968L8269m9755M488L9400o587J440n6049j7637
$$ y = [78566, 69382, 36785, 102883, 106455, 55162, 89117, 75325, 60945, 4086, -3048, 24912, 83727, 42048, 7771, 28557, -52610, -28351, 45528, 79956, 69260, 35438, 12117, 31831, 24037, -21366, 39059, -39389, -61667, 7250, -47180, -7361, 22403, 20243, -11971, -15724, -33284, 54800, 114925, 64446, 52729, 21805, -47599, -27187, -30825, 24009, 54057, 72709, 68047, 96961, 84784, 70136, 29669, -71704, -78854, -57984, -24508, -17039, -9692, 13652, -17313, 31349, 171160, 140839, 97047, 53704, 28162, 66522, 73882, 43695, 9604, 49346, 22268, 40591, 61542, 28642, 58848, -7049, -5461, -53966, -9997, 39429, 48712, 105983, 48233, 54393, 27620, 73655, 85602, 28634, 66903, 17148, 21636, 61036, 54449, 55889, -160, -17797]
2733a7797l957k7733J6755L6000M0455L811j9288l8441J11158J3177p2949k9550
2721A1641o019l3227M9755K9274j380n9814J16R796O9520j0173o2462j5024L2435
2708A4438M1158k8038n0037J8503m3861L1533M2100k6645Q1849R919p1638m2116
2696b2835J2434O286L7355l0365L0664m5580k9973N503K8650N2076L5919l4135
2684D5999k8239J6548K3051p3473l8510N4973R999k2741l6368L1454j2227J6633
2672a2901k927N8097L0072o0923K5753l5898j0101O6058m5021J1302o1305N85
2660c7209O1782Q1475K8003r555o8568p0589j6648M7082o019l3642o661m1486
2648g2035N8904M9446K1017o9400N3294K0934r3180M897K4786n66M556J5166K3496
$$ y = [-17797, -21754, -49487, -32732, 3268, 43723, 47534, 28246, -10195, 100963, 114140, 41191, 11641, 5622, -27605, 22150, 51424, 50044, -9770, -9654, 142, 69662, 59489, -2973, -17997, 14438, 55596, 27558, -22479, -3976, -47837, -16304, 25796, -849, 81000, 90919, 19281, -22835, -10401, -4115, 33240, 2875, 33539, -12041, -42014, -36511, -7861, 44215, 80134, 45999, 17760, 34308, 57359, -16114, -54624, 349, 10348, -12393, -48761, -17307, -29534, -12901, -15828, 42269, 72341, 11418, 37171, 1273, -8828, 57230, 12209, 23511, -37794, -37209, 24573, 106048, 134051, 124496, 55928, -14661, -31309, 15773, 9754, -23888, -30549, -72035, -13131, 36315, 57332, -12068, 41226, 62160, -31020, -26123, -1337, -1903, 2653, 17819, 41315]
2635D1315J0534l0141l852N2634l7707j5669l1242L1451Q201J1773L1978k1245
2623D8030o0652j5262k4197q943n1780P4981K0466K5146K3172k4997M8172l2718
2611B1418k2672m224L3571M5952o0788l0750P533N0323J7377j23365l0007Q2556
2599a3076R9717K6535j5834p3802j08200j3124K8388M6607O4768l3176m4897L2761
2587c333K9922k288p7746L3890O522k057K3980j3098k805L1164m4427J8154N7277
2574E5155o932p4964K9237K4919j1753k3065K4462O7987q0424l2491K7711j8048
2562a8206J2870n694n5300J9813J5640j9273n0714P5857N8738M6545o2915L1173
2550D8534k1587o3879j8960N4444P4323k0485J1099n2958k1n1377J707L0517n310
$$ y = [41315, 51849, 21708, 17856, 70490, 32783, 17114, -14128, 17323, 25524, 37297, 69275, 48030, -12622, -27884, -52081, -61024, -112804, -37823, -17357, 7789, 30961, 5964, 54136, 21418, -1254, -5478, 28093, 74045, 13257, -17493, -9960, 40363, 57740, -65625, -95632, -13076, 86641, 113176, 97342, 23540, -84660, -97784, -69396, -22789, 41979, 8803, -36094, -3333, 26589, 24301, -53445, -19555, -13033, -15090, 8890, -4208, -7013, 24151, -20276, -2122, 55155, 48223, -26741, 2496, 27415, 15662, -7403, 17059, 85046, 4622, -27869, -158, -18206, -5336, -11030, -66330, -46517, -30877, -50150, -100864, -25007, 33731, 80276, 17361, 48534, 26947, -36932, -55892, -1448, 72875, 52390, 63489, 10531, 10510, -40867, -39160, -8643, -13953]
2537a3953L1017o362J7223j9514k3213n1574O1827j1327l3462J3388k0930j1752
2525f8632K7266M8919J7308n979n6824J7889K7741j6674k898n7455M2686Q945
2513a7708k7472M5758O9648j0500n2393N0515K4258k7081j7405k9818o718j7177
2501a6093j0712k0103M6882Q826o4495R2409J4332J2070L307m7690m8332J6206
2489a3393K9969m924J0115m7218K1015L3230J9150j927j6832K2046P621l6066
2477B2786m1826L3235J1884m1975K6239k1112J2887K7851m6260K1975J8994L5623
2465F0301L8618N269j21896q630M0054L7096m7003m1627Q4597l2783q506k4184
2453a8694M2881j8311m5068K4692L0621p161N2555R965j3824o0959p8809j9173
$$ y = [-13953, 17064, 10702, 27925, 8411, -14802, -66376, -4549, -15876, -49338, -35950, -56880, -68632, -41366, 7553, 24861, 18882, -37942, -20053, 7688, -8986, -11884, -69339, -26653, -17708, -45180, 578, 70226, 59726, 7333, 57848, 82106, 55025, 37620, 7802, 1084, -16093, -26805, -46908, -26, 8800, -55695, 36714, 51046, 63116, 66423, 18733, -29599, -13393, 16576, 11652, 21767, -25451, -4436, 28794, 47944, 46017, 29185, 51231, 58852, 22786, -19040, 14195, 26079, -15896, 10343, -10769, 2118, 29969, -16291, 5684, 24678, 60301, 98919, 104188, -17708, -26338, 13716, 50812, 3809, -37818, 46779, 13996, 5490, -18694, 24187, 5876, -39192, -14500, 16121, 8960, 61515, 71480, 57656, -3303, -82112, -101285]
2441a01285O7363M4578j5293M1335j8936m5137k9333l503K2885R4460j3629l2737
2429A0768L7941l6414j0445j7465N5689m7595k4814n5026L6178Q5229J178K7750
2417F2974J90K3459l8535L4634m0892p4515n3617N4385k6270M4907l164n9948
2405g6392L6140j1522q848Q233K4835L9520R470O3010j4178m2717j1593J3642
2393B9600M2723l5819N1113k3227R844j3386l9532K4256m4883o1782O6930j441
2381D396m6016J5461k4666K9235O3379N63j7825J8059j0841o9992j524n326l6791
2368h1888N7457q055P032q061n2814K7000O4621M9843L50n5723J8475M3745Q676
2355G0658m3760J1419l0997l323l4818N6390k5104n62L219J2976l2050r974q778
$$ y = [-101285, -33922, 10656, -4637, 36698, 17762, -27375, -56708, -60211, -37326, 57134, 43505, 10768, 48709, 12295, 1850, -15615, 40074, -7521, -32335, -87361, -51183, 34046, 35224, 62974, 63164, 86623, 48088, 82722, 41830, -32685, -86302, -31917, -58187, -13280, -16444, -76392, -40252, -51774, -60622, -52389, -27554, 11966, 21436, 84446, 70268, 27551, 15958, 29600, 72323, 36504, 87617, 64390, 74234, 60848, 21316, 45572, 689, -61093, 5837, 4396, -41620, -26159, -50825, -21590, 41789, 42352, 24527, 42586, 31745, -38247, -39771, -45097, -81888, -24431, -32486, -25454, -33515, -86329, -59329, 5292, 55135, 55485, -238, 18237, 61982, 70658, 26898, 38317, 7320, 3997, -30821, 25569, 465, -97, 3122, 16098, -15952, -25926, -34704]
2342c4704L2382k3002j36j1018Q953M5214K794P155k6548J3611k3720l696n394
2329a8109N994m8130O7191q55P159k1110R131L0284p1974k0404L9463L1929Q946
2316A9515m3201M1130M0032M0025p933q4123o7688Q0011L8780J6181o684K2469
2304H8514P1205M2541J035K4960l6122l9905l3511j8609J8298q7284l6048k6577
2292c1503M8343J9660k9342K8279k0315M3646K9930Q23q4331o4668J9872N5463
2280A5857M9837N093k5150j3353n684j3901K5248j2200J0713l7974m3729M1031
2268d212M0266K2384j3172n1834n2756M3122N6118o190j5966j4131k7985k9459
2256e3815Q0592k003m6524J4725J4199P422j3977q730k659L7151J7357p725L0889
$$ y = [-34704, -2322, -25324, -25460, -36478, -27525, 17689, 20483, 27638, 1090, 14701, -9019, -12715, -18109, -12115, -60245, 6946, 6091, 13250, -7860, 1271, 31555, -40419, -60823, -21360, 10569, 19515, -23686, 17444, 57476, 97501, 89568, 5445, -62243, 17768, 56548, 72729, 66045, 88514, 159719, 202260, 203295, 228255, 192133, 152228, 118717, 100108, 118406, 31122, -4926, -31503, 16840, 36500, 7158, 35437, 15122, 58768, 88698, 89521, 5190, -59478, -39606, 15857, 65694, 70787, 45637, 32284, 26600, 12699, 37947, 25747, 36460, -1514, -45243, -4212, 36054, 58438, 45266, -6568, -59324, -16202, 39916, 33726, 17760, 3629, -24356, -53815, 26777, 24774, -21750, -7025, 7174, 14596, 619, -8111, -10770, 26381, 43738, 36013, 66902]
2243F6902m7345m0195k1615O485k3163m4777J9034m8398Q2133N1574K5985J646
2231B8266o3006j6231J54J2448K1235M626M1104k5158l2296p263N773J773K4156
2218d419k2652M8638J800j1640m8140m4827Q3395j869j3750j6126j8398k9987
2206g7975L5833J5322l5225q658M7345j50L8382j3454o9688P1716K7844k8259
2194C033m5005l6997Q4600K2403k3739P174J2924J6644j7777j6089L0777l735
2182C4213j075k2388J8668J3650k2268K4798o2720o1615k6370R459J8473k8394
2170a05569L3463K8883q054K9365r611l0977n969J1797Q8794p554k0052k1572
2158a7056l9534L3281K7011K7133p14j10071K2337L689J4574M4396K4340j0668
$$ y = [66902, 19557, -20638, -42253, -35768, -58931, -103708, -84674, -133072, -50939, 635, 26620, 28266, -34740, -50971, -50817, -38369, -17134, -12508, 28596, 3438, -28858, -36121, -30348, -28575, -4419, -27071, 21567, 23367, 11727, -36413, -81240, 2155, 286, -13464, -29590, -47988, -77975, -42142, -26820, -62045, -70703, -23358, -23508, 14874, 1420, -68268, 3448, 31292, 3033, -41972, -78969, 5631, 28034, 4295, 11469, 24393, 41037, 23260, 7171, 37948, 34213, 33138, 10750, 29418, 43068, 20800, 45598, -17122, -78737, -105107, -95648, -77175, -105569, -72106, -43223, -51277, -21912, -31523, -62500, -68469, -56672, 32122, 24568, 4516, -17056, -56590, -23309, 3702, 30835, 30121, -79950, -57613, -53924, -39350, 5046, 29386, 18718]
2146A8718o0226m0032K0266M7379K7971l8623K9314k6435O791m3265l7948p051
2134a03141K2368L116k639L6548K7265n0021J3267j425J0210N6686j6386N1607
2122D7455j7839q850k7500R2879l6119k2995r018K8139K537j2992K9898m0345
2110B5250K1241l9133j2604N4110L8591L9345p8781k5598R7675J286m2819q1142
2098b579j7378M2394l6636l4463N481K9479M2333l0005N92l1486K2487l1965n3937
2085i5683J67924l2122j1045k6231K4166j7783n4344J9532J108n9092n5933L2619
2073a06884L5963L0210j5373P2774J8118j9074J629K8488K1685J2224n2344l7908
2061a0492k0274n6389K9974N5699M6149m7061k6514q753k7349k218j8820L2936
$$ y = [18718, -41508, -81540, -61274, -13895, 14076, -24547, 4767, -21668, -14877, -58142, -96090, -103141, -80773, -77657, -80296, -43748, -16483, -66504, -53237, -54662, -44452, 12234, -4152, 47455, 29616, 20766, -6734, 86145, 50026, 27031, 18013, 46152, 48689, 35697, 65595, 25250, 46491, 7358, -5246, 48864, 87455, 126800, 48019, 22421, 120096, 121382, 78563, -2579, -19957, 22437, -14199, -48662, -43181, -13702, 28631, -1374, -782, -32268, -9781, -41746, -95683, 72241, 40119, 29074, 2843, 27009, 9226, -45118, -25586, -24478, -83570, -139503, -106884, -70921, -40711, -56084, 16690, 34808, 15734, 17363, 45851, 67536, 79760, 27416, -10492, -30766, -87155, -57181, -1482, 44667, -2394, -28908, -37661, -65010, -67228, -86048, -53112]
$$ [...]
##END NTUPLES=NMR SPECTRUM
##END=
