##TITLE=1H_DE-80H_X3
 200.13MHz, d2o
 8 sc
 
 19ns.26.2.2025
##JCAMPDX= 6.0         $$ Bruker NMR JCAMP-DX V2.0
##DATA TYPE= NMR SPECTRUM
##DATA CLASS= NTUPLES
##ORIGIN= UXNMR, Bruker Analytische Messtechnik GmbH
##OWNER= pz
$$ XWIN-NMR		Version 3.5
$$ Tue Dec  9 10:30:24 2025 Russian Standard Time (UT+4h)  Yarkov@DPX200
##.OBSERVE FREQUENCY= 200.1313
##.OBSERVE NUCLEUS= ^1H
##.ACQUISITION MODE= SIMULTANEOUS
##.ACQUISITION SCHEME= undefined
##.AVERAGES= 8
##.DIGITISER RES= 18
##SPECTROMETER/DATA SYSTEM= spect
##.PULSE SEQUENCE= zg30
##.SOLVENT NAME= CDCl3
##.SHIFT REFERENCE= (INTERNAL, CDCl3, 0, 15.5188)
##AUDIT TRAIL= $$ (NUMBER, WHEN, WHO, WHERE, WHAT)
$$ ##TITLE= Audit trail, XWIN-NMR		Version 3.5
$$ ##JCAMPDX= 5.01
$$ ##ORIGIN= Bruker BioSpin GmbH
$$ ##OWNER= Yarkov
$$ C:/Bruker/XWIN-NMR/data/yarkov2/nmr/H-C/1/pdata/1/auditp.txt
$$ ##AUDIT TRAIL=  $$ (NUMBER, WHEN, WHO, WHERE, WHAT)
(   1,<2025-12-09 10:29:18.89 +0400>,<Yarkov>,<DPX200>,
      <created by zg, POWCHK disabled, PULCHK disabled
       configuration hash MD5:
       00 E9 B6 7A A2 85 ED C7 34 08 36 98 17 FE 4E 26
       data hash MD5: 16K
       62 9E 47 A3 83 61 D5 0D 20 B4 E5 F5 A4 19 F5 F4>)
(   2,<2025-12-09 10:29:23.95 +0400>,<Yarkov>,<DPX200>,
      <Start of raw data processing
       efp BC_mod = 2 LB = 0.25 FT_mod = 6 PKNL = 1 PHC0 = -5312.553 PHC1 = 20.22191 SI = 16K 
       data hash MD5: 16K
       23 77 DB 69 B4 1A 74 38 9B 0F CD 4A 5C 52 6C AD>)
(   3,<2025-12-09 10:29:44.92 +0400>,<Yarkov>,<DPX200>,
      <pk PHC0 = 21.63367 PHC1 = -24.2 
       data hash MD5: 16K
       6D 20 EC 17 AF D5 00 DA CB 03 14 C0 85 BF 98 34>)
$$ ##END=
$$ 
$$ hash MD5
$$ 1C 34 27 1D 8B 0B 3A A1 05 58 DA 1B D3 90 C8 AB
##$RELAX= 
##$RELAX= 
##$RELAX= 
##$RELAX= 
##$RELAX= 
##$RELAX= 
$$ Bruker specific parameters
$$ --------------------------
##$DU= <C:/Bruker/XWIN-NMR>
##$EXPNO= 1
##$NAME= <H-C>
##$PROCNO= 1
##$TYPE= <nmr>
##$USER= <yarkov2>
##$AMP= (0..31)
100 100 100 100 100 100 100 100 100 100 100 100 100 100 100 100 100 100 
100 100 100 100 100 100 100 100 100 100 100 100 100 100 
##$AQSEQ= 0
##$AQ_mod= 1
##$AUNM= <au_zg>
##$AUTOPOS= <>
##$BF1= 200.13
##$BF2= 200.13
##$BF3= 200.13
##$BF4= 200.13
##$BF5= 200.13
##$BF6= 200.13
##$BF7= 200.13
##$BF8= 200.13
##$BYTORDA= 1
##$CFDGTYP= 0
##$CFRGTYP= 5
##$CHEMSTR= <none>
##$CNST= (0..31)
1 1 145 1 1 1 1 1 1 1 1 1 1 1 1 1 1 1 1 1 1 1 1 1 1 1 1 1 1 1 1 1 
##$CPDPRG= <>
##$CPDPRG1= <>
##$CPDPRG2= <>
##$CPDPRG3= <>
##$CPDPRG4= <mlev>
##$CPDPRG5= <mlev>
##$CPDPRG6= <mlev>
##$CPDPRG7= <mlev>
##$CPDPRG8= <mlev>
##$CPDPRGB= <>
##$CPDPRGT= <>
##$D= (0..31)
0 0.7 0 0 0 0 0 0 0 0 0 0.03 0 0 0 0 0 0 0 0 0 0 0 0 0 0 0 0 0 0 0 0 
##$DATE= 1765261758
##$DBL= (0..7)
120 120 120 120 120 120 120 120 
##$DBP= (0..7)
150 150 150 150 150 150 150 150 
##$DBP07= 0
##$DBPNAM0= <>
##$DBPNAM1= <>
##$DBPNAM2= <>
##$DBPNAM3= <>
##$DBPNAM4= <>
##$DBPNAM5= <>
##$DBPNAM6= <>
##$DBPNAM7= <>
##$DBPOAL= (0..7)
0.5 0.5 0.5 0.5 0.5 0.5 0.5 0.5 
##$DBPOFFS= (0..7)
$$ [...]
##$SUBNAM2= <"">
##$SUBNAM3= <"">
##$SUBNAM4= <"">
##$SUBNAM5= <"">
##$SUBNAM6= <"">
##$SUBNAM7= <"">
##$SUBNAM8= <"">
##$SUBNAM9= <"">
##$SW= 18.0517328524113
##$SWIBOX= (0..15)
0 0 2 0 0 0 0 0 0 0 0 0 0 0 0 0 
##$SW_h= 3612.71676300578
##$TD= 16384
##$TD0= 1
##$TE= 0
##$TE2= 300
##$TE3= 300
##$TEG= 300
##$TL= (0..7)
0 120 120 120 120 120 120 120 
##$TP= (0..7)
150 150 150 150 150 150 150 150 
##$TP07= 0
##$TPNAME0= <>
##$TPNAME1= <>
##$TPNAME2= <>
##$TPNAME3= <>
##$TPNAME4= <>
##$TPNAME5= <>
##$TPNAME6= <>
##$TPNAME7= <>
##$TPOAL= (0..7)
0.5 0.5 0.5 0.5 0.5 0.5 0.5 0.5 
##$TPOFFS= (0..7)
0 0 0 0 0 0 0 0 
##$TUNHIN= 0
##$TUNHOUT= 0
##$TUNXOUT= 0
##$USERA1= <user>
##$USERA2= <user>
##$USERA3= <user>
##$USERA4= <user>
##$USERA5= <user>
##$V9= 5
##$VALIST= <valist>
##$VCLIST= <CCCCCCCCCCCCCCC>
##$VD= 0
##$VDLIST= <DDDDDDDDDDDDDDD>
##$VPLIST= <PPPPPPPPPPPPPPP>
##$VTLIST= <TTTTTTTTTTTTTTT>
##$WBST= 1024
##$WBSW= 4
##$XGAIN= (0..3)
0 0 0 0 
##$XL= 0
##$YL= 0
##$YMAX_a= 260374
##$YMIN_a= -263824
##$ZGOPTNS= <>
##$ZL1= 120
##$ZL2= 120
##$ZL3= 120
##$ZL4= 120
##$ABSF1= 0
##$ABSF2= 0
##$ABSG= 0
##$ABSL= 0
##$ALPHA= 0
##$AQORDER= 0
##$ASSFAC= 0
##$ASSFACI= 0
##$ASSFACX= 0
##$ASSWID= 0
##$AUNMP= <proc_1d>
##$AZFE= 0.1
##$AZFW= 0.1
##$BCFW= 0
##$BC_mod= 2
##$BYTORDP= 0
##$COROFFS= 0
##$CY= -3
##$DATMOD= 1
##$DC= 0
##$DFILT= <>
##$DTYPP= 0
##$F1P= 0
##$F2P= 0
##$FCOR= 1
##$FTSIZE= 16384
##$FT_mod= 6
##$GAMMA= 0
##$GB= 0
##$INTBC= 1
##$INTSCL= 3.241238e-09
##$ISEN= 128
##$LB= 0.25
##$LEV0= 0
##$LPBIN= 0
##$MAXI= 10000
##$MC2= 0
##$MEAN= 0
##$ME_mod= 0
##$MI= 1.114404
##$NCOEF= 0
##$NC_proc= -7
##$NLEV= 6
##$NOISF1= 3.799351
##$NOISF2= 2.8
##$NSP= 0
##$NTH_PI= 0
##$NZP= 0
##$OFFSET= 15.51882
##$PC= 1
##$PHC0= -5290.919
##$PHC1= -3.97809
##$PH_mod= 1
##$PKNL= yes
##$PPARMOD= 0
##$PSCAL= 0
##$PSIGN= 0
##$REVERSE= no
##$SF= 200.130000576528
##$SI= 16384
##$SIGF1= 3
##$SIGF2= 2
##$SINO= 0.751879
##$SIOLD= 32768
##$SREGLST= <19F.Aceton>
##$SSB= 0
##$STSI= 16384
##$STSR= 0
##$SW_p= 3612.71676300578
##$SYMM= 0
##$S_DEV= 0
##$TDeff= 16384
##$TDoff= 0
##$TI= <>
##$TILT= no
##$TM1= 0
##$TM2= 0
##$TOPLEV= 0
##$USERP1= <user>
##$USERP2= <user>
##$USERP3= <user>
##$USERP4= <user>
##$USERP5= <user>
##$WDW= 1
##$XDIM= 16384
##$YMAX_p= 530305639
##$YMIN_p= -1448548
$$ End of Bruker specific parameters
$$ ---------------------------------
##NTUPLES= NMR SPECTRUM
##VAR_NAME=  FREQUENCY,     SPECTRUM/REAL,   SPECTRUM/IMAG
##SYMBOL=    X,             R,               I
##VAR_TYPE=  INDEPENDENT,   DEPENDENT,       DEPENDENT
##VAR_FORM=  AFFN,          ASDF,            ASDF
##VAR_DIM=   16384,         16384,           16384
##UNITS=     HZ,            ARBITRARY UNITS, ARBITRARY UNITS
##FACTOR=    0.220516191357247, 1,           1
##FIRST=     3105.78141731419, 0,            0
##LAST=      -506.935345691589, 0,           0
##MIN=       -506.935345691589, -1448548,    0
##MAX=       3105.78141731419, 530305639,    0
$$ Real data points
##PAGE= N=1
##DATA TABLE= (X++(R..R)), XYDATA
$$ [...]
$$ plain form
8353 -536315 -561280 -471765 -410698 -460342 -441191 -339725 -335610 -495448 -495927 -513680 -427960 -277474
8341 -277474 -384982 -351005 -461853 -363021 -438526 -549299 -521516 -543500 -550564 -556811 -467624
8330 -467624 -413829 -412024 -485548 -418519 -344583 -385810 -409265 -516950 -296190 -447223 -520565
8319 -520565 -528747 -679829 -617235 -504624 -537101 -459414 -545270 -701894 -628530 -583772 -525410
8308 -525410 -574879 -567912 -443086 -347534 -376547 -489707 -558659 -465871 -511980 -529961 -471157
8297 -471157 -428719 -461602 -502034 -512850 -533663 -529801 -418654 -454701 -430786 -474835 -608439
8286 -608439 -567850 -515905 -559140 -597256 -515297 -554004 -603049 -648669 -599426 -539727 -554136 -611285
8274 -611285 -569787 -664225 -441186 -501970 -551045 -522669 -510442 -491362 -419820 -265423 -298465
$$ packed form
8353e36315k4965Q9515O1067m9644J9151J01466M115j59838m79j7753Q5720J50486
8341b77474j07508L3977j10848R8832p5505j10773K7783k1984p064o247Q9187
8330d67624N3795J805p3524O7029P3936m1227k3455j07685K20760j51033p3342
8319e20565q182j51082O2594J12611l2477P7687q5856j56624P3364M4758N8362
8308e25410m9469O967J24826R5552k9013j13160o8952R2788m6109j7981N8804
8297d71157M2438l2883m0432j0816k0813L862J11147l6047K3915m4049j33604
8286f08439M0589N1945m3235l8116Q1959l8707m9045m5620M9243N9699j4409n7149
8274f11285M1498r4438K23039o0784m9075K8376J2227J9080P1542J54397l3042
$$ plain form
8263 -298465 -478314 -625786 -587586 -558421 -536078 -581271 -603979 -584803 -497032 -477554 -443754
8252 -443754 -575794 -712332 -631361 -526511 -544135 -474852 -451601 -448954 -659767 -645687 -666789
8241 -666789 -701353 -749104 -779481 -720144 -633429 -362928 -371736 -479761 -518724 -650242 -552890
8230 -552890 -567410 -551460 -632094 -593186 -534138 -578204 -569531 -484629 -489041 -513319 -474979 -512300
8218 -512300 -542499 -507879 -516241 -588448 -676317 -686287 -568563 -564913 -639081 -711369 -661747 -555110
8206 -555110 -320591 -381311 -351533 -355683 -505868 -492280 -470629 -658634 -618547 -596286 -518746
8195 -518746 -789728 -770544 -1146932 -1448548 -512616 -491679 -577337 -540890 -472521 -338255 -465967
8184 -465967 -508220 -494934 -602212 -572766 -539518 -531512 -614699 -514203 -477981 -470872 -397252 -597959
$$ packed form
8263b98465j79849j47472L8200K9165K2343m5193k2708J9176Q7771J9478L3800
8252d43754j32040j36538Q0971J04850j7624O9283K3251K647k10813J4080k1102
8241f66789l4564m7751l0377N9337Q6715K70501q808j08025l8963j31518R7352
8230e52890j4520J5950q0634L8908N9048m4066Q673Q4902m412k4278L8340l7321
8218e12300l0199L4620q362p2207q7869r970J17724L650p4168p2288M9622J06637
8206e55110K34519o0720K9778m150j50185J3588K1651j88005M0087K2261P7540
8195e18746k70982J9184l76388l01616R35932K0937q5658L6447O8369J34266j27712
8184d65967m2253J3286j07278K9446L3248Q006q3187J00496L6222P109P3620k00707
$$ plain form
8172 -597959 -600497 -447425 -384086 -368245 -575168 -556239 -522448 -485738 -370997 -588000 -687680
8161 -687680 -626533 -408444 -455569 -488047 -463324 -369612 -400988 -447023 -320728 -357160 -384276
8150 -384276 -465296 -574691 -460028 -486273 -494923 -580571 -663138 -622310 -718126 -670886 -617143
8139 -617143 -671893 -617545 -603173 -613136 -663343 -562814 -599624 -560879 -521866 -605533 -667823 -742395
8127 -742395 -657582 -628429 -602842 -593668 -482782 -413208 -374226 -501980 -536234 -630489 -679559
8116 -679559 -514045 -517030 -509936 -411377 -377274 -463721 -627659 -563132 -593849 -556400 -490240 -439956
8104 -439956 -450069 -412807 -401762 -462249 -637669 -648922 -574214 -614840 -502694 -638153 -635117
8093 -635117 -629299 -573062 -518572 -520477 -522498 -624836 -592095 -529925 -550055 -527480 -394297 -407960
$$ packed form
8172e97959k538J53072O3339J5841k06923J8929L3791L6710J14741k17003r9680
8161f87680O1147K18089m7125l2478K4723R3712l1376m6035J26295l6432k7116
8150c84276q1020j09395J14663k6245q650q5648q2567M0828r5816M7240N3743
8139f17143n4750N4348J4372r963n0207J00529l6810L8745L9013q3667o2290p4572
8127g42395Q4813K9153K5587R174J10886O9574L8982j27754l4254r4255m9070
8116f79559J65514k985P094R8559L4103q6447j63938O4527l0717L7449O6160N0284
8104d39956j0113L7262J1045o0487j75420j1253P4708m0626J12146j35459L036
8093f35117N818N6237N4490j905k021j02338L2741O2170k0130K2575J33183j3663
$$ plain form
8081 -407960 -481156 -496936 -592423 -681620 -717360 -667370 -618610 -553924 -518669 -535983 -563178 -524819
8069 -524819 -601246 -632801 -584001 -567770 -528570 -536158 -606628 -552794 -496288 -529907 -498153 -466172
8057 -466172 -537404 -499300 -465759 -447770 -322861 -393579 -474089 -636881 -594691 -613919 -653565
8046 -653565 -524881 -561316 -614976 -601987 -544118 -604372 -507425 -464073 -562869 -612237 -551308
8035 -551308 -473173 -520829 -629394 -551640 -659109 -693852 -705098 -714011 -654132 -699389 -706725 -597163
8023 -597163 -598791 -595868 -601050 -645800 -647378 -727366 -642790 -625314 -601650 -571624 -557220 -487560
8011 -487560 -399745 -455978 -566150 -570498 -686503 -546943 -462340 -373881 -315855 -419838 -396953
8000 -396953 -533073 -572351 -652856 -626191 -530328 -459164 -609020 -665205 -729433 -632340 -544546
$$ packed form
8081d07960p3196j5780r5487q9197l5740M9990M8760O4686L5255j7314k7195L8359
8069e24819p6427l1555M8800J6231L9200p588p0470N3834N6506l3619L1754L1981
8057d66172p1232L8104L3541J7989J24909p0718q0510j62792M2190j9228l9646
8046f53565J28684l6435n3660J2989N7869o0254R6947M3352r8796m9368O0929
8035e51308P8135m7656j08565P7754j07469l4743j1246q913N9879m5257p336J09562
8023e97163j628K923n182m4750j578p9988Q4576J7476K3664L0026J4404O9660
8011d87560Q7815n6233j10172m348j16005J39560Q4603Q8459N8026j03983K2885
8000c96953j36120l9278q0505K6665R5863P1164j49856n6185o4228R7093Q7794
$$ plain form
7989 -544546 -634492 -598212 -493146 -476767 -513376 -404929 -461167 -609919 -681940 -569415 -635822
7978 -635822 -605510 -647163 -687888 -589055 -505849 -475713 -380723 -397399 -498342 -471261 -545006
7967 -545006 -502024 -418142 -418405 -462599 -444486 -489297 -419640 -323589 -316636 -190835 175000 645178
7955 645178 1297753 1554363 1488663 1098849 722415 537496 324822 131934 1815 -106943
7945 -106943 -147338 -8129 -131302 -177487 -298199 -381441 -393428 -285324 -265061 -360397 -308272
7934 -308272 -222702 -188439 -221593 -273025 -188306 -313676 -302157 -298810 -443639 -375690 -476098
7923 -476098 -526845 -516936 -310773 -461464 -494180 -410984 -434065 -430172 -420589 -345296 -246724 -223723
7911 -223723 -269855 -433942 -461155 -435116 -437558 -377722 -500651 -579139 -565000 -664996 -568642
$$ packed form
7989e44546q9946L6280J05066J6379l6609J08447n6238j48752p2021J12525o6407
7978f35822L0312m1653m0725R8833Q3206L0136R4990j6676j00943K7081p3745
7967e45006M2982Q3882k63m4194J8113m4811O9657R6051O953J25801L65835M70178
7955F45178O52575K56610o5700l89814l76434j84919k12674j92888j30119j08758
7945a06943m0395J39209j23173m6185j20712q3242j1987J08104K0263r5336N2125
7934c08272Q5570L4263l3154n1432Q4719j25370J1519L347j44829O7949j00408
7923d76098n0747R909K06163j50691l2716Q3196k3081L893R583P5293R8572K3001
7911b23723m6132j64087k7213K6039k442N9836j22929p8488J4139r9996R6354
$$ plain form
7900 -568642 -525398 -543390 -523753 -630563 -607712 -521501 -427308 -459860 -501244 -514935 -454740
7889 -454740 -354986 -339579 -515134 -581975 -482885 -483338 -562132 -621492 -606452 -470716 -562494 -511729
7877 -511729 -529583 -498341 -466171 -531293 -569347 -583875 -366493 -512765 -527815 -397589 -418645
7866 -418645 -510438 -665958 -727284 -630228 -463794 -515201 -500415 -458060 -582484 -569745 -497818
7855 -497818 -497043 -562997 -498387 -555914 -498643 -420490 -454676 -388163 -466392 -514593 -411610 -354068
7843 -354068 -424748 -530483 -636247 -469895 -549721 -605005 -596338 -605277 -513756 -542244 -604359
7832 -604359 -627276 -612502 -589656 -477765 -366192 -392056 -382655 -509285 -434761 -434312 -373132 -438114
7820 -438114 -481861 -425117 -491692 -448751 -312807 -442914 -310743 -331642 -472566 -706376 -711164
$$ packed form
7900e68642M3244j7992J9637j06810K2851Q6211R4193l2552m1384j3691O0195
7889d54740R9754J5407j75555o6841R9090m53p8794n9360J5040J35736r1778N0765
7877e11729j7854L1242L2170o5122l8054j4528K17382j46272j5050J30226k1056
7866d18645r1793j55520o1326R7056J66434n1407J4786M2355j24424J2739P1927
7855d97818P75o5954O4610n7527N7271P8153l4186O6513p8229m8201J02983N7542
7843c54068p0680j05735j05764J66352p9826n5284Q667q939R1521k8488o2115
7832f04359k2917J4774K2846J11891J11573k5864R401j26630P4524M49O1180o4982
7820d38114m3747N6744o6575M2941J35944j30107J32171k0899j40924k33810m788
$$ plain form
7809 -711164 -546489 -533291 -468540 -401338 -381137 -431130 -475046 -464696 -429942 -407578 -267874
7798 -267874 -408440 -337352 -415040 -507615 -535929 -432343 -429515 -493391 -588108 -566425 -503399
7787 -503399 -436754 -542158 -442562 -393156 -373409 -275354 -438998 -475226 -276269 -318038 -360811
7776 -360811 -387050 -429159 -347943 -387863 -228550 -163099 -267350 -434103 -333395 -247600 -255887
7765 -255887 -369496 -332790 -403271 -438432 -297644 -408314 -355884 -418047 -398546 -409998 -404942
7754 -404942 -515658 -508905 -497841 -480785 -439460 -315429 -276045 -385529 -278306 -178833 -234223
7743 -234223 -234951 -298705 -442462 -374280 -360034 -314454 -277274 -459809 -370804 -376160 -398695 -398829
7731 -398829 -582423 -557687 -510838 -575096 -560255 -461671 -415174 -421289 -321654 -358502 -426539 -480724
$$ packed form
7809g11164J64675J3198O4751O7202K0201m9993m3916J0350L4754K2364J39704
7798b67874j40566P1088p7688r2575k8314J03586K828o3876r4717K1683O3026
7787e03399O6645j05404R9596M9406J9747R8055j63644l6228J98957m1769m2773
7776c60811k6239m2109Q1216l9920J59313O5451j04251j66753J00708Q5795q287
7765b55887j13609L6706p0481l5161J40788j10670N2430o2163J9501j1452N056
7754d04942j10716O753J1064J7056M1325J24031L9384j09484J07223R9473n5390
7743b34223p28o3754j43757O8182J4246M5580L7180j82535Q9005n356k2535j34
7731c98829j83594K4736M6849o4258J4841R8584M6497o115R9635l6848o8037n4185
$$ plain form
7719 -480724 -429938 -437465 -531873 -437425 -378566 -369761 -437209 -430666 -366057 -361962 -387859 -377431
7707 -377431 -424923 -456511 -461442 -467635 -429313 -394669 -346409 -363200 -376212 -207703 -144477 -356757
7695 -356757 -288460 -131240 -136327 -245675 -315665 -290173 -478065 -524680 -484822 -426011 -456535
7684 -456535 -348967 -260785 -329905 -351071 -389134 -428495 -375041 -533726 -519846 -484884 -482425
7673 -482425 -420601 -377852 -393265 -486424 -548013 -501618 -470606 -472304 -544323 -562706 -550587 -492515
7661 -492515 -450968 -440971 -388599 -442644 -462198 -411706 -531603 -622119 -613856 -469976 -461677 -556324
7649 -556324 -684888 -633212 -380550 -477397 -464362 -418082 -391008 -391055 -463662 -553908 -447787 -426128
7637 -426128 -404385 -419798 -500926 -588540 -474305 -469434 -413685 -494680 -526327 -483360 -606826
$$ packed form
7719d80724N0786p527r4408R4448N8859Q805o7448O543O4609M095k5897J0428
7707c77431m7492l1588m931o193L8322L4644M8260j6791j3012J68509O3226k12280
7695c56757O8297J57220n087j09348o9990K5492j87892m6615L9858N8811l0524
7684d56535J07568Q8182o9120k1166l8063l9361N3454j58685J3880L4962K459
7673d82425O1824M2749j5413r3159o1589M6395L1012j698p2019j8383J2119N8072
7661d92515M1547R997N2372n4045j9554N0492j19897r0516Q263J43880Q299r4647
7649e56324j28564N1676K52662r6847J3035M6280K7074m7p2607r0246J06121K1659
7637d26128K1743j5413q1128q7614J14235M871N5749q0995l1647M2967j23466
$$ plain form
7626 -606826 -576323 -474642 -533238 -586604 -609362 -511361 -428207 -511434 -534517 -672259 -642823
7615 -642823 -547793 -535477 -611197 -526654 -354972 -351958 -506079 -358376 -403766 -384363 -383164
7604 -383164 -465730 -548668 -584920 -673608 -761522 -619133 -493728 -621331 -712622 -675487 -687374
7593 -687374 -696283 -600055 -676580 -570481 -442554 -482146 -490583 -421855 -445277 -630232 -667762
7582 -667762 -677471 -562988 -399372 -464798 -449242 -435287 -469756 -541678 -516137 -496596 -438723
7571 -438723 -422036 -520599 -578705 -486309 -527742 -506494 -555219 -738403 -631077 -455878 -453414
7560 -453414 -493375 -401509 -500483 -453568 -612445 -585189 -581945 -502101 -465887 -479840 -671387
7549 -671387 -731193 -641485 -598384 -622530 -568696 -636846 -592608 -618764 -720863 -655019 -643694
$$ packed form
7626f06826L0503J01681n8596n3366k2758R8001Q3154q3227k3083j37742K9436
7615f42823R5030J2316p5720Q4543J71682L014j54121J47703m5390J9403J199
7604c83164q2566q2938l6252q8688q7914J42389J25405j27603r1291L7135j1887
7593f87374q909R6228p6525J06099J27927l9592q437O8728k3422j84955l7530
7582f67762r709J14483J63616o5426J5556J3955l4469p1922K5541J9541N7873
7571d38723J6687r8563n8106R2396m1433K1248m8725j83184J07326J75199K464
7560d53414l9961R1866r8974M6915j58877K7256L244P9844L6214j3953j91547
7549f71387n9806Q9708M3101k4146N3834o8150M4238k6156j02099O5844J1325
$$ plain form
7538 -643694 -680002 -694135 -678150 -594203 -471955 -406514 -521795 -491671 -426816 -477546 -540855
7527 -540855 -475994 -599289 -624086 -608738 -542756 -449500 -548329 -562584 -611135 -739389 -673299
7516 -673299 -552490 -559773 -542705 -508384 -517408 -612834 -611809 -562817 -499807 -449589 -542257 -558147
7504 -558147 -638527 -604073 -561568 -565258 -536768 -533642 -494946 -578572 -587499 -704406 -664385 -634949
7492 -634949 -553581 -585972 -587134 -612890 -593529 -485119 -533099 -511933 -451906 -543125 -596177 -520674
7480 -520674 -521128 -511779 -576146 -732589 -646322 -637424 -561066 -637429 -619921 -663945 -693113 -583341
7468 -583341 -614451 -672663 -500890 -527722 -618691 -629779 -686822 -629127 -622958 -686687 -597539 -556565
7456 -556565 -603347 -784971 -697487 -479352 -509068 -552164 -669875 -551063 -613952 -648696 -590399
$$ packed form
7538f43694l6308j4133J5985Q3947J22248O5441j15281L0124O4855n0730o3309
7527e40855O4861j23295k4797J5348O5982R3256r8829j4255m8551j28254O6090
7516f73299J20809p283J7068L4321r024r5426J025M8992O3010N0218r2668j5890
7504e58147q0380L4454M2505l690K8490L126L8696q3626q927j16907M0021K9436
7492f34949Q1368l2391j162k5756J9361J08410m7980K1166O0027r1219n3052P5503
7480e20674m54R349o4367j56443Q6267Q898P6358p6363J7508m4024k9168J09772
7468e83341l1110n8212J71773k6832r0969j1088n7043N7695O169o3729Q9148M0974
7456e56565m6782j81624Q7484K18135k9716m3096j17711J18812o2889l4744N8297
$$ plain form
7445 -590399 -675714 -664049 -669670 -652254 -622414 -693051 -684519 -555526 -428122 -476055 -481257 -466326
7433 -466326 -326988 -332628 -459809 -491776 -476075 -546786 -598123 -612804 -668207 -698317 -665430
7422 -665430 -503794 -616342 -637576 -647245 -606786 -572129 -527727 -542721 -549760 -620731 -586261 -673958
7410 -673958 -636707 -622053 -578284 -459767 -491135 -573284 -592099 -622809 -537023 -619172 -775076
7399 -775076 -679863 -558883 -466695 -461400 -469209 -504792 -524715 -525300 -441096 -406754 -370185 -434576
7387 -434576 -545431 -645046 -664371 -645278 -577840 -705359 -647301 -673165 -547311 -632767 -738005
7376 -738005 -739796 -669985 -707578 -650091 -446942 -492212 -542422 -549787 -558804 -618328 -658800 -606428
7364 -606428 -643273 -539759 -597002 -652589 -612707 -547686 -566557 -585512 -644706 -616807 -546135
$$ packed form
7445e90399q5315J1665n621J7416K9840p0637Q532J28993J27404m7933n202J4931
7433d66326J39338n640j27181l1967J5701p0711n1337j4681n5403l0110L2887
7422f65430J61636j12548k1234r669M0459L4657M4402j4994p039p0971L4470q7697
7410f73958L7251J4654M3769J18517l1368q2149j8815l0710Q5786q2149j55904
7399g75076R5213J20980R2188N295p809l5583j9923n85Q4204L4342L6569o4391
7387d34576j10855r9615j9325J9093O7438j27519N8058k5864J25854q5456j05238
7376g38005j791O9811l7593N7487K03149m5270n0210p365r017n9524m0472N2372
7364f06428l6845J03514n7243n5587L9882O5021j8871j8955n9194K7899P0672
$$ plain form
7353 -546135 -415189 -571402 -702822 -649621 -748244 -737940 -576167 -540029 -545328 -485653 -618316
7342 -618316 -579662 -592509 -456117 -449199 -476179 -450831 -478011 -570751 -687750 -721525 -671514
7331 -671514 -723732 -601167 -572871 -515490 -384977 -361287 -432015 -455452 -458826 -466981 -467494 -556906
7319 -556906 -616752 -535445 -454451 -418621 -434027 -515164 -512345 -531809 -677943 -631333 -579261 -639876
7307 -639876 -516535 -593132 -540735 -585544 -542307 -532382 -570613 -501143 -581821 -440938 -476376
7296 -476376 -534540 -573340 -629341 -545478 -505089 -589443 -529996 -542480 -660711 -670143 -601027 -558973
7284 -558973 -670560 -676651 -684508 -692727 -692926 -635797 -549049 -478825 -524021 -591301 -616866 -578435
7272 -578435 -489353 -469926 -543198 -545683 -575954 -587205 -624830 -791249 -693245 -625700 -523464
$$ packed form
7353e46135J30946j56213j31420N3201r8623J0304J61773L6138n299N9675j32663
7342f18316L8654j2847J36392O918k6980K5348k7180r2740j16999l3775N0011
7331f71514n2218J22565K8296N7381J30513K3690p0728k3437l374q155n13q9412
7319e56906n9846Q1307Q0994L5830j5406q1137K819j9464j46134M6610N2072o0615
7307f39876J23341p6597N2397m4809M3237R925l8231O9470q0678J40883l5438
7296d76376n8164l8800n6001Q3863M0389q4354N9447j2484j18231r432O9116M2054
7284e58973j11587o091p857q219j99N7129Q6748P0224m5196o7280k5565L8431
7272e78435Q9082J9427p3272k485l0271j1251l7625j66419R8004O7545J02236
$$ plain form
7261 -523464 -426121 -446805 -644001 -716314 -626326 -534178 -511191 -573191 -619981 -651284 -641250
7250 -641250 -560812 -522980 -573556 -620855 -570270 -600371 -644337 -647207 -642020 -639265 -552876 -570752
7238 -570752 -576159 -458873 -550620 -478169 -403004 -529243 -496333 -537990 -545032 -588092 -592837 -419788
7226 -419788 -646713 -680907 -630569 -545092 -566420 -662079 -536063 -532799 -575904 -591470 -525249
7215 -525249 -565113 -463341 -479217 -606206 -495502 -456343 -469629 -696128 -640689 -549588 -493801
7204 -493801 -440388 -454937 -366056 -541854 -471030 -450621 -420241 -430982 -569911 -566378 -596314
7193 -596314 -468684 -541503 -525646 -508078 -628072 -659841 -687086 -555064 -523262 -508286 -520801
7182 -520801 -529834 -538603 -423706 -421861 -451681 -440755 -564548 -583881 -574071 -627027 -616601 -494529
$$ packed form
7261e23464R7343k0684j97196p2313Q9988R2148K2987o2000m6790l1303J0034
7250f41250Q0438L7832n0576m7299N0585l0101m3966k870N187K755Q6389j7876
7238e70752n407J17286r1747P2451P5165j26239L2910m1657p042m3060m745J73049
7226d19788k26925l4194N0338Q5477k1328r5659J26016L264m3105j5566O6221
7215e25249l9864J01772j5876j26989J10704L9159j3286k26499N5439R1101N5787
7204d93801N3413j4549Q8881j75798P0824K0409L0380j0741j38929L533k9936
7193e96314J27630p2819J5857J7568j19994l1769k7245J32022L1802J4976j2515
7182e20801r033q769J14897J845k9820J0926j23793j9333R810n2956J0426J22072
$$ plain form
7170 -494529 -393913 -397743 -490478 -500282 -535642 -484073 -489742 -510429 -435014 -426218 -516866 -388345
7158 -388345 -488200 -577910 -581951 -465613 -379787 -415972 -494177 -426731 -298082 -210093 -278750
7147 -278750 -423768 -167230 -131946 -174746 -188385 -187034 -263869 -113138 -99080 -99575 -108538 -79263
7135 -79263 -1667 165065 362887 494533 1005891 1895674 2799343 2994779 2710889 2074213
7125 2074213 1657151 1363416 985381 479203 212910 84048 -73465 -237427 -216026 -204059
7115 -204059 -100623 11055 26285 -63236 -161852 -202562 -260270 -181092 -229146 -239564 -223309
7104 -223309 -293523 -319116 -222590 -279222 -253133 -282421 -323137 -389829 -350003 -469260 -341451
7093 -341451 -379907 -444743 -375112 -523450 -576237 -527169 -507381 -384918 -487058 -474679 -390346
$$ packed form
7170d94529J00616l830r2735r804l5360N1569n669k0687P5415Q796r0648J28521
7158c88345r9855q9710m041J16338Q5826l6185p8205O7446J28649Q7989o8657
7147b78750j45018K56538L5284m2800j3639J351p6835J50731J4058m95q963K9275
7135g9263P7596J66732J97822J31646N11358Q89783R03669J95436k83890o36676
7125B074213m17062k93735l78035n06178k66293j28862j57513j63962K1401J1967
7115b04059J03436J11678J5230q9521r8616m0710n7708P9178m8054j0418J6255
7104b23309p0214k5593R6526n6632K6089k9288m0716o6692L9826j19257J27809
7093c41451l8456o4836O9631j48338n2787M9068J9788J22463j02140J2379Q4333
$$ plain form
7082 -390346 -482218 -450717 -363759 -403861 -367363 -385980 -457624 -419253 -422136 -387501 -382013 -392220
7070 -392220 -424843 -301587 -221572 -191543 -295711 -535884 -304392 -188003 -88727 -132866 -267161
7059 -267161 -205442 -312321 -164431 -57522 -168063 -242418 -142459 -151146 -175319 -196837 -177399
7048 -177399 -289519 -284312 -213981 -73839 -36095 -109566 -244772 -251841 -120630 -241472 -341232
7037 -341232 -359111 -260125 -161724 -406626 -470721 -530270 -496500 -376905 -301301 -354296 -344696
7026 -344696 -323090 -414754 -483343 -559069 -559247 -571552 -406805 -392373 -425085 -431387 -426513 -349369
7014 -349369 -352464 -301961 -443796 -419543 -233770 -284771 -484390 -372174 -126727 -65772 -177008
7003 -177008 -311385 -276283 -175444 -117248 -220953 -118080 -6442 -124598 -20483 -12029
$$ packed form
7082c90346r1872L1501Q6958m0102L6498j8617p1644L8371k883L4635N488j0207
7070c92220l2623J23256Q0015L0029j04168k40173K31492J16389R9276m4139j34295
7059b67161O1719j06879J47890J06909j10541p4355R9959q687k4173k1518J9438
7048a77399j12120N207P0331J40142L7744p3471j35206p069J31211j20842r9760
7037c41232j7879R8986R8401k44902o4095n9549L3770J19595P5604n2995R600
7026c44696K1606r1664o8589p5726j78j2305J64747J4432l2712o302M874P7144
7014c49369l095N0503j41835K4253J85773n1001j99619J12216K45447O0955j11236
7003a77008j34377L5102J00839N8196j03705J02873J11638j18156J04115Q454
$$ plain form
6993 -12029 -178219 -67997 -201053 -287510 -297041 -240005 -322400 -293486 -195431 -349615 -318208
6982 -318208 -324978 -406290 -445129 -447824 -305600 -325701 -374739 -433107 -559785 -472785 -405453 -516708
6970 -516708 -483587 -388487 -340592 -480355 -445520 -410862 -497658 -510544 -481224 -435986 -514986
6959 -514986 -454393 -324452 -179512 -131074 -200866 -175865 -62067 -134422 -316062 -282471 -234052
6948 -234052 -163390 -113371 -265517 -258284 -357330 -364076 -324211 -382253 -318223 -405123 -417518 -357916
6936 -357916 -477833 -499855 -452388 -552783 -465313 -593962 -567904 -497332 -545459 -510215 -458834
6925 -458834 -412121 -512891 -453211 -430292 -516360 -493899 -393017 -438277 -489286 -560236 -538968
6914 -538968 -553402 -496106 -421384 -442443 -442518 -412307 -464073 -612102 -606327 -495742 -524903 -434914
$$ packed form
6993a2029j66190J10222j33056q6457r531N7036q2395K8914R8055j54184L1407
6982c18208o770q1312l8839k695J42224k0101m9038n8368j26678Q7000O7332j11255
6970e16708L3121R5100M7895j39763L4835L4658q6796j2886K9320M5238p9000
6959e14986O0593J29941J44940M8438o9792K5001J13798p2355j81640L3591M8419
6948b34052P0662N0019j52146P233r9046o746L9865n8042O4030q6900j2395N9602
6936c57916j19917k2022M7467j00395Q7470j28649K6058P0572m8127L5244N1381
6925d58834M6713j00770N9680K2919q6068K2461J00882m5260n1009p0950K1268
6914e38968j4434N7296P4722k1059p5L0211n1766j48029N775J10585k9161Q9989
$$ plain form
6902 -434914 -400685 -257041 -374973 -531826 -576757 -575140 -448111 -393266 -399629 -447119 -442752
6891 -442752 -483986 -456112 -368279 -396399 -486374 -532887 -515582 -487877 -454548 -599834 -666421
6880 -666421 -530492 -568407 -484888 -480120 -519643 -534490 -506483 -542556 -604878 -530048 -553371 -564447
6868 -564447 -457159 -593495 -534535 -520745 -441144 -452779 -448154 -507522 -538721 -467443 -591284
6857 -591284 -683011 -549366 -468154 -628578 -722910 -724392 -750034 -720797 -649543 -594170 -583752
6846 -583752 -631010 -615867 -551455 -563144 -583016 -501662 -447323 -572030 -543066 -690444 -706316
6835 -706316 -626741 -699711 -601552 -559472 -507602 -495290 -583707 -742829 -526504 -387141 -463322
6824 -463322 -442649 -571775 -640997 -549035 -466688 -418028 -604654 -530653 -483933 -524629 -625581
$$ packed form
6902d34914L4229J43644j17932j56853m4931J617J27029N4845o363m7490M367
6891d42752m1234K7874Q7833k8120q9975m6513J7305K7705L3329j45286o6587
6880f66421J35929l7915Q3519M768l9523j4847K8007l6073o2322P4830k3323j1076
6868e64447J07288j36336N8960J3790P9601j1635M625n9368l1199P1278j23841
6857e91284r1727J33645Q1212j60424r4332j482k5642K9237P1254N5373J0418
6846e83752m7258J5143O4412j1689j9872Q1354N4339j24707K8964j47378j5872
6835g06316P9575p2970R8159M2080N1870J2312q8417j59122K16325J39363p6181
6824d63322K0673j29126o9222R1962Q2347M8660j86626P4001M6720m0696j00952
$$ plain form
6813 -625581 -537124 -535273 -526018 -425965 -549968 -488205 -564078 -595017 -629584 -669143 -566338
6802 -566338 -590786 -658449 -627363 -400009 -436484 -537412 -415913 -367353 -620999 -557717 -564135
6791 -564135 -572607 -593213 -464074 -455584 -451633 -420157 -429572 -610933 -777840 -783635 -808073 -570093
6779 -570093 -380423 -452721 -564569 -467565 -430777 -358417 -456925 -550972 -545809 -572276 -564083 -415460
6767 -415460 -387158 -498721 -632648 -585894 -545416 -515999 -360063 -412676 -399153 -262401 182178
6756 182178 783550 1103058 1194628 804064 510727 528459 417758 173843 72779 -126854
6746 -126854 -321195 -350579 -388422 -280292 -311823 -425419 -422154 -369003 -275320 -364150 -426776
6735 -426776 -421322 -362977 -362527 -337179 -428722 -491309 -561478 -470455 -460304 -441897 -606026 -554684
$$ packed form
6813f25581Q8457J851R255J00053j24003O1763p5873l0939l4567l9559J02805
6802e66338k4448o7663L1086K27354l6475j00928J21499M8560k53646O3282o418
6791e64135q472k0606J29139Q490L951L1476r415j81361j66907n795k4438K37980
6779e70093J89670p2298j11848R7004L6788P2360r8508r4047N163k6467Q193J48623
6767d15460K8302j11563j33927M6754M0478K9417J55936n2613J3523J36752M44579
6756A82178O01372L19508R1570l90564k93337J7732j10701k43915j01064j99633
6746a26854j94341k9384l7843J08130l1531j13596L265N3151R3683q8830o2626
6735d26776N454N8345M50K5348r1543o2587p0169R1023J0151J8407j64129N1342
$$ plain form
6723 -554684 -411081 -345774 -484101 -507430 -550513 -622398 -640025 -681928 -679788 -675404 -665228 -567212
6711 -567212 -543087 -485351 -421945 -439016 -558437 -571142 -502482 -540650 -636982 -613860 -517398
6700 -517398 -646215 -570758 -611941 -640593 -732000 -666937 -570022 -468313 -545578 -650216 -715860
6689 -715860 -491783 -528145 -570260 -401928 -546099 -607284 -571408 -573118 -557354 -499323 -456504
6678 -456504 -469887 -539491 -483581 -456419 -442098 -460853 -611585 -636667 -673675 -635572 -541800
6667 -541800 -703533 -716947 -579559 -549103 -484211 -554700 -514567 -634243 -648170 -690858 -746138
6656 -746138 -665306 -623830 -672811 -717198 -589252 -616782 -765043 -673049 -624036 -509613 -518292
6645 -518292 -530944 -609549 -546411 -517450 -462437 -559472 -695007 -620444 -595518 -567459 -575257 -584208
$$ packed form
6723e54684J43603O5307j38327k3329m3083p1885j7627m1903K140M384J0176R8016
6711e67212K4125N7736O3406j7071j19421j2705O8660l8168r6332K3122R6462
6700e17398j28817P5457m1183k8652r1407O5063R6915J01709p7265j04638o5644
6689g15860K24077l6362m2115J68332j44171o1185L5876j710J5764N8031M2819
6678d56504j3383o9604N5910K7162J4321j8755j50732k5082l7008L8103R3772
6667e41800j61733j3414J37388L0456O4892p0489M0133j19676j3927m2688n5280
6656g46138Q0832M1476m8981m4387J27946k7530j48261R1994M9013J14423q679
6645e18292j2652p8605O3138K8961N5013r7035j35535P4563K4926K8059p798q951
$$ plain form
6633 -584208 -585321 -524555 -499384 -490532 -445723 -443926 -552099 -565820 -722250 -728186 -612597 -509727
6621 -509727 -523690 -473621 -547916 -592442 -630055 -643498 -584574 -611797 -595622 -630428 -688154 -643015
6609 -643015 -429690 -578690 -738766 -663958 -651105 -535778 -528972 -593735 -619958 -516797 -538919
6598 -538919 -538554 -556616 -565054 -648352 -552300 -576315 -642937 -569228 -561313 -638857 -632340 -644646 -708274
6585 -708274 -736503 -781200 -653533 -691495 -727580 -860443 -813370 -665445 -765824 -760850 -751954
6574 -751954 -610483 -639024 -710382 -698774 -645088 -503151 -599871 -571322 -556185 -520848 -495523
6563 -495523 -494596 -454834 -493689 -632918 -572997 -568893 -576213 -482629 -466562 -402601 -494388 -471153
6551 -471153 -469127 -631828 -669907 -609301 -479212 -408294 -415760 -363325 -392628 -406600 -475758 -438061
$$ packed form
6633e84208j113O0766K5171Q852M4809J797j08173j3721j56430n936J15589J02870
6621e09727j3963N0069p4295m4526l7613j3443N8924k7223J6175l4806n7726M5139
6609f43015K13325j49000j60076P4808J2853J15327O806o4763k6223J03161k2122
6598e38919L65j8062q438q3298R6052k4015o6622P3709P915p7544O517j2306o3628
6585g08274k8229m4697J27667l7962l6085j32863M7073J47925j00379M974Q896
6574g51954J41471k8541p1358J1608N3686J41937r6720K8549J5137L5337K5325
6563d95523R27L9762l8855j39229N9921M104p320R3584J6067O3961r1787K3235
6551d71153K026j62701l8079O0606J30089P0918p466N2435k9303j3972o9158L7697
$$ plain form
6539 -438061 -429447 -430770 -487445 -482336 -483857 -507779 -610625 -610297 -532802 -589290 -530156 -511052 -560360
6526 -560360 -485059 -341959 -446119 -295766 -306954 -551330 -576396 -575217 -509057 -526149 -535047
6515 -535047 -521741 -641341 -528186 -474923 -461864 -515410 -508184 -534845 -596919 -519156 -518269 -570966
6503 -570966 -597224 -534547 -533968 -584647 -462136 -500066 -540799 -503447 -577242 -483261 -433638 -415634
6491 -415634 -410961 -375336 -315689 -341905 -366294 -332062 -419746 -326426 -380129 -350747 -434185 -462893
6479 -462893 -479596 -475432 -451960 -295048 -257379 -322532 -403420 -561251 -434386 -539996 -495504
6468 -495504 -461166 -230485 -424310 -594523 -603982 -575289 -526709 -561371 -467129 -443009 -362847
6457 -362847 -256260 -349252 -334469 -331473 -376914 -418963 -524337 -640813 -622820 -559798 -495689
$$ packed form
6539d38061Q614j323n6675N109j521k3922j02846L28P7495n6488N9134J9104m9308
6526e60360P5301J43100j04160J50353j1188k44376k5066J179O6160j7092q898
6515e35047J3306j19600J13155N3263J3059n3546P226k6661o2074P7763Q87n2697
6503e70966k6258O2677N79n0679J22511l7930m0733L7352p3795R3981M9623J8004
6491d15634M673L5625N9647k6216k4389L4232q7684R3320n3703K9382q3438k8708
6479d62893j6703M164K3472J56912L7669o5153q0888j57831J26865j05610M4492
6468d95504L4338K30681j93825j70213r459K8693M8580l4662R4242K4120Q0162
6457c62847J06587r2992J4783K996m5441m2049j05374j16476J7993O3022O4109
$$ plain form
6446 -495689 -427450 -493140 -576802 -527677 -361256 -288741 -367185 -471077 -522594 -598349 -539682
6435 -539682 -576544 -495257 -281415 -181497 -325345 -326410 -179780 -96442 -194203 -371215 -362546
6424 -362546 -441414 -414307 -549570 -559584 -370915 -370733 -630848 -574075 -434499 -515965 -474144
6413 -474144 -442542 -430190 -321086 -304850 -395017 -384330 -318582 -357914 -422905 -430409 -420336 -421531
6401 -421531 -387554 -384215 -497365 -314228 -284668 -289939 -403518 -563790 -683349 -644810 -525115
6390 -525115 -538183 -559658 -466099 -444622 -446719 -468681 -411153 -452533 -520811 -560524 -446424 -503658
6378 -503658 -457632 -452324 -603630 -561778 -620484 -613346 -682011 -644769 -532140 -527797 -477540 -595649
6366 -595649 -563430 -583897 -504981 -453095 -527361 -404084 -425407 -427304 -483417 -595397 -625120
$$ packed form
6446d95689O8239o5690q3662M9125J66421P2515p8444j03892n1517p5755N8667
6435e39682l6862Q1287K13842R9918j43848j065J46630Q3338r7761j77012Q669
6424c62546p8868K7107j35263j0014J88669J82k60115N6773J39576q1466M1821
6413d74144L1602J2352J09104J6236r0167J0687O5748l9332o4991p504J0073j195
6401d21531L3977L339j13150J83137K9560n271j13579j60272j19559L8539J19695
6390e25115j3068k1475R3559K1477k097k1962N7528m1380o8278l9713J14100n7234
6378e03658M6026N308j51306M1852n8706P138o8665L7242J12629M343N0257j18109
6366e95649L2219k0467P8916N1886p4266J23277k1323j897n6113j11980k9723
$$ plain form
6355 -625120 -455379 -414902 -451282 -473046 -573152 -457249 -330253 -342970 -399334 -358057 -280495
6344 -280495 -384306 -535241 -557814 -445861 -431210 -326351 -371098 -309803 -159446 -218985 -438697
6333 -438697 -434363 -447904 -416824 -463329 -482386 -386000 -351011 -445947 -432917 -459431 -386129 -268708
6321 -268708 -273963 -352865 -309198 -304074 -288691 -284496 -397685 -408384 -494432 -571583 -574725 -553127
6309 -553127 -520159 -407815 -439028 -619454 -566933 -443903 -434828 -457669 -525083 -529527 -600357
6298 -600357 -621686 -533734 -394072 -409973 -357944 -355775 -279397 -350483 -324467 -354999 -404279 -451316
6286 -451316 -542875 -494013 -478815 -297827 -327022 -234962 -129677 -123017 -108397 -247051 -226010
6275 -226010 -181741 -321387 -480662 -397007 -447865 -442889 -292558 -240334 -227613 -289550 -256894
$$ packed form
6355f25120J69741M0477l6380k1764j00106J15903J26996j2717n6364M1277P7562
6344b80495j03811j50935k2573J11953J4651J04859m4747O1295J50357n9539k19712
6333d38697M334j3541L1080m6505j9057R6386L4989r4936J3030k6514P3302J17421
6321b68708n255p8902M3667N124J5383M195j13189j0699q6048p7151l142K1598
6309e53127L2968J12344l1213j80426N2521J23030R075k2841o7414m444p0830
6298f00357k1329Q7952J39662j5901N2029K169P6378p1086K6016l0532m9280m7037
6286d51316r1559M8862J5198J80988k9195R2060J05285O660J4620j38654K1041
6275b26010M4269j39646j59275Q3655n0858M976J50331N2224J2721o1937L2656
$$ plain form
6264 -256894 -224445 -236077 -206516 -276485 -217109 -204869 -361813 -379465 -502378 -472280 -384808
6253 -384808 -465379 -511035 -369305 -371066 -459008 -380265 -417338 -417823 -408400 -480927 -469143 -490860
6241 -490860 -416621 -402000 -373257 -337188 -414934 -478868 -458210 -444085 -583061 -445816 -395788
6230 -395788 -497660 -460941 -385062 -434688 -395682 -384065 -322854 -483359 -383877 -326472 -390444
6219 -390444 -437939 -371071 -415599 -460606 -264614 -329492 -321830 -425596 -457817 -438681 -433404 -429817
6207 -429817 -337322 -311152 -198267 -194970 -296533 -199343 -301116 -234741 -213724 -148007 -156745
6196 -156745 -158055 -54591 -30444 3868 63619 21089 132072 228978 85487 102679 71783
6185 71783 93126 39547 112565 164366 102966 191865 323339 269505 155730 58270 185670
$$ packed form
6264b56894L2449j1632K9561o9969N9376J2240j56944j7652j22913L0098Q7472
6253c84808q0571m5656J41730j761q7942P8743l7073m85R423p2527J1784k1717
6241d90860P4239J4621K8743L6069p7746o3934K0658J4125j38976J37245N0028
6230c95788j01872L6719P5879m9626L9006J1617O1211j60505R9482N7405o3972
6219c90444m7495O6868m4528m5007J95992o4878P662j03766l2221J9136N277L587
6207d29817R2495K6170J12885L297j01563R7190j01773O6375K1017O5717q738
6196a56745j310J03464K4147L4312N9751m2530J10983R6906j43491J7192l0896
6185G1783K1343n3579P3018N1801o1400Q8899J31474n3834j13775r7460J27400
$$ plain form
6174 185670 225556 236238 139904 204756 89331 89170 -43170 44509 142456 207637 405437
6163 405437 367984 600525 877115 931478 898431 754986 739460 743446 626628 631233 663205
6152 663205 753718 743066 612715 658135 846672 748922 803463 861129 708412 721617 665946
6141 665946 729152 780483 731178 615221 693945 591893 565074 742258 869192 1160576 1319122
6130 1319122 1422290 1621835 1636173 1626634 1518784 1279357 1218588 1122498 1172014 1171890 1087803
6119 1087803 1093046 1263279 1224166 1230687 1174503 1197683 1089807 1017459 772897 864986 859264
6108 859264 858094 742857 709006 796261 874795 1121306 1110442 1211564 1454497 1597319 1705847
6097 1705847 1837867 1770353 1652172 1539422 1426316 1391912 1319687 1296663 1253997 1335338 1431147
$$ packed form
6174A85670L9886J0682r6334O4852j15425j61j32340Q7679R7947O5181J97800
6163D05437l7453K32541K76590N4363l3047j43445j5526L986j16818M605L1972
6152F63205R0513j0652j30351M5420J88537r7750N4541N7666j52717J3205n5671
6141F65946O3206N1331m9305j15957P8724j02052k6819J77184J26934K91384J58546
6130A319122J03168J99545J4338r539j07850k39427o0769r6090M9516j24q4087
6119A087803N243J70233l9113O521n6184K3180j07876p2348k44562R2089n722
6108H59264j170j15237l3851Q7255P8534K46511j0864J01122K42933J42822J08528
6097A705847J32020o7514j18181j12750j13106l4404p2225k3024m2666Q1341R5809
$$ plain form
6086 1431147 1370783 1253377 1363977 1466088 1405831 1255631 1276821 1286860 1247551 1264839 1229469
6075 1229469 1171704 1121626 1048266 931010 843588 857414 893170 837790 938195 834191 856949
6064 856949 934661 1027749 969043 910284 724033 742729 748718 719625 790813 775617 810745 914087
6052 914087 966833 928266 723262 709559 642580 536249 546561 446672 216529 232388 317952
6041 317952 290128 315739 241890 197215 201588 216784 201465 208634 159402 167297 89657 96521
6029 96521 198689 63809 -1794 123574 259596 193392 31759 115243 250032 114203
6019 114203 75781 152926 225515 308525 416968 304848 364071 380972 336441 358401 320732
6008 320732 352977 226280 230769 351094 421538 352892 281885 295021 365600 329140 347486
$$ packed form
6086A431147o0364j17406J10600J02111o0257j50200K1190J0039l9309J7288l5370
6075A229469n7765n0078p3360j17256q7422J3826L5756n5380J00405j04004K2758
6064H56949P7712R3088n8706n8759j86251J8696N989k9093P1188j5196L5128J03342
6052I14087N2746l8567k05004j3703o6979j06331J0312r9889k30143J5859Q5564
6041C17952k7824K5611p3849m4675M373J5196j5319P169m9232P895p7640O864
6029I6521J02168j34880o5603J25368J36022o6204j61633Q3484J34789j35829
6019A14203l8422P7145P2589Q3010J08443j12120N9223J6901m4531K1960l7669
6008C20732L2245j26697M489J20325P0444o8646p1007J3136P0579l6460J8346
$$ plain form
5997 347486 389650 389536 468828 410250 411825 472553 459361 412345 462281 486208 379996 415593
5985 415593 594832 464196 247504 216256 176028 198649 288383 371924 178433 205627 298147
5974 298147 243361 281960 363878 385736 347740 302708 378539 448632 451660 370359 450171 685729
5962 685729 593029 440126 260771 148353 134486 51425 56423 99687 265857 171251 157866
5951 157866 107041 33779 133378 112534 88816 142785 248996 352216 246338 234598 192895
5940 192895 203835 357085 252041 172994 93026 210300 184656 157642 125393 16669 115247
5929 115247 129715 235446 266581 336758 454603 491950 626706 640948 692964 705142 602677
5918 602677 604206 594628 523859 528841 430775 368316 441142 463204 371129 348621 291938 387526
$$ packed form
5997C47486M2164j14P9292n8578J575O0728j3192m7016M9936K3927j06212L5597
5985D15593J79239j30636k16692l1248m0228K2621Q9734Q3541j93491K7194R2520
5974B98147n4786L8599Q1918K1858l7996m5032P5831P0093L028q1301P9812K35558
5962F85729r2700j52903j79355j12418j3867q3061M998M3264J66170r4606j3385
5951A57866n0825p3262R9599k0844k3718N3969J06211J03220j05878j1740m1703
5940A92895J0940J53250j05044p9047p9968J17274k5644k7014l2249j08724R8578
5929A15247J4468J05731L1135P0177J17845L7347J34756J4242N2016J2178j02465
5918F02677J529r578p0769M982r8066o2459P2826K2062r2075k2508n6683R5588
$$ plain form
5906 387526 400357 358019 379770 365714 426540 453876 653754 767585 677655 708897 807511
5895 807511 719614 646380 565478 523852 438419 482873 384047 380931 402590 404539 338185 266807
5883 266807 144721 190293 223516 261842 335501 419506 416485 526821 542958 633055 786704
5872 786704 722624 764172 587141 581549 469317 518401 489212 359822 449890 369559 343384
5861 343384 481373 316795 312280 279881 280617 210382 312389 401371 463620 522378 522919 478633
5849 478633 392451 366443 452905 576505 437648 292702 292199 319305 311738 221077 232008 243087
5837 243087 193892 219889 341336 458182 627656 636530 551854 485778 570772 525856 567645
5826 567645 869017 933266 904924 702643 533416 663462 758984 721999 662054 610854 554191
$$ packed form
5906C87526J2831m2338K1751j4056O0826K7336J99878J13831q9930L1242R8614
5895H07511q7897p3234q0902m1626q5433M4454r8826l116K1659J949o6354p1378
5883B66807j22086M5572L3223L8326P3659Q4005l021J10336J6137R0097J53649
5872G86704o4080M1548j77031n592j12232M9084k9189j29390R0068q0331k6175
5861C43384J37989j64578m515l2399P36p0235J02007Q8982O2249N8758N41m4286
5849D78633q6182k6008Q6462J23600j38857j44946n03K7106p567r0661J0931J1079
5837B43087m9195K5997J21447J16846J69474Q874q4676o6076Q4994m4916M1789
5826E67645L01372O4249k8342k02281j69227J30046R5522l6985n9945n1200n6663
$$ plain form
5815 554191 491711 635635 778334 842920 943366 1236106 1570958 1581937 1554108 1449078
5805 1449078 1317848 1331004 1278975 1132257 1134701 973735 809643 879017 812357 768991 753288
5794 753288 829606 922125 868833 936559 1099538 1471953 1770716 2050631 2438464 2784714
5784 2784714 2910754 2973220 3090992 2951643 2942112 2766049 2506212 2143005 1955198 1646677
5774 1646677 1487149 1496407 1522428 1385722 1359799 1380094 1390826 1484496 1453572 1587841 2009319
5763 2009319 2431576 2848649 3130184 3259424 3573457 3915007 3990764 3997078 3828149 3660851
5753 3660851 3297582 2945275 2816668 2667063 2495077 2338710 2206976 2081390 1926364 1911852
5743 1911852 1902936 1886287 1930395 2005589 2384930 2623105 2731570 2935411 3299556 3580357
$$ packed form
5815E54191o2480J43924J42699O4586J00446K92740L34852J0979k7829j05030
5805A449078j31230J3156n2029j46718K444j60966j64092O9374o6660m3366j5703
5794G53288P6318R2519n3292O7726J62979L72415K98763K79915L87833L46250
5784B784714J26040O2466J17772j39349r531j76063k59837l63207j87807l08521
5774A646677j59528R258K6021j36706k5923K0295J0732R3670l0924J34269M21478
5763B009319M22257M17073K81535J29240L14033L41550P5757O314j68929j67298
5753C660851l63269l52307j28607j49605j71986j56367j31734j25586j55026j4512
5743A911852q916j6649M4108P5194L79341K38175J08465K03841L64145K80801
$$ plain form
5733 3580357 3596252 3565620 3463497 3311950 3113682 2907080 2796979 2766310 2683884 2542407
5723 2542407 2598211 2577913 2756553 2952491 3164614 3355287 3324481 3321998 3459614 3504941 3401223
5712 3401223 3394055 3559021 3584643 3531458 3387827 3317507 3424538 3395740 3303299 3377406 3649018
5701 3649018 3794796 3510224 3404684 3400124 3281001 3418577 3397426 3152121 2923818 2817175
5691 2817175 2783434 2780870 2849114 2888161 2937851 3045155 3260050 3353107 3517916 3718028 4018292
5680 4018292 4139848 4440360 5090180 5700107 6641969 7707050 8564398 9111751 9421582
5671 9421582 9848645 10541664 11340475 11921872 11947445 11483135 11059461 10950180 11093082 11542800
5661 11542800 12195555 12702417 13147364 13333340 12841092 12339146 12257418 12485928 13055643 13659805
$$ packed form
5733C580357J5895l0632j02123j51547j98268k06602j10101l0669q2426j41477
5723B542407N5804k0298J78640J95938K12123J90673l0806k483J37616M5327j03718
5712C401223p168J64966K5622n3185j43631p0320J07031k8798r2441P4107K71612
5701C649018J45778k84572j05540m560j19123J37576k1151k45305k28303j06643
5691B817175l3741k564O8244L9047M9690J07304K14895R3057J64809K00112L00264
5680D018292J21556L00512O49820O09927R41862J065081Q57348N47353L09831
5671I421582M27063O93019P98811N81397K5573m64310m23674j09281J42902M49718
5661A1542800O52755N06862M44947J85976m92248n01946q1728K28510N69715O04162
$$ plain form
5651 13659805 14077291 14050802 13709728 13421232 13218980 13024536 12325896 11473715 10725273 10046596
5641 10046596 9438925 9055285 8812883 8582551 8644319 8981568 9297250 9482519 9527793 9053522
5631 9053522 8502979 7986882 7553213 7247072 7062691 6918400 6582992 6242522 6032794 5745305
5621 5745305 5417100 5046915 5000830 4943464 4807075 4852248 5058824 5227087 5439559 5776920
5611 5776920 5980573 6171081 6213153 6111567 6006204 5833195 5657143 5430605 5209749 5133353
5601 5133353 5084225 5052858 4793386 4733887 4723590 4836597 5051781 5356808 5548004 5542703 5413175
5590 5413175 5332037 5445575 5887024 6104917 6203965 6229963 6309779 6384205 6474849 6454912 6436195
5579 6436195 6494309 6486073 6628339 6873738 7202684 7933257 9179735 10509270 11486300 11962203
$$ packed form
5651A3659805M17486k6489l41074k88496k02252j94444o98640q52181p48442o78677
5641A0046596o07671l83640k42402k30332O1768L37249L15682J85269M5274m74271
5631I053522n50543n16097m33669l06141j84381j44291l35408l40470k09728k87489
5621E745305l28205l70185m6085n7366j36389M5173K06576J68263K12472L37361
5611E776920K03653J90508M2072j01586j05363j73009j76052k26538k20856p6396
5601E133353m9128l1367k59472n9499j0297J13007K15184L05027J91196n301j29528
5590E413175q1138J13538M41449K17893R9048K5998P9816P4426R0644j9937j8717
5579F436195N8114q236J42266K45399L28946P30573J246478J329535R77030M75903
$$ plain form
5569 11962203 12050426 12218832 12322924 12296957 11716011 10821282 9870805 9058343 8406060 7791687
5559 7791687 7467341 7056887 6858406 7045758 7088214 7203867 7598300 7985273 8435753 9204938
5549 9204938 10470121 11734641 12839107 12923400 12728676 12691064 12998930 13494723 13655891
5540 13655891 13627509 13331126 12977217 12442828 11627799 10774139 9864686 9193300 8709468 8232839
5530 8232839 7855143 7593167 7429513 7483659 7460221 7649032 7971929 8367171 8745961 9063472
5520 9063472 9019737 8707441 8216846 7898007 7806568 7786981 7821361 7834485 7901774 8204008 8776384
5509 8776384 9565499 10421712 11152661 11500818 11229696 10653089 10023408 9693755 9645536 9559102
5499 9559102 9364249 9021651 8664488 8181924 7664224 7443913 7181846 7028835 7075796 7153885
$$ packed form
5569A1962203Q8223J68406J04092k5967n80946q94729r50477q12462o52283o14373
5559G791687l24346m10454j98481J87352M2456J15653L94433L86973M50480P69185
5549I204938J265183J264520J104466Q4293j94724l7612L07866M95793J61168
5540A3655891k8382k96383l53909n34389q15029q53660r09453o71386m83832m76629
5530H232839l77696k61976j63654N4146k3438J88811L22897L95242L78790L17511
5520I063472m3735l12296m90595l18839r1439j9587L4380J3124O7289L02234N72376
5509H776384P89115Q56213P30949L48157k71122n76607o29681l29653m8219q6434
5499I559102j94853l42598l57163m82564n17700k20311k62067j53011M6961P8089
$$ plain form
5489 7153885 7112423 7164762 7097398 6925793 6822658 6796389 6896190 6963978 6983606 6932500 6641714
5478 6641714 6522067 6486734 6676673 6904064 6884743 6751269 6528148 6253324 6141278 6158318
5468 6158318 6427222 6642793 6982898 7205055 7103212 6882193 6478648 6353995 6111058 5817494
5458 5817494 5685558 5568353 5498987 5428432 5571673 5664831 5588146 5527907 5463375 5432900 5407121
5447 5407121 5404136 5614420 5756520 5716397 5926720 6300406 6424952 6621965 6898235 7060620
5437 7060620 7647636 8283562 8476365 8660093 8550879 8236947 8007827 7736077 7677351 7622589
5427 7622589 7665073 7648606 7548280 7593508 7881493 7968960 8252436 8513371 8749602 8800737
5417 8800737 8914370 8832262 8838677 9017185 9195104 9413370 9671755 9956783 10106097 10325330
$$ packed form
5489G153885m1462N2339o7364j71605j03135k6269R9801O7788J9628n1106k90786
5478F641714j19647l5333J89939K27391j9321j33474k23121k74824j12046J7040
5468F158318K68904K15571L40105K22157j01843k21019m03545j24653k42937k93564
5458E817494j31936j17205o9366p0555J43241R3158p6685o0239o4532l0475k5779
5447E407121k985K10284J42100m0123K10323L73686J24546J97013K76270J62385
5437G060620N87016O35926J92803J83728j09214l13932k29120k71750n8726n4762
5427G622589M2484j6467j00326M5228K87985Q7467K83476K60935K36231N1135
5417H800737J13633q2108O415J78508J77919K18266K58385K85028J49314K19233
$$ plain form
5407 10325330 10549127 11056116 11844849 12738529 13811080 14833350 15567718 15921353 15741241
5398 15741241 15660810 15791161 16452700 17341357 18160271 18460945 18263905 17987361 18226623 18466621
5388 18466621 18569954 18589841 18881518 19053775 18772437 18200096 17805777 17731088 17982970 18272468
5378 18272468 18429077 18538230 18378938 18249001 18405936 18538011 19034931 19723248 20245207
5369 20245207 20339518 19544358 18728402 18269404 18175811 18519564 18960905 19206678 19633331 19918805
5359 19918805 19667285 19007653 18443238 18152327 17980755 17959029 17820575 17722054 17622600 17602392
5349 17602392 17547208 17361907 17286603 17327181 17398502 17642125 17920169 18062639 18307302 18532601
5339 18532601 18933740 19313026 19480902 19551933 19755317 20223627 20605073 21212359 21799918 22441983
$$ packed form
5407A0325330K23797N06989P88733Q93680J072551J022270P34368L53635j80112
5398A5741241q0431J30351O61539Q88657Q18914L00674j97040k76544K39262K39998
5388A8466621J03333J9887K91677J72257k81338n72341l94319p4689K51882K89498
5378A8272468J56609J09153j59292j29937J56935J32075M96920O88317N21959
5369B0245207R4311p95160q15956m58998r3593L43753M41341K45773M26653K85474
5359A9918805k51520o59632n64415k90911j71572k1726j38454r8521r9454k0208
5349A7602392n5184j85301p5304M0578P1321K43623K78044J42470K44663K25299
5339A8532601M01139L79286J67876P1031K03384M68310L81446O07286N87559O42065
$$ plain form
5329 22441983 23296276 24103260 24723287 25379388 26176198 26870880 27683839 28524035 29755885
5320 29755885 31253774 33277362 35854725 39759768 45443457 52641983 61660791 73025483
5312 73025483 84848034 92581224 95718135 98995375 103543433 105845890 102136031 94639891
5304 94639891 86652779 80557555 76614759 74387623 72785819 71564404 70837991 70140324
5296 70140324 69532501 70383921 72872661 77410860 84559118 95957502 111566444 131461500
5288 131461500 156722802 186105742 210417492 222210375 227519674 234749383 238572568
5281 238572568 231597626 214987144 196573076 181895754 174130967 172987737 175740054 181476102
5273 181476102 189138609 192500171 185304973 177201292 175529765 181093273 192476968 208733823
$$ packed form
5329B2441983Q54293Q06984O20027O56101P96810O94682Q12959Q40196J231850
5320B9755885J497889K023588K577363L905043N683689P198526R018808J1364692
5312G3025483J1822551P733190L136911L277240M548058K302457l709859p496140
5304I4639891p987112o095224l942796k227136j601804j221415p26413o97667
5296G0140324o07823Q51420K488740M538199P148258J1398384J5608942J9895056
5288A31461500K5261302K9382940K4311750J1792883N309299P229709L823185
5281B38572568o974942j6610482j8414068j4677322p764787j143230K752317N736048
5273A81476102P662507L361562p195198q103681j671527N563508J1383695J6256855
$$ plain form
5265 208733823 228529520 249358664 265935268 286383502 322289621 373878946 435569704
5258 435569704 487157575 508254016 505361514 490682875 483415013 493622014 514140538
5251 514140538 527068529 530305639 521897262 509229795 488459597 451026869 412031590
5244 412031590 382911309 363881422 348242465 324783839 290096053 259949658 239357242
5237 239357242 229182741 227683701 233829027 245556475 261614670 274280875 279696668
5230 279696668 267849749 245134599 226990415 216279064 210342327 207425716 203315001
5223 203315001 198194827 191012528 179584750 171740508 169359264 170848994 173799925 171043726
5215 171043726 157929196 144028741 133693925 126856301 123146971 122256255 123242570 127352165
$$ packed form
5265B08733823J9795697K0829144J6576604K0448234L5906119N1589325O1690758
5258D35569704N1587871K1096441k892502j4678639p267862J0207001K0518524
5251E14140538J2927991L237110q408377j2667467k0770198l7432728l8995279
5244D12031590k9120281j9029887j5638957k3458626l4687786l0146395k0592416
5237B39357242j0174501j499040O145326J1727448J6058195J2666205N415793
5230B79696668j1846919k2715150j8144184j0711351n936737k916611m110715
5223B03315001n120174p182299j1427778p844242k381244J489730K950931k756199
5215A71043726j3114530j3900455j0334816o837624l709330q90716R86315M109595
$$ plain form
5207 127352165 134001394 140025803 137183948 125814027 114983707 106563623 99996387 93989906
5199 93989906 87511357 80660312 75143444 70610045 67204431 64473652 62287925 60337994
5191 60337994 58759399 57380151 55862997 54252142 52983877 51572885 50404306 49260640
5183 49260640 48246369 47236703 46280673 45391171 44703289 44064257 43475504 42750184 42197158
5174 42197158 41587521 41044260 40428635 40109673 39774711 39219235 38585918 38027682 37611167
5165 37611167 37191940 36823543 36532397 36287592 36252668 36189741 36122418 35949158 35759259 35865190
5155 35865190 35797943 35735672 35719477 35931282 36311042 36626778 36984350 37615541 38607673 40034586
5145 40034586 41674064 43704488 46191509 49977420 56304984 67745222 84886035 103016407
$$ packed form
5207A27352165O649229O024409k841855j1369921j0830320q420084o567236o006481
5199I3989906o478549o851045n516868m533399l405614k730779k185727j949931
5191F0337994j578595j379248j517154j610855j268265j410992j168579j143666
5183D9260640j014271j009666r56030q89502o87882o39032n88753p25320n53026
5174D2197158o09637n43261o15625l18962l34962n55476o33317n58236m16515
5165C7611167m19227l68397k91146k44805l4924o2927o7323j73260j89899J05931
5155C5865190o7247o2271j6195K11805L79760L15736L57572O31191R92132J426913
5145D0034586J639478K030424K487021L785911O327564J1440238J7140813J8130372
$$ plain form
5137 103016407 116923265 127587671 147042941 179848102 212713833 232817102 235795803
5130 235795803 224101468 201315549 171405388 142943296 120836976 102592019 88345059
5123 88345059 78061518 70880987 65703486 62305506 60063067 58405058 57322130 57086137
5115 57086137 57234650 57621963 58128728 59662418 63038367 70839362 83877044 97636965
5107 97636965 105565622 103734374 97961338 95013100 95776821 101539222 113731878 127984544
5099 127984544 136541088 135326477 130491782 130525795 138860625 162905697 217102881 291423414
5091 291423414 343128860 345172172 309183369 264550393 225572797 190250736 162277861
5084 162277861 143281484 131085679 125586866 128582706 144628707 184512864 251626199
$$ packed form
5137A03016407J3906858J0664406J9455270L2805161L2865731K0103269K978701
5130B35795803j1694335k2785919k9910161k8462092k2106320j8244957j4246960
5123H8345059j0283541p180531n177501l397980k242439j658009j082928k35993
5115E7086137J48513L87313N06765J533690L375949P800995J3037682J3759921
5107I7636965P928657j831248n773036k948238P63721N762401J2192656J4252666
5099A27984544Q556544j214611m834695L4013Q334830K4045072N4197184P4320533
5091B91423414N1705446K043312l5988803m4632976l8977596l5322061k7972875
5084A62277861j8996377j2195805n498813K995840J6046001L9884157O7113335
$$ plain form
5077 251626199 314547577 337179782 313775986 270098388 231309255 199553554 174173405
5070 174173405 160711877 154720100 148642086 138597972 126600697 115651822 107331143
5063 107331143 103202675 104104993 104988943 101908527 95754564 88611422 82487972 76805913
5055 76805913 71999392 68170772 65062921 62786555 61013361 59789179 58865451 58325176
5047 58325176 58353594 58594127 59339899 60526833 62226882 64821903 68859806 75566331 87278455
5038 87278455 106075949 129641277 153567882 174015188 190512671 208226876 228186575
5031 228186575 238939014 230798697 221181046 218808397 222164717 222374898 215847285 202422942
5023 202422942 184928185 172268630 166649886 166980861 172587731 183220737 194501125 203286779
$$ packed form
5077B51626199O2921378K2632205k3403796m3677598l8789133l1755701k5380149
5070A74173405j3461528n991777o078014j0044114j1997275j0948875q320679
5063A07331143m128468R02318Q83950l080416o153963p143142o123450n682059
5055G6805913m806521l828620l107851k276366j773194j224182r23728n40275
5047E8325176K8418K40533P45772J186934J700049K595021M037903O706525J1712124
5038H7278455J8797494K3565328K3926605K0447306J6497483J7714205J9959699
5031B28186575J0752439q140317r617651k372649L356320K10181o527613j3424343
5023B02422942j7494757j2659555n618744L30975N606870J0633006J1280388Q785654
$$ plain form
5015 203286779 216228072 234467430 253755951 279997939 313988286 342577108 342396829
5008 342396829 317558938 294402015 282068307 276946556 267584847 253587559 241968601
5001 241968601 236536655 232076705 225505210 220835259 215755858 207167999 201295702 202053685
4993 202053685 208781198 215721493 217307039 219355123 224603268 222204770 202537994 179060771
4985 179060771 158886940 142839663 130026544 118193285 105419366 93864414 84719567
4978 84719567 77833408 72585043 68348192 64966143 62072657 59496329 57067037 55220998
4970 55220998 53329561 51787042 50358766 49020051 47549478 46077991 44664881 43570655
4962 43570655 42706025 41850538 41174350 40452312 39528511 38606936 37410289 36219273 35087501
$$ packed form
5015B03286779J2941293J8239358J9288521K6241988L3990347K8588822j80279
5008C42396829k4837891k3156923j2333708n121751r361709j3997288j1618958
5001B41968601n431946m459950o571495m669951n079401q587859n872297P57983
4993B02053685O727513O940295J585546K048084N248145k398498j9666776k3477223
4985A79060771k0173831j6047277j2813119j1833259j2773919j1554952r144847
4978H4719567o886159n248365m236851l382049k893486k576328k429292j846039
4970E5220998j891437j542519j428276j338715j470573j471487j413110j094226
4962D3570655q64630q55487o76188p22038r23801r21575j196647j191016j131772
$$ plain form
4953 35087501 34108301 33275664 32301266 31405070 30625367 29859737 29164467 28573510 27982368
4944 27982368 27680488 27588298 27636796 27549588 27535983 27380858 27278412 27111720 26841021 26200535
4934 26200535 25329152 24337437 23611206 22995622 22299545 21526875 20797633 20273694 19786152
4925 19786152 19319814 19125395 19129437 19019206 19098707 19272846 19365766 19411368 19045116 18615679
4915 18615679 18187614 17663489 17246407 16769467 16252769 15574034 15177146 14849773 14509709
4906 14509709 14207472 13914207 13651269 13346860 13097908 12919128 12771413 12502559 12397553
4897 12397553 12467101 12129028 11874005 11712788 11688108 11856342 11881930 11805131 11902753 11793440
4887 11793440 11692253 11523009 11308975 11184410 11130123 11026339 11064352 10965928 10793385 10803913
$$ packed form
4953C5087501r79200q32637r74398q96196p79703p65630o95270n90957n91142
4944B7982368l01880r2190M8498q7208j3605j55125j02446j66692k70699o40486
4934B6200535q71383r91715p26231o15584o96077p72670p29242n23939m87542
4925A9786152m66338j94419M042j10231P9501J74139R2920M5602l66252m29437
4915A8615679m28065n24125m17082m76940n16698o78735l96888l27373l40064
4906A4509709l02237k93265k62938l04409k48952j78780j47715k68854j05006
4897A2397553O9548l38073k55023j61217k4680J68234K5588p6799R7622j09313
4887A1793440j01187j69244k14034j24565n4287j03784L8013r8424j72543J0528
$$ plain form
4877 10803913 10707346 10677722 10730419 10653283 10481583 10529788 10569630 10683352 10706051 10364531 10291014
4866 10291014 10368236 10348372 10327653 10307567 10182711 10236768 10284961 10350708 10312664 10328539 10454785
4855 10454785 10617191 10787872 10988306 11085793 11195351 11342064 11412423 11248661 11123142 10866616
4845 10866616 10402686 10097464 9991444 9930907 9892261 9747220 9752888 9861651 9793546 9777059
4835 9777059 9824360 9840565 9993913 10192326 10316638 10310731 10407295 10366398 10226920 10268057 10280844
4824 10280844 10276664 10059380 10012923 9998599 9920467 9938419 9866118 9641757 9478472 9375924 9401616
4813 9401616 9458905 9480702 9460372 9634043 9658196 9708801 9666605 9697619 9630164 9592925 9724904
4802 9724904 9777667 9703990 9890336 9876642 9639584 9804595 9865004 9833912 9883474 9942676 10000690
$$ packed form
4877A0803913r6567k9624N2697p7136j71700M8205L9842J13722K2699l41520p3517
4866A0291014P7222j9864k0719k0086j24856N4057M8193O5747l8044J5875J26246
4855A0454785J62406J70681K00434R7487J09558J46713P0359j63762j25519k56526
4845A0866616m63930l05222j06020o0537l8646j45041N668J08763o8105j6487
4835I777059M7301J6205J53348J98413J24312n907R6564m0897j39478M1137J2787
4824A0280844m180k17284m6457j4324p8132J7952p2301k24361j63285j02548K5692
4813I401616N7289K1797k0330J73671K4153N0605m2196L1014o7455l7239J31979
4802I724904N2763p3677J86346j3694k37058J65011O0409l1092M9562N9202N8014
$$ plain form
4791 10000690 10040273 10070181 10116378 10114206 10092184 10080544 10281964 10434511 10320009 10594347 11103828
4780 11103828 11621803 12195185 12494723 12720854 12758570 12692950 12749046 12760906 12871770 13261895
4770 13261895 13673882 14148857 14353169 14306557 14085588 13717576 13480491 13431630 13499893 13638767
4760 13638767 13921415 14342194 14919070 15295739 15484148 15448682 15181346 15207003 15416918 15842119
4750 15842119 16454368 17368650 18347450 18884297 19029015 18932383 18715569 18483277 18478389 18629110
4740 18629110 18868827 19255082 19754339 20427472 21329116 22252931 22639849 22783416 23032698
4731 23032698 23068983 22853954 22885911 22909392 23017896 23211263 23584082 24323801 25209200 26159410
4721 26159410 26973785 28035762 29012483 30336808 31871039 33721444 35949336 38781545
$$ packed form
4791A0000690L9583K9908M6197k172k2022j1640K01420J52547j14502K74338N09481
4780A1103828N17975N73382K99538K26131L7716o5620N6096J1860J10864L90125
4770A3261895M11987M74975K04312m6612k20969l68012k37085m8861O8263J38874
4760A3638767K82648M20779N76876L76669J88409l5466k67336K5657K09915M25201
4750A5842119O12249R14282R78800N36847J44718r6632k16814k32292m888J50721
4740A8629110K39717L86255M99257O73133R01644R23815L86918J43567K49282
4731B3032698L6285k15029L1957K3481J08504J93367L72819P39719Q85399R50210
4721B6159410Q14375J061977R76721J324325J534231J850405K227892K832209
$$ plain form
4713 38781545 42272498 46879921 53282122 61869326 74522626 94376427 123699201 163691863
4705 163691863 211994558 255833993 279209649 279162937 260674463 238337216 225420201
4698 225420201 224917218 237928084 263462910 297954243 330639933 331213352 294573227 254504638
4690 254504638 226376590 207852496 193869121 181857127 177070754 184814926 204651979
4683 204651979 232352021 255867739 265271577 260284335 252185105 251866251 253941581 255041544
4675 255041544 263023284 275758062 286051735 294605158 287149537 255193188 218852857
4668 218852857 189630770 166584279 147437818 128599797 111258034 97548550 86851166
4661 86851166 78905954 73159161 68428309 64347918 60643903 57165715 54064276 51411950
$$ packed form
4713C8781545L490953M607423O402201Q587204J2653300J9853801K9322774L9992662
4705A63691863M8302695M3839435K3375656m6712j8488474k2337247j2917015
4698B25420201n02983J3010866K5534826L4491333L2685690N73419l6640125m0068589
4690B54504638k8128048j8524094j3983375j2011994m786373P744172J9837053
4683B04651979K7700042K3515718R403838m987242q099230l18854K075330J099963
4675B55041544P981740J2734778J0293673Q553423p455621l1956349l6340331
4668B18852857k9222087k3046491j9146461j8838021j7341763j3709484j0697384
4661H6851166p945212n746793m730852m080391l704015l478188l101439k652326
$$ plain form
4653 51411950 49157937 47203428 45332836 43454481 42071169 40865586 39649986 38705078
4645 38705078 37825726 36810204 35595202 34204315 33011505 32043063 31251221 30169518 29242497
4636 29242497 28195332 27333483 26540364 25941065 25396379 24839639 24279959 23683889 23329998
4627 23329998 22768456 22051910 21728748 21367713 20633346 20158717 19705950 19253864 18773103
4618 18773103 18290313 17983466 17554213 16998522 16656335 16268052 16048826 15816298 15622357
4609 15622357 15487193 15394019 15197415 14891529 14389822 13919843 13655351 13477823 12988134 12657725
4599 12657725 12420160 12104038 11589182 11307483 11158433 11026921 10800196 10634838 10541644 10278999
4589 10278999 10196671 10015682 9782267 9555238 9312278 8970721 8615348 8364929 8303553 8095894
$$ packed form
4653E1411950k254013j954509j870592j878355j383312j205583j215600r44908
4645C8705078q79352j015522j215002j390887j192810r68442p91842j081703r27021
4636B9242497j047165q61849p93119n99299n44686n56740n59680n96070l53891
4627B3329998n61542p16546l23162l61035p34367m74629m52767m52086m80761
4618A8773103m82790l06847m29253n55691l42187l88283k19226k32528j93941
4609A5622357j35164r3174j96604l05886n01707m69979k64492j77528m89689l30409
4599A2657725k37565l16122n14856k81699j49050j31512k26725j65358r3194k62645
4589A0278999q2328j80989k33415k27029k42960l41557l55373k50419o1376k07659
$$ plain form
4579 8095894 7820677 7673162 7470304 7412706 7183998 7045365 6706484 6504996 6319363 6318075
4569 6318075 6435617 6339975 6187100 6021461 5876718 5842072 5771168 5803603 5708753 5588517
4559 5588517 5577867 5428104 5306518 5228981 5224406 5085976 4967858 4941967 4890923 4802190 4665485
4548 4665485 4656553 4598194 4375432 4333767 4198803 4118189 4061825 4059255 4155025 4005737 3884093
4537 3884093 3925672 3861916 3657717 3643848 3734517 3751632 3772749 3648478 3413420 3452730 3476493
4526 3476493 3270646 3181155 3096859 2973270 2916985 3012603 2824792 2860568 2784079 2727335 2737174
4515 2737174 2601862 2419619 2526884 2504665 2419651 2284109 2311561 2464373 2419911 2358296
4505 2358296 2293359 2276159 2322208 2361719 2186167 2011335 1981975 1836199 1846432 1912314 1871562
$$ packed form
4579H095894k75217j47515k02858n7598k28708j38633l38881k01488j85633j288
4569F318075J17542r5642j52875j65639j44743l4646p0904L2435r4850j20236
4559E588517j0650j49763j21586p7537m575j38430j18118k5891n1044q8733j36705
4548D665485q932n8359k22762m1665j34964q0614n6364k570R5770j49288j21644
4537C884093M1579o3756k04199j3869R0669J7115K1117j24271k35058L9310K3763
4526C476493k05847q9491q4296j23589n6285R5618j87811L5776p6489n6744R839
4515B737174j35312j82243J07265k2219q5014j35542K7452J52812m4462o1615
4505B358296o4937j7200M6049L9511j75552j74832k9360j45776J0233O5882m0752
$$ plain form
4494 1871562 1895244 1830408 1815681 1751676 1854887 1833554 1618956 1602629 1640673 1543653 1501010
4483 1501010 1478575 1438210 1539169 1499026 1416671 1392955 1510506 1422429 1343984 1386067 1363780
4472 1363780 1275833 1242137 1354358 1207488 1194625 1249210 1129850 1054465 1272560 1230656 1125724
4461 1125724 1125183 1211738 1191485 1214488 1270257 1282891 1241870 1182549 1098948 1100049 1193517 1272466
4449 1272466 1185669 1106181 1052743 1030303 943748 912689 954730 933423 992246 983091 973176 820276
4437 820276 815636 824933 784037 746371 737236 834090 741145 737744 830706 801171 782488 807420
4425 807420 764417 712609 768262 777109 740880 731892 701474 533258 523485 605232 604371 640243
4413 640243 715762 757589 697990 491884 468571 609139 703664 612638 509148 512733 648526
$$ packed form
4494A871562K3682o4836j4727o4005J03211k1333k14598j6327L8044r7020m2643
4483A501010k2435m0365J00959m0143q2355k3716J17551q8077p8445M2083k2287
4472A363780q7947l3696J12221j46870j2863N4585j19360p5385K18095m1904j04932
4461A125724n41Q6555k0253K3003N5769J2634m1021n9321q3601J101R3468P8949
4449A272466q6797p9488n3438k2440q6555l1059M2041k1307N8823r155r915j52900
4437H20276m640R297m0896l7666r135R6854r2945l401R2962k9535j8683K4932
4425H07420m3003n1808N5653Q847l6229q988l0418j68216r773Q1747q61L5872
4413F40243P5519M1827n9599k06106k3313J40568R4525r1026j03490L585J35793
$$ plain form
4402 648526 632328 571065 525830 412241 296019 413176 542789 478870 396008 424400 405646
4391 405646 459391 666393 650867 584904 593959 528709 412378 388237 533986 475446 471798
4380 471798 543920 518799 574905 508272 487349 482312 353582 384984 567376 548634 436706
4369 436706 427933 348953 448125 473615 377995 408129 455682 436272 379405 239990 223522 324376
4357 324376 355521 414815 285759 320921 283212 365689 324721 253990 246448 193815 153421 165108
4345 165108 216771 330654 265071 248229 370608 378663 245589 265950 219910 323513 356620
4334 356620 277042 310531 226139 137198 151429 167424 137180 237137 293994 405436 407553 344215
4322 344215 398203 353107 163034 354556 315202 241494 245768 321447 498344 485679 528250
$$ packed form
4402F48526j6198o1263m5235j13589j16222J17157J29613o3919q2862K8392j8754
4391D05646N3745K07002j5526o5963R055o5250j16331k4141J45749n8540l648
4380D71798P2122k5121N6106o6633k0923n037j28730L1402J82392j8742j11928
4369D36706q773p8980R9172K5490r5620L0134M7553j9410n6867j39415j6468J00854
4357C24376L1145N9294j29056L5162l7709Q2477m0968p0731p542n2633m0394J1687
4345A65108N1663J13883o5583j6842J22379Q055j33074K0361m6040J03603L3107
4334C56620p9578L3489q4392q8941J4231J5995l0244R9957N6857J11442K117o3338
4322C44215N3988m5096j90073J91522l9354p3708M274P5679J76897j2665M2571
$$ plain form
4311 528250 391951 378579 541724 791496 953470 1153922 1462610 1607208 1692522 1617919
4301 1617919 1513634 1453192 1272358 1195091 1230307 1370473 1656904 1908257 1899091 1815945 1577967
4290 1577967 1345117 1228462 1160061 1310469 1244429 1192830 1442661 1640760 1724478 1764904
4280 1764904 1751996 1761103 1955588 2074838 2078110 2049230 2082048 2304000 2160406 2047729 1798770
4269 1798770 1532031 1377411 1169390 923548 655199 650967 784911 831627 645371 549934
4259 549934 548067 470487 598104 633980 539507 496722 475703 424136 289238 238731 303760
4248 303760 321490 206199 204341 295649 271059 251987 375405 306459 221511 107331 130523
4237 130523 206932 221240 202168 251997 269973 238749 360172 237235 201849 307032 329315
$$ packed form
4311E28250j36299j3372J63145K49772J61974K00452L08688J44598Q5314p4603
4301A617919j04285o0442j80834p7267L5216J40166K86431K51353r166q3146k37978
4290A577967k32850j16655o8401J50408o6040n1599K49831J98099Q3718M0426
4280A764904j2908R107J94485J19250L272k8880L2818K21952j43594j12677k48959
4269A798770k66739j54620k08021k45842k68349m232J33944M6716j86256r5437
4259E49934j867p7580J27617L5876r4473m2785k1019n1567j34898n0507O5029
4248C03760J7730j15291j858R1308k4590j9072J23418o8946q4948j14180K3192
4237A30523P6409J4308j9072M9829J7976l1224J21423j22937l5386J05183K2283
$$ plain form
4226 329315 208545 219407 218333 356536 373982 391984 489569 667799 861918 1064972 1067678
4215 1067678 972933 874589 725372 684901 524312 404791 448824 423603 369074 281334 116435
4204 116435 127532 266720 316424 231885 156881 201399 228358 143603 199390 322251 424690
4193 424690 436215 482424 330159 293170 181472 154512 155664 300668 262038 82006 127240
4182 127240 243864 256418 191144 135838 226081 270432 222072 319318 303041 245346 113305
4171 113305 272788 414594 332562 236950 252355 360554 345490 276205 218321 339297 410595
4160 410595 341358 413370 365877 340477 279201 97086 59292 163004 269376 262775 206144
4149 206144 183109 83186 82818 48116 140185 203581 314045 263621 186904 36905 -989 95527
$$ packed form
4226C29315j20770J0862j074J38203J7446J8002R7585J78230J94119K03054K706
4215A067678r4745r8344j49217m0471j60589j19521M4033k5221n4529q7740j64899
4204A16435J1097J39188M9704q4539p5004M4518K6959q4755N5787J22861J02439
4193D24690J1525M6209j52265l6989j11698k6960J152J45004l8630j80032M5234
4182A27240J16624J2554o5274n5306R0243M4351m8360R7246j6277n7695j32041
4171A13305J59483J41806q2032r5612J5405J08199j5064o9285n7884J20976P1298
4160D10595o9237P2012m7493k5400o1276j82115l7794J03712J06372o601n6631
4149B06144k3035r9923l68l4702R2069O3396J10464n0424p6717j49999l7894R6516
$$ plain form
4137 95527 23142 32092 -42542 -25089 61087 99973 31225 -47141 -46092 50064 106959 95610
4125 95610 155240 112718 29685 180596 125169 42171 102741 57469 -46545 43538 327742
4114 327742 364846 234745 134855 108820 84916 158101 116943 72736 223804 301721 298774
4103 298774 214819 218054 352202 358537 323014 307252 189529 230828 107424 246376 371343
4092 371343 552979 467159 294475 328575 231471 209251 173087 286810 302948 122958 99125
4081 99125 83820 336357 424219 344747 383714 332978 340312 313407 198275 163853 178802 256115
4069 256115 183590 143278 55892 42500 139416 264010 413540 457863 494789 466451 471522
4058 471522 508366 490440 330354 237983 250931 283265 363775 517849 390203 344713 392121
$$ packed form
4137I5527p2385Q950p4634J7453Q6176L8886o8748p8366J049R6156N6895j1349
4125I5610N9630m2522q3033J50911n5427q2998O0570m5272j04014R0083K84204
4114C27742L7104j30101r9890k6035k3904P3185m1158m4207J51068P7917k947
4103B98774q3955L235J34148O335l5523j5762j17723M1299j23404J38952J24967
4092C71343J81636q5820j72684L4100r7104k2220l6164J13723J6138j79990k3833
4081I9125j5305K52537Q7862p9472L8967n0736P334k6905j15132l4422J4949P7313
4069B56115p2525m0312q7386j3392R6916J24594J49530M4323L6926k8338N071
4058D71522L6844j7926j60086r2371J2948L2334Q0510J54074j27646m5490M7408
$$ plain form
4047 392121 367832 295319 268477 280130 389957 387555 435988 493616 368385 346614 280750
4036 280750 347544 498814 274329 388504 489411 450070 370040 236458 197200 303799
4026 303799 253268 242290 345282 259257 240576 332161 421605 404328 302271 432686 372716
4015 372716 314110 447677 235721 165286 320919 328652 320277 404123 305827 321991 256679
4004 256679 373969 417823 270042 237951 265113 240754 216440 164218 152528 276315 229187
3993 229187 217134 211998 168105 226567 266820 201019 246406 223086 291686 468797 380999 313697
3981 313697 256397 368995 305499 302120 534913 479843 403382 310254 464559 448209 421253
3970 421253 494872 522087 503132 569089 518408 625876 695700 699375 808786 767648 798142
$$ packed form
4047C92121k4289p2513k6842J1653J09827k402M8433N7628j25231k1771o5864
4036B80750O6794J51270k24485J14175J00907l9341q0030j33582l9258J06599
4026C03799n0531j0978J02992q6025j8681R1585Q9444j7277j02057J30415n9970
4015C72716n8606J33567k11956p0435J55633P733q375Q3846r8296J6164o5312
4004B56679J17290M3854j47781l2091K7162k4359k4314n2222j1690J23787m7128
3993B29187j2053n136m3893N8462M0253o5801M5387k3320O8600J77111q7798o7302
3981C13697n7300J12598o3496l379K32793n5070p6461r3128J54305j6350k6956
3970D21253P3619K7215j8955O5957n0681J07468O9824L675J09411m1138L0494
$$ plain form
3959 798142 704284 814984 855308 755636 799856 828190 911545 946818 1005482 1060099 1190091
3948 1190091 1431876 1386579 1356504 1617349 1765949 1856728 1976294 2057624 2289053 2498345
3938 2498345 2684348 2898443 3193506 3570299 3919222 4341300 4867057 5283695 5911195 6774702
3928 6774702 7719648 8794379 9985603 10989669 11251575 10587113 9744517 9323832 9036569
3919 9036569 8827440 8654407 8692713 8748809 8621175 8516888 8463863 8613600 8696287 8742818
3909 8742818 8840874 8950396 8976400 9205516 9253112 9150805 9327237 9424071 9388592 9370932 9364506
3898 9364506 9472964 9512398 9506210 9438321 9497045 9704409 10115695 10892770 11157859 10717499
3888 10717499 9822361 8748682 7556949 6577490 5648981 4785777 4069880 3480952 2943547
$$ packed form
3959G98142r3858J10700M0324r9672M4220K8334Q3355L5273N8664N4617J29992
3948A190091K41785m5297l0075K60845J48600R0779J19566Q1330K31429K09292
3938B498345J86003K14095K95063L76793L48923M22078N25757M16638O27500Q63507
3928F774702R44946J074731J191224J004066K61906o64462q42596m20685k87263
3919I036569k09129j73033L8306N6096j27634j04287n3025J49737Q2687M6531
3909H742818R8056J09522K6004K29116M7596j02307J76432R6834l5479j7660o426
3898I364506J08458L9434o188o7889N8724K07364M11286P77075K65089m40360
3888A0717499q95138j073679j191733r79459r28509q63204p15897n88928n37405
$$ plain form
3879 2943547 2442130 2098019 1835345 1514167 1272936 1195764 1017095 853138 805284 833905
3869 833905 643860 656072 551171 395134 436771 478589 452977 358725 480999 587070 422674
3858 422674 417148 351219 315072 361505 407858 199546 313362 284269 225341 403798 463498
3847 463498 508076 420891 422949 336869 271886 335721 339702 338265 249007 263798 235471 241185
3835 241185 128039 143281 234544 145823 178677 199559 213688 221548 183857 164388 193942 283795
3823 283795 510771 269247 348832 385985 420121 442780 249323 254740 229067 168270 192299
3812 192299 226800 184235 170288 213367 209368 65467 77990 145111 144585 266694 117341 122189
3800 122189 159089 277805 223080 133221 65630 25592 126531 164791 86064 -109332 -2608
$$ packed form
3879B943547n01417l44111k62674l21178k41231p7172j78669j63957m7854K8621
3869H33905j90045J2212j04901j56037M1637M1818k5612r4252J22274J06071j64396
3858D22674n526o5929l6147M6433M6353k08312J13816k9093n8928J78457N9700
3847D63498M4578q7185K058q6080o4983O3835L981j437q9258J4791k8327N714
3835B41185j13146J5242R1263q8721L2854K0882J4129P860l7691j9469K9554Q9853
3823B83795K26976k41524P9585L7153L4136K2659j93457N417k5673o0797K4029
3812A92299L4501m2565j3947M3079l999j43901J2523O7121n26J22109j49353M848
3800A22189L6900J18716n4725q9859o7591m0038J00939L8260p8727j95396J06724
$$ plain form
3789 -2608 142084 194318 175222 221969 256490 225341 167747 141171 323461 299928 274816 147867
3777 147867 -30776 -7069 109909 224842 181393 49269 146861 141683 130576 50754 120723
3766 120723 97203 5083 19463 86506 82310 -9689 -36400 63578 214350 92809 -61682
3755 -61682 -5390 -54945 -41289 145709 59405 136219 137367 65754 130771 163868 220287 127946
3743 127946 27002 3742 -78886 -2957 128539 69647 -12173 -62728 42704 60274 35035
3732 35035 29134 59844 135850 38850 7135 51161 163062 63628 -115712 -79407 -89567 -61604
3720 -61604 48490 172775 201966 108046 134087 34768 71664 -46945 -143234 -63310 -29947
3709 -29947 -75176 -19173 151577 86403 -23807 -120762 -74745 13385 26125 109806 170616
$$ packed form
3789b608J44692N2234j9096M6747L4521l1149n7594k6576J82290k3533k5112j26949
3777A47867j78643K3707J16978J14933m3449j32124R7592n178j1107p9822O9969
3766A20723k3520r2120J4380O7043m196r1999k6711R9978J50772j21541j54491
3755f1682N6292m9555J3656J86998q6304P6814J148p1613O5017L3097N6419r2341
3743A27946j00944k3260q2628P5929J31496n8892q1820n0555J05432J7570k5239
3732C5035n901L0710P6006r7000l1715M4026J11901r9434j79340L6305j0160K7963
3720f1604J10094J24285K9191r3920K6041r9319L6896j18609r6289P9924L3363
3709b9947m5229N6003J70750o5174j10210r6955M6017Q8130J2740Q3681O0810
$$ plain form
3698 170616 149617 68494 95875 176620 174956 171244 218285 175902 274321 210022 182948 211940
3686 211940 287867 258861 313569 232691 141816 228609 287665 341068 268471 89829 -18250
3675 -18250 83333 103353 12653 72691 59347 140538 68478 153023 33662 -68670 47708
3664 47708 32827 -9577 85285 84302 105681 289186 320459 354399 202401 197141 289549 165386
3652 165386 132164 103175 139848 218292 324944 211433 153819 80299 160306 300657 234820
3641 234820 184285 -23633 -48455 818 128811 159544 213632 359502 209347 84216 24501
3630 24501 -25024 181096 156617 245183 86936 -60473 -93704 -52071 100047 66979 185144
3619 185144 137058 -83484 52229 179004 250342 155494 50712 35329 20507 189127 249412
$$ packed form
3698A70616k0999q1123K7381Q0745j664l712M7041m2383R8419o4299k7074K8992
3686B11940P5927k9006N4708q0878r0875Q6793N9056N3403p2597j78642j08079
3675a8250J01583K0020r0700O0038j3344Q1191p2060Q4545j19361j02332J16378
3664D7708j4881m2404R4862r83K1379J83505L1273L3940j51998n260R2408j24163
3652A65386l3222k8989L6673P8444J06652j13511n7614p3520Q0007J40351o5837
3641B34820n0535k07918k4822M9273J27993L0733N4088J45870j50155j25131n9715
3630B4501m9525K06120k4479Q8566j58247j47409l3231M1633J52118l3068J18165
3619A85144m8086k20542J35713J26775P1338r4848j04782j5383j4822J68620O0285
$$ plain form
3608 249412 231455 305518 128610 109268 216604 210933 203122 381558 258621 303790 374542
3597 374542 216681 87268 -14989 101938 312955 329818 117443 185736 274358 271991 337204
3586 337204 232794 256476 138189 89117 166576 177122 101176 105198 93906 223456 190921
3575 190921 153085 149301 132472 170446 137997 158256 200716 167035 159455 182517 213185 169952
3563 169952 244348 448136 445421 449094 398910 435530 440233 373119 276681 353313 488184 557956
3551 557956 468472 637148 715375 617326 590603 684674 711385 717315 757834 796491 819816 820376
3539 820376 1168813 1182396 1205023 1361882 1424911 1447285 1601667 1661909 1526465 1418193 1373863
3528 1373863 1398213 1484605 1576787 1707698 1906985 1883226 1958815 2004819 1887356 1867496 1815512
$$ packed form
3608B49412j7957P4063j76908j9342J07336n671p811J78436j22937M5169P0752
3597C74542j57861j29413j02257J16927K11017J6863k12375O8293Q8622k367O5213
3586C37204j04410K3682j18287m9072P7459J0546p5946M022j1292J29550l2535
3575A90921l7836l784j6829L7974l2449K0259M2460l3681p580K3062L0668m3233
3563A69952P4396K03788k715L673n0184L6620M703o7114r6438P6632J34871O9772
3551E57956q9484J68676P8227r8049k6723R4071K6711N930M0519L8657K3325N60
3539H20376L48437J3583K2627J56859O3029K2374J54382O0242j35444j08272m4330
3528A373863K4350Q6392R2182J30911J99287k3759P5589M6004j17463j9860n1984
$$ plain form
3517 1815512 1690131 1554725 1371084 1560545 1656393 1623828 1591544 1792314 1937541 1946137
3507 1946137 2007477 1960900 2036563 2290359 2534865 2786386 3103974 3265062 3244812 3190145
3497 3190145 2946717 2797671 2877827 3158551 3414152 3622758 3659348 3598105 3657376 3698225
3487 3698225 3442214 3154877 2878705 2805983 2670680 2580771 2614893 2663597 2690073 2841994
3477 2841994 3176594 3366429 3346066 3100779 3155776 3221066 3345531 3526118 3650964 3851225
3467 3851225 3915799 3995529 3944376 3687761 3434560 3365071 3468479 3671904 3760046 3970403
3457 3970403 4154553 4378188 4663328 4579325 4468079 4445326 4364365 4035497 4021346 4097710
3447 4097710 4388511 4709907 4996744 5562088 6087764 6160465 5885045 5696231 5324112 5339890
$$ packed form
3517A815512j25381j35406j83641J89461R5848l2565l2284K00770J45227Q596
3507A946137O1340m6577P5663K53796K44506K51521L17588J61088k0250n4667
3497C190145k43428j49046Q0156K80724K55601K08606L6590o1243N9271M0849
3487C698225k56011k87337k76172p2722j35303q9909L4122M8704K6476J51921
3477B841994L34600J89835k0363k45287N4997O5290J24465J80587J24846K00261
3467C851225O4574P9730n1153k56615k53201o9489J03408K03425Q8142K10357
3457C970403J84150K23635K85140q4003j11246k2753q0961l28868j4151P6364
3447D097710K90801L21396K86837N65344N25676P2701k75420j88814l72119J5778
$$ plain form
3437 5339890 5578318 5867177 6414006 6874662 7097816 6914437 6405071 5847683 5597650 5403488
3427 5403488 5418258 5456765 5403667 5666345 5796256 6047201 6081244 5956295 5660412 5504975
3417 5504975 5449550 5527655 5773740 6159584 6794957 7373534 7959628 7868055 7330742 6997230
3407 6997230 6700386 6779880 7170022 7668951 8329879 9079383 9724414 9419269 8412262 7417651
3397 7417651 6737565 6253626 6004025 5707315 5314963 5010717 4900783 4780322 4474901 4232757
3387 4232757 4121116 3872213 3733156 3683336 3789531 3902319 4196973 4546621 4798977 4612194
3377 4612194 4398964 4164760 4065563 4040807 4053360 4242207 4524430 4886288 5106925 4862017
3367 4862017 4355151 3956954 3490364 3183533 3049947 2643957 2179056 1932081 1869986 1686825
$$ packed form
3437E339890K38428K88859N46829M60656K23154j83379n09366n57388k50033j94162
3427E403488J4770L8507n3098K62678J29911K50945L4043j24949k95883j55437
3417E504975n5425P8105K46085L85844O35373N78577N86094r1573n37313l33512
3407F997230k96844P9494L90142M98929O60928P49504O45031l05145j007007r94611
3397G417651o80086m83939k49601k96710l92352l04246j09934j20461l05421k42144
3387D232757j11641k48903j39057m9820J06195J12788K94654L49648K52356j86783
3377D612194k13230k34204r9197k4756J2553J88847K82223L61858K20637k44908
3367D862017n06866l98197m66590l06831j33586m05990m64901k46975o2095j83161
$$ plain form
3357 1686825 1454336 1564411 1465407 1368440 1269106 1292437 1199352 1177595 1088471 1127414 1098315
3346 1098315 957289 966423 1026260 1128391 961427 821972 640210 686918 721183 710740 697900
3335 697900 672063 532422 354634 343921 401169 569490 679905 546397 327420 280231
3325 280231 401823 515688 410771 203152 213645 270613 324796 359652 359574 279492 277035 315144
3313 315144 303704 355485 194231 193312 279705 303413 213383 135523 145916 213695 155596 156532
3301 156532 193764 153231 139694 119092 189861 105964 113036 21106 2428 136583 36796 29864
3289 29864 -27228 -30606 49317 12590 -15802 105517 275756 175837 102046 96376 10772 33810
3277 33810 -50199 44717 54900 -17270 139737 98119 -29526 -68902 20771 -90129 -103076
$$ packed form
3357A686825k32489J10075r9004r6967r9334K3331r3085k1757q9124L8943k9099
3346A098315j41026R134N9837J02131j66964j39455j81762M6708L4265j0443j2840
3335F97900k5837j39641j77788j0713N7248J68321J10415j33508k18977m7189
3325B80231J21592J13865j04917k07619J0493N6968N4183L4856p8q0082k457L8109
3313C15144j1440N1781j61254r19Q6393K3708r0030p7860J0393O7779n8099R36
3301A56532L7232m0533j3537k0602P0769q3897P072r1930j8678J34155r9787o932
3289B9864n7092l378P9923l6727k8392J21319J70239r9919p3791n670q5604K3038
3277C3810q4009R4916J0183p2170J57007m1618j27645l9376Q9673j10900j2947
$$ plain form
3266 -103076 -156735 -136880 -15493 -188482 -97182 -54089 -15003 105623 -109245 -146628 -113445
3255 -113445 10593 -16064 -30131 -22378 -143167 -67005 -52058 88787 33868 -63309 -188810
3244 -188810 -205635 -177604 -114051 -70862 -64797 -63375 93814 68010 -67511 -174879 -150767
3233 -150767 -90870 -57899 -133557 -176007 -254799 -148045 -123279 -208470 -19174 -83474 -81220
3222 -81220 -21790 -32996 -128299 -160325 -133038 -272730 -205574 -91276 -20126 -168782 -162744
3211 -162744 -174685 -243510 -190165 -231468 -77058 47425 855 -37817 -99961 -117119 -130441
3200 -130441 -43368 113281 134078 51772 -92638 -78296 -30384 -126674 -160966 -178763 -122524
3189 -122524 -186970 -180227 -86607 -123025 4712 -127064 -105503 -63278 -214784 -63371 -48393
$$ packed form
3266a03076n3659J9855J21387j72989R1300M3093L9086J20626k14868l7383L3183
3255a13445J24038k6657j4067P753j20789P6162J4947J40845n4919r7177j25501
3244a88810j6825K8031O3553M3189O065J422J57189k5804j35521j07368K4112
3233a50767N9897L2971p5658m2450p8792J06754K4766q5191J89296o4300K254
3222h1220N9430j1206r5303l2026K7287j39692O7156J14298P1150j48656O038
3211a62744j1941o8825N3345m1303J54410J24483m6570l8672o2144j7158j3322
3200a30441Q7073J56649K0797q2306j44410J4342M7912r6290l4292j7797N6239
3189a22524o4446O743R3620l6418J27737j31776K1561M2225j51506J51413J4978
$$ plain form
3178 -48393 -138918 -73647 -125758 -140203 -213412 -78772 -11212 -6436 -52053 -150995 -111455 -155955
3166 -155955 -222057 -102193 -135763 24527 183290 37771 -110991 -153970 -233035 -240361 -49221
3155 -49221 23304 -50574 -100939 -71466 22709 57057 24043 -40936 -231459 -337622 -261802
3144 -261802 -227555 -70451 -25641 -120464 -166117 -158601 -119572 -110804 -142691 -214218 -166369 -103684
3132 -103684 -74135 -71843 9831 122122 56346 54726 -65987 -76567 -70883 50013 80252 87364
3120 87364 67248 23281 -55468 -66417 -72616 -45562 -76140 -63518 -106916 -63758 -3096 -107654
3108 -107654 -163790 -137920 79215 -13691 -241359 -138888 -55354 -39873 -1533 20106 116271
3097 116271 93494 -72969 -24231 -62687 -4206 -83563 -574 56422 -13573 -28830 -57150
$$ packed form
3178d8393r0525O5271n2111j4445p3209J34640O7560M776m5617r8942L9540m4500
3166a55955o6102J19864l3570J60290J58763j45519j48762m2979p9065p326J91140
3155d9221P2525p3878n0365K9473R4175L4348l3014o4979j90523j06163P5820
3144b61802L4247J57104M4810r4823m5653P516L9029Q768l1887p1527M7849O2685
3132a03684K9549K292Q1674J12291o5776j620j20713j0580N684J20896L0239P112
3120H7364k0116m3967p8749j0949o199K7054l0578J2622m3398M3158O0662j04558
3108a07654n6136K5870K17135r2906k27668J02471Q3534J5481L8340K1639R6165
3097A16271k2777j66463M8738l8456N8481p9357Q2989N6996o9995j5257k8320
$$ plain form
3086 -57150 -18473 -8249 46009 23046 -11240 -98974 71497 -30539 -9780 -119485 -24330
3075 -24330 24202 -101906 -208645 -142784 -39447 -4829 88806 163797 180207 131049 22769
3064 22769 72290 6852 -97587 -143552 -95640 -204864 -127321 -109883 -136107 -54631 -167312
3053 -167312 -332590 -226408 -119451 -159777 -95009 -67160 -86083 -107717 -193693 -191092 -230586
3042 -230586 -127582 39346 -7740 -105256 7056 -79862 -250825 -252209 -79204 -3928 -219151
3031 -219151 -312099 -338041 -275206 -213875 -82345 -157436 -224900 -322886 -297470 -221724 -264538
3020 -264538 -226809 -269761 -290525 -285083 -278000 -234299 -199839 -170837 -263764 -282465 -330486 -359012
3008 -359012 -225268 -142052 -350269 -327044 -222590 -104210 -75610 -83050 -161605 -160215 -147690
$$ packed form
3086e7150L8677J0224N4258k2963l4286q7734J70471j02036K0759j09705R5155
3075b4330M8532j26108j06739O5861J03337L4618R3635P4991J6410m9158j08280
3064B2769M9521o5438j04439m5965M7912j09224P7543J7438k6224Q1476j12681
3053a67312j65278J06182J06957m0326O4768K7849j8923k1634q5976K601l9494
3042b30586J03004J66928m7086r7516J12312q6918j70963j384J73005P5276k15223
3031b19151r2948k5942O2835O1331J31530p5091o7464r7986K5416P5746m2814
3020b64538L7729m2952k0764N442P083M3701L4460K9002r2927j8701m8021k8526
3008c59012J33744Q3216k08217K3225J04454J18380K8600p440p8555J390J2525
$$ plain form
2997 -147690 -206748 -279892 -257808 -154831 -205802 -149112 -176843 -102481 -165579 -173813 -174659 -69344
2985 -69344 -103384 -56067 -121992 -61701 -167095 -214638 -188547 -111211 26439 -137343 -279520
2974 -279520 -290690 -242012 -374648 -466579 -415491 -325913 -278705 -242408 -232155 -241190 -293153 -327409
2962 -327409 -316286 -318851 -371738 -257950 -268403 -259907 -176803 -145739 -61908 -63708 -216410 -325094
2950 -325094 -349705 -303276 -219257 -294994 -431135 -336034 -251185 -225796 -352095 -127339 -64590
2939 -64590 -205648 -257621 -355055 -349211 -249161 -243830 -257779 -184482 -128499 -282342 -277633 -267975
2927 -267975 -309932 -265605 -182372 -248094 -195881 -262791 -232943 -345510 -326164 -169756 -196261
2916 -196261 -301355 -358436 -351285 -323958 -374721 -258852 -150920 -130947 -136027 -194793 -210632
$$ packed form
2997a47690n9058p3144K2084J02977n0971N6690k7731P4362o3098q234q46J05315
2985f9344l4040M7317o5925O0291j05394m7543K6091P7336J37650j63782j42177
2974b79520j1170M8678j32636r1931N1088Q9578M7208L6297J0253r035n1963l4256
2962c27409J1123k565n2887J13788j0453Q496Q3104L1064Q3831j800j52702j08684
2950c25094k4611M6429Q4019p5737j36141R5101Q4849K5389j26299K24756O2749
2939f4590j41058n1973r7434N844J00050N331j3949P3297N5983j53843M709R658
2927b67975m1957M4327Q3233o5722N2213o6910K9848j12567J9346J56408k6505
2916a96261j05094n7081P151K7327n0763J15869J07932J9973n080n8766j5839
$$ plain form
2905 -210632 -254434 -255094 -341629 -195254 -229740 -332688 -390728 -282410 -424667 -356298 -158284
2894 -158284 -254837 -247588 -236358 -386954 -446535 -235049 -188166 -279769 -311230 -264801 -259743 -272970
2882 -272970 -286872 -200128 -260232 -174291 -169945 -203244 -225362 -233159 -279869 -216900 -219294 -253141
2870 -253141 -255988 -258378 -233824 -159781 -133155 -252486 -193290 -368215 -283810 -146104 -149870 -266720
2858 -266720 -327989 -157504 -3074 -96898 -169714 -290851 -297073 -245934 -235075 -213610 -215154
2847 -215154 -219688 -225865 -259883 -128458 -233328 -139866 -185349 -297853 -356592 -239798 -274426
2836 -274426 -208440 -242700 -284527 -222089 -239001 -205330 -171884 -158780 -52246 -168692 -176652
2825 -176652 -71953 -115591 -231240 -268798 -239267 -220629 -206699 -342326 -317423 -305849 -274462
$$ packed form
2905b10632m3802o60q6535J46375l4486j02948n8040J08318j42257O8369J98014
2894a58284r6553P249J1230j50596n9581K11486M6883r1603l1461M6429N058j3227
2882b72970j3902Q6744o0104Q5941M346l3299k2118p797m6710O2969k394l3847
2870b53141k847k390K4554P4043K6626j19331N9196j74925Q4405J37706l766j16850
2858b66720o1269J70485J54430r3824p2816j21137o222N1139J0859K1465j544
2847b15154m534o177l4018J31425j04870R3462m5483j12504n8739J16794l4628
2836b74426O5986l4260m1827O2438j6912L3671L3446J3104J06534j16446p960
2825a76652J04699m3638j15649l7558K9531J8638J3930j35627K4903J1574L1387
$$ plain form
2814 -274462 -308099 -384080 -354722 -141948 -148880 -249777 -266051 -236459 -377615 -228429 -162691
2803 -162691 -242223 -134477 -259307 -367055 -178207 -87440 -210347 -287613 -204114 -103151
2793 -103151 718 -40656 -115658 -48018 31661 94828 -124180 -196535 -273497 -191701 -99633
2782 -99633 -65957 -55784 -157516 -129378 -209797 -238614 -170468 -152285 -271534 -272740 -322288 -314044
2770 -314044 -377893 -283624 -221067 -285382 -296847 -205566 -56717 -74307 -130080 -147079 -247749
2759 -247749 -144878 -222151 -349788 -331771 -228393 -197829 -274401 -327540 -146188 -14945 -116610
2748 -116610 -271708 -373171 -249000 -193837 -267729 -182565 -250228 -148606 -151206 -236762 -273607
2737 -273607 -360356 -381008 -381831 -404013 -434971 -253921 -111665 -99759 -231222 -277024 -279596 -129528
$$ packed form
2814b74462l3637p5981K9358K12774o932j00897j6274K9592j41156J49186O5738
2803a62691p9532J07746j24830j07748J88848R0767j22907p7266Q3499J00963
2793a03151J03869m1374p5002O7640P9679O3167k19008p2355p6962Q1796R2068
2782i9633L3676J0173j01732K8138q0419k8817O8146J8183j19249j206m9548Q244
2770c14044o3849R4269O2557o4315j1465R1281J48849j7590n5773j6999j00670
2759b47749J02871p7273j27637J8017J03378L0564p6572n3139J81352J31243j01665
2748a16610j55098j01463J24171N5163p3892Q5164o7663J01622k600q5556l6845
2737b73607q6749k0652q23k2182l0958J81050J42256J1906j31463m5802k572J50068
$$ plain form
2725 -129528 -67475 -103521 -212237 -257834 -275193 -169610 -133568 -180630 -128107 -199093 -198605 -153968
2713 -153968 -126953 -90589 -231167 -369914 -219657 -105930 -240589 -258170 -273687 -144580
2703 -144580 -213484 -250163 -218843 -230697 -177996 -180455 -126599 -245295 -251129 -238040 -149936 -152637
2691 -152637 -54481 -105692 -185740 -236039 -236979 -272476 -249085 -159433 -281648 -204118 -189810 -159552
2679 -159552 -71524 -54412 -98906 -126824 -295858 -280192 -220262 -227515 -216719 -121487 -211219 -94257
2667 -94257 -95991 -169876 -162689 -193712 -128958 -84314 -46159 -47001 -143802 -266794 -178456 -120163
2655 -120163 -69938 -89258 -188044 -233712 -112328 -71894 28203 37390 -147399 -153294 -121443
2644 -121443 -290941 -159640 -15354 -13793 -47742 -106752 -170325 -289628 -249359 -235277 -294090
$$ packed form
2725a29528O2053l6046j08716m5597j7359J05583L6042m7062N2523p0986M88M4637
2713a53968K7015L6364j40578j38747J50257J13727j34659j7581j5517J29107
2703a44580o8904l6679L1320j1854N2701k459N3856j18696n834J3089Q8104k701
2691a52637R8156n1211q0048n0299r40l5497K3391Q9652j22215P7530J4308L0258
2679a59552Q8028J7112m4494k7918j69034J5666N9930p253J0796R5232q9732J16962
2667i4257j734p3885P187l1023O4754M4644L8155q42r6801j22992Q8338N8293
2655a20163N0225j9320r8786m5668J21384M0434J00097R187j84789n895L1851
2644a21443j69498J31301J44286J561l3949n9010o3573j19303M0269J4082n8813
$$ plain form
2633 -294090 -213958 -23764 -82882 -210900 -103614 -31253 -105270 -150150 -262732 -342882 -142095
2622 -142095 15211 77235 -85567 -161807 -152365 -63494 -123797 -147800 -9725 145498 85762
2611 85762 -104866 -48638 -135575 -239564 -216101 -194424 -219851 -184305 -51918 -62942 -157228
2600 -157228 -133123 -127293 -118783 -37968 -131658 -182041 -181149 -84366 -64320 -49420 -60505 -155204
2588 -155204 -115596 57682 1728 8708 -63042 -129613 -115990 -211579 -128333 -64524 -65514 72200
2576 72200 211951 98925 -57308 -26793 109039 135080 195552 312798 407074 434943 562450
2565 562450 395211 285024 329413 198282 160290 138132 23865 17433 -11633 -37253 -65593
2554 -65593 -34901 -43791 87067 9635 -74838 -127278 -63987 -108558 -27901 -112869 -4641 -57653
$$ packed form
2633b94090Q0132J90194n9118j28018J07286P2361p4017m4880j12582q0150K00787
2622a42095J57306O2024j62802p6240R442Q8871o0303k4003J38075J55223n9736
2611H5762j90628N6228q6937j03989K3463K1677k5427L5546J32387j1024r4286
2600a57228K4105N830Q510Q0815r3690n0383Q92R6783K0046J4900j1085r4699
2588a55204L9608J73278n5954O980p1750o6571J3623r5589Q3246O3809r90J37714
2576G2200J39751j13026j56233L0515J35832K6041O0472J17246R4276K7869J27507
2565E62450j67239j10187M4389j31131l7992k2158j14267o432k9066k5620k8340
2554f5593L0692q890J30858p7432q4473n2440O3291m4571Q0657q4968J08228n3012
$$ plain form
2542 -57653 -94568 -161512 -156502 -178667 -196577 -90732 -192933 -181271 -43343 21744 -44709
2531 -44709 66798 93536 147827 207694 48236 -110326 -81997 -25352 -78154 -88986 -54681
2520 -54681 -14422 -4826 66700 63693 -72205 -96935 -144014 -141189 5790 -68111 -24469 87876
2508 87876 19471 69366 57743 -68989 -24805 -31596 -96890 -19609 -132814 -136550 -23368 112462
2496 112462 33998 36675 110762 83521 93429 113377 46189 30409 51014 66823 105489 233182
2484 233182 145883 47675 37717 59987 66207 -3179 59465 114200 123284 340718 126903 52384
2472 52384 33695 91779 71531 115229 129826 171661 89409 -10468 47799 117566 52975 112260
2460 112260 172515 210287 320221 263448 256393 207249 225325 271316 392234 322486 110646
$$ packed form
2542e7653l6915o6944N010k2165j7910J05845j02201J1662J37928O5087o6453
2531d4709J11507K6738N4291N9867j59458j58562K8329N6645n2802j0832L4305
2520e4681M0259R596P1526l007j35898k4730m7079K825J46979p3901M3642J12345
2508H7876o8405M9895j1623j26732M4184o791o5294P7281j13205l736J13182J35830
2496A12462p8464K677P4087k7241R908J9948o7188j5780K0605J5809L8666J27693
2484B33182q7299r8208r958K2270O220o9386O2644N4735R084K17434k13815p4519
2472E2384j8689N8084k0248M3698J4597M1835q2252r9877N8267O9767o4591N9285
2460A12260O0255L7772J09934n6773p055m9144J8076M5991J20918o9748k11840
$$ plain form
2449 110646 71816 119991 204978 119926 43759 199726 145882 36388 40351 148846 261141
2438 261141 262561 269781 380481 351519 395609 400246 287274 332678 367130 222205 204572 410022
2426 410022 340405 441474 408336 442427 370620 465796 569368 552606 515169 556869 641225
2415 641225 620877 664033 546648 488270 551251 486518 522219 479238 489154 665384 729045
2404 729045 680540 706522 779111 792775 758104 838890 804602 673770 636378 721793 794376
2393 794376 702526 832962 683701 811372 835620 849155 845286 958026 971967 940995 884791
2382 884791 869612 891358 908787 971908 1060062 1013931 920522 1032280 966202 1024765 987558
2371 987558 1027635 1219281 1139528 1165781 1335076 1515768 1450629 1402851 1388248 1260078 1288502
$$ packed form
2449A10646l8830M8175Q4987q5052p6167J55967n3844j09494L963J08495J12295
2438B61141J420P220J10700k8962M4090M637j12972M5404L4452j44925j7633K05450
2426D10022o9617J01069l3138L4091p1807R5176J03572j6762l7437M1700Q4356
2415F41225k0348M3156j17385n8378O2981o4733L5701m2981R916J76230O3661
2404G29045m8505K5982P2589J3664l4671Q0786l4288j30832l7392Q5415P2583
2393G94376r1850J30436j49261J27671K4248J3535l869J12740J3941l0972n6204
2382H84791j5179K1746J7429O3121Q8154m6131r3409J11758o6078N8563l7207
2371I87558M0077J91646p9753K6253J69295J80692o5139m7778j4603j28170K8424
$$ plain form
2360 1288502 1395780 1386053 1426323 1461976 1388597 1458080 1511066 1495109 1774143 1783338 1765214
2349 1765214 1773729 1845977 2032056 2084847 2075922 2190406 2310809 2356945 2404866 2556165 2630352
2338 2630352 2614283 2649718 2697935 2812145 2894654 2808649 3127502 3200716 3236560 3376033 3569043
2327 3569043 3706799 3869027 3996398 4263336 4415952 4551293 4845184 5328809 5758748 6613736
2317 6613736 7306792 8174636 8967342 9510946 9406395 9654883 9917704 10734086 11809668
2308 11809668 13522191 15630198 19189350 24316392 33602304 47610930 65336676 85273172
$$ packed form
2360A288502J07278r727M0270L5653p3379O9483N2986j5957K79034R195j8124
2349A765214Q515P2248J86079N2791q925J14484J20403M6136M7921J51299P4187
2338B630352j6069L5435M8217J14210Q2509q6005L18853P3214L5844J39473J93010
2327C569043J37756J62228J27371K66938J52616J35341K93891M83625M29939Q54988
2317F613736O93056Q67844P92706N43604j04551K48488K62821Q16382J075582
2308A1809668J712523K108007L559152N127042R285912J4008626J7725746J9936496
$$ [...]
##END NTUPLES=NMR SPECTRUM
##END=
