##TITLE=1H_DE-80H_X3
 200.13MHz, d2o
 8 sc
 
 19ns.26.2.2025
##JCAMPDX= 6.0         $$ Bruker NMR JCAMP-DX V2.0
##DATA TYPE= NMR SPECTRUM
##DATA CLASS= NTUPLES
##ORIGIN= UXNMR, Bruker Analytische Messtechnik GmbH
##OWNER= pz
$$ XWIN-NMR		Version 3.5
$$ Tue Dec  9 10:38:44 2025 Russian Standard Time (UT+4h)  Yarkov@DPX200
##.OBSERVE FREQUENCY= 200.1313
##.OBSERVE NUCLEUS= ^1H
##.ACQUISITION MODE= SIMULTANEOUS
##.ACQUISITION SCHEME= undefined
##.AVERAGES= 8
##.DIGITISER RES= 18
##SPECTROMETER/DATA SYSTEM= spect
##.PULSE SEQUENCE= zg30
##.SOLVENT NAME= CDCl3
##.SHIFT REFERENCE= (INTERNAL, CDCl3, 0, 15.5188)
##AUDIT TRAIL= $$ (NUMBER, WHEN, WHO, WHERE, WHAT)
$$ ##TITLE= Audit trail, XWIN-NMR		Version 3.5
$$ ##JCAMPDX= 5.01
$$ ##ORIGIN= Bruker BioSpin GmbH
$$ ##OWNER= Yarkov
$$ C:/Bruker/XWIN-NMR/data/yarkov2/nmr/H-C/1/pdata/1/auditp.txt
$$ ##AUDIT TRAIL=  $$ (NUMBER, WHEN, WHO, WHERE, WHAT)
(   1,<2025-12-09 10:37:22.32 +0400>,<Yarkov>,<DPX200>,
      <created by zg, POWCHK disabled, PULCHK disabled
       configuration hash MD5:
       00 E9 B6 7A A2 85 ED C7 34 08 36 98 17 FE 4E 26
       data hash MD5: 16K
       A1 60 C9 27 6F 12 3C 70 A2 81 37 0A 14 06 0A 36>)
(   2,<2025-12-09 10:37:26.04 +0400>,<Yarkov>,<DPX200>,
      <Start of raw data processing
       efp BC_mod = 2 LB = 0.25 FT_mod = 6 PKNL = 1 PHC0 = -5290.919 PHC1 = -3.978085 SI = 16K 
       data hash MD5: 16K
       E9 A5 44 F8 C3 98 E9 43 A0 59 6B A8 8D 94 A4 50>)
$$ ##END=
$$ 
$$ hash MD5
$$ 8D 5A C7 55 50 88 F1 00 4C 8A E2 B1 49 68 47 E4
##$RELAX= 
##$RELAX= 
##$RELAX= 
##$RELAX= 
##$RELAX= 
##$RELAX= 
$$ Bruker specific parameters
$$ --------------------------
##$DU= <C:/Bruker/XWIN-NMR>
##$EXPNO= 1
##$NAME= <H-C>
##$PROCNO= 1
##$TYPE= <nmr>
##$USER= <yarkov2>
##$AMP= (0..31)
100 100 100 100 100 100 100 100 100 100 100 100 100 100 100 100 100 100 
100 100 100 100 100 100 100 100 100 100 100 100 100 100 
##$AQSEQ= 0
##$AQ_mod= 1
##$AUNM= <au_zg>
##$AUTOPOS= <>
##$BF1= 200.13
##$BF2= 200.13
##$BF3= 200.13
##$BF4= 200.13
##$BF5= 200.13
##$BF6= 200.13
##$BF7= 200.13
##$BF8= 200.13
##$BYTORDA= 1
##$CFDGTYP= 0
##$CFRGTYP= 5
##$CHEMSTR= <none>
##$CNST= (0..31)
1 1 145 1 1 1 1 1 1 1 1 1 1 1 1 1 1 1 1 1 1 1 1 1 1 1 1 1 1 1 1 1 
##$CPDPRG= <>
##$CPDPRG1= <>
##$CPDPRG2= <>
##$CPDPRG3= <>
##$CPDPRG4= <mlev>
##$CPDPRG5= <mlev>
##$CPDPRG6= <mlev>
##$CPDPRG7= <mlev>
##$CPDPRG8= <mlev>
##$CPDPRGB= <>
##$CPDPRGT= <>
##$D= (0..31)
0 0.7 0 0 0 0 0 0 0 0 0 0.03 0 0 0 0 0 0 0 0 0 0 0 0 0 0 0 0 0 0 0 0 
##$DATE= 1765262241
##$DBL= (0..7)
120 120 120 120 120 120 120 120 
##$DBP= (0..7)
150 150 150 150 150 150 150 150 
##$DBP07= 0
##$DBPNAM0= <>
##$DBPNAM1= <>
##$DBPNAM2= <>
##$DBPNAM3= <>
##$DBPNAM4= <>
##$DBPNAM5= <>
##$DBPNAM6= <>
##$DBPNAM7= <>
##$DBPOAL= (0..7)
0.5 0.5 0.5 0.5 0.5 0.5 0.5 0.5 
##$DBPOFFS= (0..7)
0 0 0 0 0 0 0 0 
##$DE= 6
##$DECBNUC= <off>
##$DECIM= 32
##$DECNUC= <off>
##$DECSTAT= 4
##$DIGMOD= 1
##$DIGTYP= 9
##$DL= (0..7)
0 120 120 120 120 120 120 120 
##$DP= (0..7)
$$ [...]
##$SUBNAM2= <"">
##$SUBNAM3= <"">
##$SUBNAM4= <"">
##$SUBNAM5= <"">
##$SUBNAM6= <"">
##$SUBNAM7= <"">
##$SUBNAM8= <"">
##$SUBNAM9= <"">
##$SW= 18.0517328524113
##$SWIBOX= (0..15)
0 0 2 0 0 0 0 0 0 0 0 0 0 0 0 0 
##$SW_h= 3612.71676300578
##$TD= 16384
##$TD0= 1
##$TE= 0
##$TE2= 300
##$TE3= 300
##$TEG= 300
##$TL= (0..7)
0 120 120 120 120 120 120 120 
##$TP= (0..7)
150 150 150 150 150 150 150 150 
##$TP07= 0
##$TPNAME0= <>
##$TPNAME1= <>
##$TPNAME2= <>
##$TPNAME3= <>
##$TPNAME4= <>
##$TPNAME5= <>
##$TPNAME6= <>
##$TPNAME7= <>
##$TPOAL= (0..7)
0.5 0.5 0.5 0.5 0.5 0.5 0.5 0.5 
##$TPOFFS= (0..7)
0 0 0 0 0 0 0 0 
##$TUNHIN= 0
##$TUNHOUT= 0
##$TUNXOUT= 0
##$USERA1= <user>
##$USERA2= <user>
##$USERA3= <user>
##$USERA4= <user>
##$USERA5= <user>
##$V9= 5
##$VALIST= <valist>
##$VCLIST= <CCCCCCCCCCCCCCC>
##$VD= 0
##$VDLIST= <DDDDDDDDDDDDDDD>
##$VPLIST= <PPPPPPPPPPPPPPP>
##$VTLIST= <TTTTTTTTTTTTTTT>
##$WBST= 1024
##$WBSW= 4
##$XGAIN= (0..3)
0 0 0 0 
##$XL= 0
##$YL= 0
##$YMAX_a= 294244
##$YMIN_a= -294364
##$ZGOPTNS= <>
##$ZL1= 120
##$ZL2= 120
##$ZL3= 120
##$ZL4= 120
##$ABSF1= 0
##$ABSF2= 0
##$ABSG= 0
##$ABSL= 0
##$ALPHA= 0
##$AQORDER= 0
##$ASSFAC= 0
##$ASSFACI= 0
##$ASSFACX= 0
##$ASSWID= 0
##$AUNMP= <proc_1d>
##$AZFE= 0.1
##$AZFW= 0.1
##$BCFW= 0
##$BC_mod= 2
##$BYTORDP= 0
##$COROFFS= 0
##$CY= -3
##$DATMOD= 1
##$DC= 0
##$DFILT= <>
##$DTYPP= 0
##$F1P= 0
##$F2P= 0
##$FCOR= 1
##$FTSIZE= 16384
##$FT_mod= 6
##$GAMMA= 0
##$GB= 0
##$INTBC= 1
##$INTSCL= 3.241238e-09
##$ISEN= 128
##$LB= 0.25
##$LEV0= 0
##$LPBIN= 0
##$MAXI= 10000
##$MC2= 0
##$MEAN= 0
##$ME_mod= 0
##$MI= 1.114404
##$NCOEF= 0
##$NC_proc= -6
##$NLEV= 6
##$NOISF1= 3.799351
##$NOISF2= 2.8
##$NSP= 0
##$NTH_PI= 0
##$NZP= 0
##$OFFSET= 15.51882
##$PC= 1
##$PHC0= -5290.919
##$PHC1= -3.978085
##$PH_mod= 1
##$PKNL= yes
##$PPARMOD= 0
##$PSCAL= 0
##$PSIGN= 0
##$REVERSE= no
##$SF= 200.130000576566
##$SI= 16384
##$SIGF1= 3
##$SIGF2= 2
##$SINO= 0.751879
##$SIOLD= 32768
##$SREGLST= <19F.Aceton>
##$SSB= 0
##$STSI= 16384
##$STSR= 0
##$SW_p= 3612.71676300578
##$SYMM= 0
##$S_DEV= 0
##$TDeff= 16384
##$TDoff= 0
##$TI= <>
##$TILT= no
##$TM1= 0
##$TM2= 0
##$TOPLEV= 0
##$USERP1= <user>
##$USERP2= <user>
##$USERP3= <user>
##$USERP4= <user>
##$USERP5= <user>
##$WDW= 1
##$XDIM= 16384
##$YMAX_p= 315176096
##$YMIN_p= -774596
$$ End of Bruker specific parameters
$$ ---------------------------------
##NTUPLES= NMR SPECTRUM
##VAR_NAME=  FREQUENCY,     SPECTRUM/REAL,   SPECTRUM/IMAG
##SYMBOL=    X,             R,               I
##VAR_TYPE=  INDEPENDENT,   DEPENDENT,       DEPENDENT
##VAR_FORM=  AFFN,          ASDF,            ASDF
##VAR_DIM=   16384,         16384,           16384
##UNITS=     HZ,            ARBITRARY UNITS, ARBITRARY UNITS
##FACTOR=    0.220516191357247, 1,           1
##FIRST=     3105.78141731478, 0,            0
##LAST=      -506.935345690999, 0,           0
##MIN=       -506.935345690999, -774596,     0
##MAX=       3105.78141731478, 315176096,    0
$$ Real data points
##PAGE= N=1
##DATA TABLE= (X++(R..R)), XYDATA
$$ [...]
$$ plain form
8449 -353165 -395633 -324088 -271858 -229331 -280083 -266799 -332484 -357838 -345146 -358369 -343956 -365205
8437 -365205 -328589 -418402 -469322 -443367 -400271 -431263 -365951 -368107 -336803 -348745 -352411 -303265
8425 -303265 -315343 -359302 -386401 -452084 -405627 -342627 -320681 -310463 -253143 -240505 -325406 -291273
8413 -291273 -296650 -264252 -307472 -294948 -315982 -396686 -387853 -378221 -356252 -361273 -404475 -453004
8401 -453004 -493284 -485791 -442186 -413647 -375067 -363818 -318895 -289807 -380155 -352520 -304826 -338416
8389 -338416 -335335 -369227 -444144 -385398 -358744 -373231 -397856 -379421 -341733 -339488 -311311 -305529
8377 -305529 -367376 -391310 -409185 -382353 -321062 -306906 -360283 -409271 -416050 -336575 -324460 -342742
8365 -342742 -336310 -372748 -451148 -471560 -410501 -349210 -357207 -384265 -375651 -382988 -349364 -384537
$$ packed form
8449c53165m2468P1545N2230M2527n0752J3284o5685k5354J2692j3223J4413k1249
8437c65205L6616q9813n0920K5955M3096l0992O5312k156L1304j1942l666M9146
8425c03265j2078m3959k7099o5683M6457O3000K1946J0218N7320J2638q4901L4133
8413b91273n377L2398m3220J2524k1034q0704Q833R632K1969n021m3202m8529
8401d53004m0280P493M3605K8539L8580J1249M4923K9088r0348K7635M7694l3590
8389c38416L081l3892p4917N8746K6654j4487k4625J8435L7688K245K8177N782
8377c05529o1847k3934j7875K6832O1291J4156n3377m8988o779P9475J2115j8282
8365c42742O432l6438p8400k0412O1059O1291p997k7058Q614p337L3624l5173
$$ plain form
8353 -384537 -378075 -382338 -396258 -382281 -413003 -397752 -371940 -384408 -417594 -440079 -382682 -298613
8341 -298613 -370900 -450044 -400950 -410156 -383259 -358403 -410907 -479711 -436205 -357252 -506752 -509436
8329 -509436 -431471 -402501 -347889 -346252 -312532 -388335 -332229 -333334 -358410 -372826 -431190 -375027
8317 -375027 -434125 -390407 -406928 -469661 -401990 -375257 -456099 -400422 -423484 -385906 -379063 -400339
8305 -400339 -404623 -409836 -385678 -370626 -391664 -411883 -357986 -321043 -312024 -402478 -352774 -354963
8293 -354963 -390536 -458342 -461482 -451766 -477685 -451565 -413334 -442103 -434912 -355082 -419911 -449481
8281 -449481 -375167 -409076 -359053 -396118 -390710 -351495 -342687 -374598 -379188 -326820 -389583 -413151
8269 -413151 -322480 -365107 -389802 -399266 -412359 -426249 -360396 -366653 -404068 -371324 -350250 -383561
$$ packed form
8353c84537O462m263j3920J3977l0722J5251K5812j2468l3186k2485N7397Q4069
8341b98613p2287p9144M9094r206K6897K4856n2504o8804M3506P8953j49500k684
8329e09436P7965K8970N4612J637L3720p5803N6106j105k5076j4416n8364N6163
8317c75027n9098M3718j6521o2733O7671K6733q0842N5677k3062L7578O843k1276
8305d00339m284n213K4158J5052k1038k0219N3897L6943R019r0454M9704k189
8293c54963l5573o7806l140R716k5919K6120L8231k8769P191P9830o4829k9570
8281d49481P4314l3909N0023l7065N408L9215Q808l1911m590N2368o2763k3568
8269d13151R0671m2627k4695r464j3093j3890O5853o257l7415L2744K1074l3311
$$ plain form
8257 -383561 -399883 -384752 -378440 -438426 -418584 -392930 -350630 -345533 -386869 -467451 -456789 -331121
8245 -331121 -379981 -392918 -392929 -342851 -348699 -341907 -375615 -375174 -374012 -355900 -336052 -318294 -363611
8232 -363611 -362673 -371302 -323522 -280348 -366197 -435082 -422171 -409083 -436221 -447114 -401328 -351324
8220 -351324 -376478 -344641 -362349 -405673 -354296 -401285 -400027 -360282 -377848 -415830 -400737 -393265
8208 -393265 -417183 -345630 -319649 -341699 -302254 -375284 -354644 -371473 -362031 -358377 -310396 -417718
8196 -417718 -402323 -444777 -462885 -699379 -774596 -396665 -346891 -268825 -312676 -261197 -346050
8185 -346050 -338513 -371768 -422699 -501398 -465102 -368381 -441065 -428756 -402430 -470312 -483382 -416597
8173 -416597 -389329 -448662 -390084 -376911 -360357 -369806 -396067 -375655 -349377 -335631 -340380 -385126
$$ packed form
8257c83561j6322J5131O312n9986J9842K5654M2300N097m1336q0582J0662J25668
8245c31121m8860j2937j1N0078n848O792l3708M41J162J8112J9848J7758m5317
8232c63611R38q629M7780M3174q5849o8885J2911J3088k7138j0893M5786N0004
8220c51324k5154L1837j7708m3324N1377m6989J258L9745j7566l7982J5093P472
8208c93265k3918P1553K5981k2050L9445p3030K0640j6829R442L654M7981j07322
8196d17718J5395m2454j8108k36494p5217L77931M9774P8066m3851N1479q4853
8185c46050P537l3255n0931p8699L6296R6721p2684J2309K6326o7882j3070O6785
8173d16597K7268n9333N8578J3173J6554r449k6261K0412K6278J3746m749m4746
$$ plain form
8161 -385126 -385701 -436071 -400769 -366384 -333635 -352237 -434706 -398218 -356084 -298497 -331654 -325950
8149 -325950 -364976 -343255 -437600 -436513 -429210 -414223 -411435 -419042 -437572 -452153 -404013 -392876
8137 -392876 -389058 -339003 -320351 -378748 -454613 -421255 -481017 -477219 -471850 -477276 -371867 -394646
8125 -394646 -451592 -420057 -398502 -408369 -404860 -359625 -410086 -417791 -366763 -388312 -389916 -361931
8113 -361931 -341014 -323826 -442714 -426385 -442826 -420785 -413174 -445593 -419110 -404352 -412834 -439756
8101 -439756 -414494 -428741 -421985 -448561 -479977 -500669 -419854 -436876 -428200 -397940 -379582 -393977
8089 -393977 -401333 -380573 -416045 -398201 -457327 -493648 -429800 -366299 -402460 -433272 -412892 -426743
8077 -426743 -367538 -379455 -327127 -432902 -362809 -406460 -441011 -408778 -454285 -394682 -368414
$$ packed form
8161c85126n75n0370L5302L4385L2749j8602q2469L6488M2134N7587l3157N704
8149c25950l9026K1721r4345J087P303J4987K788p607j8530j4581M8140J1137
8137c92876L818N0055J8652n8397p5865L3358n9762L798N369n426J05409k2779
8125c94646n6946L1535K1555r867L509M5235n0461p705N1028k1549j604K7985
8113c61931K0917J7188j18888J6329j6441K2041P611l2419K6483J4758q482k6922
8101d39756K5262j4247O756k6576l1416k0692Q0815j7022Q676L0260J8358j4395
8089c93977p356K0760l5472J7844n9126l6321O3848O3501l6161l0812K0380j3851
8077d26743N9205j1917N2328j05775P0093m3651l4551L2233m5507N9603K6268
$$ plain form
8066 -368414 -403645 -411591 -453650 -484947 -489715 -461923 -412285 -376703 -348857 -342405 -362346 -348972
8054 -348972 -348546 -395334 -430250 -375716 -376218 -346170 -342047 -364811 -434990 -434579 -349348 -327996 -381225
8041 -381225 -388548 -352209 -411297 -468671 -449429 -389123 -390318 -389448 -410789 -439473 -430576 -393403 -381848
8028 -381848 -399580 -362496 -340883 -395082 -349858 -363024 -358302 -410505 -384223 -348072 -357738 -375147
8016 -375147 -317646 -376814 -393255 -380211 -354139 -389512 -433928 -376837 -363826 -349850 -416162 -440097
8004 -440097 -399704 -329273 -306589 -342842 -350718 -408916 -385315 -346751 -223651 -165276 -91172 -5564
7992 -5564 13721 -24676 -103759 -158827 -199314 -165604 -284483 -330067 -306725 -314936 -366766 -362415
7980 -362415 -280369 -222651 -367909 -426348 -401396 -446257 -380283 -404809 -458059 -432301 -347467
$$ packed form
8066c68414l5231p946m2059l1297m768K7792M9638L5582K7846O452j9941J3374
8054c48972M26m6788l4916N4534n02L0048M123k2764p0179M11Q5231K1352n3229
8041c81225p323L6339n9088n7374J9242O0306j195Q70k1341k8684Q897L7173J1555
8028c81848j7732L7084K1613n4199M5224j3166M722n2203K6282L6151r666j7409
8016c75147N7501n9168j6441J3044K6072l5373m4416N7091J3011J3976o6312k3935
8004d40097M0393P0431K2684l6253p876n8198K3601L8564J23100N8375P4104Q5608
7992e564J9285l8397p9083n5068m0487L3710j18879m5584K3342q211n1830M351
7980c62415Q2046N7718j45258n8439K4952m4861O5974k4526n3250K5758Q4834
$$ plain form
7969 -347467 -300073 -303869 -349615 -363972 -308536 -303269 -379429 -384489 -415159 -391836 -359342 -347582
7957 -347582 -321944 -328824 -244639 -188293 -82606 8632 -24413 -49830 -99351 -183578 -173631 -196937
7945 -196937 -171677 -246597 -263877 -193709 -227955 -294087 -285605 -220145 -361333 -361287 -301644 -193023
7933 -193023 -69092 -16188 -63047 -108912 -132190 -192476 -243869 -286556 -331511 -351529 -340912
7922 -340912 -401895 -364641 -341853 -384991 -374680 -328063 -341664 -329959 -285022 -259632 -280719 -304332
7910 -304332 -341183 -304743 -233513 -227322 -254358 -314564 -288635 -293040 -359494 -341780 -300853 -296696
7898 -296696 -284798 -306592 -374199 -438394 -400209 -350245 -358750 -308401 -327359 -400007 -392459 -411196
7886 -411196 -352826 -329249 -362851 -337788 -396701 -451069 -442180 -382947 -391766 -433930 -402583 -403518
$$ packed form
7969c47467M7394l796m5746j4357N5436N267p6160n060l0670K3323L2494J1760
7957c47582K5638o880Q4185N6346J05687R1238l3045k5417m9521q4227R947k3306
7945a96937K5260p4920j7280P0168l4246o6132Q482O5460j41188M6N9643J08621
7933a93023J23931N2904m6859m5865k3278o0286n1393m2687m4955k0018J0617
7922c40912o0983L7254K2788m3138J0311M6617j3601J1705M4937K5390k1087k3613
7910c04332l6851L6440P1230O191k7036o0206K5929m405o6454J7714M0927M157
7898b96696J1898k1794o7607o4195L8185M9964q505N0349j8958p2648P548j8737
7886d11196N8370K3577l3602K5063n8913n4368Q889N9233q819m2164L1347r35
$$ plain form
7874 -403518 -434930 -407943 -338428 -312489 -382263 -393033 -322899 -313612 -378585 -336073 -333615 -316017
7862 -316017 -312866 -316782 -333327 -356203 -393521 -403416 -352172 -322763 -345478 -370175 -369912 -320052 -344291
7849 -344291 -368700 -367133 -354795 -354427 -380692 -376066 -372788 -343121 -188531 -63600 -29080 -95487
7837 -95487 -49112 -15026 -109088 -138864 -213022 -228162 -244385 -277280 -308620 -344441 -351269 -282284
7825 -282284 -263944 -217260 -197535 -223815 -225501 -179585 -164534 -70552 63860 271625 324152
7814 324152 321756 135866 142933 -312010 -322973 -118664 -293188 -243355 -297407 -220378 -213139
7803 -213139 -224792 -276704 -278409 -305666 -231019 -197010 -170597 -156190 -96680 9755 267940
7792 267940 384181 383619 339121 218925 57074 -38360 -70446 -46279 -73026 -119973 -227561
$$ packed form
7874d03518l1412K6987O9515K5939o9774j0770P0134R287o4973M2512K458J7598
7862c16017L151l916j6545k2876l7318r895N1244K9409k2715k4697K63M9860k4239
7849c44291k4409J567J2338L68k6265M626L278K9667J54590J24931L4520o6407
7837i5487M6375L4086r4062k9776p4158j5140j6223l2895l1340l5821o828O8985
7825b82284J8340M6684J9725k6280j686M5916J5051R3982J34412K07765N2527
7814C24152k396j85890P067m54943j0963K04309j74524M9833n4052P7029P239
7803b13139j1653n1912j705k7257P4647L4009K6413J4407N9510J06435K58185
7792B67940J16241n62m4498j20196j61851r5434l2086K4167k6747m6947j07588
$$ plain form
7781 -227561 -228764 -217454 -270929 -207484 -224759 -168463 -134639 -155343 -145612 -155478 -44204 150526
7769 150526 362179 438621 391035 354449 305974 231495 127231 153574 237380 294937 244681
7758 244681 96955 166196 165218 49965 45587 -40630 -132043 -119971 -58748 -88206 -85589 41237
7746 41237 156405 211102 234574 137956 133779 136456 193474 380505 616003 626361 521336
7735 521336 420159 297305 252344 155795 6021 -34251 -86141 -163951 -84194 -65554 -117990
7724 -117990 -126745 -111865 -145289 -132919 -183659 -150962 -95942 -33452 133136 379011 564702
7713 564702 586367 503802 371618 250745 92221 7896 -64029 -56150 -86990 -127114 -102485
7702 -102485 -66590 -103014 -187970 -179750 -141980 -182601 -183719 -147700 -98971 49483 300992 562463
$$ packed form
7781b27561j203J1310n3475O3445j7275N6296L3824k0704R731r866J11274J94730
7769A50526K11653P6442m7586l6586m8475p4479j04264K6343Q3806N7557n0256
7758B44681j47726O9241r78j15253m378q6217r1413J2072O1223k9458K617J26826
7746D1237J15168N4697K3472r6618m177K677N7018J87031K35498J0358j05025
7735E21336j01177j22854m4961r6549j49774m0272n1890p7810P9757J8640n2436
7724a17990q755J4880l3424J2370n0740L2697N5020O2490J66588K45875J85691
7713E64702K1665q2565j32184j20873j58524q4325p1925P879l0840m0124K4629
7702a02485L5895l6424q4956Q220L7770m0621j118L6019M8729J48454K51509K61471
$$ plain form
7690 562463 716430 663196 519976 348027 229263 109607 2148 24591 -30913 -68157
7680 -68157 -86785 -123432 -161128 -229805 -197992 -189919 -158011 -101658 -149198 -178332 -142094 7450
7668 7450 162128 202056 169914 70310 -100748 -193940 -145030 -97317 -123216 -181170 -279698 -272086
7656 -272086 -272130 -295022 -225256 -207080 -311939 -254897 -271855 -265983 -315090 -304024 -295556 -371019
7644 -371019 -385198 -369607 -319778 -341030 -343872 -295191 -279550 -307010 -286077 -311834 -337431 -347880
7632 -347880 -329076 -344628 -313270 -282364 -282926 -332498 -365477 -357456 -338270 -289091 -230863 -233829
7620 -233829 -228977 -294755 -339174 -351495 -298256 -301171 -385463 -409328 -386318 -337987 -294796 -292553
7608 -292553 -261101 -304201 -326977 -314099 -283709 -314032 -362735 -303035 -349947 -344142 -337493 -377927
$$ packed form
7690E62463J53967n3234j43220j71949j18764j19656j07459K2443n5504l7244
7680f8157j8628l6647l7696o8677L1813Q073L1908N6353m7540k9134L6238J49544
7668G450J54678L9928l2142r9604j71058r3192M8910M7713k5899n7954r8528P612
7656b72086m4k2892O9766J8176j04859N7042j6958N872m9107J1066Q468p5463
7644c71019j4179J5591M9829k1252k842M8681J5641k7460K0933k5757k5597j0449
7632c47880J8804j5552L1358L0906n62m9572l2979Q021J9186M9179N8228k966
7620b33829M852o5778m4419j2321N3239k915q4292k3865K3010M8331M3191K243
7608b92553L1452m3100k2776J2878L0390l0323m8703N9700m6912N805O649m0434
$$ plain form
7596 -377927 -329297 -323160 -402689 -429647 -444483 -387035 -350686 -385639 -445383 -408357 -418702 -417574
7584 -417574 -447545 -427589 -381113 -403496 -425141 -406442 -395827 -342757 -359991 -392756 -378799 -387495
7572 -387495 -416497 -403639 -366481 -437305 -390477 -359028 -367946 -468378 -472305 -408795 -367557 -327061
7560 -327061 -355123 -434060 -370410 -390841 -430187 -394410 -333238 -384559 -473004 -377619 -292310 -334297
7548 -334297 -380527 -343204 -403854 -409154 -364456 -287697 -374531 -420332 -443105 -408445 -385874 -418881
7536 -418881 -405825 -427144 -372273 -368401 -349192 -317409 -344952 -356297 -318214 -281419 -305065 -384458
7524 -384458 -365136 -401763 -397936 -423601 -452123 -436434 -444968 -483871 -472820 -412956 -455662 -457737
7512 -457737 -463973 -391940 -419837 -418430 -356210 -366596 -385623 -392516 -485697 -455171 -415064 -442000
$$ packed form
7596c77927M8630O137p9529k6958j4836N7448L6349l4953n9744L7026j0345J128
7584d17574k9971J9956M6476k2383k1645J8699J0615N3070j7234l2765J3957q696
7572c87495k9002J2858L7158p0824M6828L1449q918j00432l927O3510M1238M0496
7560c27061k8062p8937O3650k0431l9346L5777O1172n1321q8445R5385Q5309m1987
7548c34297m6230L7323o0650n300M4698P6759q6834m5801k2773L4660K2571l3007
7536d18881J3056k1319N4871L872J9209L1783k7543j1345L8083L6795k3646p9393
7524c84458J9322l6627L827k5665k8522J5689q534l8903J1051N9864m2706k075
7512d57737o236P2033k7897J407O2220j0386j9027o893r3181L0526M0107k6936
$$ plain form
7500 -442000 -463083 -471808 -438861 -375704 -359606 -430262 -453284 -462217 -414712 -371630 -348869 -394814
7488 -394814 -408284 -363027 -355191 -386954 -419671 -354500 -374814 -365166 -374607 -401518 -378873 -467456
7476 -467456 -473520 -448356 -433585 -436605 -431806 -425078 -414337 -367521 -373622 -394467 -316535 -297362 -342115
7463 -342115 -413929 -419366 -430122 -445456 -445453 -423588 -385529 -442262 -466540 -409157 -412676 -432433 -408505
7450 -408505 -414787 -424699 -386955 -420046 -387386 -438154 -419932 -426015 -456951 -390933 -335265 -367113
7438 -367113 -381104 -474775 -519626 -472722 -519850 -486109 -486155 -397409 -397385 -431387 -420379 -405371 -394990
7425 -394990 -380331 -431900 -448053 -448025 -454649 -381236 -426020 -440265 -397792 -413582 -426172 -459975
7413 -459975 -455414 -459724 -455434 -460382 -486155 -465793 -441789 -456158 -409804 -395990 -423063 -474511
$$ packed form
7500d42000k1083q725L2947O3157J6098p0656k3022q933M7505M3082K2761m5945
7488c94814j3470M5257P836l1763l2717O5171k0314R648r441k6911K2645q8583
7476d67456o064K5164J4771l020M799O728J0741M6816o101k0845P7932J9173m4753
7463c42115p1814n437j0756j5334LK1865L8059n6733k4278N7383l519j9757K3928
7450d08505o282r912L7744l3091L2660n0768J8222o083l0936O6018N5668l1848
7438c67113j3991r3671m4851M6904m7128L3741m6Q8746K4l4002J1008J5008J0381
7425c94990J4659n1569j6153K8o624P3413m4784j4245M2473j5790j2590l3803
7413d59975M561m310M290m948k5773K0362K4004j4369M6354J3814k7073n1448
$$ plain form
7401 -474511 -428009 -374565 -382731 -391758 -395273 -356095 -374785 -386379 -395616 -439445 -433022 -394354 -406709
7388 -406709 -427315 -398846 -369278 -364208 -407790 -452966 -410108 -482059 -407786 -337950 -412272 -406298
7376 -406298 -403355 -414790 -443432 -497509 -456811 -465261 -499934 -371005 -357460 -381302 -373528 -333006
7364 -333006 -349394 -357564 -366844 -372144 -409423 -380385 -354595 -413989 -471451 -504178 -448767 -403398
7352 -403398 -372504 -380056 -374622 -398042 -503991 -459231 -376136 -401025 -386748 -397122 -398491 -367775
7340 -367775 -412785 -413328 -413681 -445992 -471691 -420665 -428790 -408550 -390162 -424903 -391210 -453741 -464613
7327 -464613 -431807 -366733 -361808 -423465 -451986 -355667 -359982 -439989 -413889 -416232 -466009 -443497
7315 -443497 -423897 -425475 -445930 -438431 -465926 -501104 -489831 -512587 -464033 -414840 -406651 -424025
$$ packed form
7401d74511M6502N3444q166r027l515L9178j8690j1594r237m3829O423L8668j2355
7388d06709k0606K8469K9568N070m3582m5176M2858p1951P4273O9836p4322N974
7376d06298K943j1435k8642n4077M0698q450l4673J28929J3545k3842P774M0522
7364c33006j6388q170r280n300l7279K9038K5790n9394n7462l2727N5411M5369
7352d03398L0894p552N434k3420j05949M4760Q3095k4889J4277j0374j369L0716
7340c67775m5010n43l53l2311k5699N1026q125K0240J8388l4741L3693o2531j0872
7327d64613L2806O5074M925o1657k8521R6319m315q0007K6100k343m9777K2512
7315d43497J9600j578k0455P499k7495l5178J1273k2756M8554M9193Q189j7374
$$ plain form
7303 -424025 -412397 -416345 -408862 -426831 -458707 -399231 -397199 -454605 -431610 -410710 -405240 -377377
7291 -377377 -390895 -408622 -375725 -443948 -427452 -379119 -303981 -294673 -363587 -365153 -355187 -351538
7279 -351538 -444267 -429215 -381363 -301531 -314976 -357703 -425094 -469817 -431870 -435231 -417778 -407823
7267 -407823 -350338 -363908 -374738 -327131 -411786 -446227 -395072 -383120 -436484 -355756 -347913 -369264
7255 -369264 -375858 -374912 -410443 -385159 -369950 -413019 -429014 -423736 -405870 -395108 -401097 -351333 -347653
7242 -347653 -349410 -348806 -417030 -373462 -385583 -373887 -381639 -418143 -483474 -425015 -421781 -425382 -374854
7229 -374854 -369064 -402132 -328297 -334632 -387942 -370141 -402986 -374596 -279521 -316808 -315080 -401474
7217 -401474 -447216 -441151 -413360 -348565 -403277 -405838 -426181 -369269 -339250 -291278 -340769 -367160
$$ packed form
7303d24025J1628l948P483j7969l1876N9476K032n7406K2995K0900N470K7863
7291c77377j3518j7727L2897o8223J6496M8333P5138R308o8914j566R966L649
7279c51538r2729J5052M7852P9832j3445m2727o7391m4723L7947l361J7453R955
7267d07823N7485j3570j0830M7607q4655l4441N1155J1952n3364Q0728P843k1351
7255c69264o594R46l5531K5284J5209m3069j5995N278J7866J0762n989M9764L680
7242c47653j757O04o8224M3568j2121J1696p752l6504o5331N8459L234l601N0528
7229c74854N790l3068P3835o335n3310J7801l2845K8390R5075l7287J728q6394
7217d01474m5742O065K7791O4795n4712k561k0343N6912L0019M7972m9491k6391
$$ plain form
7205 -367160 -307371 -316058 -299528 -332687 -319217 -347023 -383346 -350081 -289985 -258157 -243935 -242615
7193 -242615 -312165 -283708 -227525 -300102 -343771 -342303 -283356 -248409 -289640 -291342 -333071 -330060
7181 -330060 -297851 -315393 -387104 -375500 -376137 -358211 -421173 -413041 -379944 -380646 -298045 -289083 -298163
7168 -298163 -277583 -279324 -261342 -202303 -244694 -232032 -213441 -243743 -245592 -234769 -216398 -152743
7156 -152743 -236589 -217029 -194316 -201069 -238468 -219755 -209353 -196936 -138109 -172395 -117056 -116683
7144 -116683 -54344 57055 175524 279277 414281 529663 530153 522592 559679 670505 964831
7133 964831 1445662 1729298 1750706 1880455 1915324 2376554 3457951 5720375 7358617 7022040
7123 7022040 6534775 5608103 4193942 3137136 2434726 1995888 1656111 1427129 1236754
$$ packed form
7205c67160N9789q687J6530l3159J3470k7806l6323L3265O0096L1828J4222J320
7193b42615o9550K8457N6183p2577m3669J468N8947L4947m1231j702m1729L011
7181c30060L2209j7542p1711J1604o37J7926o2962Q132L3097p02Q2601Q962r080
7168b98163K0580j741J7982N9039m2391J2662J8591l0302j849J0823J8371O3655
7156a52743q3846J9560K2713o753l7399J8713J0402J2417N8827l4286N5339L73
7144a16683O2339J11399J18469J03753J35004J15382M90p561L7087J10826K94326
7133I64831M80831K83636K1408J29749L4869M61230J081397K262424J638242l36577
7123G022040m87265r26672j414161j056806p02410m38838l39777k28982j90375
$$ plain form
7114 1236754 917095 644798 629483 508232 445779 398996 334967 290764 218708 193352 187030
7103 187030 227423 153890 100841 128525 133615 85297 46586 25342 9158 -24997 -14649 3021
7091 3021 -44790 -62731 -22245 -73325 -88740 -114768 -149860 -125955 -185460 -189762 -143559 -198604
7079 -198604 -135805 -119369 -148464 -135320 -75299 -135860 -162466 -89715 -72521 -80270 -59434 -31580
7067 -31580 -22577 -9194 30876 103593 182252 187110 267969 340927 344330 360202 479287 615702
7055 615702 951994 1127598 1027644 931376 839017 780581 799128 960564 1114482 1150755 1117734
7044 1117734 1005498 758521 562658 492809 449983 458478 427066 400140 325501 273087 180970
7033 180970 152612 102925 33652 -38230 3201 45171 85798 8689 -97801 -92482 -158943 -102405
$$ packed form
7114A236754l19659k72297j5315j21251o2453m6783o4029m4203p2056k5356o322
7103A87030M0393p3533n3049K7684N090m8318l8711k1244j6184l4155J0348J7670
7091C021m7811j7941M0486n1080j5415k6028l5092K3905n9505m302M6203n5045
7079a98604O2799J6436k9095J3144O0021o0561k6606P2751J7194p749K0836K7854
7067c1580R003J3383M0070P2717P8659M858Q0859P2958L403J5872J19085J36415
7055F15702L36292J75604r9954r6268r2359n8436J8547J61436J53918L6273l3021
7044A117734j12236k46977j95863o9849m2826Q495l1412k6926p4639n2414r2117
7033A80970k8358m9687o9273p1882M1431M1970M0627p7109j06490N319o6461N6538
$$ plain form
7021 -102405 -93675 -100216 -162733 -183808 -135273 -189884 -217979 -172246 -163801 -149094 -133772 -51846
7009 -51846 -61722 -44406 -126948 -100818 -34637 143843 303031 391939 429190 410671 511072
6998 511072 684267 903041 1145546 1314310 1364836 1182517 1032154 1106311 1228935 1311976
6988 1311976 1355456 1228480 1072931 923460 804477 670688 603371 555712 501135 342189
6978 342189 236260 163251 69624 42501 22123 2182 -46993 -84119 -118260 -97862 -59055
6967 -59055 -129420 -109683 -111720 -85569 -65723 -28961 -62317 -8934 -94 5439 79810 145868
6955 145868 223400 301643 407959 379481 492094 653216 917637 1016299 985150 898218 758500
6944 758500 688868 794213 996403 1112349 1029118 936529 708633 489180 454098 469102 372760
$$ packed form
7021a02405Q730o541o2517k1075M8535n4611k8095M5733Q445J4707J5322Q1926
7009e1846r876J7316q2542K6130O6181J78480J59188Q8908L7251j8519J00401
6998E11072J73195K18774K42505J68764N0526j82319j50363P4157J22624Q3041
6988A311976M3480j26976j55549j49471j18983j33789o7317m7659n4577j58946
6978C42189j05929p3009r3627k7123k0378j9941m9175l7126l4141K0398L8807
6967e9055p0365J9737k037K6151J9846L6762l3356N3383Q840N533P4371O6058
6955A45868P7532P8243J06316k8478J12613J61122K64421R8662l1149q6932j39718
6944G58500o9632J05345K02190J15946q3231r2589k27896k19453l5082J5004r6342
$$ plain form
6933 372760 310019 253307 175363 90194 -28295 -82942 -86121 -85027 -51581 -134551 -215499 -225291
6921 -225291 -184854 -211052 -254159 -214462 -233835 -228522 -148215 -220037 -191303 -215646 -252796 -297045
6909 -297045 -349888 -329210 -309227 -238684 -193340 -179456 -202778 -300960 -266863 -235994 -261284 -298763
6897 -298763 -360034 -367458 -335613 -320090 -339897 -396975 -399854 -324175 -282539 -295576 -370789 -415361
6885 -415361 -440846 -453547 -393749 -356253 -390034 -323627 -332302 -380805 -370068 -350473 -361908 -354784
6873 -354784 -353142 -335466 -374752 -346280 -339843 -312421 -326964 -383441 -396617 -354817 -364151 -385536
6861 -385536 -393793 -388836 -428985 -440174 -422880 -387510 -367367 -373029 -397859 -367948 -322050 -377730
6849 -377730 -392692 -416671 -434415 -403337 -366961 -375899 -373965 -387596 -372101 -402863 -439946 -472029
$$ packed form
6933C72760o2741n6712p7944q5169j18489n4647l179J094L3446q2970q0948r792
6921b25291M0437k6198m3107L9697j9373N313Q0307p1822K8734k4343l7150m4249
6909b97045n2843K0678J9983P0543M5344J3884k3322r8182L4097L0869k5290l7479
6897b98763o1271p424L1845J5523j9807n7078k879P5679M1636j3037p5213m4572
6885d15361k5485j2701N9798L7496l3781O6407q675m8503J0737J9595j1435P124
6873c54784J642J7676l9286K8472O437K7422j4543n6477j3176M1800r334k1385
6861c85536q257M957m0149j1189J7294L5370K0143n662k4830K9911M5898n5680
6849c77730j4962k3979j7744L1078L6376q938J934j3631J5495l0762l7083l2083
$$ plain form
6837 -472029 -491238 -423872 -401289 -436741 -483325 -489399 -414225 -417627 -466003 -462314 -435187 -468541
6825 -468541 -394053 -432653 -471865 -444072 -441224 -489651 -461017 -420293 -428123 -446928 -477406 -436066
6813 -436066 -381069 -376908 -388218 -427940 -466008 -425995 -479972 -456945 -439204 -469913 -432416 -375912
6801 -375912 -404160 -407379 -414681 -417309 -373924 -338532 -362194 -363034 -399357 -436912 -415190 -366618 -385387
6788 -385387 -428933 -452813 -425397 -395737 -375983 -340786 -315316 -361252 -371944 -399780 -430975 -429958
6776 -429958 -462746 -464070 -472850 -471092 -444603 -403192 -430751 -493049 -472925 -408506 -384828 -386030
6764 -386030 -382867 -353970 -340644 -376306 -386520 -326752 -328341 -337129 -304144 -343432 -332051 -217510
6752 -217510 -133911 -139714 -164174 -213283 -253396 -311466 -357867 -329174 -338774 -359740 -372389 -382951
$$ packed form
6837d72029j9209O7366K2583l5452m6584o074P5174l402m8376L689K7127l3354
6825d68541P4488l8600l9212K7793K848m8427K8634M0724p830j8805l0478M1340
6813d36066N4997M161j1310l9722l8068M0013n3977K3027J7741l0709L7497N6504
6801c75912k8248l219p302k628M3385L5392k3662q40l6323l7555K1722M8572j8769
6788c85387m3546k3880K7416K9660J9754L5197K5470m5936j0692k7836l1195J017
6776d29958l2788j324q780J758K6489M1411k7559o2298K0124O4419K3678j202
6764c86030L163K8897J3326l5662j0214N9768j589q788L2985l9288J1381J14541
6752b17510Q3599n803k4460m9109m0113n8070m6401K8693r600k0966j2649j0562
$$ plain form
6740 -382951 -348696 -337815 -352230 -428910 -422359 -406295 -411509 -454248 -473477 -398667 -381626 -424198
6728 -424198 -464477 -460525 -510744 -480381 -472714 -446241 -441830 -448833 -423126 -350532 -346160 -416622 -411482
6715 -411482 -426801 -382319 -432071 -433002 -407464 -458129 -443710 -467234 -459347 -486176 -454717 -419888
6703 -419888 -420753 -476644 -478608 -538341 -535392 -477887 -458941 -506275 -463813 -420111 -416776 -417067 -453855
6690 -453855 -414781 -428357 -482904 -423048 -380756 -442061 -491700 -487504 -464633 -521529 -506032 -473530
6678 -473530 -484683 -525984 -419631 -427576 -470241 -431436 -441633 -475821 -453670 -522889 -484485 -474330
6666 -474330 -530473 -545174 -483334 -452199 -454095 -404811 -431235 -455491 -402131 -430514 -416734 -424945
6654 -424945 -443646 -442294 -450511 -470197 -505467 -451110 -469899 -444595 -447614 -436430 -460888 -493480
$$ packed form
6740c82951L4255J0881j4415p6680O551J6064n214m2739j9229P4810J7041m2572
6728d24198m0279L952n0219L0363P667K6473M411p003K5707P2594M372p0462N140
6715d11482j5319M4482m9752r31K5538n0665J4419k3524P887k6829L1459L4829
6703d19888q65n5891j964n9733K949N7505J8946m7334M2462M3702L335k91l6788
6690d53855L9074j3576n4547N9856M2292o1305m9639M196K2871n6896J5497L2502
6678d73530j1153m1301J06353p945m2665L8805j0197l4188K2151o9219L8404J0155
6666d74330n6143j4701O1840L1135j896M9284k6424k4256N3360k8383J3780q211
6654d24945j8701J352q217j9686l5270N4357j8789K5304l019J1184k4458l2592
$$ plain form
6642 -493480 -506882 -408518 -435124 -462476 -458464 -432837 -414829 -410122 -488646 -468057 -405376 -367164
6630 -367164 -390221 -430836 -427036 -438915 -452261 -457931 -499248 -468277 -446998 -463573 -474814 -484311
6618 -484311 -448279 -473799 -417955 -445901 -437541 -395130 -387044 -399441 -372760 -454265 -462769 -455507
6606 -455507 -491042 -466838 -508537 -507648 -465133 -414508 -456663 -490745 -516142 -542184 -528966 -443727
6594 -443727 -400362 -420541 -420457 -455382 -465119 -431809 -417345 -453629 -501744 -517482 -449746 -455923 -420425
6581 -420425 -465465 -465494 -441654 -452698 -464674 -475657 -457562 -449581 -443584 -485511 -446878 -503601 -479193
6568 -479193 -411442 -401082 -409704 -474790 -437404 -395385 -442570 -456893 -413523 -414568 -409961 -389057
6556 -389057 -392066 -464256 -486428 -463578 -478198 -469888 -484754 -503773 -443157 -458673 -447111 -403452
$$ packed form
6642d93480j3402R8364k6606k7352M012K5627J8008M707p8524K0589O2681L8212
6630c67164k3057m0615L800j1879j3346n670m1317L0971K1279j6575j1241r497
6618d84311L6032k5520N5844k7946Q360M2411Q086j2397K6681q1505q504P262
6606d55507l5535K4204m1699Q89M2515N0625m2155l4082k5397k6042J3218Q5239
6594d43727M3365k0179Q4l4925r737L3310J4464l6284m8115j5738O7736o177L5498
6581d20425m5040k9K3840j1044j1976j0983J8095P981N997m1927L8633n6723K4408
6568d79193O7751J0360q622o5086L7386M2019m7185j4323M3370j045M607K0904
6556c89057l009p2190k2172K2850j4620Q310j4866j9019O0616j5516J1562M3659
$$ plain form
6544 -403452 -455724 -455880 -459671 -472987 -505046 -469889 -418260 -426538 -441436 -444602 -403833 -425786 -413982
6531 -413982 -391489 -402714 -497528 -543661 -543882 -451395 -372225 -433488 -485329 -437523 -455207 -462816
6519 -462816 -408669 -437806 -389857 -400778 -369240 -380223 -425192 -313181 -306423 -312908 -332246 -374478
6507 -374478 -389284 -395508 -335312 -271233 -295850 -311387 -317980 -356551 -352390 -369556 -419868 -397958
6495 -397958 -387829 -387019 -376952 -353513 -375759 -385067 -368558 -307534 -304121 -334933 -307372 -373236
6483 -373236 -378881 -411782 -360429 -305210 -323964 -307893 -245776 -277386 -339523 -348471 -329073 -360264
6471 -360264 -296131 -323839 -366190 -380846 -393352 -382884 -429613 -494041 -491598 -447228 -455632 -427794
6459 -427794 -383172 -380780 -395795 -394266 -466012 -401944 -345418 -347586 -331941 -362604 -389221 -357492
$$ packed form
6544d03452n2272j56l791j3316l2059L5157N1629q278j4898l166M0769k1953J1804
6531d13982K2493j1225r4814m6133k21R2487P9170o1263n1841M7806j7684p609
6519d62816N4147k9137M7949j0921L1538j0983m4969J12011O758o485j9338m2232
6507c74478j4806o224O0196O4079k4617j5537o593l8571M161j7166n0312K1910
6495c97958J0129Q10J0067K3439k2246r308J6509O1024L413l0812K7561o5864
6483c73236n645l2901N1353N5219j8754J6071O2117l1610o2137q948J9398l1191
6471c60264O4133k7708m2351j4656j2506J0468m6729o4428K443M4370q404K7838
6459d27794M4622K392j5015J529p1746O4068N6526k168J5645l0663k6617L1729
$$ plain form
6447 -357492 -367284 -406887 -413526 -423307 -477628 -364470 -334532 -373343 -381248 -406247 -398886 -475430
6435 -475430 -384819 -376559 -339037 -320648 -366509 -496334 -466895 -481070 -494472 -443048 -295479
6424 -295479 -196156 -273684 -310380 -313260 -356042 -376449 -325438 -320727 -353010 -432889 -369158 -386499
6412 -386499 -407138 -423740 -436085 -445140 -414449 -490265 -497268 -536405 -575866 -456650 -393166 -404465
6400 -404465 -451060 -439130 -416163 -371208 -436125 -468771 -431060 -405662 -408351 -425351 -391360 -357244
6388 -357244 -347283 -420954 -446809 -434581 -463960 -467958 -420534 -438199 -447947 -460096 -417307 -414486
6376 -414486 -364643 -385699 -417596 -381956 -417921 -449785 -393000 -424595 -431580 -431553 -476573 -454072
6364 -454072 -480491 -493459 -478619 -452193 -473407 -408556 -418461 -341972 -354724 -426846 -432760 -459416
$$ packed form
6447c57492r792l9603o639r781n4321J13158K9938l8811p905k4999P361p6544
6435d75430R0611Q260L7522J8389m5861j29825K9439j4175j3402N1424J47569
6424b95479R9323p7528l6696k880m2782k0407N1011M711l2283p9879O3731j7341
6412c86499k0639j6602j2345r055L0691p5816p003l9137l9461J19216O3484j1299
6400d04465m6595J1930K2967M4955o4917l2646L7711K5398k689j7000L3991L4116
6388c57244R961p3671k5855J2228k9379l998M7424j7665r748j2149M2789K821
6376d14486M9843k1056l1897L5640l5965l1864N6785l1595o985K7m5020K2501
6364d54072k6419j2968J4840K6426k1214O4851r905P6489j2752p2122n914k6656
$$ plain form
6352 -459416 -502204 -492969 -498264 -426163 -471182 -450461 -452834 -416832 -382962 -396306 -356236 -368528
6340 -368528 -413494 -463138 -448172 -440318 -367049 -415601 -437265 -439281 -371568 -346469 -379418 -376364
6328 -376364 -331021 -366030 -384051 -419903 -448985 -475357 -438837 -380330 -362632 -457042 -435767 -423502
6316 -423502 -404676 -350932 -379738 -397233 -391580 -373944 -322809 -332520 -340429 -277299 -302679 -415568
6304 -415568 -462912 -457890 -531909 -500390 -361748 -386157 -442399 -415480 -418264 -441472 -444042 -449030
6292 -449030 -486319 -439949 -416848 -371653 -313604 -329264 -280870 -344693 -363230 -308057 -319961 -307468
6280 -307468 -359208 -400254 -407893 -346700 -324952 -310252 -297942 -332551 -453772 -377985 -434477 -378482
6268 -378482 -321793 -390060 -422736 -474692 -438018 -451923 -432984 -429410 -415066 -367180 -359006 -366395
$$ packed form
6352d59416m2788R235n295P2101m5019K0721k373L6002L3870j3344M0070j2292
6340c68528m4966m9644J4966P854P3269m8552k1664k016O7713K5099l2949L054
6328c76364M5343l5009j8021l5852k9082k6372L6520N8507J7698r4410K1275J2265
6316d23502J8826N3744k8806j7495N653J7636N1135r711p909O3130k5380j12889
6304d15568m7344N022p4019L1519J38642k4409n6242K6919k784k3208k570m988
6292d49030l7289M6370K3101M5195N8049j5660M8394o3823j8537N5173j1904J2493
6280c07468n1740m1046p639O1193K1748J4700J2310l4609j21221P5787n6492N5995
6268c78482N6689o8267l2676n1956L6674j3905J8939L574J4344M7886Q174p389
$$ plain form
6256 -366395 -399649 -361619 -398816 -369648 -315959 -274775 -276763 -334434 -357002 -387054 -422494 -450296
6244 -450296 -424888 -393556 -375842 -368243 -394257 -402127 -395661 -401841 -366825 -368503 -399102 -356664 -356428
6231 -356428 -345325 -364615 -421335 -365999 -367019 -347728 -329905 -330152 -367851 -423431 -378221 -336484
6219 -336484 -318237 -291181 -308492 -277242 -291694 -318557 -349569 -308235 -345285 -297356 -233443 -261915
6207 -261915 -297461 -270830 -302319 -292823 -345291 -393624 -336155 -242544 -273648 -286851 -288972 -299292
6195 -299292 -238995 -230636 -258690 -281153 -226579 -204001 -197822 -208229 -264355 -207581 -224704 -264350
6183 -264350 -225419 -137802 -1473 -60651 6942 96457 62396 36041 -19995 -61813 -65643 -128127
6171 -128127 -140569 -63063 -52579 -11853 84116 75512 43797 109382 113309 96258 95046 90710
$$ packed form
6256c66395l3254L8030l7197K9168N3689M1184j988n7671k2568l0052l5440k7802
6244d50296K5408L1332J7714P599k6014p870O466o180L5016j678l0599M2438K36
6231c56428J1103j9290n6720N5336j020J9291J7823k47l7699n5580M5210M1737
6219c36484J8247K7056j7311L1250j4452k6863l1012M1334l7050M7929O3913k8472
6207b61915l5546K6631l1489R496n2468m8333N7469R3611l1104j3203k121j0320
6195b99292O0297Q359k8054k2463N4574K2578O179j0407n6126N6774j7123l9646
6183b64350L8931Q7617J36329n9178O7593Q9515l4061k6355n6036m1818l830o2484
6171a28127j2442P7506J0484M0726R5969q604l1715O5585L927j7051j212m336
$$ plain form
6159 90710 9468 81387 151776 131861 199753 245990 310128 293243 280938 278735 362235 477205
6147 477205 732424 1001098 1326591 1509189 1515394 1380846 1153035 921084 731108 639614
6137 639614 677084 803544 861731 829330 724835 637998 598439 634139 665261 643240 667905
6126 667905 581928 578726 673422 754401 783913 844294 873068 956148 987353 1030914 1216166 1699645
6114 1699645 2510242 3641718 4202390 4096014 3748065 3185570 2596928 2161035 1863053
6105 1863053 1688853 1705514 1827716 1975834 1999422 2028572 1954368 1848949 1921761 2087670
6095 2087670 2192379 2347395 2440693 2503932 2394910 2308604 2227920 2207600 2193511 2247740 2347421
6084 2347421 2428581 2676901 3297932 4345753 5207679 5446765 5411729 5010097 4525472 4173812
$$ packed form
6159I0710q1242P1919P0389j9915O7892M6237O4138j6885j2305k203Q3500J14970
6147D77205K55219K68674L25493J82598O205j34548k27811k31951j89976r1494
6137F39614L7470J26460N8187l2401j04495q6837l9559L5700L1122k2021K4665
6126F67905q5977l202R4696Q0979K9512O0381K8774Q3080L1205M3561J85252M83479
6114A699645Q10597J131476N60672j06376l47949n62495n88642m35893k97982
6105A863053j74200J6661J22202J48118K3588K9150p4204j05419P2812J65909
6095B087670J04709J55016R3298O3239j09022q6306q0684k0320j4089N4229R9681
6084B347421Q1160K48320O21031J047821Q61926K39086l5036m01632m84625l51660
$$ plain form
6074 4173812 3969439 3854990 3830098 3937186 3900791 3737553 3711760 3742756 3621154 3411725
6064 3411725 3199534 2973512 2813015 2667755 2601313 2472589 2306622 2036095 1835146 1803759
6054 1803759 1731318 1766935 1909544 2060534 2266849 2621856 2964727 3102788 3109914 3057118
6044 3057118 2860602 2587582 2340559 2042761 1744064 1576973 1511581 1433828 1338555 1237860
6034 1237860 1040690 894089 819923 748409 597703 504948 488630 400747 376896 370636 306682
6023 306682 280339 288421 245715 230099 226405 260115 213277 230196 246262 228065 184411 193917
6011 193917 223272 151658 69911 116916 23470 -14926 128155 117511 60421 40631 -1339
6000 -1339 -19146 19141 46688 25705 31803 70957 55002 98098 96759 113191 50620 34919
$$ packed form
6074D173812k04373j14449k4892J07088l6395j63238k5793L0996j21602k09429
6064C411725k12191k26022j60497j45260o6442j28724j65967k70527k00949l1387
6054A803759p2441L5617J42609J50990K06315L55007L42871J38061P126n2796
6044C057118j96516k73020k47023k97798k98697j67091o5392p7753r5273j00695
6034A237860j97170j46601p4166p1514j50706r2755j6318q7883k3851o260o3954
6023C06682k6343Q082m2706j5616l694L3710m6838J6919J6066j8197m3654R506
6011A93917K9355p1614q1747M7005r3446l8396J43081j0644n7090j9790m1970
6000a339j7807L8287K7547k0983O098L9154j5955M3096j339J6432o2571j5701
$$ plain form
5988 34919 38103 62391 41933 80754 39773 17353 42953 70737 78439 75598 8334 -48488
5976 -48488 12038 -13443 -76728 -80486 -131980 -105337 -35664 -31613 -63701 -9357 -78685 -104792
5964 -104792 -79024 -53367 -78029 -59091 -62088 -47923 6722 -49089 -20412 -89927 -65765 -10658
5952 -10658 -31400 -95248 -154086 -140557 -118640 -104643 -149282 -153996 -102286 -127254 -119014 -35509
5940 -35509 36178 64602 -425 49697 87117 14481 -22815 -24090 -106417 -111795 -139601 -100904
5928 -100904 -77073 -38375 -694 -67089 -68236 -17134 -124600 -156640 -97905 -120758 -100786 -43575
5916 -43575 73670 115660 48228 -20539 19771 -34844 -45839 7878 79168 91812 111411 79337
5904 79337 29741 43007 89247 28240 23953 42366 8170 52347 127997 47000 71894 95150
$$ packed form
5988C4919L184K4288k0458L8821m0981k2420K5600K7784P702k841o7264n6822
5976d8488O0526k5481o3285l758n1494K6643O9673M051l2088N4344o9328k6107
5964a04792K5768K5657k4662J8938k997J4165N4645n5811K8677o9515K4162N5107
5952a0658k0742o3848n8838J3529K1917J3997m4639m714N1710k4968Q240Q3505
5940c5509P1687K8424o5027N0122L7420p2636l7296j275q2327n378k7806L8697
5928a00904K3831L8698L7681o6395j147N1102j07466l2040N8735k2853J9972N7211
5916d3575J17245M1990o7432o8767M0310n4615j0995N3717P1290J2644J9599l2074
5904G9337m9596J3266M6240o1007m287J8413l4196M4177P5650q0997K4894K3256
$$ plain form
5892 95150 66352 79556 107640 97625 100015 81012 -4782 -16791 -15197 37863 147958 107315
5880 107315 97999 83627 71849 42324 125758 182033 80748 70163 82587 26983 14624 16278
5868 16278 59920 41197 23600 32892 32506 -32909 -31511 -45103 -56842 -74647 -76575 -37823 -11468
5855 -11468 29021 -44399 -35221 -100886 -58611 -78403 -111199 -93842 3028 17306 45045 47997
5843 47997 22914 41562 -18974 -19942 -34671 -106436 -48635 -69752 -47466 -44953 -44426 6962 10288
5830 10288 38435 21641 -56600 -9387 34570 35170 55627 32720 28434 58630 108711 114691 151791
5817 151791 129888 95233 33131 19447 -15560 -86972 -13792 -19047 -66291 -45621 -47924 -19212
5805 -19212 8336 128126 216328 152617 132515 173915 153643 122690 9517 54048 104823
$$ packed form
5892I5150k8798J3204K8084j0015K390j9003q5794j2009J594N3060J10095m0643
5880A07315r316j4372j1778k9525Q3434N6275j01285j0585J2424n5604j2359J654
5868A6278M3642j8723j7597R292l86o5415J398j3592j1739j7805j928L8752K6355
5855a1468M0489p3420R178o5665M2275j9792l2796J7357R6870J4278K7739K952
5843D7997k5083J8648o0536r68j4729p1765N7801k1117K2286K513N27N1388L326
5830A0288K8147j6794p8241M7213M3957O00K0457k2907m286L0196N0081N980L7100
5817A51791k1903l4655o2102j3684l5007p1412P3180n255m7244K0670k303K8712
5805a9212K7548J19790Q8202o3711k0102M1400k0272l0953j13173M4531N0775
$$ plain form
5794 104823 166794 129998 67280 65497 85678 137198 131823 184395 117303 154509 172545 172067
5782 172067 202225 269125 370506 403004 481387 557949 576133 510491 556599 506498 437409
5771 437409 403204 379546 372701 273140 214809 229188 283508 219362 210852 217563 200571 170576
5759 170576 258559 352115 455528 447836 541517 661245 590652 624754 715134 724930 644740 539519
5747 539519 464061 439231 485396 480703 465784 438563 463913 418969 421380 436433 409830 465784
5735 465784 459464 510201 511449 534999 560457 620060 723624 843498 831138 824218 798947 849621
5723 849621 816018 780878 809730 859817 870977 858982 926466 1017177 1103360 1273738 1583794
5712 1583794 2128710 2853014 3353053 3498017 3269712 2925576 2528637 2166485 1965951 1855993
$$ packed form
5794A04823O1971l6796o2718j783K0181N1520n375N2572o7092L7206J8036m78
5782A72067L0158O6900J01381L2498P8383P6562J8184o5642M6108n0101o9089
5771D37409l4205k3658o845r9561n8331J4379N4320o4146q510O711j6992k9995
5759A70576Q7983R3556J03413p692R3681J19728p0593L4102R0380R796q0190j05221
5747E39519p5458k4830M6165m693j4919k7221K5350m4944K411J5053k6603N5954
5735D65784o320N0737J248K3550K5458N9603J03564J19874j2360o920k5271N0674
5723H49621l3603l5140K8852N0087J1160j1995O7484R0711Q6183J70378L10056
5712A583794N44916P24304N00039J44964k28305l44136l96939l62152k00534j09958
$$ plain form
5702 1855993 1827259 1781690 1897219 2209130 2807360 3465318 3866791 3876552 3666814 3283379
5692 3283379 2824191 2447519 2143673 1977273 1863060 1825882 1735874 1697596 1631356 1569099
5682 1569099 1584305 1651004 1617972 1589900 1534702 1686119 1820617 1850919 1845949 1852810 1922432
5671 1922432 2110709 2497466 3013151 3456045 3658432 3711583 3819423 3920774 4204901 4604837
5661 4604837 5145587 5829724 6541762 6798680 6732691 6397917 6015666 5658946 5432727 5286275
5651 5286275 5155555 5206082 5246387 5480531 6024934 7008542 7868961 8159697 7819408 7254902
5641 7254902 6606662 6006266 5498482 5018213 4664629 4334219 4047921 3852723 3696090 3564910
5631 3564910 3420931 3424374 3506886 3675694 3730306 3752457 3731284 3791525 4020987 4407944 4802936
$$ packed form
5702A855993k8734m5569J15529L11911N98230O57958M01473R761k09738l83435
5692C283379m59188l76672l03846j66400j14213l7178r0008l8278o6240o2257
5682A569099J5206O6699l3032k8072n5198J51417J34498L0302m970O861O9622
5671A922432J88277L86757N15685M42894K02387N3151J07840J01351K84127L99936
5661D604837N40750O84137P12038K56918o5989l34774l82251l56720k26219j46452
5651E286275j30720N0527M0305K34144N44403R83608Q60419K90736l40289n64506
5641G254902o48240o00396n07784m80269l53584l30410k86298j95198j56633j31180
5631C564910j43979L443Q2512J68808N4612K2151k1173O0241K29462L86957L94992
$$ plain form
5620 4802936 5010766 4936589 4602659 4248349 3856065 3481712 3269827 3008593 2937433 2916334
5610 2916334 2934695 3045614 3223886 3395401 3588659 3766361 3857904 4015767 4221101 4265982
5600 4265982 4406349 4829681 5377304 5822547 5960396 5701350 5371964 4980868 4640412 4489438
5590 4489438 4484266 4593779 4694595 4655923 4678862 4801846 4815978 5017027 5288018 5592375
5580 5592375 6100823 6662364 7012964 7419425 7800857 8261772 8903796 9785167 11188930
5571 11188930 13570485 18082526 25073675 31701712 34854181 34885345 33716349 32349062
5563 32349062 32373693 34292937 36715525 37480789 35855503 32212158 27798051 23403194 19561349
5554 19561349 16808274 15015763 14071900 13804320 14203325 15319331 17518352 21108997 26476660
$$ packed form
5620D802936K07830p4177l33930l54310l92284l74353k11885k61234p1160k1099
5610B916334J8361J10919J78272J71515J93258J77702R1543J57863K05334M4881
5600D265982J40367M23332N47623M45243J37849k59046l29386l91096l40456j50974
5590D489438n172J09513J00816l8672K2939J22984J4132K01049K70991L04357
5580E592375N08448N61541L50600M06461L81432M60915O42024Q81371J403763
5571A1188930K381555M512041O991149O628037L152469L1164j168996j367287
5563C2349062K4631J919244K422588P65264j625286l643345m414107m394857l841845
5554A9561349k753075j792511r43863k67580L99005J116006K199021L590645N367663
$$ plain form
5545 26476660 34065030 40689031 42756579 41160251 38044338 34594635 32642036 33886742
5537 33886742 37110164 40298329 41548356 40474634 37214572 32542821 27318525 22679394
5529 22679394 18758160 15682789 13469685 11941289 10911889 10107846 9518527 9127583 8800118
5520 8800118 8578139 8499182 8669645 9286561 10366550 11283364 11377968 10930864 10147485 9266822
5510 9266822 8675515 8366175 8208962 8112742 8039454 8033700 8228866 8752650 9719726 10549124
5500 10549124 10537738 10046827 9246855 8279531 7448742 6836852 6561272 6477423 6426141 6492179
5490 6492179 6425765 6249922 5973938 5896960 6017574 6417336 7061532 7745205 7986685 7841421
5480 7841421 7371861 6725301 6108726 5610709 5292658 5038903 4863504 4766248 4773070 4968006
$$ packed form
5545B6476660P588370O624001K067548j596328l115913l449703j952599J244706
5537C3886742L223422L188165J250027j073722l260062m671751n224296m639131
5529B2679394l921234l075371k213104j528396j029400q04043n89319l90944l27465
5520H800118k21979p8957J70463O16916J079989R16814R4604m47104p83379q80663
5510I266822n91307l09340j57213r6220p3288n754J95166N23784R67076Q29398
5500A0549124j1386m90911p99972r67324q30789o11890k75580q3849n1282O6038
5490F492179o6414j75843k75984p6978J20614L99762O44196O83673K41480j45264
5480G841421m69560o46560o16575m98017l18051k53755j75399r7256O822J94936
$$ plain form
5470 4968006 5313400 5547723 5486849 5321396 5047377 4771946 4675231 4772461 4754329 4672120
5460 4672120 4651061 4544529 4376211 4268396 4105872 3913600 3729884 3677556 3623972 3484213
5450 3484213 3363899 3336897 3354614 3343422 3309776 3258635 3268348 3305626 3307990 3289624 3316456 3344543
5438 3344543 3377403 3419038 3533189 3839697 4058259 4377229 4469302 4425778 4403871 4307711 4291598
5427 4291598 4336465 4326103 4280983 4196632 4169142 4095895 4092746 4087314 4104931 4239420 4443650
5416 4443650 4594049 4719495 4694446 4607279 4524686 4468561 4484293 4525892 4648918 4864215 5134606
5405 5134606 5409971 5544059 5621934 5735392 5951210 6415932 7090889 7962855 8675384 9134496
5395 9134496 9151891 8845815 8382779 7908116 7512217 7421367 7547712 7811630 7877131 7779304
$$ packed form
5470D968006L45394K34323o0874j65453k74019k75431r6715R7230j8132q2209
5460D672120k1059j06532j68318j07815j62524j92272j83716n2328n3584j39759
5450C484213j20314k7002J7717j1192l3646n1141R713L7278K364j8366K6832K8087
5438C344543L2860M1635J14151L06508K18562L18970R2073m3524k1907r6160j6113
5427D291598M4867j0362m5120q4351k7490p3247l149n432J7617J34489K04230
5416D443650J50399J25446k5049q7167q2593n6125J5732M1599J23026K15297K70391
5405E134606K75365J34088P7875J13458K15818M64722O74957Q71966P12529M59112
5395I134496J7395l06076m63036m74663l95899r0850J26345K63918O5501r7827
$$ plain form
5385 7779304 7696074 7600268 7344040 7246134 7219963 7376665 7509725 7499869 7520760 7516578 7630417
5374 7630417 7967516 8583350 9484442 10388604 10947170 10970610 10576297 10051739 9675355 9342262
5364 9342262 9024039 8744547 8512932 8238017 8022182 7899293 7834397 7954310 8282415 8523445
5354 8523445 8722111 8778015 8740273 8744088 8738648 8808465 9157314 9569678 10045752 10410783 10545506
5343 10545506 10393461 10202898 9963456 9926103 9941139 10007082 9958562 9996308 10049170 10215877
5333 10215877 10356801 10535942 10779385 10929328 11010957 11216909 11441672 11710554 11997534 12478631
5323 12478631 12903493 13473548 14241318 15307694 16276096 17074380 17506065 17639163 17845816
5314 17845816 18250329 18759036 19480298 20397567 21874107 24259101 28705968 36661439 46512405
$$ packed form
5385G779304q3230r5806k56228r7906k6171J56702J33060r856K0891m182J13839
5374G630417L37099O15834R01092R04162N58566K3440l94313n24558l76384l33093
5364I342262l18223k79492k31615k74915k15835j22889o4896J19913L28105K41030
5354H523445J98666N5904l7742L815n440O9817L48849M12364M76074L65031J34723
5343A0545506j52045j90563k39442l7353J5036O5943m8520L7746N2862J66707
5333A0215877J40924J79141K43443J49943Q1629K05952K24763K68882K86980M81097
5323A2478631M24862N70055P67770J066376R68402P98284M31685J33098K06653
5314A7845816M04513N08707P21262R17269J476540K384994M446867P955471R850966
$$ plain form
5305 46512405 52539132 55215927 58419598 63207294 66298147 64242056 59091445 52609952
5297 52609952 45842940 40402530 36958816 35635594 36001329 36384026 36369703 36590393 37207748
5288 37207748 38564025 40922597 43758006 46931341 51689107 59841886 75362178 99270207
5280 99270207 120591677 131796321 139447784 149074796 155392159 152140439 139351924 123680443
5272 123680443 107506009 94470339 87518074 88232197 97152305 108287474 110131764 107686696
5264 107686696 103626664 98949558 97028654 99568878 110099656 128641677 141387984 146452084
5256 146452084 153222643 166710208 197542811 238261201 273914207 306729546 315176096
5249 315176096 301664328 288249312 282703528 281017809 286820968 298519271 304368969 306621528
$$ packed form
5305D6512405O026727K676795L203671M787696L090853k056091n150611o481493
5297E2609952o767012n440410l443714j323222L65735L82697j4323K20690O17355
5288C7207748J356277K358572K835409L173335M757766Q152779J5520292K3908029
5280I9270207K1321470J1204644P651463R627012O317363l251720j2788515j5671481
5272A23680443j6174434j3035670o952265P14123Q920108J1135169J844290k445068
5264A07686696m060032m677106j920904K540224J0530778J8542021J2746307N064100
5256A46452084O770559J3487565L0832603M0718390L5653006L2815339Q446550
5249C15176096j3511768j3415016n545784j685719N803159J1698303N849698K252559
$$ plain form
5241 306621528 292578581 264502439 234308995 209643813 195167477 181142747 162779337
5234 162779337 148272483 133292581 120112391 109828333 105761508 108293575 118978071
5227 118978071 134086349 154930502 162643779 154107236 141270717 124752562 110501347
5220 110501347 101965599 99490632 101683424 103077661 98425279 92790829 87183816 84071940
5212 84071940 86766089 90025075 86788408 82258183 75652123 67858982 61118708 56185871
5204 56185871 53636352 54216621 59787451 70139396 75134653 72366019 67828340 60472956
5196 60472956 52665553 45877146 40739250 36762996 33851593 31621820 30054682 28784542
5188 28784542 27791452 27002953 26579941 26262843 25950583 25487873 24905595 24243032 23716779
$$ packed form
5241C06621528j4042947k8076142l0193444k4665182j4476336j4024730j8363410
5234A62779337j4506854j4979902j3180190j0284058m066825K532067J0684496
5227A18978071J5108278K0844153P713277q536543j2836519j6518155j4251215
5220A10501347q535748k474967K192792J394237m652382n634450n607013l111876
5212H4071940K694149L258986l236667m530225o606060p793141o740274m932837
5204E6185871k549519N80269N570830J0351945M995257k768634m537679p355384
5196F0472956p807403o788407n137896l976254k911403k229773j567138j270140
5188B8784542r93090p88499m23012l17098l12260m62710n82278o62563n26253
$$ plain form
5179 23716779 23300148 23024366 22581383 22186010 21734913 21335908 21009196 21001944 21082330 21048615
5169 21048615 20868841 20713264 20635609 20627885 20589939 20450876 20236782 19998499 19748961 19523317
5159 19523317 19525370 19579826 19499341 19517732 19442205 19364135 19509845 19811727 20033619 20108583 20219694
5148 20219694 20234511 20359494 20597219 21017098 21499259 22188364 23085394 24306792 26040159
5139 26040159 28503136 32062616 38008770 47692649 58773946 65407609 71786105 83738219
5131 83738219 101581099 117823967 125761135 129698287 123680615 107289189 90963260 75017277
5123 75017277 60827711 50369687 42761223 37419876 33795009 31217831 29558803 28503142
5115 28503142 27835617 27410310 27458098 27600734 27965121 28589205 29597866 31111799 34372365
$$ packed form
5179B3716779m16631k75782m42983l95373m51097l99005l26712p252Q0386l3715
5169B1048615j79774j55577p7655p724l7946j39063k14094k38283k49538k25644
5159A9523317K053N4456q0485J8391p5527p8070J45710L01882K21892P4964J11111
5148B0219694J4817J24983K37725M19879M82161O89105Q97030J221398J733367
5139B6040159K462977L559480N946154R683879J1081297O633663O378496J1952114
5131H3738219J7842880J6242868P937168L937152o017672j6391426j6325929j5945983
5123G5017277j4189566j0458024p608464n341347l624867k577178j659028j055661
5115B8503142o67525m25307M7788J42636L64387O24084J008661J513933L260566
$$ plain form
5106 34372365 40477649 49454094 54227550 54030525 53276401 51266541 49238108 50185807 55556417
5097 55556417 64847209 71479989 73044790 73651193 74504596 77837867 91188256 122386305
5089 122386305 162461943 179180166 174123235 163290685 141087834 115073975 94925803
5082 94925803 80236397 70387894 64854166 63619269 66973269 77788993 101097338 138045145
5074 138045145 168120070 170647366 159470184 142970600 119553658 98916685 86870227
5067 86870227 80663760 75943818 70387630 64575483 59131839 54056481 50648322 50163224
5059 50163224 50879658 49278802 46356127 43437047 40026346 37033396 34801356 32817124
5051 32817124 31314809 30061756 29025724 28217942 27664798 27359963 27137891 27179823 27318471
$$ packed form
5106C4372365O105284Q976445M773456j97025p54124k009860k028433R47699N370610
5097E5556417R290792O632780J564801O06403Q53403L333271J3350389L1198049
5089A22386305M0075638J6718223n056931j0832550k2202851k6013859k0148172
5082I4925803j4689406r848503n533728j234897L354000J0815724K3308345L6947807
5074A38045145L0074925K527296j1177182j6499584k3416942k0636973j2046458
5067H6870227o206467m719942n556188n812147n443644n075358l408159m85098
5059E0163224P16434j600856k922675k919080l410701k992950k232040j984232
5051C2817124j502315j253053j036032q07782n53144l04835k22072M1932J38648
$$ plain form
5042 27318471 27694998 28293218 29136973 30431537 32510565 35929037 41903383 51252320 60794975
5033 60794975 66946162 70646996 71527069 71583391 74862700 83931179 103084000 121876455
5025 121876455 123557353 121296298 118297719 118425853 118894371 118832204 116373831 106557863 95967576
5016 95967576 85652903 78169037 75470637 80021453 90114974 98282427 108065519 116973747
5008 116973747 120328448 129572029 152392224 186584902 204445804 198552879 186222001
5001 186222001 170491402 157724597 143434753 130140731 122537599 119563578 117304933
4994 117304933 113410766 114632591 116040970 110348279 103687401 100039736 101369306 105035045
4986 105035045 104653534 108302823 119614546 128633924 122163492 110685636 96129938 79782361
$$ packed form
5042B7318471L76527N98220Q43755J294564K079028L418472N974346R348937R542655
5033F0794975O151187L700834Q80073N6322L279309R068479J9152821J8792455
5025A21876455J680898k261055k998579J28134M68518o2167k458373r815968j0590287
5016I5967576j0314673p483866k698400M550816J0093521Q167453R783092Q908228
5008A16973747L354701R243581K2820195L4192678J7860902n892925j2330878
5001A86222001j5730599j2766805j4289844j3294022p603132k974021k258645
4994A17304933l894167J221825J408379n692691o660878l647665J329570L665739
4986A05035045l81511L649289J1311723R019378o470432j1477856j4555698j6347577
$$ plain form
4978 79782361 65722739 54797688 46981883 41036321 36677836 33412671 31044797 29168312
4970 29168312 27615292 26341422 25280335 24419976 23682338 23016488 22488545 22124612 22027519
4961 22027519 21846533 21544674 21197691 20921073 20898846 21524142 23178814 25885799 28569059
4952 28569059 30317333 30218287 28418830 26069941 23421019 21102115 19340345 18045766
4944 18045766 17084885 16422740 16111628 16005444 16196232 16698060 17947498 20306652 23415471
4935 23415471 26283293 29080111 31283016 33547635 35075210 35226152 33264289 29882321
4927 29882321 26233396 22661022 19632062 17273477 15660747 14583377 13874090 13446313
4919 13446313 13372529 13507759 14123932 15614615 18443275 21673192 24129441 25489744 24487265
$$ packed form
4978G9782361j4059622j0925051p815805n945562m358485l265165k367874j876485
4970B9168312j553020j273870j061087q60359p37638o65850n27943l63933r7093
4961B2027519j80986l01859l46983k76618k2227O25296J654672K706985K683260
4952B8569059J748274r9046j799457k348889k648922k318904j761770j294579
4944A8045766r60881o62145l11112j06184J90788N01828J249438K359154L108819
4935B3415471K867822K796818K202905K264619J527575J50942j961863l381968
4927B9882321l648925l572374l028960k358585j612730j077370p09287m27777
4919A3446313p3784J35230O16173J490683K828660L229917K456249J360303j002479
$$ plain form
4910 24487265 22348180 19690044 17064860 14954574 13314590 12034885 11050943 10318496
4902 10318496 9828355 9340515 8946197 8554205 8287862 8086379 7912848 7754198 7639709
4893 7639709 7573632 7479066 7345985 7183100 7107068 7000378 6897663 6881371 6847383 6831955 6844452
4882 6844452 6808151 6827611 6930874 6912515 6746092 6621644 6492076 6459196 6478743 6618433
4872 6618433 6714841 6740406 6717178 6735383 6921254 7309119 7939367 8490301 8673879 8452257
4862 8452257 8081452 7557755 7116465 6799778 6571756 6449244 6315574 6257452 6242034 6280550
4852 6280550 6294604 6337091 6505301 6890391 7443243 8242924 8940796 9475054 10097274 10798461
4842 10798461 11025551 10634900 9927098 9115371 8166233 7414503 6982534 6657678 6474609
$$ packed form
4910B4487265k139085k658136k625184k110286j639984j279705r83942p32447
4902A0318496m90141m87840l94318l91992k66343k01483j73531j58650j14489
4893G639709o6077r4566j33081j62885p6032j06690j02715j6292l3988j5428J2497
4882F844452l6301J9460J03263j8359j66423j24448j29568l2880J9547J39690
4872F618433R6408K5565k3228J8205J85871L87865O30248N50934J83578k21622
4862H452257l70805n23697m41290l16687k28022j22512j33670n8122j5418L8516
4852F280550J4054M2487J68210L85090N52852P99681O97872N34258O22220P01187
4842A0798461K27090l90651p07802q11727r49138p51730m31969l24856j83069
$$ plain form
4833 6474609 6381066 6395146 6379021 6424609 6509608 6657520 6841270 7122215 7682397 8460234
4823 8460234 8854690 8747736 8270667 7665533 7130851 6669463 6393699 6264809 6166166 6096530
4813 6096530 5995186 5875388 5769842 5686615 5639494 5510333 5434106 5323732 5340731 5309186
4803 5309186 5336718 5362977 5371631 5548569 5612008 5601553 5620485 5640625 5668765 5604563 5594035
4792 5594035 5570452 5595837 5646915 5694498 5803326 5935371 6015024 6061255 6023176 6015388 6073300
4781 6073300 6115677 6203574 6399863 6575057 6900450 7303974 7643525 7807539 7948715 8112464
4771 8112464 8267424 8464152 8882760 9376766 10267726 11989580 15093945 19359418 23270913
4762 23270913 25029833 24521980 22667200 20276020 17961241 16328034 15703660 16071739 17941757
$$ packed form
4833F474609r3543J4080j6125M5588Q4999J47912J83750K80945N60182P77837
4823H460234L94456j06954m77069o05134n34682m61388k75764j28890r8643o9636
4813F096530j01344j19798j05546q3227m7121j29161p6227j10374J6999l1545
4803E309186K7532K6259Q654J76938O3439j0455J8932K0140K8140o4202j0528
4792E594035k3583K5385N1078M7583J08828J32045P9653M6231l8079p788N7912
4781F073300M2377Q7897J96289J75194L25393M03524L39551J64014J41176J63749
4771H112464J54960J96728M18608M94006Q90960J721854L104365M265473L911495
4762B3270913J758920n07853j854780k391180k314779j633207o24374L68079J870018
$$ plain form
4753 17941757 21363209 25022439 26923874 26743982 25035006 22753006 20500000 19039455
4745 19039455 18270557 18455826 20221832 23028715 25258628 25778195 24727496 22819251 20728083
4736 20728083 18990457 17789876 17357533 17881791 19886843 23019885 25915609 27062330
4728 27062330 26374837 24529748 22176290 19958130 18165888 16822172 16022833 15551161 15456350
4719 15456350 15505248 15603024 15760133 15998367 16328648 16729156 17347893 18127304 19116695 20247830
4709 20247830 21540577 23206155 25478519 28618226 32674995 38141846 45517676 57484060
4701 57484060 79389610 112159288 144572424 167943227 174570956 164282451 147143941
4694 147143941 128729062 113993798 108946204 120098954 153202550 188360218 195096835
$$ packed form
4753A7941757L421452L659230J901435j79892j708976k282000k253006j460545
4745A9039455p68898J85269J766006K806883K229913N19567j050699j908245k091168
4736B0728083j737626j200581m32343N24258K005052L133042K895724J146721
4728B7062330o87493j845089k353458k218160j792242j343716p99339m71672r4811
4719A5456350M8898R7776J57109K38234L30281M00508O18737P79411R89391J131135
4709B0247830J292747J665578K272364L139707M056769N466851P375830J1966384
4701E7484060K1905550L2769678L2413136K3370803O627729j0288505j7138510
4694A47143941j8414879j4735264n047594J1152750L3103596L5157668O736617
$$ plain form
4687 195096835 183759724 164291920 137608683 112614469 94468394 83478195 78818944
4680 78818944 81575131 95405113 118173033 139252409 150581409 151140624 149090694 144219455
4672 144219455 134960983 130072108 133322885 138756342 151020875 166889666 165327813 150044751
4664 150044751 130861663 108242278 86610084 69590218 57423838 48539097 42142457
4657 42142457 37665705 34429291 31981467 30227288 28932049 27765352 26525267 25122061
4649 25122061 23622392 22199268 20959282 19920651 18938262 18189634 17652901 17114469 16628054
4640 16628054 16403923 16175336 15721872 15149906 14579338 14074168 13486389 12948868 12452449
4631 12452449 12018947 11651813 11278036 10932817 10593124 10378411 10244437 10172253 10010347 9877027
$$ packed form
4687A95096835j1337111j9467804k6683237k4994214j8146075j0990199m659251
4680G8818944K756187J3829982K2767920K1079376J1329000N59215k049930m871239
4672A44219455r258472m888875L250777N433457J2264533J5868791j561853j5283062
4664A50044751j9183088k2619385k1632194j7019866j2166380q884741o396640
4657D2142457m476752l236414k447824j754179j295239j166697j240085j403206
4649B5122061j499669j423124j239986j038631r82389p48628n36733n38432m86415
4640A6628054k24131k28587m53464n71966n70568n05170n87779n37521m96419
4631A2452449m33502l67134l73777l45219l39693k14713j33974p2184j61906j33320
$$ plain form
4621 9877027 9681384 9453096 9236129 9010101 8716521 8436376 8172690 7940838 7715049 7449775
4611 7449775 7325450 7265237 7156828 7096096 7017588 6891279 6841696 6814147 6748574 6796088 6695538
4600 6695538 6522171 6320806 6078783 5925495 5792323 5592926 5465817 5345709 5133476 4984342
4590 4984342 4863409 4875248 4916414 4901164 4788251 4745947 4728900 4677124 4624069 4516210 4467392
4579 4467392 4372742 4246261 4063581 4003140 3810426 3730427 3593906 3474783 3384442 3340162
4569 3340162 3281739 3181480 3102493 3088571 3056622 2973482 2917517 2887144 2874485 2840570 2798453
4558 2798453 2805734 2736323 2621705 2598312 2537351 2521984 2565002 2572184 2534459 2460074 2396748 2364295
4546 2364295 2292141 2233707 2135049 2090780 2140527 2167456 2093910 2065515 2041029 1991782 1925297
$$ packed form
4621I877027j95643k28288k16967k26028k93580k80145k63686k31852k25789k65274
4611G449775j24325o0213j08409o0732p8508j26309m9583k7549o5573M7514j00550
4600F695538j73367k01365k42023j53288j33172j99397j27109j20108k12233j49134
4590D984342j20933J1839M1166j5250j12913m2304j7047n1776n3055j07859m8818
4579D467392r4650j26481j82680o0441j92714p9999j36521j19123r0341m4280
4569C340162n8423j00259p8987j3922l1949q3140n5965l0373j2659l3915m2117
4558B798453P281o9411j14618k3393o0961j5367M3018P182l7725p4385o3326l2453
4546B364295p2154n8434r8658m4269M9747K6929p3546k8395k4486m9247o6485
$$ plain form
4535 1925297 1943129 1937997 1971753 1881978 1872739 1924295 1938255 1945451 1936631 1873287 1823102 1792268
4523 1792268 1761098 1712481 1691444 1683157 1620690 1540701 1577931 1583384 1559572 1456324 1479582 1502709
4511 1502709 1547830 1555242 1579632 1524988 1433993 1488865 1511769 1462469 1395399 1415689 1337736 1361706
4499 1361706 1385314 1287759 1242054 1251394 1206858 1208227 1202030 1229530 1210263 1246385 1269833 1179791
4487 1179791 1102660 1107852 1073050 1055089 1036437 990993 1011909 1104641 1156713 1077521 984325 912420
4475 912420 876465 904353 880487 866417 860148 837698 873482 803075 811437 854680 828245 806655
4463 806655 815944 766788 744020 697540 735781 702116 761972 779836 698651 671282 656533 644398
4451 644398 631245 685039 635354 619244 566767 629777 715997 722833 676087 704889 632595 622691
$$ packed form
4535A925297J7832n132L3756q9775r239N1556J3960P196q820o3344n0185l0834
4523A792268l1170m8617k1037q287o2467p9989L7230N453k3812j03248K3258K3127
4511A502709M5121P412K4390n4644r0995N4872K2904m9300o7070K0290p7953K3970
4499A361706K3608r7555m5705R340m4536J369o197K7500j9267L6122K3448r0042
4487A179791p7131N192l4802j7961j8652m5444K0916R2732N2072p9192r3196p1905
4475I12420l5955K7888k3866j4070o269k2450L5784p0407Q362M3243k6435k1590
4463H06655R289m9156k2768m6480L8241l3665N9856J7864q1185k7369j4749j2135
4451F44398j3153N3794m9685j6110n2477O3010Q6220O836m6746K8802p2294r904
$$ plain form
4439 622691 666566 665377 624561 539604 572232 628288 589168 602645 643339 628250 627965 613749
4427 613749 537872 508289 488528 471365 453186 512543 565472 543069 570396 573136 504141 520547
4415 520547 507569 426853 521078 497929 393960 406126 429636 481123 473714 475575 548581 553733
4403 553733 463384 413567 448980 423025 404958 427931 449299 442369 379446 369642 401271 404764
4391 404764 396277 377506 384106 418276 400153 353147 387831 428019 439615 445045 501506 442708
4379 442708 437529 474772 444918 457950 426290 430198 390637 406035 445621 459263 453139 458114
4367 458114 478721 447057 469845 527437 448908 408222 413004 444449 445917 421907 460734 489015
4355 489015 509043 479004 446660 494324 593059 534160 454518 416876 433363 428742 371348 314198
$$ packed form
4439F22691M3875j189m0816q4957L2628N6056l9120J3477M0694j5089k85j4216
4427F13749p5877k9583j9761j7163j8179N9357N2929k2403K7327K740o8995J6406
4415E20547j2978q0716R4225k3149j03969J2166K3510N1487p409J861P3006N152
4403E53733r0349m9817L5413k5955j8067K2973K1368o930o2923r804L1629L493
4391D04764q487j8771O600L4170j8123m7006L4684M0188J1596N430N6461n8798
4379D42708n179L7243k9854J3032l1660L908l9561J5398L9586J3642o124M975
4367D58114K0607l1664K2788N7592p8529m0686M782L1445J468k4010L8827K8281
4355D89015K0028l0039l2344M7664R8735n8899p9642l7642J6487m621n7394n7150
$$ plain form
4343 314198 364093 436773 454194 453034 412756 381524 425028 445810 394352 340289 379631 367464
4331 367464 418419 477088 431061 492196 430464 352642 340205 372710 335397 324533 359701 381493
4319 381493 378825 369112 362482 406971 465277 455162 438610 422596 397513 413285 436054 414242
4307 414242 424605 434385 512719 539966 575777 618171 737840 1011267 1270593 1341242 1270342
4296 1270342 1187611 1030192 894792 886490 883806 1027191 1209366 1354667 1414026 1412189 1301744
4285 1301744 1139054 947268 876732 910624 937680 1003695 1100781 1268819 1450009 1515402 1648730
4274 1648730 1763969 2056157 2699338 3999990 4819325 4697086 4446045 3805269 3124136
4265 3124136 2539736 2067553 1639364 1295318 1082414 915496 853280 830369 791421 708412
$$ packed form
4343C14198M9895P2680J7421j160m0278l1232M3504K0782n1458n4063L9342j2167
4331C67464N0955N8669m6027O1135o1732p7822j2437L2505l7313j0864L5168K1792
4319C81493k668r713o630M4489N8306j0115j6552j6014k5083J5772K2769k1812
4307D14242J0363R780P8334K7247L5811M2394J19669K73427K59326P0649p0900
4296A270342q2731j57419j35400q302k684J43385J82175J45301N9359j837j10445
4285A301744j62690j91786p0536L3892K7056O6015R7086J68038J81190O5393J33328
4274A648730J15239K92188O43181J300652Q19335j22239k51041o40776o81133
4265C124136n84400m72183m28189l44046k12904j66918o2216k2911l8948q3009
$$ plain form
4255 708412 664843 595834 522708 602930 551546 543729 528478 472368 446947 461860 427120 465741
4243 465741 470824 519485 425909 385434 391054 413023 430451 418867 389499 335477 296246 284343
4231 284343 364641 378712 321539 323371 320908 362403 318106 337792 326105 331302 320913 343835
4219 343835 336827 290779 305612 339980 451919 409996 484134 602042 668408 682534 690031 610716
4207 610716 546568 443519 371725 320028 322138 377279 316400 236632 289044 267296 279140 359662
4195 359662 377590 347551 363494 385051 334295 366286 396985 333982 331640 336177 376381 372507
4183 372507 314466 327288 277545 236546 220204 198309 194616 212831 173457 73395 125507 227049
4171 227049 147756 101019 165753 200834 213978 243115 228331 193965 195207 146459 168867 243284
$$ packed form
4255G08412m3569o9009p3126Q0222n1384p817j5251n6110k5421J4913l4740L8621
4243D65741N083M8661r3576m0475N620K1969J7428j1584k9368n4022l9231j1903
4231B84343Q0298J4071n7173J832k463M1495m4297J9686j1687N197j0389K2922
4219C43835p008m6048J4833L4368J11939m1923P4138J17908O6366J4126P497p9315
4207F10716o4148j03049p1794n1697K110N5141o0879p9768N2412k1748J1844Q0522
4195C59662J7928l0039J5943K1557n0756L1991L0699o3003k342M537M0204l874
4183C72507n8041J2822m9743m0999j6342k1895l693J8215l9374j00062N2112J01542
4171B27049p9293m6737O4734L5081J3144K9137j4784l4366J242m8748K2408P4417
$$ plain form
4159 243284 259625 273062 306650 358304 545903 625755 699840 649409 558222 534662 441105
4148 441105 343073 360635 388487 302535 231206 229746 222083 208442 182761 227579 247472 236651
4136 236651 284761 313476 303667 230178 189259 168784 183525 192707 215106 204327 238726 227221
4124 227221 175023 170575 199073 123061 125837 142744 220892 242421 225367 217563 197068 165417
4112 165417 174834 195884 206458 282864 252355 243600 255224 264015 223020 200264 224223 205593
4100 205593 281118 351298 340052 385819 347255 295485 276508 285453 393126 349393 298335 338248
4088 338248 387861 409486 398447 433691 396713 353504 285849 271045 285837 278690 324872 349580
4076 349580 316097 328974 326806 283629 268348 349024 370310 343339 345215 395080 481638 475344
$$ packed form
4159B43284J6341J3437L3588N1654J87599P9852P4085n0431r1187k3560r3557
4148D41105r8032J7562K7852q5952p1329j460p663j3641k5681M4818J9893j0821
4136B36651M8110K8715r809p3489m0919k0475J4741R182K2399j0779L4399j1505
4124B27221n2198m448K8498p6012K776J6907P8148K1529j7054p804k0495l1651
4112A65417R417K1050J0574P6406l0509q755J1624Q791m0995k2756K3959j8630
4100B05593P5525P0180j1246M5767l8564n1770j8977Q945J07673m3733n1058L9913
4088C38248M9613K1625j1039L5244l6978m3209o7655j4804J4792p147M6182K4708
4076C49580l3483J2877k168m3177j5281Q0676K1286k6971J876M9865Q6558o294
$$ plain form
4064 475344 474963 507475 524205 442331 370096 385291 388406 445165 471655 475968 386769 392253 381345
4051 381345 328333 372289 329082 330253 304976 284794 271357 228351 264400 335533 305412 246170
4039 246170 232145 270852 401161 345988 330727 365323 343766 356954 376515 357937 359975 414183
4027 414183 347364 255659 266791 284614 301439 354659 312932 321468 301858 273697 262787 249359
4015 249359 250525 257989 307869 351695 368003 347524 327407 236014 235551 213885 214944 295679 258535
4002 258535 267355 276425 305467 375011 366945 320916 262450 288499 337964 340897 433012 430206 439331
3989 439331 379602 350701 378404 450366 450517 384654 355707 413860 446969 429669 433449 485540
3977 485540 459259 482830 498353 402496 396597 389373 421241 498392 479804 496290 493409 503603
$$ packed form
4064D75344l81L2512J6730q1874p2235J5195L115N6759K6490M313q9199N484j0908
4051C81345n3012M3956m3207J171k5277k0182j3437m3006L6049P1133l0121n9242
4039B46170j4025L8707J30309n5173j5261L4596k1557J3188J9561j8578K038N4208
4027D14183o6819r1705J1132J7823J6825N3220m1727Q536j9610k8161j0910j3428
4015B49359J166P464M9880M3826J6308k0479k0117r1393m63k1666J059Q0735l7144
4002B58535Q820R070K9042O9544q066m6029n8466K6049M9465K933R2115k806R125
3989D39331n9729k8901K7703P1962J51o5863k8947N8153L3109j7300L780N2091
3977D85540k6281K3571J5523r5857n899p224L1868P7151j8588J6486k881J0194
$$ plain form
3965 503603 525974 544962 611298 573694 562103 571742 607751 677528 656449 614020 660256 755036
3953 755036 808108 860352 938294 971739 1035823 1143451 1271905 1432380 1597526 1675111 1863439
3942 1863439 2133594 2405996 2898587 3485015 4182597 5282503 6821229 8855493 10973599
3933 10973599 12492241 13067548 12972130 12842916 12843317 12869299 12914918 13022557 12723822 11547818
3923 11547818 9788051 7940204 6274201 4981032 4064138 3311192 2750000 2337254 2055060
3914 2055060 1863385 1680038 1522820 1429273 1340266 1322613 1273441 1273668 1276223 1270082 1298997 1318370
3902 1318370 1371312 1393086 1344451 1420387 1395866 1315025 1275361 1279076 1234747 1140859 1152866 1193510
3890 1193510 1243675 1221496 1231375 1203145 1205862 1212238 1161199 1109670 1113641 1141540 1141419 1174863 1147667
$$ packed form
3965E03603K2371J8988O6336l7604j1591R639L6009O9777k1079m2429M6236R4780
3953G55036N3072N2244P7942L3445O4084J07628J28454J60475J65146P7585J88328
3942A863439K70155K72402M92591N86428O97582J099906J538726K034264K118106
3933A0973599J518642N75307r5418j29214M01K5982M5619J07639k98735j176004
3923A1547818j759767j847847j666003j293169r16894p52946n61192m12746k82194
3914B055060j91675j83347j57218r3547q9007j7653m9172K27K555o141K8915J9373
3902A318370N2942K1774m8635P5936k4521q0841l9664L715m4329r3888J2007M0644
3890A193510N0165k2179R879k8230K717O376n1039n1529L971K7899j21L3444k7196
$$ plain form
3877 1147667 1251454 1324805 1417390 1565565 1660985 1715348 1622479 1539113 1502079 1524702 1560981
3866 1560981 1502695 1484805 1444706 1388907 1364666 1377721 1452964 1434852 1421118 1479685 1453997
3855 1453997 1392108 1266069 1179187 1102507 1047057 1014366 1012734 921144 926091 1007610 1016690 946908
3843 946908 837619 856824 817099 788476 767451 741064 768429 828322 785737 750534 673715
3832 673715 797809 829987 729125 698687 678787 662391 658219 580871 482268 468323 413876
3821 413876 392931 371706 304066 239011 237294 242006 248474 288415 286914 219059 240344 240451 264317
3808 264317 264071 201752 161596 140086 138959 154203 216145 199370 311646 268661 196930 162047
3796 162047 151535 229818 202970 209039 169100 119687 192352 187087 142527 173831 202617 197521
$$ packed form
3877A147667J03787P3351R2585J48175R5420N4363r2869q3366l7034K2623L6279
3866A560981n8286j7890m0099n5799k4241J3055P5243j8112j3734N8567k5688
3855A453997o1889j26039q6882p6680n5450l2691j632r1590M947Q1519R080o9782
3843I46908j09289J9205l9725k8623k1025k6387K7365N9893m2585l5203p6819
3832F73715J24094L2178j00862l0438j9900j6396m172p7348r8603j3945n4447
3821D13876k0945k1225o7640o5055j717M712O468L9941j501o7855K1285J07K3866
3808B64317k46o2319m0156k1510j127J5244O1942j6775J12276m2985p1731l4883
3796A62047j0512P8283k6848O069l9939m9413P2665n265m4560L1304K8786n096
$$ plain form
3784 197521 190331 166501 183636 115497 106699 144204 196355 180287 160037 191433 129094 96652
3772 96652 122572 132261 125567 113716 153285 138824 97999 108474 140580 183931 176279 103209
3760 103209 177362 191088 152010 137872 111757 124832 115884 91098 94554 158373 150885 140601
3748 140601 147635 144413 234242 244588 186592 154153 159501 99941 130543 91854 55827 62545
3736 62545 90591 201562 199053 157393 106123 132202 102314 80526 110401 208312 250954 286641
3724 286641 220318 233652 274308 275975 272233 286248 287751 285994 268498 228706 225828 280467 289388
3711 289388 275105 271119 340825 314882 293991 343164 310527 218332 247687 309642 368308 339863
3699 339863 374000 315057 229137 301953 351566 384651 412184 374565 448723 442081 417192 451070
$$ packed form
3784A97521p190k3830J7135o8139q798L7505N2151j6068k0250L1396o2339l2442
3772I6652K5920R689o694j1851L9569j4461m0825J0475L2106M3351p652p3070
3760A03209P4153J3726l9078j4138k6115J3075q948k4786L456O3819p488j0284
3748A40601P034l222Q9829J0346n7996l2439N348n9560L0602l8689l6027O718
3736F2545K8046J10971k509m1660n1270K6079k9888k1788K9875R7911M2642L5687
3724B86641o6323J3334M0656J667l742J4015J503j757j7496l9792k878N4639Q921
3711B89388j4283l986O9706k5943k0891M9173l2637r2195K9355O1955N8666k8445
3699C39863L4137n8943q5920P2816M9613L3085K7533l7619P4158o642k4889L3878
$$ plain form
3687 451070 396737 355773 375532 369565 302033 350957 335461 314569 335229 294454 277392 263126
3675 263126 282637 280799 285462 306842 310510 281910 249908 252588 296822 315358 260365 257061 242403
3662 242403 209828 242198 262606 269345 248887 279440 283433 236522 259218 247408 196881 110246
3650 110246 127913 90172 103384 179309 221598 158484 130762 142891 206539 225871 281734 306557
3638 306557 241432 184078 199948 262390 208858 122169 96634 153877 127917 161018 213233 153845
3626 153845 159371 224293 225337 199434 151990 151953 157169 179575 229336 255294 261908 260172 189501
3613 189501 104518 84508 84875 124524 130816 176123 226640 196536 178501 245399 288333 304679
3601 304679 243361 256747 286477 227972 251545 280969 262608 252006 249277 278067 287272 305969
$$ packed form
3687D51070n4333m0964J9759n967o7532M8924j5496k0892K0660m0775j7062j4266
3675B63126J9511j838M663K1380L668k8600l2002K680M4234J8536n4993l304j4658
3662B42403l2575L2370K0408O739k0458L0553L993m6911K2696j1810n0527q6635
3650A10246J7667l7741J3212P5925M2289o3114k7722J2129O3648J9332N5863K4823
3638C06557o5125n7354J5870O2442n3532q6689k5535N7243k5960L3101N2215n9388
3626A53845N526O4922J044k5903m7444l7N216K2406M9761K5958O614j736p0671
3613A89501q4983k0010L67L9649O292M5307N0517l0104j8035O6898M2934J6346
3601C04679o1318J3386K9730n8505K3573K9424j8361j0602k729K8790R205J8697
$$ plain form
3589 305969 300819 288278 308903 349099 309767 302220 309089 307893 323342 353740 362071 308464 317738
3576 317738 346344 344472 485733 501172 411263 401076 406675 328954 321450 395748 452382 432682
3564 432682 418541 337574 383503 407572 418198 455506 452063 505102 496483 484480 476227 495442
3552 495442 555279 577698 572063 517757 540997 464746 446046 462309 422936 443969 510237 549513
3540 549513 556102 633729 719206 763198 736787 813774 865670 935708 1008467 1126839 1109853 1098692
3528 1098692 1157019 1165413 1149993 1186654 1250377 1321578 1499926 1621436 1735301 1998883 2289173
3517 2289173 2997864 4131278 5063618 5119295 4902822 4282808 3590976 3025942 2600404 2373784
3507 2373784 2239815 2149715 2032507 2030345 1981676 1895522 1819535 1754175 1735638 1780852 1842863
$$ packed form
3589C05969n150j2541K0625M0196l9332p547O869j196J5449L0398Q331n3607R274
3576C17738K8606j872J41261J5439q9909j0187N599p7721p504P4298N6634j9700
3564D32682j4141q0967M5929K4069J0626L7308l443N3039q619j2003q253J9215
3552D95442N9837K2419n635n4306K3240p6251j8700J6263l9373K1033O6268L9276
3540E49513O589P7627Q5477M3992k6411P6987N1896P0038P2759J18372j6986j1161
3528A098692N8327Q394j5420L6661O3723P1201J78348J21510J13865K63582K90290
3517B289173P08691J133414R32340N5677k16473o20014o91832n65034m25538k26620
3507B373784j33969r0100j17208k162m8669q6154p5987o5360j8537M5214O2011
$$ plain form
3496 1842863 1947364 2008838 2030900 2235325 2329346 2448126 2595113 2848295 3117492 3348446
3486 3348446 3888882 4871612 6919166 9187883 9754938 9389757 8491551 7128747 5805137
3477 5805137 4777071 4224504 3994064 3853923 3647941 3592960 3425382 3179598 2966081 2841216
3467 2841216 2674453 2570303 2472524 2425652 2416105 2568067 2614266 2668281 2659706 2686370 2669198
3456 2669198 2722373 2909134 3135841 3605646 4500672 5733715 6659581 7139046 7238001 6792777
3446 6792777 6143444 5443403 4972616 4836477 4969954 5252472 6119333 7933693 10638317
3437 10638317 12554736 12503478 11556676 9967203 8200348 6748495 5752059 5056598 4713427
3428 4713427 4655108 4645931 4403706 4120005 3869381 3671720 3504706 3408339 3403497 3539073 4080458
$$ packed form
3496A842863J04501O1474K2062K04425R4021J18780J46987K53182K69197K30954
3486C348446N40436R82730K047554K268717N67055l65181q98206j362804j323610
3477E805137j028066n52567k30440j40141k05982n4981j67578k45784k13517j24865
3467B841216j66763j04150r7779m6872r547J51962M6199N4015q575K6664j7172
3456B669198N3175J86761K26707M69805Q95026J233043R25866M79465R8955m45224
3446F792777o49333p00041m70787j36139J33477K82518Q66861J814360K704624
3437A0638317J916419n1258r46802j589473j766855j451853r96436o95461l43171
3428D713427n8319r177k42225k83701k50624j97661j67014r6367m842J35576N41385
$$ plain form
3417 4080458 4957648 5742956 5985289 5922046 5692039 5548183 5517521 5800843 6682031 8661017
3407 8661017 12681236 18510066 21335892 20789016 18903409 15606428 12399852 9608579
3399 9608579 7783720 6564968 6052592 5944315 5750697 5458389 4970464 4435664 3975263
3390 3975263 3606649 3372629 3213454 3195860 3372899 3606895 3837099 3923856 3827455 3655100
3380 3655100 3587421 3543830 3746547 4200020 5303387 7384069 9830049 10785096 10337923
3371 10337923 9282777 7669775 6159835 4934003 4117509 3535043 3307438 3266322 3105851
3362 3105851 2846180 2624477 2323932 2009356 1794868 1625103 1476615 1306271 1247494 1216795
3352 1216795 1159322 1088675 991625 980656 962504 910331 889815 871429 830395 848231 834765
$$ packed form
3417D080458Q77190P85308K42333o3243k30007j43856l0662K83322Q81188J978986
3407H661017M020219N828830K825826n46876j885607l296981l206576k791273
3399I608579j824859j218752n12376j08277j93618k92308m87925n34800m60401
3390C975263l68614k34020j59175j7594J77039K33996K30204Q6757r6401j72355
3380C655100o7679m3591K02717M53473J103367K080682K445980R55047m47173
3371A0337923j055146j613002j509940j225832q16494n82466k27605m1116j60471
3362C105851k59671k21703l00545l14576k14488j69765j48488j70344n8777l0699
3352A216795n7473p0647r7050j0969j8152n2173k0516j8386m1034J7836j3466
$$ plain form
3341 834765 848264 790098 776623 809658 746276 706046 663142 617075 627896 608418 568712 587047
3329 587047 543227 477048 500326 500112 492393 482437 539282 526218 451592 414637 418206 452348 401574
3316 401574 322053 329149 333404 263455 287645 313739 339280 283391 320707 321261 318810 324183 283559
3303 283559 279884 231033 260558 252094 191754 210382 226951 190838 193129 218478 221596 243118
3291 243118 216564 110980 72038 88822 127218 116274 121796 69479 55182 154043 161047 121951
3279 121951 88264 43642 119679 130261 125502 88663 109902 95487 82434 78518 79513 88309 96425
3266 96425 60802 75642 143113 77619 2235 -18332 36683 33354 32535 46172 -51140 -64726
3254 -64726 48888 48864 17252 -36379 -12537 -8519 21275 52273 42239 -48791 -33959 -23573
$$ packed form
3341H34765J3499n8166j3475L3035o3382m0230m2904m6067J0821j9478l9706J8335
3329E87047m3820o6179K3278k14p719r956N6845j3064p4626l6955L569L4142n0774
3316D01574p9521P096M255o9949K4190K6094K5541n5889L7316N54k451N373m0624
3303B83559l675m8851K9525q464o0340J8628J6569l6113K291K5349L118K1522
3291B43118k6554j05584l8942J6784L8396j0944N522n2317j4297R8861P004l9096
3279A21951l3687m4622P6037J0582m759l6839K1239j4415j3053l916R95Q796Q116
3266I6425l5623J4840O7471o5494p5384k0567N5015l329q19J3637r7312j3586
3254f4726J13614k4l1612n3631K3842M018K9794L0998j0034r1030J4832J0386
$$ plain form
3242 -23573 64983 53018 -28202 5937 -1887 25190 104189 9730 -43306 -35299 23055 85712
3230 85712 27890 -27171 -26009 -48416 -21079 17601 1282 10952 35380 41238 61391 37476
3218 37476 44577 14605 11465 61657 7401 -11228 -54828 23111 27948 50937 70483 26129
3206 26129 21959 -23880 12768 42059 78080 101480 37294 38980 -29825 31754 36864 -3720
3194 -3720 -74629 -84107 2859 61250 81785 52444 7974 16905 30425 4469 -21006 -58831
3182 -58831 -40623 -12221 -1024 -9503 -116816 -75424 -4405 10808 70643 90982 48510 -27434
3170 -27434 -42909 -16149 14200 19194 -20462 16611 63999 35236 86661 44537 -6905 39181
3158 39181 13601 36333 50498 -15514 -25158 -60574 -83093 -41215 34244 67720 28680 -3057
$$ packed form
3242b3573Q8556j1965q1220L4139p824K7077P8999r4459n3036Q007N8354O2657
3230H5712n7822n5061J162k2407K7337L8680j6319R670K4428N858K0153k3915
3218C7476P101k9972l140N0192n4256j8629m3600P7939M837K2989J9546m4354
3206B6129m170m5839L6648K9291L6021K3400o4186J686o8805O1579N110m0584
3194c720p0909r478Q6966N8391K0535k9341m4470Q931J3520k5956k5475l7825
3182e8831J8208K8402J1197q479j07313M1392P1019J5213N9835K0339m2472p5944
3170b7434j5475K6760L0349M994l9656L7073M7388k8763N1425m2124n1442M6086
3158C9181k5580K2732J4165o6012r644l5416k2519M1878P5459L3476l9040l1737
$$ plain form
3146 -3057 10820 15664 46198 51695 15058 -930 -4987 26904 45794 -25427 -29046 16399 32811
3133 32811 1825 37112 9264 4179 -9409 -14984 29280 -22445 -58863 -29575 80635 7162
3121 7162 14072 54916 107640 145371 131263 97374 28164 12731 66731 78527 37783 62716
3109 62716 42096 94428 73438 113400 65224 81441 27037 24041 20828 45289 124072 71432
3097 71432 53804 37915 105002 141031 95594 75002 20714 49929 15682 50074 100234 99478
3085 99478 97415 73161 18154 1701 5492 8225 -8354 -26642 16505 3561 13384 -36185 -25327
3072 -25327 -48885 -44945 -98446 -127103 -164934 -101859 -133894 -55452 -64724 -57735 -28186 -20545 -37108
3059 -37108 -48056 -43892 -59785 -90650 -137967 -122577 -73989 -25694 -45436 -88557 -59150 19740
$$ packed form
3146c057J3877M844L0534N497l6637j5988m057L1891J8890p1221l619M5445J6412
3133C2811l0986L5287k7848n085j3588n575M4264n1725l6418K9288J10210p3473
3121G162O910M0844N2724L7731j4108l3889o9210j5433N4000J1796m0744K4933
3109F2716k0620N2332k0990L9962m8176J6217n4404k996l213K4461P8783n2640
3097G1432j7628j5889O7087L6029m5437k0592n4288K9215l4247L4392N0160p56
3085I9478k063k4254n5007j6453L791K733j6579j8288M3147j2944R823m9569J0858
3072b5327k3558L940n3501k8657l7831O3075l2035P8442r272O989K9549P641j6563
3059c7108j0948M164j5893l0865m7317J5390M8588M8295j9742m3121K9407P8890
$$ plain form
3047 19740 -29427 -91866 -74771 -38214 13855 -2703 -68706 -34646 -6209 -18237 5258 -45114
3035 -45114 -116095 -117695 -128594 -67532 -78288 -65572 -19593 -63471 -91088 -82069 -26150 -5216
3023 -5216 -82846 -57800 -48005 -80676 -53429 -74846 -99853 -80695 -56888 -46398 -84594 -99026
3011 -99026 -65941 -70750 -111585 -92001 -126707 -109181 -92560 -94862 -93557 -112178 -154702 -170184
2999 -170184 -198756 -222097 -152688 -76533 -55383 -49677 -110642 -100571 -129902 -129338 -101195 -101106 -93694
2986 -93694 -138404 -137013 -123947 -147727 -109752 -45354 -150801 -119458 -124761 -175024 -108326 -83913
2974 -83913 -76928 -106107 -115766 -91225 -155252 -153622 -125702 -128517 -107129 -87756 -64496 -43713 -46857
2961 -46857 -90019 -142533 -126775 -120804 -81583 -109872 -160700 -126524 -88475 -74770 -105594 -165499
$$ packed form
3047A9740m9167o2439J7095L6557N2069j6558o6003L4060K8437j2028K3495n0372
3035d5114p0981j600j0899O1062j0756J2716M5979m3878k7617R019N5919K0934
3023e216p7630K5046R795l2671K7247k1417k5007J9158K3807J0490l8196j4432
3011i9026L3085m809m0835J9584l4706J7526J6621k302J305j8621m2524j5482
2999a70184k8572k3341O9409P6155K1150N706o0965J0071k9331N64K8143Q9P412
2986i3694m4710J391J3066k3780L7975O4398j05447L1343n303n0263O6698K4413
2974h3913O985k9179r659K4541o4027J630K7920k815K1388J9373K3260K0783l144
2961d6857m3162n2514J5758N971L9221k8289n0828L4176L8049J3705l0824n9905
$$ plain form
2949 -165499 -215914 -173612 -164073 -188825 -140427 -77459 -27417 -184 -30755 -34350 -50881 -52448
2937 -52448 -45557 -84910 -88202 -28080 -70147 -89354 -111752 -91803 -86035 -73060 -88196 -62556
2925 -62556 -106107 -131596 -141310 -154486 -148714 -124420 -104732 -65459 -88366 -82987 -141386 -129949
2913 -129949 -91185 -92824 -90699 -115751 -70651 -96048 -151926 -207645 -206678 -151234 -139219 -132145 -70344
2900 -70344 -110935 -46466 -50870 -173370 -196753 -85566 -107607 -102241 -151759 -142501 -145586 -125726
2888 -125726 -137408 -139132 -137897 -135505 -134186 -128559 -117372 -184327 -175563 -112950 -99657 -47065 -29145
2875 -29145 -46449 -169807 -145701 -97888 -137011 -133041 -91654 -146054 -100401 -83750 -116244 -74811
2863 -74811 -83165 -81029 -106203 -87699 -65017 -74489 -77626 -2092 -33959 -86803 -73479 -76729 -88983
$$ packed form
2949a65499n0415M2302R539k4752M8398O2968N0042K7233l0571l595j6531j567
2937e2448O891l9353l292O0122m2067j9207k2398J9949N768J2975j5136K5640
2925f2556m3551k5489r714j3176N772K4294J9688L9273k2907N379n8399J1437
2913a29949L8764j639K125k5052M5100k5397n5878n5719R67N5444J2015P074O1801
2900g0344m0591O4469m404j22500k3383J11187k2041N366m9518R258l085J9860
2888a25726j1682j724J235K392J319N627J1187o6955Q764O2613J3293N2592J7920
2875b9145j7304j23358K4106M7813l9123L970M1387n4400M5653J6651l2494M1433
2863g4811q354K136k5174J8504K2682r472l137P5534l1867n2844J3324l250j2254
$$ plain form
2850 -88983 -189795 -105434 -114661 -133768 -72776 -100206 -91763 -131547 -78996 -65617 -65649 -85326 -64996
2837 -64996 -80132 -151286 -135122 -156727 -166018 -169501 -156248 -133988 -146644 -142885 -98735 -38647
2825 -38647 -131911 -117568 -137321 -150638 -94436 -90760 -35546 32753 -66067 -66190 -130112 -95938
2813 -95938 -63008 -25061 -68075 -84440 -93850 -102557 -100960 -163674 -160643 -114578 -128731 -120992 -109316
2800 -109316 -152405 -98758 -131461 -186881 -165373 -139302 -144195 -146600 -145841 -151700 -117208 -152662 -194408
2787 -194408 -138989 -87966 -65743 -100273 -62278 -100251 -126241 -168507 -166307 -103636 -113426 -80219
2775 -80219 -99909 -84230 -125019 -133046 -74628 -47911 -94233 -144373 -190141 -179945 -69003 -115898
2763 -115898 -124865 -81410 -104376 -52915 -158832 -199485 -81522 -78503 -101872 -60586 -15254 -61472
$$ packed form
2850h8983j00812Q4361r227j9107O0992k7430Q443l9784N2551J3379l2j9677K0330
2837f4996j5136p1154J6164k1605r291l483J3253K2260j2656L759M4150O0088
2825c8647r3264J4343j9753j3317N6202L676N5214O8299r8820j23o3922L4174
2813i5938L2930L7947m3014j6365r410q707J597o2714L031M6065j4153P739J1676
2800a09316m3089N3647l2703n5420K1508K6071m893k405P59n859L4492l5454m1746
2787a94408N5419N1023K2223l4530L7995l7973k5990m2266K200O2671r790L3207
2775h0219j9690J5679m0789q027N8418K6717m6322n0140m5768J0196J10942m6895
2763a15898q967M3455k2966N1461j05917m0653J17963L019k3369M1286M5332m6218
$$ plain form
2751 -61472 -104034 -91793 -153189 -136012 -66593 -97918 -92254 -145187 -144958 -107474 -124296 -174276
2739 -174276 -186683 -202237 -154877 -122213 -134055 -160461 -93468 -111901 -83799 -104629 -169556 -79619
2727 -79619 -67707 -143702 -125011 -141789 -109274 -78254 -37188 -82590 -162484 -159460 -181996 -109857
2715 -109857 -23266 -36730 -52764 -78322 -69065 -43764 -102037 -131564 -123984 -100303 -139878 -131964
2703 -131964 -115924 -116300 -86089 -75371 -71881 -118749 -148300 -98891 -73747 -91266 -86029 -93385 -137564
2690 -137564 -116119 -161198 -114098 -65955 -121703 -108551 -88043 -113331 -80610 -95408 -127950 -150323
2678 -150323 -128488 -105107 -114825 -130846 -147657 -134055 -112176 -56302 -67492 -62766 -66762 -139328
2666 -139328 -144958 -142966 -149331 -48546 -55395 -135054 -155227 -135525 -110179 -116467 -89628 -77226
$$ packed form
2751f1472m2562J2241o1396J7177O9419l1325N664n2933K29L7484j6822m9980
2739a74276j2407j5554M7360L2664j1842k6406O6993j8433K8102k0830o4927Q9937
2727g9619J1912p5995J8691j6778L2515L1020M1066m5402p9894L024k2536P2139
2715a09857Q6591j3464j6034k5558R257K5301n8273k9527P580K3681l9575P914
2703a31964J6040l76L0211J0718L490m6868k9551M9409K5144j7519N237p356m4179
2690a37564K1445m5079M7100M8143n5748J3152K0508k5288L2721j4798l2542k2373
2678a50323K1835K3381r718j6021j6811J3602K1879N5874j1190M726l996p2566
2666a39328n630J992o365J00785o849p9659k0173J9702K5346o288K6839J2402
$$ plain form
2654 -77226 -46371 -52285 -114943 -114428 -135220 -175293 -122885 -86712 -85948 -52773 -28041 -44733 -50900
2641 -50900 -49844 -77234 -18824 -66632 -82801 -112094 -123567 -54520 -75382 -83086 -76594 -79102 -21422
2628 -21422 -58958 -90732 -60850 -42325 -58189 -75352 -143750 -111359 -101731 -107042 -55891 -99125
2616 -99125 -111942 -115785 -137280 -101427 -65098 -49536 -122629 -104526 -123315 -115300 -65500 -20650
2604 -20650 2505 -62496 34560 -25629 -66998 -65830 -48634 -117244 -103243 -38189 -90923 -68945
2592 -68945 -58300 -66210 -134430 -157860 -96481 -54243 -36642 -74885 -79885 -107019 -42021 -69273
2580 -69273 -63769 -38615 -62863 -94550 -71018 -93890 -39730 -22196 -80190 -98003 -69988 -47497
2568 -47497 -54407 -68181 -18228 -14186 33911 156242 256925 304275 255015 193842 74520 114730
$$ packed form
2654g7226L0855n914o2658N15k0792m0073N2408L6173P64L3175K4732j6692o167
2641e0900J056k7390N8410m7808j6169k9293j1473O9047k0862p704O492k508N7680
2628b1422l7536l1774K9882J8525j5864j7163o8398L2391R628n311N1151m3234
2616i9125j2817l843k1495L5853L6329J5562p3093J8103j8789Q015M9800M4850
2604b0650K3155o5001R7056o0189m1369J168J7196o8610J4001O5054n2734K1978
2592f8945J0645p910o8220k3430O1379M2238J7601l8243n000k7134O4998k7252
2580f9273N504K5154k4248l1687K3532k2872N4160J7534n7994j7813K8015K2491
2568d7497o910j3774M9953M042M8097J22331J00683M7350m9260o1173j19322M0210
$$ plain form
2556 114730 134596 73755 -6222 -6409 -3442 -61181 -16609 -43041 -64686 -65021 -27180 -42818 -73176
2543 -73176 -64554 13942 -6762 -38414 451 -16245 -26475 6724 -14348 -74932 -16110 -11162
2531 -11162 -13413 -67175 -8112 33740 -60253 -35627 -25843 -4323 -11880 11481 957 -103210
2519 -103210 -104741 -80626 -90089 -68687 -69291 -110426 -39306 -72334 -114553 -91137 -31026 -32427 -40223
2506 -40223 -29717 -10321 38121 -36274 -69086 -31623 37318 11019 19998 -37571 -55520 44111
2494 44111 7914 -23826 -9282 -8267 -12322 -45475 -40459 2297 5449 6762 12406 5187 -66710
2481 -66710 -18833 -41666 -73411 24225 30098 -10774 -1537 -13929 -10056 -73179 -66821 5658 79827
2468 79827 97075 79269 87249 17230 -20014 3372 -34176 35939 49030 86059 -15762 -5494
$$ packed form
2556A14730J9866o0841p9977j87K967n7739M4572k6432k1645l35L7841j5638l0358
2543g3176Q622P8496k0704l1652L8865j6696j0230L3199k1072o0584N8822M948
2531a1162k251n3762N9063M1852r3993K4626R784K1520p557K3361j0524j04167
2519a03210j531K4115r463K1402o04m1135P1120l3028m2219K3416O0111j401p796
2506d0223J0506J9396M8442p4395l2812L7463O8941k6299Q979n7569j7949R9631
2494D4111l6197l1740J4544J015m055l3153N016M2756L152J313N644p219p1897
2481f6710M7877k2833l1745R7636N873m0872R237j2392L873o3123O358P2479P4169
2468G9827J7248j7806P980p0019l7244K3386l7548P0115J3091L7029j01821J0268
$$ plain form
2456 -5494 -16362 -57126 -56520 -22815 -64172 29791 132555 115844 132570 89208 6703 33418
2444 33418 88943 86858 98192 104237 160169 154095 138188 89587 98307 92767 88242 91822 132281
2431 132281 95744 95590 173413 141915 138457 122401 169770 97149 83191 104472 151399 136144
2419 136144 167259 172700 203618 200301 138314 121527 93040 107460 145794 196839 196756 174290 137170
2406 137170 180334 267833 254108 166113 162272 203894 188188 252695 302491 228744 186292 233192
2394 233192 271060 302571 302610 303310 294114 308736 326885 223475 246724 252274 332975 329609 396306
2381 396306 381850 300789 229720 256702 270508 307209 322204 334732 293230 343357 371276 473022
2369 473022 519432 537098 476389 484505 535274 596846 571283 530419 465853 562881 590304 606828
$$ packed form
2456e494j0868m0764O06L3705m1357R3963J02764j6711J6726m3362q2505K6715
2444C3418N5525k085J1334O045N5932o074j5907m8601Q720n540m525L580M0459
2431A32281l6537j54P7823l1498l458j6056M7369p2621j3958K1281M6927j5255
2419A36144L1115N441L0918l317o1987j6787k8487J4420L8334N1045q3k2466l7120
2406A37170M3164Q7499j3725q7995l841M1622j5706O4507M9796p3747m2452M6900
2394B33192L7868L1511L9P00r196J4622J8149j03410K3249N550Q0701l366O6697
2381C96306j4456q1061p1069K6982J3806L6701J4995J2528m1502N0127K7919J01746
2369D73022M6410J7666o0709Q116N0769O1572k5563m0864o4566R7028K7423J6524
$$ plain form
2357 606828 591209 674606 698422 705836 636739 612382 547392 629657 663293 650228 702428 755292
2345 755292 803157 823350 802046 818004 806297 792584 811304 889270 907619 960065 960026 974064
2333 974064 991774 1055443 1182505 1216972 1220128 1296394 1353079 1421219 1428662 1390206 1334587 1419606
2321 1419606 1514878 1595560 1672181 1782501 1878820 1972869 2146388 2337840 2498144 2867607
2311 2867607 3352975 4059822 4376969 4536535 4691582 4750946 4833389 5201227 5844481 6794634
2301 6794634 8180815 10091292 12534893 16812874 25527136 43480649 62642173 63070242
2293 63070242 58152609 50195670 38175412 27995542 20351099 15316002 11529085 9037465
2285 9037465 7234771 6354268 5618077 5244427 5126366 5299480 4947738 4525960 4064129
$$ packed form
2357F06828j5619Q3397K3816P414o9097k4357o4990Q2265L3636j3065N2200N2864
2345G55292M7865K0193k1304J5958j1707j3713J8720P7966J8349N2446l9J4038
2333I74064J7710O3669J27062L4467L156P6266N6685O8140P443l8456n5619Q5019
2321A419606R5272Q0682P6621J10320R6319R4049J73519J91452J60304L69463
2311B867607M85368P06847L17147J59566J55047N9364Q2443L67838O43254R50153
2301F794634J386181J910477K443601M277981Q714262J7953513J9161524M28069
2293F3070242m917633p956939j2020258j0179870p644443n035097l786917k491620
2285I037465j802694q80503p36191l73650j18061J73114l51742m21778m61831
$$ plain form
2276 4064129 3675438 3150373 2853860 2578850 2454190 2262772 2200613 2090990 2021492 1907029
2266 1907029 1766300 1586267 1553499 1430231 1392170 1323054 1230389 1154996 1117975 1040129 1099201
2255 1099201 1076989 1051397 983893 1031236 955966 935705 924775 902668 849235 786274 716247
2244 716247 744552 728643 770309 675323 647827 633966 536194 514552 560565 461687 405267 358716
2232 358716 397084 338131 270135 366265 355345 350958 295336 292400 287879 177539 224656 264609
2220 264609 221943 163249 182714 133391 171383 204869 303480 247815 142677 165253 170445 137172
2208 137172 116674 118890 131375 89550 118690 165143 161514 118689 131188 141575 70258 63135
$$ packed form
2276D064129l88691n25065k96513k75010j24660j91418o2159j09623o9498j14463
2266A907029j40729j80033l2768j23268l8061o9116r2665p5393l7021p7846N9072
2255A099201k2212k5592o7504M7343p5270k0261j0930k2107n3433o2961p0027
2244G16247K8305j5909M1666r4986k7496j3861r7772k1642M6013r8878n6420m6551
2232C58716L8368n8953o7996R6130j0920m387n5622k936m521j10340M7117L9953
2220B64609m2666n8694J9465m9323L7992L3486R8611n5665j05138K2576N192l3273
2208A37172k0498K216J2485m1825K9140M6453l629m2825J2499J0387p1317p123
$$ [...]
##END NTUPLES=NMR SPECTRUM
##END=
