##TITLE=1H_DE-80H_X3
 200.13MHz, d2o
 8 sc
 
 19ns.26.2.2025
##JCAMPDX= 6.0         $$ Bruker NMR JCAMP-DX V2.0
##DATA TYPE= NMR SPECTRUM
##DATA CLASS= NTUPLES
##ORIGIN= UXNMR, Bruker Analytische Messtechnik GmbH
##OWNER= pz
$$ XWIN-NMR		Version 3.5
$$ Tue Jan 27 10:01:08 2026 Russian Standard Time (UT+4h)  Yarkov@DPX200
##.OBSERVE FREQUENCY= 200.1313
##.OBSERVE NUCLEUS= ^1H
##.ACQUISITION MODE= SIMULTANEOUS
##.ACQUISITION SCHEME= undefined
##.AVERAGES= 8
##.DIGITISER RES= 18
##SPECTROMETER/DATA SYSTEM= spect
##.PULSE SEQUENCE= zg30
##.SOLVENT NAME= CDCl3
##.SHIFT REFERENCE= (INTERNAL, CDCl3, 0, 15.4417)
##AUDIT TRAIL= $$ (NUMBER, WHEN, WHO, WHERE, WHAT)
$$ ##TITLE= Audit trail, XWIN-NMR		Version 3.5
$$ ##JCAMPDX= 5.01
$$ ##ORIGIN= Bruker BioSpin GmbH
$$ ##OWNER= Yarkov
$$ C:/Bruker/XWIN-NMR/data/yarkov2/nmr/H-C/1/pdata/1/auditp.txt
$$ ##AUDIT TRAIL=  $$ (NUMBER, WHEN, WHO, WHERE, WHAT)
(   1,<2026-01-27 09:59:50.65 +0400>,<Yarkov>,<DPX200>,
      <created by zg, POWCHK disabled, PULCHK disabled
       configuration hash MD5:
       00 E9 B6 7A A2 85 ED C7 34 08 36 98 17 FE 4E 26
       data hash MD5: 16K
       33 1B 50 31 BD D5 07 82 0E AD E8 4E 43 56 96 87>)
(   2,<2026-01-27 09:59:57.73 +0400>,<Yarkov>,<DPX200>,
      <Start of raw data processing
       efp BC_mod = 2 LB = 0.25 FT_mod = 6 PKNL = 1 PHC0 = -5300.897 PHC1 = 7.62193 SI = 16K 
       data hash MD5: 16K
       EF DB E2 B5 E0 CC 14 F8 51 48 71 96 40 6B BD FA>)
(   3,<2026-01-27 10:00:08.93 +0400>,<Yarkov>,<DPX200>,
      <pk PHC0 = 6.2 PHC1 = 0 
       data hash MD5: 16K
       66 C8 43 B6 96 25 84 5F 79 6D 09 63 1C D5 B5 FD>)
$$ ##END=
$$ 
$$ hash MD5
$$ 5D 9F 82 F6 7D BF 3D 03 3F 41 96 EE B5 56 95 89
##$RELAX= 
##$RELAX= 
##$RELAX= 
##$RELAX= 
##$RELAX= 
##$RELAX= 
$$ Bruker specific parameters
$$ --------------------------
##$DU= <C:/Bruker/XWIN-NMR>
##$EXPNO= 1
##$NAME= <H-C>
##$PROCNO= 1
##$TYPE= <nmr>
##$USER= <yarkov2>
##$AMP= (0..31)
100 100 100 100 100 100 100 100 100 100 100 100 100 100 100 100 100 100 
100 100 100 100 100 100 100 100 100 100 100 100 100 100 
##$AQSEQ= 0
##$AQ_mod= 1
##$AUNM= <au_zg>
##$AUTOPOS= <>
##$BF1= 200.13
##$BF2= 200.13
##$BF3= 200.13
##$BF4= 200.13
##$BF5= 200.13
##$BF6= 200.13
##$BF7= 200.13
##$BF8= 200.13
##$BYTORDA= 1
##$CFDGTYP= 0
##$CFRGTYP= 5
##$CHEMSTR= <none>
##$CNST= (0..31)
1 1 145 1 1 1 1 1 1 1 1 1 1 1 1 1 1 1 1 1 1 1 1 1 1 1 1 1 1 1 1 1 
##$CPDPRG= <>
##$CPDPRG1= <>
##$CPDPRG2= <>
##$CPDPRG3= <>
##$CPDPRG4= <mlev>
##$CPDPRG5= <mlev>
##$CPDPRG6= <mlev>
##$CPDPRG7= <mlev>
##$CPDPRG8= <mlev>
##$CPDPRGB= <>
##$CPDPRGT= <>
##$D= (0..31)
0 0.7 0 0 0 0 0 0 0 0 0 0.03 0 0 0 0 0 0 0 0 0 0 0 0 0 0 0 0 0 0 0 0 
##$DATE= 1769493590
##$DBL= (0..7)
120 120 120 120 120 120 120 120 
##$DBP= (0..7)
150 150 150 150 150 150 150 150 
##$DBP07= 0
##$DBPNAM0= <>
##$DBPNAM1= <>
##$DBPNAM2= <>
##$DBPNAM3= <>
##$DBPNAM4= <>
##$DBPNAM5= <>
##$DBPNAM6= <>
##$DBPNAM7= <>
##$DBPOAL= (0..7)
0.5 0.5 0.5 0.5 0.5 0.5 0.5 0.5 
##$DBPOFFS= (0..7)
0 0 0 0 0 0 0 0 
$$ [...]
##$SUBNAM2= <"">
##$SUBNAM3= <"">
##$SUBNAM4= <"">
##$SUBNAM5= <"">
##$SUBNAM6= <"">
##$SUBNAM7= <"">
##$SUBNAM8= <"">
##$SUBNAM9= <"">
##$SW= 18.0517328524113
##$SWIBOX= (0..15)
0 0 2 0 0 0 0 0 0 0 0 0 0 0 0 0 
##$SW_h= 3612.71676300578
##$TD= 16384
##$TD0= 1
##$TE= 0
##$TE2= 300
##$TE3= 300
##$TEG= 300
##$TL= (0..7)
0 120 120 120 120 120 120 120 
##$TP= (0..7)
150 150 150 150 150 150 150 150 
##$TP07= 0
##$TPNAME0= <>
##$TPNAME1= <>
##$TPNAME2= <>
##$TPNAME3= <>
##$TPNAME4= <>
##$TPNAME5= <>
##$TPNAME6= <>
##$TPNAME7= <>
##$TPOAL= (0..7)
0.5 0.5 0.5 0.5 0.5 0.5 0.5 0.5 
##$TPOFFS= (0..7)
0 0 0 0 0 0 0 0 
##$TUNHIN= 0
##$TUNHOUT= 0
##$TUNXOUT= 0
##$USERA1= <user>
##$USERA2= <user>
##$USERA3= <user>
##$USERA4= <user>
##$USERA5= <user>
##$V9= 5
##$VALIST= <valist>
##$VCLIST= <CCCCCCCCCCCCCCC>
##$VD= 0
##$VDLIST= <DDDDDDDDDDDDDDD>
##$VPLIST= <PPPPPPPPPPPPPPP>
##$VTLIST= <TTTTTTTTTTTTTTT>
##$WBST= 1024
##$WBSW= 4
##$XGAIN= (0..3)
0 0 0 0 
##$XL= 0
##$YL= 0
##$YMAX_a= 303298
##$YMIN_a= -220948
##$ZGOPTNS= <>
##$ZL1= 120
##$ZL2= 120
##$ZL3= 120
##$ZL4= 120
##$ABSF1= 0
##$ABSF2= 0
##$ABSG= 0
##$ABSL= 0
##$ALPHA= 0
##$AQORDER= 0
##$ASSFAC= 0
##$ASSFACI= 0
##$ASSFACX= 0
##$ASSWID= 0
##$AUNMP= <proc_1d>
##$AZFE= 0.1
##$AZFW= 0.1
##$BCFW= 0
##$BC_mod= 2
##$BYTORDP= 0
##$COROFFS= 0
##$CY= -3
##$DATMOD= 1
##$DC= 0
##$DFILT= <>
##$DTYPP= 0
##$F1P= 0
##$F2P= 0
##$FCOR= 1
##$FTSIZE= 16384
##$FT_mod= 6
##$GAMMA= 0
##$GB= 0
##$INTBC= 1
##$INTSCL= 3.241238e-09
##$ISEN= 128
##$LB= 0.25
##$LEV0= 0
##$LPBIN= 0
##$MAXI= 10000
##$MC2= 0
##$MEAN= 0
##$ME_mod= 0
##$MI= 1.114404
##$NCOEF= 0
##$NC_proc= -5
##$NLEV= 6
##$NOISF1= 3.799351
##$NOISF2= 2.8
##$NSP= 0
##$NTH_PI= 0
##$NZP= 0
##$OFFSET= 15.44169
##$PC= 1
##$PHC0= -5294.697
##$PHC1= 7.62193
##$PH_mod= 1
##$PKNL= yes
##$PPARMOD= 0
##$PSCAL= 0
##$PSIGN= 0
##$REVERSE= no
##$SF= 200.130016012151
##$SI= 16384
##$SIGF1= 3
##$SIGF2= 2
##$SINO= 0.751879
##$SIOLD= 32768
##$SREGLST= <19F.Aceton>
##$SSB= 0
##$STSI= 16384
##$STSR= 0
##$SW_p= 3612.71676300578
##$SYMM= 0
##$S_DEV= 0
##$TDeff= 16384
##$TDoff= 0
##$TI= <>
##$TILT= no
##$TM1= 0
##$TM2= 0
##$TOPLEV= 0
##$USERP1= <user>
##$USERP2= <user>
##$USERP3= <user>
##$USERP4= <user>
##$USERP5= <user>
##$WDW= 1
##$XDIM= 16384
##$YMAX_p= 320844331
##$YMIN_p= -310583
$$ End of Bruker specific parameters
$$ ---------------------------------
##NTUPLES= NMR SPECTRUM
##VAR_NAME=  FREQUENCY,     SPECTRUM/REAL,   SPECTRUM/IMAG
##SYMBOL=    X,             R,               I
##VAR_TYPE=  INDEPENDENT,   DEPENDENT,       DEPENDENT
##VAR_FORM=  AFFN,          ASDF,            ASDF
##VAR_DIM=   16384,         16384,           16384
##UNITS=     HZ,            ARBITRARY UNITS, ARBITRARY UNITS
##FACTOR=    0.220516191357247, 1,           1
##FIRST=     3090.34575600178, 0,            0
##LAST=      -522.371007004, 0,              0
##MIN=       -522.371007004, -310583,        0
##MAX=       3090.34575600178, 320844331,    0
$$ Real data points
##PAGE= N=1
##DATA TABLE= (X++(R..R)), XYDATA
$$ [...]
7468C8862N92M6787N646p7611J2788L9697n6163n653M7322K1778m1114L7214N6020
7455A26165k947r5825m5738L3085m5057n4119M5980M1869k6720L8680N0452L1509
7443I7334n1867R838R603n1541n2271N0771J82p8618k831N6499L2667q787j2558
7430a579O8754k3644q1983N1052L7116n6780k9253m3498P699k096k9214P8688
7418b4738K5414p7026J7383L8065o5958K8639M2248L3487J272k2475K5998K0656
7406D2965j8138l8021M0557P7059n8005k8157J12318r4481q0782N2700k4764l7317
7394e4066N2252N9211L2402n805l4778O1215l3904l6148N5316m0569j20297K7108
7382c8063J08543r5150j8026R2676m8660Q462k0728M8697O7193o0822L9236K3190
$$ y = [38862, 39454, 86241, 91887, 14276, 27064, 66761, 10598, 4945, 52267, 74045, 32931, 70145, 126165, 123218, 27393, -18345, 14740, -30317, -84436, -38456, 3413, -23307, 15373, 65825, 97334, 45467, 55305, 64908, 13367, -38904, 11867, 12049, -66569, -69400, -12901, 19766, 10979, -1579, 67175, 43531, -38452, 12600, 49716, -7064, -36317, -79815, -72116, -74212, -103426, -24738, 676, -76350, -58967, -20902, -86860, -58221, -15973, 17514, 18786, -3689, 22309, 42965, 24827, -13194, 27363, 104422, 46417, 18260, 130578, 36097, -44685, 8015, -16749, -54066, -1814, 57397, 89799, 83994, 49216, 110431, 76527, 40379, 95695, 55126, -65171, -38063, 70480, -24670, -42696, 49980, 1320, 9782, -10946, 37751, 104944, 44122, 83358, 106548]
7370A06548q4550k1107K3049N421q9181J6340N0103o3517j3550P2248K2695k6330
7358a831J7801j4083o213l2948k1637L8414j9334k1420P5350l57p8148K6510L3306
7345d590K2718j056L174K3804l3631k0641L4882j6374n7136J8345M8954j6571
7333A878L191L6987K4426k2085l3576l425k6913m4251N7832K3288k6443J4262
7321E171M2634K8682L232n4561J9149n1113o8602O2146k9064j7598K9602L1415
7309A093Q9713m743J9506L9248j9319o3108l7736M111J1112k835m4161O3235N336
7296F1452m7937Q2584K134l4531J9412k7265k1150j2779j8134j9270j7852O180
7284b7156K1381M9411K0255R21L3436o4630J554K9244k2840m0334P2531M4332
$$ y = [106548, 21998, 891, 23940, 29361, -59820, -43480, 6623, -56894, -70444, 1804, 24499, -1831, 15970, 1887, -4326, -37274, -58911, -20497, -39831, -61251, 14099, 13742, -64406, -37896, -4590, 18128, 17072, 20246, 44050, 10419, -10222, 24660, 8286, -48850, -30505, 18449, 1878, 5069, 42056, 66482, 44397, 10821, 7396, -19517, -63768, -5936, 17352, -9091, 5171, 47805, 76487, 79719, 25158, 44307, -6806, -75408, -13262, -42326, -59924, -30322, 1093, 90806, 86063, 105569, 144817, 125498, 62390, 24654, 28765, 39877, 37042, -7119, 56116, 61452, 13515, 96099, 98233, 63702, 83114, 55849, 34699, 21920, 3786, -15484, -33336, -27156, -5775, 43636, 63891, 64812, 98248, 33618, 35172, 64416, 41576, 1242, 73773, 118105]
7272A18105l9739J995K4188k5282r076k2444L9226j4334k4087o495L4017k0650
7260E5424p4237P6743N2281j9115K5687j1278L3628K075k7480M9833M9560l8886
7248A74235k5183R8624k0021m6580L0559O5535m208j3405P5430M3866J9665j3499
7236C85018J1630O3243k2880p6623N4548p960m6271K618J7711R685k242P9823
7224D68300M0749J3608j7178K7679J0697m0145k2353k0497p6428l8152L0428K2827
7212C99535n4526N2050L6407m8559n7655o2540J4652q6992q474M9010K178k3257
7200B11829p89N8559k5660j47269L5968M8789m7335n6593K5424O2079m7336k6817
7188I0849J5396O630l3238J6310O5992J027n8062k6446N7610p2319n2046Q0413
$$ y = [118105, 78366, 80361, 104549, 79267, 70191, 47747, 86973, 72639, 48552, 42057, 76074, 55424, -18813, 57930, 110211, 91096, 116783, 105505, 139133, 141208, 113728, 163561, 213121, 174235, 149052, 247676, 227655, 181075, 211634, 277169, 272961, 259556, 334986, 378852, 398517, 385018, 396648, 459891, 437011, 360388, 414936, 406976, 360705, 363323, 381034, 390719, 388477, 468300, 509049, 522657, 505479, 533158, 543855, 503710, 481357, 460860, 384432, 346280, 376708, 399535, 345009, 397059, 433466, 384907, 327252, 264712, 279364, 192372, 183898, 232908, 235086, 211829, 211040, 269599, 243939, 96670, 132638, 181427, 134092, 77499, 102923, 165002, 117666, 90849, 106245, 112875, 79637, 95947, 161939, 162966, 104904, 78458, 136068, 63749, 11703, 92116]
7176I2116n437k9578M3653K7376k2488j2109N2688K4618o0682p280j1847J951
7164I2981j23495M8453K7237l4283M083L1877M2061q642Q064P81o5671O946n826
7151B4566k1785r099J5153P0946M2594l4709j7004L6647k8520o2097P7643J1340
7139A05675l8256L4950P2258J08886J58994J23596M7397l7830j71429j17021m4754
7128B42466r5854p3287m985k3675L3703O166o0233P721P3572l1358m4636p053
7116B2547m0954l9140M7068M3706J0932k6780k2780J9196J0653k5145K7104K0238
7104D6645k2433l4830N5563k0259k9307M2599m0415l1761j7387K3427j7527J925
7092d3760L7087L9045j9585k5802L4877m406k4190J8273M4950L215k4769j7910
$$ y = [92116, 86679, 57101, 100754, 128130, 105642, 93533, 146221, 170839, 110157, 102877, 91030, 92981, -30514, 17939, 45176, 10893, 14976, 46853, 88914, 80272, 88336, 89117, 23446, 30392, 24566, 2781, -6318, 8835, 79781, 122375, 87666, 70662, 107309, 78789, 16692, 94335, 105675, 67419, 102369, 174627, 283513, 442507, 566103, 613500, 575670, 404241, 287220, 242466, 146612, 73325, 68340, 44665, 78368, 84534, 24301, 32022, 105594, 74236, 29600, 22547, -18407, -57547, -10479, 33227, 44159, 17379, -5401, 13795, 24448, -697, 26407, 46645, 24212, -10618, 44945, 24686, -4621, 37978, -2437, -34198, -51585, -28158, -45685, -43760, -6673, 32372, 12787, -13015, 21862, 17456, -6734, 11539, 56489, 59704, 34935, 17025]
7080A7025J4393o6613J0733K9673J686n99K6574L9696j5102o4087N703L0893j7692
7067A2283p1695L672r895J6068r293K3395J5558P621K4878k5669k0298r436j9104
7054f1915k9246N7411K642J246N1059L0712N222l2658m2005j984k2176m0241K9931
7041e2002K5903l0308N2067J6441M478M2310O50o0769k7158J4882l051o1970M565
7028g3962P5566j9688n1518L2692L8612J102m3471P5857J8181j21862K6120R5047
7016E2676l8172j0813P8005J4371l1367j4317K5507m612r5953m4534O3720q162
7004a3651n006P9720M3980n9576k0813K7365q6788l7489L8720n3634l165N1466
6992c8871J9818l184L9400K7073k6288l4455k3876P8167l5312o9878J34725O6120
$$ y = [17025, 31418, -35195, -24462, 5211, 6897, 6298, 32872, 72568, 57466, -6621, -918, 29975, 12283, -59412, -55740, -65635, -49567, -58860, -35465, -19907, -12286, 12592, -13077, -33375, -42811, -61915, -91161, -33750, -31108, -29862, 21197, 51909, 57131, 24473, -17532, -19516, -41692, -81933, -52002, -26099, -56407, -4340, 12101, 16579, 58889, 59539, -1230, -28388, -13506, -16557, -78527, -73962, 1604, -18084, -69602, -36910, 1702, 2804, -40667, 35190, 53371, -68491, -42371, 52676, 14504, 3691, 81696, 96067, 64700, 50383, 75890, 71278, -24675, -69209, -5489, -13651, -18657, 61063, 105043, 45467, 24654, 52019, -34769, -72258, -33538, -87172, -90337, -38871, -19053, -22237, 17163, 44236, 17948, -16507, -40383, 37784, 2472, -67406, 67319, 133439]
6980A33439j04735J2589M5762o2095j1438O1963k6359n4671M891K1011j32o7475
6968d7250l1061K5984j235m100L923L7781n2888K1733M6385k3478K637K5457j2072
6955h184l0211M2906L2904Q519O3748Q481l4424L2387n074m2892l6288j2914j0244
6942H714J6701n4085N7497M2608q6964k379Q4943J4328m3321k9994J4390m111
6930A8327n9602K6771L4j631J1530k4314P3471P513n6882R9990L5813n6270k7031
6917D7719n234l359P953p2215j8612M0838K6444P487l6858P667K1099m3657M632
6904a6096m207K7464L6429k1884N1157Q173o4400K787P2469l1424P677K2607R504
6891A00256k2639O872m4865M6053k0748m3720P2123J7350j3321k8041J6836l8688
$$ y = [133439, 28704, 41293, 87055, 24960, 13522, 75485, 49126, -5545, -654, 20357, 20225, -47250, -78311, -52327, -53562, -57662, -53739, -15958, -68846, -47113, -728, -24206, -21569, 3888, -8184, -38395, 4511, 37415, 45934, 109682, 118163, 83739, 116126, 111052, 68160, 31872, 18958, 8714, 25415, -28670, 28827, 71435, -15529, -17908, 67035, 81363, 38042, 8048, 22438, 18327, -41275, -14504, -14470, -16101, -4571, -28885, 44586, 52099, -4783, 95207, 131020, 74750, 47719, 42485, 39126, 47079, -25136, -43748, -2910, 23534, 31021, -5837, 1830, 22929, -20728, -16096, -20303, 7161, 43590, 21706, 72863, 81036, 16636, 19423, 91892, 60468, 68145, 90752, 100256, 77617, 84489, 39624, 85677, 64929, 21209, 93332, 110682, 97361, 69320, 86156, 47468]
6879D7468J5971J8096o0390O586k6150P412R07O194N0466k2821m9969L7607Q1130
6866A12507l4604J0742P6701j8748n8589M5818P307o2168o8089K0025K4521r823
6854D5600p171Q0027J9431m0003P5217J4986o7157p1591n619K5825q6899M0351
6842B2997L6842k2054N7084M7477L1514n2940o4192K7579n4986q0206Q7422L2979
6830F9516l1518N9813R8917K3194m9459k9046K8818o9310l3167P647k9120l8948
6818G337L4880N3429L8147P298O8006J4961q0323J1037k076r5121k2360L4329
6806F9544k9923k6283R9649O2170K566J7976M6406L345k2962M3339j8788J1463
6794B58502m039Q3n1544j6091P5181q217p7885J3487J7368J2747m7724K1581R3097
$$ y = [47468, 63439, 81535, 21145, 27731, 1581, 8993, 9900, 16094, 66560, 43739, -6230, 31377, 112507, 77903, 88645, 165346, 146598, 88009, 133827, 141134, 78966, 10877, 30902, 55423, 45600, 38429, 118456, 137887, 97884, 173101, 188087, 120930, 49339, 43720, 69545, -17354, 22997, 59839, 37785, 94869, 142346, 173860, 120920, 56728, 84307, 29321, -50885, 36537, 69516, 37998, 97811, 196728, 219922, 170463, 141417, 170235, 100925, 67758, 75405, 46285, 7337, 42217, 95646, 133793, 141091, 209097, 224058, 143735, 154772, 152696, 57575, 35215, 69544, 39621, 13338, 112987, 175157, 177723, 195699, 242105, 245450, 222488, 265827, 247039, 258502, 254463, 254546, 203002, 186911, 262092, 253875, 175990, 189477, 206845, 219592, 171868, 193449, 286546]
6781B86546p0603m1861N6775j5738q0763M1862P937j6149M3386K1984O3288r747
6769B86917j1928J6303J0730l0532m0707l13Q658O3890L6574j6893O4888K9570
6757D17157r9832j5184J078q56o008l2795l1070J6349L7991M872J9918O400N078
6744C23098N387k5415j6115P8753j0317l9593N4743j2368j18744Q1406L4943r0159
6732B65619N5450P3694M6362n27k4426M0281j7674n3550M231O887r537k4872P9745
6719D41683N0304o1043K5510r18l5276J1381m0764n0152j3576l1992n9694K7416
6707B62879n4801K5963O4015k6843K2190M1135k9535p915k5211K5692L5443J1405
6695C44417k3263J9380O4008n0104j7277M1966m6353o3510N8894o633J0133Q100
$$ y = [286546, 215943, 174082, 230857, 215119, 134356, 176218, 184155, 168006, 211392, 233376, 296664, 286917, 274989, 291292, 302022, 271490, 230783, 230470, 239128, 303018, 339592, 322699, 387587, 417157, 317325, 302141, 303219, 302363, 296355, 263560, 232490, 248839, 286830, 291702, 311620, 318020, 323098, 328485, 303070, 286955, 365708, 355391, 315798, 370541, 358173, 239429, 320835, 355778, 265619, 321069, 394763, 441125, 440598, 416172, 456453, 438779, 385229, 389460, 396347, 386810, 361938, 441683, 491987, 430944, 456454, 455536, 420260, 431641, 390877, 340725, 327149, 295157, 235463, 262879, 208078, 234041, 298056, 271213, 293403, 334538, 305003, 297088, 271877, 297569, 333012, 344417, 321154, 340534, 404542, 354438, 337161, 379127, 332774, 269264, 328158, 321525, 331658, 339758]
6683C39758j1194N5745q195l6067J08503J4281m8755N5488R7512o078n1924L8759
6671E47833O2482j13578l6161P7007k157l2472r208J04051K1434n6591M9099J01164
6659G12903m5837r4219L3464J2937p4405n550J01681P0534l6282O8621L5537p0353
6647G09031l5428J9030m8338p1507j380L2197K2845K216j0601L2428m2291l8005
6635E70197K8254q7362m1661J07629J8354J4548O1021K6970O677K6574k8702l1307
6623F71192K4976l4897m709M3527K4811n5436O9262K5074k62K6659k4776N6928
6611H22349J1875j12178Q3049J09165p0011k0159J25335K3477j04187M8777O6226
6600I83718j27863n9073P3465P2421J3519m3027J27439R6304j05639L1318J59256
$$ y = [339758, 328564, 384309, 376114, 340047, 448550, 462831, 414076, 469564, 567076, 560998, 509074, 547833, 610315, 496737, 460576, 537583, 535426, 502954, 493746, 597797, 619231, 562640, 611739, 712903, 667066, 572847, 606311, 619248, 544843, 539293, 640974, 711508, 675226, 743847, 779384, 709031, 673603, 692633, 644295, 572788, 571408, 603605, 626450, 628666, 618065, 650493, 608202, 570197, 598451, 511089, 469428, 577057, 595411, 609959, 670980, 697950, 704627, 731201, 702499, 671192, 696168, 661271, 656562, 700089, 724900, 669464, 738726, 763800, 763538, 790197, 765421, 822349, 834224, 722046, 805095, 914260, 844249, 824090, 949425, 972902, 868715, 917492, 983718, 855855, 796782, 870247, 942668, 956187, 913160, 1040599, 1136903, 1031264, 1062582, 1221838]
6589A221838j02130o5693J30831l5313q570Q3285R8357Q5827L105N8433P0349
6578A540319N6023L326N3621P5906l8213R388J42962o788N8840K07409O3457J26729
6566B292979J73029N8677M7393k442j33569O908j7266j23863L3360l537q1784
6555B249885J4161O6077K5217Q6839O4322O5058J64769P0957N2836J19338J58902
6544C138361O4723N7029J40364R1833J37430J61811K39986K72208K11496K14552
6534D729793K26155J61604N180p6226m9422r0192q2936j0734J7363L7515J01306
6523D969406J91226K45306K41010K96317L47949M30267N52231O76532R70319J278559
6513A0199122J560667J585866J160061M97623n4528n11716q40636r45075q27772
$$ y = [1221838, 1119708, 1054015, 1184846, 1149533, 1140963, 1224248, 1322605, 1408432, 1411537, 1469970, 1540319, 1596342, 1599668, 1653289, 1729195, 1690982, 1700370, 1843332, 1836544, 1895384, 2102793, 2166250, 2292979, 2466008, 2524685, 2572078, 2569636, 2436067, 2442975, 2425709, 2301846, 2335206, 2331669, 2249885, 2264046, 2330123, 2355340, 2442179, 2506501, 2571559, 2736328, 2807285, 2860121, 2979459, 3138361, 3203084, 3260113, 3400477, 3492310, 3629740, 3791551, 4031537, 4303745, 4515241, 4729793, 4955948, 5117552, 5122732, 5046506, 4997084, 4906892, 4823956, 4813222, 4830585, 4868100, 4969406, 5160632, 5405938, 5646948, 5943265, 6291214, 6721481, 7273712, 7950244, 8920563, 10199122, 11759789, 13345655, 14505716, 15003339, 14948811, 14437095, 13596459, 12651384, 11823612]
6504A1823612o06068n16111k65947j96089j43809p819L1658K26516L17087L12166
6494A0975196N93436P20519P49647J070121J134521J214365J439237J679210J978938
6485B1555190K418606K931200L483082L813841L647697K977697J883058N33040
6477D3243411p66058j751613k346057k624788k417686j836031j458344q68197
6469B9174637k81379P6466M67785O60325R11788J299613J495910J647987K015588
6460C7468720K229840K329795K615896K812606K889742K904412K699611K169615
6452E8120237J555549J087419P94436P36798M65935j33744r32885j940153k692389
6443E7061203k982099l126697l283251l311572l419641l597635l407797l199039
$$ y = [11823612, 11217544, 10701433, 10435486, 10239397, 10095588, 10087769, 10119427, 10345943, 10663030, 10975196, 11568632, 12289151, 13038798, 14108919, 15243440, 16457805, 17897042, 19576252, 21555190, 23973796, 26904996, 30388078, 34201919, 37849616, 40827313, 42710371, 43243411, 42477353, 40725740, 38379683, 35754895, 33337209, 31501178, 30042834, 29174637, 28893258, 28969724, 29437509, 30097834, 31009622, 32309235, 33805145, 35453132, 37468720, 39698560, 42028355, 44644251, 47456857, 50346599, 53251011, 55950622, 58120237, 59675786, 60763205, 61557641, 62294439, 62760374, 62626630, 61693745, 59753592, 57061203, 54079104, 50952407, 47669156, 44357584, 40937943, 37340308, 33932511, 30733472]
6435C0733472k868550k413081k106516j767932j401851j168076r76349p63722
6427A7267395n50459m62879k90738j51567n0353J35404K85964M75217P39136R39041
6417A8336161J170107J451500J326729Q94938N04267l27141j143441j498438j726756
6408A8987926j820848j722094j463978j234874j166076j115849q97416p48017
6400H818774p06312o17361m30174m19441m11447l05026k12013k85209k45318j71464
6390E015009k47934k51134j18697j49993q2692j03212j33516j17708j02302o8007
6380C639814p2944j28886j06853q4066n3370l6845o5480r933j0715r1987m3950
6369B934785p1201k13627o7564m8077j22914n7618o4062o4011L750n9638l2771
$$ y = [30733472, 27864922, 25451841, 23345325, 21577393, 20175542, 19007466, 18031117, 17267395, 16716936, 16254057, 15963319, 15811752, 15761399, 15896803, 16182767, 16657984, 17397120, 18336161, 19506268, 20957768, 22284497, 23179435, 23683702, 23356561, 22213120, 20714682, 18987926, 17167078, 15444984, 13981006, 12746132, 11580056, 10464207, 9566791, 8818774, 8112462, 7495101, 7064927, 6645486, 6234039, 5929013, 5717000, 5431791, 5186473, 5015009, 4767075, 4515941, 4397244, 4247251, 4164559, 4061347, 3927831, 3810123, 3707821, 3639814, 3566870, 3437984, 3331131, 3247065, 3193695, 3156850, 3091370, 3081437, 3070722, 2978735, 2934785, 2863584, 2649957, 2582393, 2534316, 2411402, 2353784, 2289722, 2225711, 2229461, 2169823, 2137052]
6358B137052k1360m2638p1325j2169k3132j06485m297n6970m2739K2121k8925
6347A749133j3486m588l3123n5948P206k9953n9680J1215k165n6641j2972l3219
6335A465779q0046k9247m9346o2130J5342K0291p1791P113k4988m8940m418q472
6323A129147k6299k09J1569n3537J1972M20j3143J017n4116l5754N5254m3765
6311I82556N232P3716p6492q3693N44o675l9811l2175R0040K0301q5326m4141
6299H04076K7437j675o0002j5290M8971o1426o7535J00790O361n6203O8447O3061
6287H57012q3266p569N9522L4824n4770l4023N4089j4060l0784N9929N0346l5631
6275H55619n6324R7155O8489o8293L7949N6775l9399m7646N79k2750o1836m7313
$$ y = [2137052, 2115692, 2073054, 2001729, 1989560, 1966428, 1859943, 1855646, 1798676, 1755937, 1778058, 1749133, 1735647, 1731059, 1697936, 1641988, 1649194, 1619241, 1559561, 1570776, 1568611, 1511970, 1498998, 1465779, 1385733, 1356486, 1307140, 1245010, 1260352, 1280643, 1208852, 1215965, 1190977, 1142037, 1137619, 1129147, 1102848, 1102639, 1114208, 1060671, 1072643, 1073063, 1059920, 1060937, 1006821, 971067, 1026321, 982556, 987788, 1061504, 985012, 901319, 901863, 895188, 855377, 823202, 913242, 933543, 848217, 804076, 831513, 829838, 769836, 754546, 803517, 742091, 674556, 775346, 781707, 725504, 793951, 857012, 773746, 766177, 825699, 860523, 805753, 771730, 825819, 811759, 780975, 840904, 891250, 855619, 799295, 896450, 964939, 896646, 934595, 991370, 951971, 904325, 904904, 882154, 820318, 773005]
6263G73005M9626K1971m1321l7555P3354K9806o3049j1336O0840J2417k1359L0790
6251H77189K7166m3461k66P2419K5804m3969o9549M3941J2993p1413K4382O9732
6239I24968n181j8161O7362K4230o9123P381M5276M595p879K202J0196P059o328
6226I86597j0141K0856n9212q485N0003m5713M0270K9059n4174j1083M1788l6542
6214I43223M159O5699k4001L758K0091l446N1727l1786J8264N9154o165j2443
6202A088234l3805M879n170m3806J6631k6262n1594N7333j9937M3500P3935L0494
6190A134432k8140j3008L5630M5410o166n958R6228j206o1371M2878O6983l2987
6178A272725l4037J40430N8793j12488O5180J09253j3016p227N7839N1198J432
$$ y = [773005, 822631, 844602, 803281, 765726, 839080, 868886, 805837, 794501, 855341, 867758, 846399, 877189, 904355, 860894, 860628, 933047, 958851, 914882, 845333, 889274, 902267, 830854, 855236, 924968, 919787, 901626, 968988, 993218, 924095, 931476, 976752, 981347, 973468, 975670, 985866, 992925, 986597, 976456, 997312, 938100, 929615, 979618, 933905, 974175, 1003234, 949060, 937977, 979765, 943223, 947382, 1013081, 989080, 992838, 1012929, 1009483, 1061210, 1029424, 1047688, 1106842, 1100677, 1088234, 1054429, 1059308, 1054138, 1010332, 1026963, 1000701, 949107, 1006440, 986503, 1030003, 1103938, 1134432, 1106292, 1093284, 1128914, 1174324, 1168158, 1162200, 1258428, 1257222, 1195851, 1238729, 1305712, 1272725, 1238688, 1379118, 1437911, 1325423, 1390603, 1499856, 1486840, 1479613, 1537452, 1588650, 1590082]
6167A590082r427M9222O8732M1565N9287J38498M5598N8895P7707R7126L8375
6156B255660N7246J30958K5355R4271J64128J24473K30126K95942L49306L69493
6146D096958L63717N47636P40375R89345J734823L079604M619053N207836L425023
6137B4804370k22842l285206m252578l516636k519224j806567j234017r41268
6129G026032p36509n20384m13352j60374n350n6896J32022J64273J94906K62691
6119E887059L56064M95975O85776Q63243Q44393J134959J438628J807508K691160
6110A6204765M140460P226100J1984237J6024250J4211449M397511p209134j3278400
6102E3701238j2738116r544406o731497m712391l455398k698951k117702j480873
$$ y = [1590082, 1580655, 1629877, 1698609, 1740174, 1799461, 1937959, 1983557, 2042452, 2120159, 2217285, 2255660, 2312906, 2443864, 2469219, 2563490, 2727618, 2852091, 3082217, 3378159, 3727465, 4096958, 4460675, 5008311, 5748686, 6738031, 8472854, 11552458, 16171511, 21379347, 24804370, 24581528, 21296322, 17043744, 13527108, 11007884, 9201317, 7967300, 7026032, 6289523, 5769139, 5355787, 5195413, 5190063, 5133167, 5265189, 5429462, 5624368, 5887059, 6243123, 6739098, 7424874, 8288117, 9132510, 10267469, 11706097, 13513605, 16204765, 20345225, 27571325, 39555562, 55579812, 69791261, 74188772, 66979638, 53701238, 40963122, 31418716, 24687219, 19974828, 16519430, 13820479, 11702777, 10221904]
6094A0221904j038165n74287l39573l44614o9874r9368k0876K18264K78776M14773
6084H646960O22095Q16981R53531J181655J613059K232138L465962N815380R955509
6075C5303270J5045115J6209058R251190k948308j2098968j4074315j1340363
6068C5346679q125228n685293m068652l119008k413667j853282j281768q27026
6060G972755p00939n47096l64636l36094k46615j66697k4511l7781j879J63217
6050E709724K37225K09620M41040O19280Q05330J522773K755959M406373N492233
6041B2199557M165081N93265l145374m809958m271609l229465k260599j630476
6033G610422j272462r45818o70623m93497m11189l01455k43910k63253j86297
$$ y = [10221904, 9183739, 8609452, 8269879, 7925265, 7855391, 7756023, 7735147, 7953411, 8232187, 8646960, 9269055, 10086036, 11039567, 12221222, 13834281, 16066419, 19532381, 25347761, 35303270, 50348385, 66557443, 75808633, 72860325, 60761357, 46687042, 35346679, 27221451, 21536158, 17467506, 14348498, 11934831, 10081549, 8799781, 7972755, 7271816, 6724720, 6360084, 6023990, 5777375, 5610678, 5586167, 5548386, 5546507, 5709724, 5946949, 6156569, 6597609, 7216889, 8022219, 9544992, 12300951, 16707324, 22199557, 26364638, 26957903, 23812529, 19002571, 14730962, 11501497, 9240898, 7610422, 6337960, 5392142, 4721519, 4228022, 3816833, 3515378, 3271468, 3008215, 2821918]
6024B821918j66172j11051q7454j05299m5879j03564j94129j17962l0138q8804
6014A771466j16675l6248k8183l4491m4655o7461q448j04365m5118n7126l1765
6003A196931j6221l5220L7591n7928j3183K493m1057P148k3566n7660j8940j7520
5991I62868k5707j8600o6638k4519M7070n4653n8975L6099k6128m1194J5568l4148
5979G11043n4728k267k7683m7255Q473m8121o6591R2438k4013j5340L1600l4486
5967E23070L8339k2113k4528M2530o186p3163j9270N4369K413q2552O38J7288
5955D50835p3157J1127O5487k6413J4227p437k6068L6913q0120n4275K3933r4647
5943B40405k4431K255l7523R5694M7291m7353K4687J8838l9109j6585q610j9215
$$ y = [2821918, 2655746, 2544695, 2457241, 2351942, 2306063, 2202499, 2008370, 1890408, 1860270, 1771466, 1654791, 1618543, 1590360, 1555869, 1511214, 1443753, 1435305, 1330940, 1285822, 1228696, 1196931, 1180710, 1145490, 1183081, 1125153, 1111970, 1114463, 1073406, 1080554, 1056988, 999328, 980388, 962868, 937161, 918561, 851923, 827404, 874474, 819821, 760846, 796945, 770817, 729623, 745191, 711043, 656315, 654048, 626365, 579110, 587583, 539462, 472871, 565309, 541296, 525956, 557556, 523070, 561409, 539296, 514768, 557298, 551112, 477949, 458679, 513048, 515461, 432909, 433547, 450835, 377678, 388805, 454292, 427879, 442106, 434669, 408601, 445514, 365394, 311119, 335052, 240405, 215974, 218229, 180706, 276400, 323691, 276338, 301025, 319863, 280754, 264169, 255559, 236344]
5931B36344K4119J0528K8566J7511n3058j0832M8513r717q3189R600N1031q0603
5919A88813p574N8890k8928O192r294J4230m7041J8206M599k5741l3250n0328
5907H8774N8157l2019l5642R5765M9284m8546M2323P4424m0073l8837M5449P05
5895B59764m3809m9016K0620J4810o7357L8716L1744l1020K2881M4008K773m5147
5883A98967M0515k000l289N83n0278M5359p0110k7020R6466r262k5172l9187L9601
5870A95173K3404o0014J085R864l184Q636l2711k0274L0095l4863M1339P1501
5858B30051k8361J9964K7r400K1310j1721K5100p437q1596O8299M6046o5502j5211
5845A91569j0465j4857o0933K6530N7965r9529j3668R6251m2110j25151P0611
$$ y = [236344, 260463, 270991, 299557, 317068, 264010, 253178, 301691, 291974, 208785, 218385, 269416, 188813, 181239, 240129, 211201, 217393, 208099, 222329, 175288, 193494, 198093, 172352, 139102, 88774, 146931, 114912, 79270, 175035, 224319, 175773, 218096, 292520, 252447, 213610, 259059, 259764, 215955, 166939, 187559, 202369, 135012, 173728, 205472, 174452, 197333, 241341, 244114, 198967, 239482, 237482, 234193, 234776, 184498, 229857, 159747, 132727, 229193, 219931, 194759, 155572, 195173, 218577, 158563, 159648, 169512, 166328, 174964, 142253, 121979, 152074, 117211, 158550, 230051, 201690, 221654, 221681, 212281, 233591, 221870, 246970, 239533, 157937, 226236, 272282, 206780, 191569, 181104, 166247, 105314, 131844, 189809, 90280, 76612, 172863, 130753, 5602, 76213]
5834G6213Q2723l3237l9952L4017R8398r1374o5286J11758m9110n4832M9513R6042
5822B14873N0020j2735N1606M3555o4155n9850K190J4070r0746K0808K9460n4355
5810A44741L0734j4005l5563r035L2192n587K8784P4746J2218J7665l6792m8338
5798A91760N984q3279o847K3879N3646o6392M3756N8644K8151L0834m6631k6908
5786B06597O3966p9664r1752R8108Q389m9240R418N4921l2579l3691K0803J5328
5774A90604k048l0837O1394J44713K3632j1612N9954k3216j07680K3688P70l1299
5762B98063O47k9272J5798j1596n4544K8152l5482K0681O3550J4147L6953J12088
5750D59185J70503J53434J70778J71556n5745k31075j36449m9614j32428p2474
$$ y = [76213, 158936, 125699, 85747, 119764, 218162, 126788, 61502, 173260, 124150, 69318, 118831, 214873, 264893, 252158, 303764, 347319, 283164, 223314, 225504, 239574, 148828, 169636, 199096, 144741, 175475, 161470, 125907, 116872, 149064, 143477, 172261, 247007, 259225, 276890, 240098, 191760, 197744, 114465, 107618, 131497, 185143, 118751, 162507, 221151, 249302, 280136, 233505, 206597, 270563, 190899, 99147, 197255, 205644, 156404, 165822, 220743, 188164, 154473, 175276, 190604, 188556, 157719, 219113, 363826, 387458, 375846, 435800, 412584, 304904, 328592, 329362, 298063, 298710, 269438, 285236, 273640, 219096, 247248, 211766, 232447, 295997, 310144, 347097, 459185, 629688, 783122, 953900, 1125456, 1069711, 838636, 702187, 652573, 520145, 447671]
5740D47671L9355J06718J04033l4079P2189p2840j48592j8675n5411o4627m0115
5729C35627Q0392J8789k7231J8759O2716P7274L2583M5809J02219J12351J92351
5718A051639M06408O53316P62310M75813j34315n88243n93221m64639l25757k15244
5708A028067j72984q3345p9825m6747J2841N4356P2157K0491r120r9957q1509
5697F14425k2195k3399J139j6927J0126J0095L8747M8964N5435J47225J54143
5686A017778M44047O47494O08722K80872k63879n46420n07947l95844k66064j97433
5676H21326j68284j50337n1508j7297j14854k868J0143L8173N4570l1894n1582
5665C35588J1546k166j407p054k3814j7214k8209O8428R1525k1771Q1645K08711
$$ y = [447671, 487026, 593744, 697777, 663698, 735887, 663047, 514455, 495780, 440369, 375742, 335627, 416019, 434808, 407577, 426336, 489052, 566326, 598909, 644718, 746937, 859288, 1051639, 1458047, 2111363, 2873673, 3349486, 3215171, 2626928, 2033707, 1569068, 1243311, 1028067, 855083, 771738, 691913, 645166, 658007, 712363, 784520, 805011, 795891, 695934, 614425, 592230, 568831, 569970, 553043, 563169, 573264, 612011, 660975, 716410, 863635, 1017778, 1461825, 2109319, 2718041, 2998913, 2735034, 2188614, 1680667, 1284823, 1018759, 821326, 653042, 502705, 451197, 433900, 319046, 316178, 326321, 364494, 419064, 387170, 335588, 347134, 344968, 343561, 336507, 312693, 295479, 267270, 335698, 427223, 405452, 487097, 695808]
5653F95808K29507J92105J0668p2162j93877k34712p9530j05028j30636m6114
5643B66029j411J6379k5273m4062L9357J9492o7472r013k6322j5600m850K5219
5631A72473J7722l5161K0203N0614l7421m1052M4864m6459n3384r724M4091J2472
5619A39238r5798K4701N4975p3033n643P6184N6891k4654k1618N4315j0992m6313
5607A28253j7320j460m4326P876L4301J4420r099L804l8411L2344N7984k2742
5595A45624j5157J3653J2781k8210j5774o006M0777q1876m7031Q2802j9216m9683
5583C2684J8477R8094n2974n1974R2403J7814n8950k0688K6581J183m9628Q55
5571E3877N7667p0176m586J00987J0184q3907N6930M3368q8642m2653M2107K8840
$$ y = [695808, 925315, 1117420, 1128088, 1055926, 862049, 627337, 547807, 442779, 312143, 266029, 264618, 280997, 255724, 211662, 251019, 270511, 203039, 194026, 167704, 152104, 147254, 172473, 190195, 155034, 175237, 225851, 188430, 147378, 192242, 145783, 92399, 82675, 126766, 139238, 43440, 68141, 123116, 50083, 44440, 120624, 177515, 152861, 131243, 185558, 174566, 128253, 110933, 109473, 65147, 73023, 107324, 121744, 112645, 116449, 78038, 110382, 168366, 145624, 130467, 144120, 156901, 128691, 112917, 106911, 147688, 65812, 18781, 101583, 82367, 32684, 51161, 149255, 96281, 44307, 136710, 154524, 95574, 74886, 101467, 102650, 53022, 53877, 111544, 41368, 36782, 137769, 147953, 64046, 120976, 164344, 75702, 33049, 75156, 103996]
5559A03996p1794L3767L6718q967o3153o047J04804l5498r7810J108M4972p0076
5547b7980j4629M9867J0820l5020N9483J10774j2419m9357Q238K7155m4295q9288
5535f651j8113K0219m4963K8751J04033l0299l7442K6032K6029k782m6736m0334
5523b2256L9213l4149K8127P190M444M4893N740P707j4887m9553L9021L1932o5565
5510B1857J5993K6513n3148K9913J3053j3339K2641n4918P8801L368m6360m395
5498C9979L4406R168l2422m0534m45M942k5560k2376L7157p166N0013N391j0389
5485D2164K3256m0537J7357k7804l8050J4063j7839k1702N8513K4762L947K3097
5473F1227J1690j9462K2872M707m1395k6405j0387j2419l7122k0853M3425M1472
$$ y = [103996, 32202, 65969, 102687, 93720, 30567, 24520, 129324, 93826, -3984, -2876, 42096, -27980, -42609, 7258, 18078, -16942, 42541, 153315, 140896, 91539, 99777, 126932, 82637, -6651, -24764, -4545, -49508, -20757, 83276, 52977, 15535, 41567, 67596, 64814, 18078, -22256, 16957, -17192, 10935, 18125, 22569, 67462, 73202, 80909, 66022, 16469, 55490, 87422, 21857, 37850, 64363, 11215, 41128, 54181, 40842, 63483, 8565, 87366, 90734, 44374, 39979, 74385, 83553, 51131, 10597, 10152, 15094, -10466, -32842, 4315, -2851, 47162, 52553, 42164, 65420, 24883, 42240, 14436, -23614, -9551, -27390, -49092, 9421, 34183, 38130, 61227, 72917, 53455, 76327, 81034, 39639, 13234, 2847, -9572, -46694, -67547, -24122, 17350]
5461A7350k898K5916M7901k9749l0956J9497J0232o4541k4460N5980r408j5318
5449d54Q962L338O458k1475L9478O3801m7201l21M9729j3915o4111k1983J6878
5436A9184m0709j9574M9515M471O3802q771K0771J9595j8682l3584n1413l0103
5424b5498l210k1441K7012O0006K7564r278J4330J3478n409j6404n2190J4361
5412B3321o0790k4631K9239P08M7385L4968k539K3847O026l8338J3038l769m6046
5399B419l8731l0847K6864r523j3286Q0958M3509j3744K6293J6010L5343l7151
5387H8114n8464j1567J5650m8698p516J2179j9270K2813k6523M6564P5991k0952
5375F8321L671j1969j4671o08k7433M5880J1344L8117J7712j0851L9071o0507
$$ y = [17350, 14452, 40368, 88269, 58520, 27564, 47061, 57293, -7248, -31708, 24272, 14864, -454, 8508, 11846, 18304, -3171, 36307, 100108, 52907, 52586, 102315, 88400, 24289, 2306, 19184, -21525, -41099, 8416, 12887, 76689, 67918, 88689, 108284, 89602, 56018, 4605, -25498, -28708, -50149, -23137, 36869, 64433, 55155, 69485, 82963, 77554, 61150, 8960, 23321, -37469, -62100, -32861, -32153, 15232, 50200, 47661, 71508, 77534, 39196, 52234, 48465, 2419, -36312, -67159, -40295, -49818, -63104, 17854, 61363, 47619, 73912, 89922, 125265, 88114, 29650, 18083, 33733, -14965, -22481, -10302, -29572, -6759, -33282, 13282, 89273, 68321, 71992, 60023, 45352, 44744, 17311, 63191, 74535, 112652, 130364, 119513, 158584, 98077]
5363I8077l3953J2328L0293l4318m1589K6613j2231K8649j3036n183K1986m4441
5351C3195K8443L8091k1947n2241J0300M9906m0476l8588M5312L3453M7111j0411
5339A22148J9983k1999j8637R8841L0183m2919K7388M6148q371m2702j7721r9444
5327I2898m8556l3043J3960K8279l5335N6220L7818k6689K3547k7158o2989j6702
5315B250k4042K3579n0406j0573J10517M4374J3518R8390l1322l7028L8416k8629
5303A49044k7660k7343j3028M3641k4585M885N5823j2922m5745M0084L475o0308
5291H5361j3024J9294L5695n2249l9964Q1795J1771l8579K0589M6755K6254P485
5279A91183j2451L703k6394k2228N0734j94K6932k7758R85L8795m670j1650K5849
$$ y = [98077, 64124, 76452, 106745, 72427, 30838, 57451, 45220, 73869, 60833, 55650, 77636, 33195, 61638, 99729, 77782, 25541, 35841, 85747, 45271, 6683, 51995, 85448, 132559, 122148, 142131, 120132, 101495, 200336, 230519, 187600, 214988, 261136, 252765, 210063, 192342, 92898, 44342, 11299, 25259, 53538, 18203, 74423, 112241, 85552, 109099, 81941, 18952, 2250, -21792, 1787, -48619, -59192, 51325, 95699, 109217, 207607, 176285, 139257, 177673, 149044, 121384, 94041, 81013, 124654, 100069, 104954, 160777, 147855, 102110, 142194, 145669, 85361, 72337, 91631, 127326, 75077, 35113, 116908, 128679, 90100, 110689, 157444, 183698, 191183, 178732, 182435, 156041, 133813, 184547, 184353, 211285, 183527, 184512, 223307, 218637, 206987, 232836]
5266B32836j0031m6566K2773n340k2038j494N6408M351m3377J9490N5347m1315
5254B21044l5917N4654K2027l1917m0868L4914M0621r3288N178R5969j3382p2284
5242A86751L2104R1243n074o1852N3278j0853l1617j1220P993O7260n1217p9464
5230A87332O9825j5549m8781L0720L5417L9724n359K6847J7465j2815M8569K4076
5218C97471o9660l8570o505l8680j2892o771O4090K8312k6699P657L8459m8191
5206B88021n5735J6875J5881o6529p2920R8843P7662o8570l9831O6142K8620o9452
5194B19007k4082M4984K8290p2304K5033J00346k4593j06085K6910Q9288l4059
5183B72735l5227n1564O1447p5301n9400M5646k5281p0643j1238K8302J3705m5612
$$ y = [232836, 222805, 176239, 199012, 193672, 171634, 170140, 226548, 230899, 187522, 207012, 262359, 221044, 185127, 239781, 261808, 229891, 189023, 223937, 264558, 171270, 176448, 272417, 259035, 186751, 218855, 310098, 305024, 243172, 296450, 285597, 253980, 242760, 250753, 318013, 266796, 187332, 257157, 241608, 192827, 223547, 258964, 298688, 293329, 320176, 337641, 324826, 373395, 397471, 327811, 289241, 282736, 244056, 231164, 224393, 288483, 316795, 290096, 297753, 336212, 288021, 232286, 249161, 265042, 198513, 125593, 224436, 302098, 233528, 193697, 259839, 288459, 219007, 194925, 239909, 268199, 195895, 220928, 321274, 296681, 190596, 217506, 306794, 272735, 237508, 185944, 247391, 172090, 112690, 158336, 133055, 62412, 51174, 79476, 93181, 47569]
5171D7569J1540R0968r400m0551N9792n6099q214L1384p906P920j2788J8193P7442
5158B09850k7853J6634M6428m1679q0165Q186O6415p0584p5320P0395N5756j09963
5146F8100j3381Q7089m29n7013m868O1025m4280o1756O6784L1760o4298n2171
5134A6562Q1271P0668q0366k7326Q3251m0720j7545K6096K8587m262l8462L9194
5122A36948J5458n2027O2503j9378k9338J0170m9485P721Q762J2927J03035m4013
5110A63283r6815Q3919l4410o1268K6456k3853k2519k221K8752O6156o4116L7408
5098A00772O7818o8536j9141N1975j6526r0930K8878O8583m3053l4574P0399N3888
5086A69553p7152Q697J08507m0391n8915O0952j047q6957J6066M1408k1439p9938
$$ y = [47569, 59109, 150077, 140677, 100126, 159918, 103819, 95605, 126989, 119083, 127003, 114215, 132408, 209850, 181997, 198631, 245059, 203380, 123215, 131401, 197816, 127232, 51912, 122307, 178063, 68100, 54719, 141808, 141379, 84366, 79498, 140523, 96243, 34487, 101271, 133031, 68733, 16562, 97833, 168501, 88135, 60809, 144060, 103340, 85795, 111891, 140478, 136216, 97754, 136948, 152406, 100379, 162882, 143504, 114166, 124336, 74851, 82572, 91334, 104261, 207296, 163283, 66468, 150387, 115977, 54709, 81165, 57312, 34793, 32572, 61324, 127480, 63364, 100772, 168590, 100054, 80913, 132888, 116362, 25432, 54310, 122893, 79840, 45266, 115665, 169553, 92401, 101098, 209605, 169214, 110299, 171251, 170204, 83247, 99313, 140721, 119282, 39344]
5074C9344M3287P1617p5456j8638J22175o590n5753K6284L824l5966n2388P3108
5062A34848M8796q1616L4200R6288r320o694J9078N2609k8139j15703N8169K7116
5050B29632o4803Q143L248m916m6361L047N6656K3222o7070j7913L7949P224r544
5037A58514n294N5763k5190l7733Q3158L3418j079l0896N9050M4525l5123k0416
5025B78697k594K4795J4593k2541K5075L1258r6472L3746M0381l0638j1098q274
5013B76928m774O9567k1706j5647k9790n6859M6708k6496o3625P9090K1948J7241
5001B92585O47J9776R7107k191n0162P5698r9j16520m881O8760R896o8860J2271
4988C34027Q9205o5443J757N9653k9703j2681j3816P271R504p0452k1186M8239
$$ y = [39344, 82631, 154248, 78792, 60154, 182329, 175739, 119986, 146270, 150094, 114128, 61740, 134848, 183644, 102028, 136228, 232516, 223196, 216502, 235580, 288189, 260050, 144347, 202516, 229632, 164829, 172972, 176220, 171304, 124943, 127990, 184646, 207868, 140798, 122885, 160834, 168058, 158514, 153220, 208983, 183793, 146060, 229218, 262636, 261557, 230661, 289711, 334236, 299113, 278697, 276103, 300898, 315491, 292950, 318025, 349283, 252811, 286557, 326938, 296300, 285202, 276928, 272154, 341721, 320015, 304368, 274578, 217719, 264427, 237931, 174306, 253396, 275344, 292585, 293232, 313008, 410115, 407924, 357762, 433460, 433361, 316841, 311960, 380720, 390616, 321756, 334027, 423232, 357789, 359546, 419199, 389496, 376815, 362999, 370270, 379774, 309322, 288136, 336375]
4976C36375m0850N091M4912j5719q188M7832l4180R198M2729j5543l9970l1212
4964C00475L0244M3874L304L187M4231K3644l4833R7K6859k8536o1745M4292J39377
4951E34470J7197J7806N1797O934q483n4417o5858l8745k5270J7629J8558k6415
4939D45203j1652N3086Q78p786K0547k8827j1751O2802J10179k6393n0350J1412
4927E67348O6445L7502M3354N5544O6093l9188N6878O8825K8435N6585O7232M2774
4915A117827n569o5636K6530k4541l5947j4667O234n8065L3274J02994L8210L7898
4903A158542P3381J06746J9211P021J17095P5157P9871Q7343J34625J42465O7353
4892B068810K41960K91107K55260L52953N32248O97286J070750J465648J854067
$$ y = [336375, 295525, 300616, 345528, 329809, 321621, 369453, 335273, 344471, 387200, 371657, 331687, 300475, 330719, 374593, 377897, 381084, 425315, 448959, 414126, 414223, 441082, 412546, 350801, 395093, 534470, 551667, 569473, 621270, 628204, 619721, 565304, 499446, 460701, 435431, 453060, 471618, 445203, 433551, 486637, 487515, 479729, 500276, 471449, 459698, 522500, 632679, 606286, 555936, 567348, 633793, 671295, 714649, 770193, 836286, 797098, 853976, 922801, 951236, 1007821, 1075053, 1117827, 1112258, 1046622, 1073152, 1048611, 1012664, 997997, 1004231, 946166, 979440, 1082434, 1120644, 1158542, 1231923, 1338669, 1357880, 1364901, 1481996, 1557153, 1637024, 1724367, 1858992, 2001457, 2068810, 2310770, 2601877, 2857137, 3210090, 3742338, 4439624, 5510374, 6976022, 8830089]
4883H830089J894174J175000J66607o20751j244298j418252j389495j243338q84840
4874E264896p05713n70700l35457k16670j68641j66073k3394M2210M4815M9626
4864C214899J95549K76450L26215M27285M16029L08509K82012M22294O92242R69838
4854G531322J577380K304726K650349K708589K396847J205638l26475j536218
4846A8512158k268563k574021k476541j992189j415510j063138q28400n82878
4838E310918n39896m87357l54187k23667k69596k52392p7257r48q025K88P3391
4827C171272J47199J16226R6658L40032M30045N08469R23792J424475J636451
4818H794619J617738R44781m8118q12981j285878j479677j398757j147275r11772
$$ y = [8830089, 10724263, 11899263, 12065870, 11445119, 10200821, 8782569, 7393074, 6149736, 5264896, 4559183, 3988483, 3653026, 3436356, 3267715, 3101642, 3078248, 3120458, 3165273, 3214899, 3410448, 3686898, 4013113, 4440398, 4856427, 5164936, 5446948, 5869242, 6561484, 7531322, 9108702, 11413428, 14063777, 16772366, 19169213, 20374851, 20048376, 18512158, 16243595, 13669574, 11193033, 9200844, 7785334, 6722196, 5893796, 5310918, 4771022, 4283665, 3929478, 3705811, 3436215, 3183823, 3106566, 3105618, 3097593, 3097881, 3171272, 3318471, 3434697, 3531355, 3871387, 4301432, 4809901, 5733693, 7158168, 8794619, 10412357, 11357138, 11309020, 10496039, 9210161, 7730484, 6331727, 5184452, 4272680]
4809D272680o54888n52143m36871k03588j53792k37175p4723n8012j59713q5426
4799A656349j8342o1027k9003j1925K6086K1820r4261k4593J3378n7738k5548
4788A395196l969K3763k6993j1335L5993K3285j5932L4217K1371K5436P265J5083
4776A523380Q9098P2629Q9N6967K872k3912N8128L7114L6706R8204O8232J41996
4764B161503J34164R8238K09851J50369J08440J91255J52049J23428J97241K91159
4754C817697L46183K84049K85412L15431K57740K53082L72470L76136M77454O38956
4744G424610P60933R73505J197297J479868J691713J770503J716782J308204O93535
4735A9016950O4180o28573j064211j281323j343452j212128j088636r23762n83209
$$ y = [4272680, 3617792, 3065649, 2628778, 2425190, 2271398, 2034223, 1959500, 1901488, 1741775, 1656349, 1638007, 1576980, 1547977, 1536052, 1562138, 1583958, 1489697, 1465104, 1478482, 1420744, 1395196, 1391227, 1414990, 1387997, 1376662, 1412655, 1435940, 1420008, 1454225, 1475596, 1501032, 1508297, 1523380, 1612478, 1685107, 1685196, 1742163, 1745035, 1721123, 1779251, 1816365, 1853071, 1951275, 2019507, 2161503, 2295667, 2393905, 2603756, 2754125, 2862565, 3053820, 3205869, 3329297, 3526538, 3817697, 4163880, 4447929, 4733341, 5048772, 5306512, 5559594, 5932064, 6308200, 6785654, 7424610, 8185543, 9159048, 10356345, 11836213, 13527926, 15298429, 17015211, 18323415, 19016950, 19081130, 18452557, 17388346, 16107023, 14763571, 13551443, 12462807, 11539045, 10955836]
4726A0955836m53098l75734l918P3670K9523J47130J51146J63880J94228K63448
4716A1146111N01523O55599Q88491J283231J625871J788840J831437J653605J161430
4707B2536138P89278P38612P16632O53094N95309L97984R4035j12193l10715m52000
4697B5646174p78920j203001j680845j833546j950977j866679j561281j404171
4689A3366754j173437r82839q26282o37712m40435m08138k43309q6155j22209
4680H446238N5298K55219K61641M16274O40014P73936R09315J153245J334413
4671A4245593J360479J129780P38176J10711n14177j080209j401964j483391j576258
4662A1528740j475685j217588j049366r64627p49092n85376n33383m33221l32746
$$ y = [10955836, 10502738, 10127004, 10123086, 10196756, 10226279, 10373409, 10524555, 10688435, 10882663, 11146111, 11647634, 12303233, 13191724, 14474955, 16100826, 17889666, 19721103, 21374708, 22536138, 23325416, 24064028, 24780660, 25433754, 26029063, 26427047, 26521082, 26408889, 26098174, 25646174, 24867254, 23664253, 21983408, 20149862, 18198885, 16332206, 14770925, 13366754, 12193317, 11210478, 10384196, 9746484, 9306049, 8897911, 8654602, 8568447, 8446238, 8501536, 8756755, 9018396, 9434670, 10074684, 10848620, 11757935, 12911180, 14245593, 15606072, 16735852, 17474028, 17584739, 17070562, 15990353, 14588389, 13104998, 11528740, 10053055, 8835467, 7786101, 6821474, 6072382, 5487006, 4953623, 4520402, 4187656]
4653D187656k64122k65428k08601j73967j10859k17424k16831j03830j31093j53935
4643B341566p6745l0218o7542j21163q9385m7090j71445j04795k0134r9292j00818
4632A412939n0138k8728Q391l2875R981J9755n9135L331L0932o4922j43n2058
4620A197330k4560K4299m0738k1166m2789m0753n7292k1456k8644P6823l2270
4609I88784n7503K5411j242l8765n2441k7551P445m3118n6140P8297K4227j945
4597H45459M6056j0308m6073K2443L2746p636l0801m8430m7346J7562j0997J1311
4585G73986n2246n1069Q114L8874p3448l4014O9407k607j2467N775Q200J0625
4573F89130J8241k936j3233K244J2480k6739N7476m1493p1285L8329r419J6427
$$ y = [4187656, 3923534, 3658106, 3449505, 3275538, 3164679, 2947255, 2730424, 2626594, 2495501, 2341566, 2264821, 2234603, 2167061, 2045898, 1956513, 1909423, 1737978, 1633183, 1613049, 1513757, 1412939, 1362801, 1334073, 1342464, 1309589, 1319570, 1339325, 1280190, 1283521, 1314453, 1249531, 1249388, 1197330, 1172770, 1197069, 1156331, 1135165, 1092376, 1051623, 994331, 972875, 944231, 1021054, 988784, 931281, 956692, 955450, 916685, 864244, 836693, 844138, 801020, 744880, 823177, 847404, 845459, 891515, 881207, 835134, 857577, 890323, 882687, 851886, 803456, 756110, 773672, 762675, 773986, 721740, 670671, 678785, 717659, 644211, 610197, 679604, 676997, 664530, 670305, 678505, 689130, 707371, 704435, 691202, 693446, 705926, 679187, 736663, 695170, 623885, 662214, 652795, 669222]
4561F69222j9872n3088K2017K2771r4936J0131M1056q2591K7319O4053j5583j0300
4549E80199k1883r153l9691l8899k105P1905Q4720K06j7464L7441n5249k3486
4537E66541j046o6294J4386L9992n0335k5973Q5672j6028p2906O5948k1688N657
4525E23926K1265k3851J6661J4719j6495M7420Q3316j7242K1110m2780l1177O0481
4513F57353j1995J5064M883N2098L2416q312Q4674J8015m1660N5455J76923J77057
4501A211971L55901M30727L03877q7101l27024k76310k40451j96231j17671j13607
4491I44081l0209n8494m5643k0039l3445n1556k0796k4244n15k4236m8044j2564
4479E74296M8350N3238k9888L2528P188m5765J0200l6948n0993J8877m1352N437
$$ y = [669222, 649350, 596262, 618279, 641050, 546114, 556245, 597301, 514710, 542029, 606082, 590499, 580199, 558316, 549163, 509472, 470573, 468468, 540373, 625093, 625299, 607835, 645276, 590027, 566541, 565495, 499201, 513587, 553579, 503244, 477271, 562943, 546915, 474009, 539957, 518269, 523926, 545191, 521340, 538001, 552720, 536225, 583645, 666961, 649719, 670829, 628049, 596872, 657353, 645358, 660422, 665305, 717403, 749819, 741507, 826181, 844196, 802536, 857991, 1034914, 1211971, 1567872, 1998599, 2302476, 2215375, 1888351, 1612041, 1371590, 1175359, 1057688, 944081, 913872, 855378, 809735, 789696, 756251, 704695, 683899, 659655, 659140, 634904, 586860, 574296, 622646, 675884, 645996, 678524, 685712, 639947, 650147, 613199, 562206, 581083, 539731, 545168]
4467E45168L7938k2955L653p411M59N2333j2687n5990N9197L2032l1782l0950
4455E69005J1408P5089k9794j5535P3714j3081o6973l9958K4898k546o2085L975
4443E28117R1017m326l3132L8751K5548L5j8427J3390k6517o5813n6017n45K1620
4430E13701m5017l4620O669N503O8248J857n5506P7229J9694m3641q696j0056
4418D95365p041j0120N1776K8251j5763L4125O2204M3345R872J1422J09315J7824
4406H30575n1026J1641m6624j31692K2101L6792j05711k4880j5612r1448l7132
4395C96984k5223R2478K0903m8297L8717O1648n9613l1124J24141M343m2145j4775
4383E18037L4785l1035L8032J09638K4913j0566L0867m5180m9287j4174J12766
$$ y = [545168, 583106, 560151, 563804, 556393, 556852, 609185, 596498, 540508, 599705, 631737, 599955, 569005, 580413, 655502, 625708, 610173, 683887, 670806, 603833, 563875, 588773, 586227, 524142, 528117, 619134, 614808, 581676, 620427, 645975, 646010, 627583, 640973, 614456, 548643, 492626, 492081, 513701, 468684, 434064, 440733, 446236, 514484, 516341, 460835, 538064, 557758, 514117, 505421, 495365, 488324, 478204, 529980, 558231, 542468, 576593, 638797, 682142, 692014, 703436, 812751, 830575, 779549, 791190, 744566, 612874, 634975, 671767, 566056, 541176, 525564, 434116, 396984, 371761, 464239, 485142, 436845, 475562, 537210, 477597, 446473, 570614, 574957, 532812, 518037, 552822, 521787, 559819, 669457, 694370, 683804, 714671, 669491, 620204, 606030, 718796]
4372G18796R8589K7164P3328O768o8969q8803j9943J291j23518l7628O3716l2452
4360F18339J3232O4998O8955M0557J0821j6825J8112m5646m2314K2131o118q545
4348G37697k6795r19K7638k7577o628m206P1054N0504j7476n9615L6537K3446
4336H03660k2434J431M5762N738k9206J2712N0730L260l4835M1491J02141M748
4324I85198L3491O1411O9122K3724l4814K1276J1795l8891K9074O107j8469O5664
4312A214688M7657K8543j3659j3649L1617m1360j9784M7135k2852p9379R33K0514
4300A200404l421m286L427Q8460l5383k0800J51867J18795J0365n236J01886P6354
4288A682432n8573J02428J32341K616k431K3947L1539L5205P415M3292M9650n1839
$$ y = [718796, 817385, 844549, 917877, 924645, 855676, 766873, 746930, 748221, 624703, 587075, 650791, 618339, 631571, 696569, 765524, 806081, 816902, 800077, 818189, 772543, 730229, 752360, 746242, 737697, 710902, 709983, 737621, 710044, 703416, 699210, 770264, 820768, 803292, 743677, 780214, 803660, 781226, 782657, 828419, 834157, 804951, 817663, 868393, 871653, 836818, 878309, 980450, 985198, 1018689, 1080100, 1149222, 1172946, 1138132, 1159408, 1171203, 1132312, 1161386, 1167493, 1149024, 1214688, 1262345, 1290888, 1277229, 1263580, 1295197, 1253837, 1234053, 1281188, 1258336, 1178957, 1179890, 1200404, 1196983, 1192697, 1196124, 1284584, 1249201, 1228401, 1380268, 1499063, 1509428, 1504192, 1606078, 1682432, 1623859, 1726287, 1858628, 1861244, 1858813, 1882760, 1914299, 1949504, 1956919, 2000211, 2049861, 1998022]
4276A998022j3969M0559o386Q2319O9566M9460L4924N7142L6220N2697J03483
4265B504037M2622j1557m531p7104P961J5275L9853J34877J53525J04372J73682
4254C083012J63190J55887J35797J58901K23171K80350J16641K0546J73153J87489
4244D698137J38387N1661J69754K46229J18871K06633K15245K01470K52332M19824
4234F718543N70832N05559M18266M62834N63115M68461N43231P21662P16300R39588
4224A2628391J257402J320334J151702J278771J734876K314857K823933L313697
4216B7823963L699096M497588O056532R132451J4537193K6390187M9070459P5944141
4208B17151610P5601496K8091225l2416551o3968868o0539330m3930154l0149193
$$ y = [1998022, 1984053, 2024612, 2018226, 2100545, 2170111, 2219571, 2254495, 2311637, 2347857, 2400554, 2504037, 2546659, 2535102, 2530571, 2453467, 2461428, 2476703, 2516556, 2651433, 2804958, 2909330, 3083012, 3246202, 3402089, 3537886, 3696787, 3919958, 4200308, 4316949, 4337495, 4510648, 4698137, 4836524, 4888185, 5057939, 5304168, 5423039, 5629672, 5844917, 6046387, 6298719, 6718543, 7289375, 7794934, 8213200, 8676034, 9239149, 9707610, 10250841, 10972503, 11688803, 12628391, 13885793, 15206127, 16357829, 17636600, 19371476, 21686333, 24510266, 27823963, 31523059, 36020647, 42077179, 51209630, 65746823, 92137010, 141207469, 217151610, 292753106, 320844331, 288427780, 224458912, 163919582, 119989428, 89840235]
4201H9840235k1133720j5345890j1540792q734478o401088m155125k387228j553472
4193A8588442j186572r61287r54857j131364j202797j096915r34567q57476p40077
4184I522530n81348o15702n67395l85078k21940j18241j89686k27913k66819l02226
4174F046182k13313k27247k33200j92421k26617j38693j35167k47606k13104r5306
4164D123508j15262p5257q6238k1829O767o7297J2753K4539r9486j26901j83138
4153C392159j24114k00499k58958p4424q8317r6287k3535l7631o2160k9859r2272
4142B304103k3082o3913r5933j2957m0655q7599P947L4350k0888m296k9173o1841
4130A906063j33174r2927J3696k3408p0256j0296M0314k4716j07688M2489N5312
$$ y = [89840235, 68706515, 53360625, 41819833, 33085355, 26684267, 22529142, 20141914, 18588442, 17401870, 16440583, 15485726, 14354362, 13151565, 12054650, 11120083, 10262607, 9522530, 8941182, 8325480, 7758085, 7373007, 7151067, 7032826, 6843140, 6615227, 6348408, 6046182, 5832869, 5605622, 5372422, 5180001, 4953384, 4814691, 4679524, 4431918, 4218814, 4123508, 4008246, 3932989, 3846751, 3824922, 3831689, 3764392, 3777145, 3801684, 3702198, 3575297, 3392159, 3268045, 3067546, 2808588, 2734164, 2645847, 2549560, 2526025, 2488394, 2426234, 2396375, 2304103, 2281021, 2217108, 2121175, 2108218, 2067563, 1979964, 1987911, 2022261, 2001373, 1997077, 1967904, 1906063, 1772889, 1679962, 1693658, 1670250, 1599994, 1589698, 1630012, 1605296, 1497608, 1540097, 1595409]
4119A595409m1276m3170K6642k3089q6325k4902m6677k8501q7317m0999K9250
4108A229045k5346L903N1137N2795O9102N9170m0357p6220n4162j19321n0266
4097A099480p7997j00183P099k3046l8266P2006l5733p0736O4114L9780o1218
4086H75300p1058R080k8543K00l9126N8941K2354l8404j1112L9324M721m4462
4074G77215L923P1697P7599P5018O4792M1931k4247m9790q4022m9035l6109p7076
4062G91896o9879Q565m6394q6826k4021m5115n1693K701N6955M0712M599r392
4050E72108O4975j6281q8718m1909n1749j14444m1746K3950R5241N8546P2865
4039E32838Q0636n8523o2633L1357j6236k9895r044O8563L9747r7039N7669P5777
$$ y = [1595409, 1554133, 1510963, 1537605, 1514516, 1428191, 1403289, 1356612, 1328111, 1240794, 1199795, 1229045, 1203699, 1207602, 1258739, 1311534, 1380636, 1439806, 1399449, 1323229, 1269067, 1149746, 1099480, 1021483, 921300, 928399, 905353, 867087, 939093, 903360, 832624, 896738, 936518, 875300, 804242, 813322, 784779, 784979, 745853, 804794, 827148, 788744, 777632, 816956, 821677, 777215, 781138, 852835, 930434, 1005452, 1070244, 1112175, 1087928, 1038138, 954116, 905081, 868972, 791896, 722017, 730582, 684188, 597362, 573341, 528226, 476533, 479234, 536189, 576901, 581500, 572108, 637083, 620802, 532084, 490175, 438426, 323982, 282236, 306186, 401427, 459973, 532838, 613474, 554951, 492318, 523675, 507439, 477544, 468500, 537063, 576810, 479771, 537440, 613217]
4027F13217l5752p1920R2248L3648q1798m9486N1752J8124q5277P9875J04885
4016F69516j32454o7471J2548K872l2193m8642N0370j7202j07563N4210R4496
4005D78487j20518k4784R0616Q196n3928J6858O2305o652o5295R3729M4838o7522
3993D56330K5931L6293k4836q2137K3020N3092o1909l2259L9309L3033O340j5071
3981D57136l0088j3944m1044l9779l2974k9868k1106M6260k426N7849L6593j600
3969C85009J9994L4458L2799j06530m529m131o2034K1778N1083L5075J4276k784
3957D14464J9538J1360n4347m3174o735j6285q417K6618j8239k8660N2997J217
3945C50337o3159j8718O7618o838q3237M8579K5893j1968m3609J02043P9063o0475
$$ y = [613217, 577465, 505545, 597793, 631441, 549643, 500157, 551909, 570033, 484756, 564631, 669516, 537062, 469591, 482139, 485011, 452818, 404176, 454546, 437344, 329781, 383991, 478487, 357969, 333185, 423801, 431997, 378069, 394927, 457232, 450580, 385285, 479014, 523852, 456330, 482261, 518554, 493718, 411581, 434601, 487693, 425784, 393525, 432834, 465867, 472207, 457136, 427048, 413104, 372060, 332281, 299307, 269439, 248333, 294593, 292167, 350016, 386609, 385009, 405003, 439461, 472260, 365730, 361201, 357070, 295036, 316814, 367897, 402972, 417248, 414464, 434002, 445362, 391015, 347841, 341106, 324821, 316404, 343022, 324783, 296123, 349120, 350337, 287178, 268460, 336078, 329240, 246003, 294582, 320475, 308507, 264898, 366941, 446004, 385529]
3933C85529L6696L9807K7618n7829J1787R3958q7902l4019O0917j567k3894J6420
3921D67521N4945L0678l2441M9742J48571J27224K19851M54805L36981R1195k13525
3910A735547l42530k82840k53513p7888j23871j34339m1910k3229J8636m7859
3900D26204m905Q2073q3384k7350N0245K660q2094J5789N0345o7156n2838K746
3888C12335K3732p4106N108Q1657o7559j7040j6553L4897J7681l6393O285N7348
3876C27392m3746k1853J7661J6324l150J3967O2972o6470N4201J3620j8296j0283
3864C42339o2164p770M7467j7661K4141M9620p1769l2997K1211j16546l2633p413
3852A35825M958O472J7013Q3233j6623l0889L8874J7730J6519j4765M5245R8238
$$ y = [385529, 422225, 462032, 489650, 431821, 443608, 537566, 449664, 415645, 476562, 474995, 451101, 467521, 522466, 553144, 520703, 570445, 719016, 846240, 1066091, 1520896, 1857877, 1949072, 1735547, 1393017, 1110177, 856664, 778776, 654905, 520566, 478656, 455427, 474063, 426204, 421299, 503372, 419988, 392638, 442883, 445543, 363449, 379238, 429583, 362427, 309589, 312335, 336067, 261961, 267069, 348726, 281167, 264127, 247574, 282471, 300152, 263759, 270044, 327392, 283646, 261793, 279454, 295778, 292628, 306595, 369567, 303097, 357298, 370918, 352622, 342339, 280175, 272405, 319872, 302211, 326352, 375972, 304203, 271206, 292417, 175871, 143238, 135825, 140783, 147255, 164268, 247501, 230878, 199989, 238863, 256593, 273112, 258347, 303592, 401830]
3840D01830m9067k8462M0651J5918l8645M3456l575p5236M1262L4174n4927k5141
3828C02238j0685m166k7593K673j387K3879k293J0840M9917m6780l892N4144M1706
3815C88601J8108K2695J27107J22694J1131k8280n3857o6782n2495o0217k5012
3804D03693k0237l8675n8K3282j0856j2724l0095J7918O3835j15577j2807M124
3792B71823l4466M6392r931P069J9271K0177N8952M2119N1289P4469Q6528K22836
3780H56528K53208J01683r2226j34890j38491j22714j10705p056k9761l7554m5354
3769D92668q528j7319m3160o558M8832p2286o4799L5124M6315P2937J7178l8662
3757D61742L7120k670o8432L5158Q954M776M920P4877J09022O5466J30913N2859
$$ y = [401830, 352763, 324301, 364952, 380870, 342225, 385681, 382106, 306870, 348132, 382306, 327379, 302238, 291553, 287387, 259794, 262467, 261080, 284959, 282666, 293506, 343423, 296643, 292751, 346895, 388601, 406709, 429404, 556511, 679205, 690336, 662056, 608199, 541417, 488922, 428705, 403693, 383456, 344781, 344723, 368005, 357149, 344425, 314330, 332248, 396083, 280506, 267699, 271823, 237357, 283749, 273818, 280887, 300158, 320335, 379287, 421406, 472695, 547164, 633692, 856528, 1109736, 1211419, 1119193, 984303, 845812, 723098, 612393, 605337, 575576, 538022, 492668, 484140, 466821, 423661, 417103, 465935, 393649, 328850, 363974, 410289, 483226, 500404, 461742, 498862, 496192, 427760, 462918, 471872, 476648, 481568, 556445, 665467, 730933, 861846, 914705]
3745I14705p8281q7309q7595q6247l1157k3218L1252J6224r1767L8702L0649p3077
3733D72881l2646L1305l1664j7071M6636L6839k4478P5887L2047P555r668l0519
3721E57104M0889J2737m9391J8117l5388o6224M0657M8366q054J6556L4032N0493
3709F59894J3657j8912J9854o3124J720N5083o357J7693j1151N2668J9117l9704
3697G00438M2532N0804k7920J5505P585J5575L4012K5296M7941K1879m8959k625
3685H82063j8957l0485J2844k5662l6342l241L210M0089K9957J2595O6078k0554
3673I11595m5961j770O6099l3847n8551J07326k1654p2867J7030M6968j1049q4837
3661H18482L1249Q8494J9260M2283J03042m8349m5951l40m0080l7448m4511L168
$$ y = [914705, 836424, 749115, 661520, 575273, 544116, 520898, 552150, 568374, 476607, 515309, 545958, 472881, 440235, 471540, 439876, 422805, 469441, 506280, 481802, 557689, 589736, 597291, 587623, 557104, 597993, 610730, 561339, 579456, 544068, 477844, 518501, 566867, 558813, 575369, 609401, 659894, 673551, 654639, 674493, 611369, 613089, 668172, 661815, 679508, 668357, 721025, 740142, 700438, 742970, 793774, 765854, 781359, 788944, 804519, 838531, 863827, 911768, 933647, 884688, 882063, 863106, 832621, 845465, 819803, 783461, 780220, 783430, 823519, 853476, 866071, 932149, 911595, 865634, 863864, 929963, 896116, 837565, 944891, 923237, 850370, 867400, 914368, 903319, 818482, 849731, 938225, 957485, 999768, 1102810, 1054461, 1008510, 1008170, 968090, 930642, 886131, 889299]
3649H89299j3757o0528N5252J154q0712O8702P0592l4323j9266M5378Q0022l8425
3637I63388o6945M3428l3860n0297L5483N2367m1625n2536K2374J01035o560o864
3625I59388R6875M8343m781R719m0864k8430J6715K609k5456K010Q3379L886O198
3612A129591P8485p070k8106k9142K8607L4449l3308K6018O5019Q0244m2199k1742
3600A280846R5038L0207l6324O1548j6621m0518K7078j3777J8482M0269k2970
3589A423258O0586L8560K5379O9564R612o0085N8644K7379k2721K0012J28033
3578A778221L1253j7132J00973R1770N4553O7003Q7406J38637k7034J7717J10809
3567B434176J33456j4292L3332J40565O2304j7746O2055J18764P6264O3791J20198
$$ y = [889299, 875542, 815014, 870266, 871420, 790708, 859410, 930002, 895679, 876413, 921791, 1001813, 963388, 896443, 939871, 906011, 855714, 891197, 943564, 901939, 849403, 871777, 972812, 966252, 959388, 1056263, 1104606, 1099825, 1109544, 1068680, 1040250, 1056965, 1059574, 1034118, 1036128, 1119507, 1123393, 1129591, 1208076, 1201006, 1172900, 1143758, 1172365, 1206814, 1173506, 1199524, 1264543, 1344787, 1302588, 1280846, 1375884, 1406091, 1369767, 1431315, 1414694, 1374176, 1401254, 1387477, 1405959, 1446228, 1423258, 1483844, 1522404, 1547783, 1617347, 1626959, 1566874, 1625518, 1652897, 1630176, 1650188, 1778221, 1809474, 1792342, 1893315, 1985085, 2039638, 2106641, 2194047, 2332684, 2305650, 2323367, 2434176, 2567632, 2553340, 2586672, 2727237, 2789541, 2771795, 2833850, 2952614, 3028878, 3092669, 3212867]
3556C212867Q0799Q4968R9853K72324K25037J04405K08493J61135O5349J91383
3546D706613J75261K12262K01718K69531L79026L75681L50718O38615P15396Q29489
3536H854310J086034J132485J092709J208207J621097K505439L746919O657378
3528B7904578J2286062J9656407K0548576P117617r276616j6663824j4799552
3521D6773248j0336764o874470m724597l424284k408495j683659j215739p55061
3513A5350179m05517j51883j38350n1246J68571K64882L76973P18669J117113
3504A7249391J539970J673927J769837J797117K433110L599767N787027R736083
3496D5586229J8391218L2715008M3766093K7771763p109591l0622617l3041112
$$ y = [3212867, 3293666, 3378634, 3478487, 3750811, 3975848, 4080253, 4288746, 4449881, 4515230, 4706613, 4881874, 5094136, 5295854, 5565385, 5944411, 6320092, 6670810, 7309425, 8024821, 8854310, 9940344, 11072829, 12165538, 13373745, 14994842, 17500281, 21247200, 27904578, 40190640, 59847047, 80395623, 87513240, 78236624, 61572800, 46773248, 36436484, 29562014, 24837417, 21413133, 19004638, 17320979, 16105240, 15350179, 14944662, 14792779, 14654429, 14603183, 14771754, 15036636, 15413609, 16132278, 17249391, 18789361, 20463288, 22233125, 24030242, 26463352, 30063119, 35850146, 45586229, 63977447, 96692455, 140458548, 168230311, 161120720, 130498103, 97456991]
3489I7456991k4704546j7232420j2025701q683536o363198m849023l527107k431846
3481A7639614j549451j188259q76549p59835m56671l74077k68108n5084J85289
3472A2296869L26133O09162O53129P00933R43783J436428K348324L982451P195643
3463C0492855J3102019K0433728J9516276M517628j1498972j7671322j5005567
3456D3886645j0607556p419853n287902l743172k897721k229545j562305j055730
3448I082861q22209o25466n58754m51524l87253l73359k34357k11242k85829k76817
3438D856051j22695j72067k81741r2179N3041L6936J0292L21870N49048N67836
3428E726392K01194k07361n09022o96433m55889j73530k30739l12804j97447j98086
$$ y = [97456991, 72752445, 55520025, 43494324, 34810788, 28447590, 23598567, 20071460, 17639614, 16090163, 14901904, 14025355, 13265520, 12808849, 12434772, 12166664, 12111580, 12296869, 12623002, 13232164, 13885293, 14586226, 15530009, 16966437, 19314761, 23297212, 30492855, 43594874, 64028602, 83544878, 88062506, 76563534, 58892212, 43886645, 33279089, 25859236, 20571334, 16828162, 13930441, 11700896, 10138591, 9082861, 8260652, 7635186, 7076432, 6624908, 6237655, 5864296, 5629939, 5418697, 5132868, 4856051, 4733356, 4561289, 4279548, 4187369, 4240410, 4277346, 4287638, 4609508, 5158556, 5726392, 5927586, 5720225, 5211203, 4514770, 4058881, 3885351, 3654612, 3341808, 3144361, 2946275]
3418B946275k17622j28071r7562j74643r4521o6179k9206k4336l3654K2982q578
3407B094885p9412k825j0958j37868r8766P6960l4048j42690j7666J15161o4164
3396A698609p1264L7605R2859N3346J48916K76200J19166j09235k08929k00368
3386A836905j76999j96872j34542q4966k95n0034J991J0135j6986m5641q1701
3375A060995n5105l8356l7684J7398k5269L7497K2294Q991L3858K3343j3789p7447
3363I56726k9640J15979P5425O643J10449J06764l7833o0117j34908j27453o4658
3352I17377o6298j6345k8822o9247p4176o7122k9398o1421j0806M6437J4451M9131
3340F03761K295l2444J9014N498j8998q283k8542l7660O898m6853j0475k8964
$$ y = [2946275, 2728653, 2600582, 2503020, 2328377, 2233856, 2167677, 2138471, 2114135, 2080481, 2103463, 2094885, 2015473, 2012648, 2001690, 1863822, 1765056, 1842016, 1807968, 1665278, 1647612, 1762773, 1698609, 1627345, 1664950, 1757809, 1811155, 1960071, 2236271, 2355437, 2246202, 2037273, 1836905, 1659906, 1463034, 1328492, 1243526, 1243231, 1193197, 1195188, 1205323, 1188337, 1142696, 1060995, 1005890, 967534, 929850, 947248, 921979, 959476, 981770, 990761, 1024619, 1047962, 1034173, 956726, 927086, 1043065, 1118490, 1125133, 1235582, 1342346, 1304513, 1244396, 1109488, 982035, 917377, 851079, 834734, 805912, 736665, 662489, 595367, 565969, 504548, 493742, 540179, 554630, 603761, 606056, 573612, 592626, 598124, 579126, 570843, 542301, 504641, 511539, 464686, 454211, 425247]
3328D25247L8050P6833Q4180n9951n3099p269o1745j3189J3633p971L02L5368
3316D70389l8929k8526L3437P54k8719K6986K2688m5591j0030p25j6314j3912
3304C71508l1119L2898K4398l6647k7688N4697o5188m5543N7758k2j8191j2745
3292C04116l4439K2506l138m1549j1939L3131M4448J1950j4107J6699k2024o150
3280B99504R722M0003j2599l9688k9337L4107p3701l2227L5278J0492N7987M3855
3268C43396j671k2625l6875L5126k2782q9359M4232O0381j0212j0563j3324M8264
3256C23988k4381n20Q2027l2859k0820N7501k4014n7766K4431J1346J9039J2411
3244C70383Q8613M2285n8982j986P2547J0104K4502J28515J05363k5611j54281
$$ y = [425247, 463297, 540130, 624310, 564359, 511260, 503991, 442246, 429057, 442690, 434719, 435021, 470389, 431460, 402934, 436371, 437125, 408406, 435392, 458080, 412489, 402459, 401734, 385420, 371508, 340389, 373287, 397685, 361038, 333350, 388047, 322859, 277316, 335074, 335052, 316861, 304116, 269677, 292183, 289045, 247496, 235557, 268688, 313136, 325086, 310979, 327678, 305654, 299504, 309226, 349229, 336630, 296942, 267605, 301712, 228011, 195784, 231062, 241554, 299541, 343396, 341725, 319100, 282225, 317351, 294569, 205210, 249442, 309823, 299611, 289048, 275724, 323988, 299607, 299087, 381114, 348255, 327435, 384936, 360922, 303156, 327587, 338933, 357972, 370383, 458996, 501281, 442299, 440313, 512860, 522964, 547466, 675981, 781344, 755733, 601452]
3233F01452l9679j0664o3490n228L0255k793n5008O311K2766k4085j4626j7822
3221D27389L4090K4247l0251J4962K7387n256j3871M4849M0229k3170N4543O8402
3209F63550M744L4844J35652J87565K20640K10754J44096q6397j92703p2607O1929
3198A312067p7627J2069J16136m4852m1810P473M1912r0709m5018M8625m050q2734
3186A151482j7406P1634l594q0952N0695O8124m8591j4420R8936K1351K021Q9291
3174A388571J41414J93041K04808K35063K94554K34057K05719L4110j57993k50863
3164B522481k85677j90429k74488j60760n3914j96648r8775l7981l2655q6245
3154A104909j2211m248l6782j5850l1879Q3120n0076r2506J06381M2275J7212
$$ y = [601452, 561773, 551109, 487619, 482391, 512646, 509853, 454845, 461156, 483922, 459837, 445211, 427389, 461479, 485726, 455475, 470437, 497824, 492568, 478697, 523546, 563775, 540605, 595148, 663550, 668294, 703138, 838790, 1026355, 1246995, 1457749, 1601845, 1515448, 1322745, 1250138, 1312067, 1234440, 1246509, 1362645, 1317793, 1275983, 1283456, 1325368, 1234659, 1189641, 1238266, 1234216, 1151482, 1134076, 1205710, 1202116, 1121164, 1171859, 1239983, 1191392, 1176972, 1275908, 1297259, 1299280, 1388571, 1529985, 1723026, 1927834, 2162897, 2457451, 2691508, 2897227, 2931337, 2773344, 2522481, 2236804, 2046375, 1771887, 1611127, 1557213, 1360565, 1261790, 1223809, 1191154, 1104909, 1092698, 1088450, 1051668, 1035818, 1003939, 1087059, 1036983, 944477, 1050858, 1093133, 1110345]
3143A110345Q457N2690M2895l8224P6480K2092n0080l1180n5993K005j03171l3290
3131A003026l1925r0192p8493l3132p0111j20369L3923n328j04004P4913L0573
3120F08881m5944k4716k1745K1196j40792J5140M3423l1354o2820K5112Q0617
3109D66998p4819o3199M2118n4825j9682j2563j7914p193q987J2025O3800k0165
3097C05594l1221K7876m8078l5393k133o2372L2787k7244K4813K5913k0787J06253
3085B96008m1838m5003L1696j6234l6488k8345k0444K1133k7R964K8139j7240
3073A81321m8328J4530j792k5004m5919M459J6806l3706l9521O54q46M4198m3183
3060B3669K7535N6940k0462N050M694q101n2774L6528K7833r9038O886O2245k1696
$$ y = [1110345, 1118802, 1171492, 1214387, 1176163, 1252643, 1274735, 1224655, 1193475, 1137482, 1139487, 1036316, 1003026, 971101, 880909, 802416, 769284, 699173, 578804, 612727, 607399, 503395, 578308, 608881, 562937, 538221, 516476, 537672, 396880, 412020, 455443, 424089, 361269, 386381, 466998, 392179, 328980, 371098, 316273, 296591, 284028, 266114, 258921, 249934, 261959, 325759, 305594, 274373, 302249, 254171, 218778, 216645, 154273, 187060, 159816, 184629, 210542, 189755, 296008, 254170, 209167, 240863, 224629, 188141, 159796, 139352, 160485, 160458, 170422, 198561, 181321, 132993, 147523, 145731, 120727, 74808, 79267, 96073, 62367, 22846, 23500, 22654, 66852, 23669, 51204, 108144, 87682, 92732, 97426, 89325, 36551, 73079, 100912, 1874, 8760, 71005, 49309]
3047D9309j1241k853O7897k8828J460P7390n0874o5786n422j4656n9132n5934
3035i8670M1721P2471k2517k1316R7324n190k8875M1586j9515l3547K0677L4362
3023G8511R947m1382m829l462l107K3192L1991N626m1182o478J5485Q997l6978
3010C6331K5348N921n4267k500n442l3161M8484K3384j261j0115J8678M675K2935
2997G9010J8055j3189l8241o4583j7652L9256m2222m0708N9845l772k5063K0370
2985b8894j5263n0868k0383M9715K2257o4548M9364L1775J7712J1956J8422K5899
2973D7144j7241j0486L2452j0707p7822L6330o420o1715L2511k1531O612Q4941
2961C4068K5206j3691j9532l0544J2774m7061q7837J2856L7012o0044M4986O4443
$$ y = [49309, 38068, 35215, 103112, 74284, 75744, 153134, 102260, 36474, 31052, 16396, -42736, -98670, -56949, 15522, -6995, -28311, 69013, 63823, 34948, 76534, 57019, 23472, 44149, 78511, 88458, 47076, 42247, 38785, 35678, 58870, 90861, 96487, 55305, 48827, 64312, 73309, 36331, 61679, 67600, 13333, 10833, 5391, -27770, 20714, 44098, 42837, 32722, 51400, 56075, 79010, 97065, 83876, 45635, -18948, -36600, 2656, -39566, -80274, -20429, -24201, -49264, -28894, -44157, -95025, -115408, -65693, -43436, -107984, -58620, -26845, -9133, 2823, 21245, 47144, 29903, 19417, 51869, 41162, -36660, -330, -6750, -68465, -35954, -57485, -50873, 34068, 59274, 45583, 26051, -4493, 8281, -38780, -126617, -113761, -76749, -136793, -91807, -27364]
2949b7364j1147N2552N8591k1322l8518j6810K333L1086M5120n9154J2670K3856
2937E1893P818j3737n6008K4019J5486l604p5914p582P4075n8330j0731P0848
2925A8233l7246o2616M5962K1910J1786m9773k8581O9319q714n0477M6205R598
2913a4394m6974O0631K5050l8043k5643P3721m4695o1116M3547k366p4172q062
2901a12516O1098o958r7136P9145P7559n1461n9265L3982j4356l0929M0998R1269
2889A1430l1774n3944N3033N3357m4184j6497p089n8229L2306J4589M1103m5498
2877e1397K1029R1216j01099N7119K9192m8777o113l1676L0271J3870m0368J5071
2865b1662M666l5967p966K2188K2553K5724j9089j1410O9462m5278l0620n858
$$ y = [-27364, -38511, 14041, 72632, 51310, 12792, -4018, -1685, 29401, 74521, 15367, 28037, 51893, 59711, 45974, -10034, 13985, 29471, 25867, -50047, -57629, 16446, -41884, -52615, 18233, -19013, -81629, -35667, -13757, -1971, -51744, -80325, -11006, -19720, -70197, -23992, -14394, -61368, -737, 24313, -13730, -39373, 34348, -10347, -71463, -27916, -30282, -104454, -112516, -51418, -58376, -155512, -76367, 1192, -50269, -109534, -75552, -89908, -120837, -79839, 11430, -20344, -74288, -21255, 32102, -12082, -28579, -35668, -93897, -61591, -47002, -5899, -51397, -30368, 60848, -40251, 16868, 46060, -2717, -8830, -40506, -10235, 3635, -36733, -21662, -16996, -52963, -60929, -38741, -16188, 9536, -9553, -20963, 48499, 3221, -27399, -33257]
2853c3257M9336L0619p8674K9338J6643o4947J549N2939K8990j01048j98M7044
2841b1666l612j9370J5930J1363q0504M070O2477r65r775M1275j690q5510O1466
2828b6511N938n5176k369j6147M8989n7938m262R0534l6250m9346L2974M1899
2816b7665R72n6321K9318j179n7320M8312L6768o253o892J4934J8336K7664p4719
2803e4045N0631K2055r5160M2825K1460q9923n180O0386L6833p50j6559L6927
2791I500n21n977J150J5174J9537q4422K4410j0148o2712L5513N4530J5320m3842
2778c2488K4352N2072N011l5289n1815N888j7833J0896k2373k903q9j5430P1899
2765h102k2937k1079J2611k0030M811k64n4429M1629j8789k0211L9842K6060P673
$$ y = [-33257, 16079, 46698, -31976, -2638, 14005, -50942, -49393, 3546, 32536, -68512, -68710, -21666, -25278, -44648, -28718, -17355, -97859, -93789, -31312, -32277, -42052, -777, -2467, -87977, -26511, -20573, -75749, -78118, -94265, -45276, -103214, -107476, -16942, -53192, -102538, -69564, -27665, -26693, -83014, -53696, -54875, -112195, -63883, -27115, -33368, -40260, -25326, -6990, 20674, -54045, -3414, 18641, -76519, -33694, -12234, -102157, -107337, -46951, -10118, -10868, -27427, 9500, 8979, 3002, 4152, 19326, 38863, -45559, -21149, -31297, -94009, -58496, -3966, 11354, -32488, -8136, 43936, 48947, 13658, -38157, -32269, -50102, -39206, -61579, -64482, -64571, -80001, -8102, -31039, -52118, -39507, -59537, -54726, -54990, -109419, -67790, -86579, -106790, -66948, -40888, -33215]
2752c3215j8585K9229l7635K6845J0200k2977l3577m2131M0068n951p861N2086
2740d3504J5024j4249m6691N0227J7179j194l0383K80r64n5594M5223J2661l5093
2727h7078K657O1625M4451J3120m0935Q424k8223r690j3247l9171K5588M3231
2715a9248k1834M1879K3988l4553L20k6558r703R820k9857P8870j4228o5457J6651
2702d9910O6278N109p605L9682m259q7311J8585N2059o8506q102N1497p128m4452
2689d4063K215N0925k3813q6751K7729M5876n4344l6380O5550M062n7656L3345
2677g3305O4162n8269j438M5679K849o7501K5506O6037o105m838K3995N181p0863
2664d8910K0639M56k9831K532J2139R068J9570n025L1989K302m0717J9288j6426
$$ y = [-33215, -51800, -22571, -60206, -33361, -23161, -46138, -79715, -121846, -81778, -87729, -95590, -43504, -28480, -42729, -89420, -39193, -22014, -23208, -53591, -53311, -54275, -109869, -64646, -51985, -87078, -84421, -22796, 21655, 34775, -6160, 2264, -25959, -35649, -48896, -88067, -62479, -19248, -41082, 797, 24785, -9768, -9448, -36006, -45709, -35889, -65746, 13124, -1104, -66561, -49910, 16368, 21477, 13872, 53554, 49295, -38016, -19431, 32628, -35878, -43980, 7517, 389, -44063, -41848, 9077, -14736, -101487, -73758, -27882, -82226, -118606, -53056, -48994, -106650, -73305, -9143, -67412, -68850, -23171, -20322, -87823, -62317, 3720, -2385, -7223, 16772, 21953, -48910, -28271, -27815, -57646, -55114, -42975, -33907, -14337, -19362, 12627, 14929, -25788, -6500, -22926]
2651b2926q3925L8121L1752m4371J0468P5011J4463j838O2481L4941j6574m1682
2639E5921R3750K8153m3138R1089J26526r3743r5943J187j4597k4125p1640J9415
2627G2855K1927j00443Q786J2233p8258k849K7888L7647L9048l6759j8202J5573
2615e54q587K4361j490l6642m6653O033K4723J1970q707L2532J4104n0414m988
2602d4312J8051l7775l7783O8391k5954l9650j1341M1004N6664o4673M4564N9133
2590B6319k9783o0807Q5854J7333j16691L9912O9427k1331p9269M0437J34744
2579A06145k2130q6589K9793M9365o8387j08547N0568K3936n3537K0612N9370
2568E99J0237l1513M7611L1015n0017k1649n1205N3627j3240K019M3061k7208
$$ y = [-22926, -106851, -68730, -36978, -81349, -70881, 4130, 18593, 16755, 79236, 114177, 97603, 55921, 149671, 177824, 134686, 225775, 352301, 258558, 162615, 163802, 149205, 125080, 53440, 72855, 94782, -5661, 3125, 15358, -62900, -65749, -37861, -214, 38834, 2075, -16127, -554, -9141, 15220, 13730, -22912, -69565, -63532, -38809, -26839, -35546, -3014, 11090, -39324, -44312, -26261, -64036, -101819, -33428, -59382, -99032, -110373, -69369, -12705, -77378, -32814, 26319, -3464, -64271, 21583, 38916, -77775, -37863, 31564, 10233, -69036, -28599, 106145, 84015, -2574, 27219, 76584, 8197, -100350, -49782, -25846, -79383, -58771, 599, 10836, -20677, 26934, 57949, 7932, -13717, -64922, -11295, -24535, -22516, 20545, -6663]
2556f663J311L300J06L4480O093K043j0630L5951l0344m9506m2159O1324J9274
2543B4580o5432K4498L6987n1511L8309J4873l177j5310j7609O3863J9586k7215
2531D2442m605J5174o610J0983k0145J1810O770k0022K4249k4924j3896M6325
2519F7551p4318l294R1399n9524p2841L5613O7182j2936p1896M7596P4372n5802
2507C3102m8718J31329l5547j12574O5189Q0352o2251k4621N7033N5864k6270
2496A12888K1434L0177K1723l4055K2262L3227r9517l424L1169k4164m0356J2592
2484H3956L6834k1485K5689M9622m2421j7427O2725n5292j1208k712J0859k547
2472A16593j7891L0303N4128l2703J6360Q2403o0985o7826n753m3883L2851k886
$$ y = [-6663, -5352, -2052, -1946, 32534, 38627, 40670, 30040, 65991, 35647, -13859, -56018, 5306, 24580, -40852, -16354, 20633, -30878, 7431, 22304, 19127, 3817, -13792, 50071, 69657, 42442, 37837, 53011, 46401, 57384, 37239, 49049, 55819, 35797, 60046, 35122, 21226, 67551, -6767, -10061, 81338, 21814, -51027, -15414, 51768, 38832, -33064, 14532, 88904, 33102, -15616, 115713, 80166, -32408, 32781, 113133, 50882, 26261, 83294, 139158, 112888, 134322, 164499, 186222, 152167, 174429, 207656, 108139, 104715, 135884, 111720, 71364, 83956, 120790, 99305, 124994, 174616, 132195, 114768, 177493, 122201, 110993, 108281, 119140, 116593, 98702, 129005, 183133, 150430, 166790, 249193, 188208, 120382, 114629, 70746, 103597, 100711]
2460A00711K295L2266J7772L6554L0958j8074J7686j3046n4504j8967k6596K3839
2448A30894K73m5525P0775L4612J4498K223P7663J3226k3784J0962K5580l5449
2436B75948l9062L6795Q6776p413k6041P8995j2431o355J5846J2739K9326l2524
2424D12599k5791N5264j7715o6648M4432j682K2563O9594M4771P8977j464J9592
2412F34492M7777o736K6114M3553K5958N7952L3305m7901L7814P0636N8120J5785
2400I96869J4941R0892N8825l249J00740J57499O6148K0534R2329J59147O4246
2389A818921J96117K51951L10350L28863O00857O22136K42759k4755J55622K22615
2379D725436N19875N73055P60203R32997J494926K044872L370068N737518J1178586
$$ y = [100711, 103006, 135272, 153044, 189598, 220556, 202482, 220168, 207122, 152618, 133651, 107055, 130894, 131167, 85642, 156417, 191029, 205527, 207750, 285413, 298639, 274855, 285817, 311397, 275948, 236886, 273681, 360457, 353044, 327003, 405998, 393567, 387212, 403058, 415797, 445123, 412599, 386808, 442072, 424357, 357709, 402141, 400459, 423022, 492616, 537387, 616364, 614900, 634492, 682269, 675533, 701647, 745200, 771158, 829110, 862415, 814514, 852328, 922964, 981084, 996869, 1011810, 1102702, 1161527, 1158278, 1259018, 1416517, 1482665, 1503199, 1595528, 1754675, 1818921, 2015038, 2266989, 2577339, 2906202, 3507059, 4129195, 4371954, 4347199, 4502821, 4725436, 5245311, 5818366, 6578569, 7511566, 9006492, 11051364, 14421432, 20158950, 31337536]
2370C1337536J7042160J5529046n16426j2667871j3219569j0585308o671064m716720
2362A5531784l351691k725778j853706j502969j058059n72906p6001J7588R2924
2353D501186k74323m23892n43549m10246k80857k15161k55224j09293j76984p7227
2343A734430q2296j20295q9111J2281j12245j06531p3087q152m9330m6212o8338
2332I91114J510j8646j09054k245o876j05316l0582N210J00j2904j1727M1034
2320G41618k7538L792J0383R486k8388p1685p4050m5158p8665l0596P0957r9304
2308C80852o508O6315m6265n835K9087j1883j8730q5920m1875J4232p3602K5861
2296B25729J00570m1563l0785R673Q3260K1079j7568K2441J0843o6141l8785n4112
$$ y = [31337536, 48379696, 63908742, 63392316, 50724445, 37504876, 26919568, 20248504, 15531784, 12180093, 9454315, 7600609, 6097640, 5039581, 4466675, 4390674, 4408262, 4501186, 4226863, 3802971, 3259422, 2849176, 2568319, 2353158, 2097934, 1988641, 1811657, 1734430, 1652134, 1531839, 1442728, 1455009, 1342764, 1236233, 1163146, 1154994, 1105664, 1059452, 991114, 992624, 973978, 864924, 862679, 855803, 750487, 719905, 725115, 725215, 712311, 700584, 741618, 714080, 717872, 728255, 737741, 709353, 637668, 563618, 518460, 439795, 409199, 480156, 380852, 374344, 440659, 394394, 388559, 417646, 405763, 387033, 301113, 259238, 273470, 199868, 225729, 326299, 284736, 253951, 263624, 346884, 367963, 350395, 372836, 383679, 317538, 278753, 224641]
2284B24641l0167p227j4171N1339l6807K5380j7582k7058R113J2156m4131k7642
2272A17844K8256j2581k8927J7560J2526m0231k5891M0823n617k3016j6246O9833
2260A34333L1739l7130r475M2454q3184M898j3911o2413N8295J1167j453L6733
2248A12053o2691J7789m326n7965q671K4978l0529j4776r286q126m704O7716Q6671
2235A08133r910L617J3375k8367l2528o6880j6803N1133j04826n265R7111J3709
2223B2499o60M0564J5661n9315m2349k4169r856J4646o6049L5477K8601o7716
2211a12666Q2467O7287J2600Q025o154p8918J5906l1984m2586L0960J1932M7605
2199D474O366m5307L0154J1495j7470K3710K4897P030o2347n058J2572o0334k2942
$$ y = [224641, 194474, 187247, 173076, 224415, 187608, 212988, 195406, 168348, 177461, 189617, 145486, 117844, 146100, 133519, 104592, 122152, 134678, 94447, 68556, 109379, 103762, 80746, 64500, 134333, 166072, 128942, 119467, 161921, 78737, 83635, 69724, 7311, 65606, 76773, 75320, 112053, 49362, 67151, 62825, 4860, -3811, 21167, -9362, -24138, -33424, -41550, -46254, 21462, 108133, 98223, 101840, 115215, 86848, 54320, -12560, -29363, 21770, -83056, -88321, 8790, 22499, 21839, 62403, 78064, 18749, -23600, -47769, -57625, -42979, -109028, -73551, -44950, -112666, -30199, 37088, 49688, 57713, 51559, -27359, -11453, -43437, -86023, -55063, -43131, 4474, 10840, -34467, -4313, 7182, -10288, 13422, 38319, 45349, -16998, -22056, -9484, -69818, -92760]
2186i2760M6308L4749m758j5549L0541O4384l2850k077N5745m9640o1311L2924
2174E706M654p0010k131M5671J7715j4166J6326M5580J4186r7444j5068L6349
2162a2632o9043k5162L9835J5695m9643k073N1604K5054o220K7968M4742J471
2150D1596l8792k7074m319n5015K2786O628n8472Q781O8527M1729M682Q188K2548
2137D1793n76l4493l7799K8471l8956o6174J945L0853k2763n351P7668K3668j9329
2124b1043J4168N6168L5210j22108m5326P9753m7803p2028N4192J02064p926l4160
2112h839M8245M5380k3683p4485L4698K792p8709m0676P7986N509K5135J17273
2100A30626J08946L5567q591j2746m5233o3567j12662j9990l8148p2902K0500
$$ y = [-92760, -46452, -11703, -16461, -32010, -1469, 62915, 30065, 27988, 83733, 34093, -27218, 5706, 10360, -59650, -61781, -16110, 1605, -12561, 3765, 49345, 63531, -33913, -48981, -12632, -81675, -106837, -67002, -51307, -100950, -103023, -51419, -26365, -32585, -4617, 40125, 41596, 2804, -24270, -28589, -83604, -60818, -54190, -112662, -103881, -35354, 6375, 11057, 19245, 41793, 41217, 6724, -31075, -2604, -41560, -107734, -105789, -74936, -97699, -103050, -25382, -1714, -21043, -6875, 49293, 84503, -37605, -82931, -3178, -50981, -123009, -68817, 33247, 25321, -8839, 39406, 84786, 61103, -13382, 21316, 24108, -54601, -95277, -17291, -11782, 13353, 130626, 239572, 275139, 266548, 253802, 208569, 145002, 32340, 12350, -25798, -98700, -78200]
2089g8200M3465m009J6704L8013L4210j8825J8293k0230k8160n1393r095P111
2077e2116r2432m4239O1226L1252J3780N6301N5012j3758j0552R352l4063l1142
2065e1379o0587n445L260j5347r576O4822O3276Q821L1294j9721k293j4702p4455
2052h2032K8169k679p7185P963Q2057m133j1053L4638N109m2623j2942N0432J6512
2039g767o0245m924L4271j9709k9862L1615N3843n7892j9084L4437J2140L0244
2027b933J5706j1347m5640p748j425j0347l7809m1241M8877L0554J4979N1542
2015C168O679j1386J8116j9590l7784o8413n1400K0099J5070j4902K2120P2822
2003d5401j1998L5721P3694k8213k3616l7026j3889n3427q1480k36M1431O6767
$$ y = [-78200, -34735, -38744, -22040, 15973, 50183, 31358, 49651, 29421, 1261, -50132, -59227, -52116, -144548, -188787, -127561, -96309, -82529, -26228, 28784, 15026, 4474, 13826, -20237, -51379, -111966, -117411, -114151, -129498, -139074, -74252, -10976, -2155, 29139, 9418, 7125, -7577, -82032, -53863, -56542, -133727, -125764, -43707, -47840, -58893, -24255, -19146, -61769, -74711, -24279, -7767, -68012, -72936, -38665, -58374, -88236, -56621, -2778, -60670, -79754, -45317, -33177, -2933, 12773, 1426, -44214, -51962, -53387, -63734, -101543, -142784, -93907, -63353, -48374, 3168, 9847, -1539, 16577, -3013, -40797, -109210, -160610, -140511, -125441, -140343, -118223, -45401, -57399, -21678, 52016, 23803, 187, -36839, -50728, -104155, -185635, -185871, -144440, -77673]
1991g7673p64O3992J4369k818L2621J243l722o3142N04r2327n948M6168O607J6175
1977f4715n372l2927P5008L0470m5245K4570j0531m3454L0880j4559m9764L5065
1965g0574O7573q982j5485J5783L4043m1877j2638J3933L210l3922m4464N5737
1953c7663n4496l1228Q3823R801j2175n320N8476j3224l9787J4416l7797l1741
1941i6915j4630j0065J1453k2956L4305Q8445m8011K2529Q9275j9698j04714N6790
1929a4192k2421k4139R131k723j3250j11250N087J10470k7438p1334P7442P6848
1917g769k4104l99L2442l0547l9175j7426J8124l2686k7800L1198N2285k5819
1905g1676J4759Q1003j9260j1872M3087o5549o2863M5505m253j3446k2970M4744
$$ y = [-77673, -78437, -14445, -76, -2894, 29727, 30970, 27248, -35894, -35390, -127717, -133665, -87497, -80890, -64715, -70087, -103014, -28006, 2464, -42781, -18211, -28742, -72196, -41316, -55875, -105639, -70574, -3001, -11983, -27468, -11685, 22358, -19519, -32157, -18224, -15014, -48936, -93400, -37663, -92159, -123387, -39564, -29763, -41938, -47258, 11218, -2006, -41793, -27377, -65174, -96915, -111545, -121610, -110157, -133113, -98808, -10363, -58374, -35845, 53430, 33732, -70982, -14192, -36613, -60752, -51621, -54344, -67594, -178844, -173757, -63287, -90725, -162059, -84617, -7769, -31873, -32272, 170, -30377, -69552, -86978, -68854, -101540, -129340, -98142, -45857, -71676, -56917, 24086, 4826, -7046, 36041, -29508, -92371, -46866, -51119, -64565, -87535, -42791]
1893d2791R177l3275J7633M2781P049r9106K7340O0733q4602k9513P9218m3269
1881h8625k1199N0022J1847L0742k9529l373N4423p6484k2281P0053l7890l5329
1869i7623R202J4872m0j5526O0733o843m4403P2623l2795K357K5082q2010j8668
1856a13039j0853k5423N0761l7005l9440J21673N5887j04398R2935M8194r7402
1845e8110n1446K7095l891l6523p7719P1340Q7057l5728K7383J04147k2519p0501
1833c9415N1155k8845l0553l1078k6552M9622K787n3376J8001O3190j304Q153
1821a8215J7584m0276k5614L7857l229l1393L0282K2495o6743K4635K7947j5632
1809d0302j0910n8190Q6452J1975p4828O3318L6110j11336Q821L8369j7459j0878
$$ y = [-42791, -33614, -66889, -49256, -6475, 574, -98532, -71192, -10459, -95061, -124574, -45356, -88625, -109824, -59802, -47955, -17213, -46742, -50115, 4308, -72176, -94457, -24404, -62294, -97623, -88421, -73549, -73589, -89115, -28382, -35225, -79628, -7005, -39800, -37443, -12361, -94371, -113039, -123892, -149315, -98554, -135559, -174999, -53326, 2561, -101837, -8902, 39292, -58110, -109556, -82461, -86352, -122875, -200594, -129254, -42197, -77925, -50542, 53605, 31086, -39415, 11740, -17105, -47658, -78736, -105288, -55666, -52879, -106255, -88254, -25064, -26368, -18215, -631, -40907, -66521, -28664, -31893, -63286, -33004, -10509, -77252, -52617, -24670, -40302, -51212, -109402, -22950, -10975, -85803, -22485, 13625, -97711, -88890, -50521, -67980, -78858]
1797g8858m249L931J6717n873k4113L3406k6767m5651J9420q807M5608K045m5102
1784a18293N4890N0367l0249M0803Q0433m3299p8382K2286J0980m2523r5681P8986
1772f9682J7091l3540Q490n097P9821l6843o55J19626q0345m6908M3850o3841
1760f8033q089j6132o0993L7459L5341m846N0136n312p026J02686o7518q5763
1748i8090O5621p893m4631J4431L7267n0282J2035M2461j1240k362k2203J6012
1736d8874M2123l7256m9113K2324O215j0042M3818N0915n6151R226K5290m4596
1724d6121j7341j3117m8220M987J6480m8258P9230K6173j0668P2073o8059M453
1712d8388P7597p2985j5503O1197o8375j8582M1934J0988m3891l2999k385L6383
$$ y = [-78858, -83107, -79176, -62459, -68332, -92445, -59039, -85806, -131457, -112037, -120844, -75236, -73191, -118293, -63403, -13036, -43285, -2482, 77951, 34652, -43730, -21444, -10464, -52987, -148668, -69682, -52591, -86131, -77641, -82738, -2917, -39760, -40415, 79211, -1134, -48042, -4192, -68033, -76122, -92254, -153247, -115788, -80447, -85293, -35157, -40469, -47495, 55191, -12327, -98090, -32469, -40362, -84993, -70562, -33295, -83577, -71542, -29081, -40321, -42683, -64886, -48874, -6751, -44007, -93120, -70796, -64581, -74623, -30805, 20110, -36041, -26815, -1525, -46121, -63462, -76579, -124799, -119812, -103332, -151590, -72360, -46187, -56855, 15218, -52841, -48388, 29209, -43776, -59279, 1918, -66457, -85039, -43105, -32117, -76008, -109007, -111392, -75009]
1700g5009k5359l8372R1923L3267n2800l98O7035o7638m2871L6754K9075l9469
1688h3862j4936Q38L4035j4940k2018O4220J1373n2105N6769M9901o9966J8371
1676b2320N2891n1432J2306k1790J0549J8340n4333j5691O4428o5961m6544Q0518
1664c9039l7774j1944L3306K6602J1897l7922k2724K1175n6710p243M8681k1910
1652i3605j7077j6625O7782Q147l8914Q3860L2538p3404k322m24R123M7838p1686
1639f4769O5751K5935j09655J7297J6411n9006P349k1288Q489Q1181J0739j2399
1627c3965J1864N7629m6726m2495j4866m3598P526l0066J0853R2137l790k8200
1615f3697M5306M8467p2381Q336O027o016j5908l0630j3210Q696o82K300M2409
$$ y = [-75009, -100368, -138740, -46817, -13550, -66350, -66748, 287, -67351, -110222, -73468, -44393, -83862, -98798, -97960, -63925, -78865, -100883, -36663, -25290, -77395, -20626, 29275, -40691, -22320, 30571, -20861, -8555, -30345, -19796, -1456, -55789, -71480, -7052, -73013, -119557, -39039, -76813, -88757, -55451, -28849, -16952, -54874, -77598, -56423, -113133, -120376, -71695, -93605, -110682, -127307, -59525, -51378, -90292, -6432, 26106, -47298, -49620, -50044, -40921, 6917, -64769, 982, 26917, -82738, -65441, -49030, -108036, -100687, -121975, -113486, -32305, -21566, -33965, -22101, 35528, -11198, -53693, -68559, -112157, -104631, -134697, -123844, -31707, -35497, -63697, -18391, 30076, -42305, -33969, -27942, -33958, -49866, -80496, -93706, -85010, -85692, -83392, -40983]
1602d0983k5945j8353J1397J1682k2198J4167O272K5738M8041m9132k6500M1585
1590b4229o7026j1791M820l1152Q551L9129K006L9715K4790k5904L309L7383j3171
1577a3570j3887j0597j2398K2718k360k9272R651J5652n6510j2944K9000k6137
1565a00654l448K1038N1916K5144o6552J912P0249l1749p8097R0702J106j13546
1553a31979K2610L1654j2520j1037N6794L2053j5106m1239M1021N1021p0553K512
1541d4769M1951l6073k3323L0015j1993r3143j7219O2599l2140K90M9086k155
1529g6874L1861j3602J8133J6266o3783q300O9344p1854l7240O4518o591K8054
1517e0068R927K6670N3052r5056j0713N2073j3509j5067J8911N104L704k6881
$$ y = [-40983, -66928, -85281, -73884, -62202, -84400, -70233, -63961, -38223, 9818, -39314, -65814, -24229, -91255, -103046, -98226, -129378, -120827, -81698, -79692, -39977, -15187, -41091, -37782, -399, -13570, -27457, -38054, -50452, -27734, -30094, -59366, -49715, -34063, -90573, -103517, -74517, -100654, -104102, -83064, -31148, -6004, -72556, -70644, -395, -32144, -110241, -19539, -18433, -131979, -109369, -77715, -90235, -101272, -44478, -12425, -27531, -68770, -27749, 23272, -47281, -44769, -2818, -38891, -62214, -32199, -44192, -137335, -154554, -91955, -124095, -123805, -74719, -76874, -45013, -58615, -40482, -24216, -87999, -96299, -26955, -98809, -136049, -71531, -78122, -50068, -40141, -13471, 39581, -55475, -66188, -14115, -27624, -42691, -23780, -18676, -14972, -41853]
1505d1853m551L7107n9263j9433l298L25k1560l1317K0887L3220J1105k375K8569
1492e2437j7518M275l6411J3545O1795o2703l7305O6321J2293l5002K2048M2519
1480a8580J793j3178O856K0413L3188o4519K0344K3381l5709m0155l1968j7457
1468a15591K7166J2466n6979m780P0523M318K1931o748J7147R557q2230l93L3607
1455g0006l0842O821l514K2143l4580J6458M8817N5522k0763l7437N6249O615
1443A5483m3103j8905L1762j1839n4311K7976J2971o7203j8437R860L1834p786
1431i1698l8629L8384N2336o5016k01P6296l1610J7178p836l1624J9482l0604
1419i3542K765M4607J9064Q182k4576n219p68j1794k9404K0814P8864k9586m7796
$$ y = [-41853, -46404, -9297, -68560, -87993, -91291, -90966, -112526, -143843, -122956, -89736, -78631, -81006, -52437, -69955, -65680, -102091, -88546, -26751, -89454, -126759, -60438, -48145, -83147, -61099, -18580, -16787, -29965, -23109, -2696, 30492, -34027, -13683, 9698, -26011, -66166, -98134, -115591, -88425, -75959, -132938, -137718, -67195, -62877, -40946, -47694, -30547, -20990, -103220, -103613, -70006, -100848, -94027, -97541, -75398, -109978, -93520, -44703, 10819, -9944, -47381, 8868, 15483, -27620, -46525, -14763, -26602, -80913, -52937, -39966, -107169, -125606, -115746, -83912, -91698, -130327, -91943, -39607, -104623, -104824, -28528, -60138, -42960, -50796, -82420, -62938, -93542, -90777, -46170, -27106, -18924, -43500, -48719, -49487, -61281, -90685, -69871, 8993, -20593, -68389]
1406f8389P2682L8694q6297m4330L7088n4797j15774L1269J6120K8650K5186K0294
1394i9604O8610K8043J795L6946l5653n7324L9951k6707l1993K2694p784j370
1382f2396P35j7866l555O834K510K6914k7398j7741J8754K1688m9585j9656J6765
1369a03997j7901m8437K0230O0803J3982k2350M3091L5321j8057n8170N7674m563
1357d2374k7638K1371J9169Q095p1635M1788L8062l9085L824j2659K0974l7935
1345g8043n8478O1581k1168r733M5121J276m130L8174j9645j4568k4782k7938
1333a12333J8912K5678m1101K1739j0137n98J6809K1603R519l3925N8938M628
1321b0268j8867l0871M3303n501p0784K54J7064m8092o6875N4817M7973l625N3915
$$ y = [-68389, 4293, 42987, -43310, -87640, -50552, -105349, -221123, -189854, -173734, -145084, -119898, -99604, -30994, -2951, -1156, 35790, 137, -57187, -17236, -43943, -75936, -53242, -61026, -62396, -61661, -79527, -83082, -76248, -73738, -46824, -74222, -91963, -73209, -51521, -101106, -120762, -103997, -121898, -170335, -150105, -89302, -75320, -97670, -54579, -19258, -37315, -95485, -37811, -42374, -70012, -48641, -29472, -21377, -93012, -51224, -13162, -52247, -48423, -61082, -40108, -78043, -136521, -74940, -96108, -105841, -60720, -59444, -63574, -25400, -45045, -59613, -84395, -112333, -93421, -67743, -108844, -87105, -97242, -97840, -81031, -59428, -49909, -83834, -24896, -20268, -39135, -70006, -26703, -32204, -102988, -102734, -85670, -133762, -200637, -145820, -97847, -101472, -47557]
1308d7557P1505Q58n5043k5923J0328o467q0814L7840M4088o2672J5315Q9786
1296h756l0570m7930P4617L002l754j0568m499o397J2548m7906L2093m871n3048
1283i6039M7040L8796m6708k9275P3675k6939q8730L1031K2120l445k741M1963
1271c9252K5251l9144n5520M0652O3196j15453R371Q5158m9782j3095N9659l552
1259c2511k561l6635M7391N6096l3437m8823K5814L6501o1867q504M0828l7844
1247e5552l9155J1009j6923o325N3097J5828J6616J4398j3234J3668j2846l1297
1235e0716k0855l1164O046j2651j4096r583J0248O1402m335M9081L0085L318j2568
1222D212J5388R627K16n3055m2340L1765k0491o8890M213o052K1029M9123k9849
$$ y = [-47557, 23948, 24806, -30237, -56160, -45832, -52299, -133113, -95273, -51185, -113857, -98542, -8756, -39326, -87256, -12639, -9637, -13391, -23959, -28458, -34855, -22307, -70213, -38120, -42991, -96039, -48999, -10203, -56911, -86186, -12511, -39450, -128180, -97149, -75029, -78474, -81215, -39252, -14001, -53145, -108665, -68013, -4817, -120270, -110899, -25741, -75523, -88618, -28959, -32511, -35072, -71707, -24316, 31780, -1657, -50480, -24666, 11835, -50032, -58536, -17708, -55552, -94707, -83698, -100621, -106946, -53849, -38021, -21405, -7007, -20241, -6573, -19419, -50716, -71571, -102735, -96689, -109340, -123436, -133019, -122771, -61369, -65704, -16623, 13462, 16780, 4212, 19600, 29227, 29443, -23612, -65952, -34187, -54678, -123568, -119355, -125407, -104378, -55255, -85104]
1209h5104J563L4593L4636L0l4298K0007k14o4886l5881M9509M44m8365O8735
1196e9231P7546j895m3255K1178O0192p8650o6857J21059K2306j43214L780J01222
1184A4181l8601r3452N8546M6198o7875p2499J7127L5863n9999l9752R3099R5967
1172a1197j13361K906J00822k1424m6184L7042K8214o094p7259j0982Q4591J181
1160c1745m0243N4891K4982n4221K2208P6843n7653l5319L2429l3207n9484K9612
1148g0907k1830l2730J6813k7096K7014k4652l6517J24060N4604j44649L7279
1137i8611N3267o9129L234O0428J8885l1500k5816P9560J9984p5651k7424J06212
1125A3439K7520r7672J8884L9853n9060k5958J8187K4345K694n3298L176J2343
$$ y = [-85104, -83541, -48948, -14312, -14282, -48580, -28573, -28787, -93673, -129554, -80045, -79601, -127966, -59231, 18315, 16420, -26835, -5657, 54535, -24115, -90972, 30087, 52393, -90821, -87041, 14181, -24420, -117872, -59326, -13128, -81003, -153502, -136375, -100512, -160511, -200263, -107164, -11197, -124558, -121652, -20830, -42254, -88438, -51396, -23182, -29276, -106535, -117517, -32926, -31745, -71988, -17097, 7885, -46336, -24128, 52715, -4938, -40257, -7828, -41035, -100519, -70907, -92737, -125467, -108654, -135750, -108736, -133388, -169905, -45845, 8759, -135890, -98611, -45344, -114473, -111239, -50811, -31926, -63426, -89242, -9682, 10302, -65349, -92773, 13439, 40959, -56713, -37829, 2024, -57036, -82994, -64807, -40462, -37768, -91066, -87890, -75547]
1113g5547l2016m8470K9761L0998l6783J9193N0390k6520J7114L4900m2581J9140
1101f0421J7893j2008J1382n5502K3208N4226m089J2432q827r790j5253K3634
1089b3115m2058L80J2151k3052J7512K0134L8351n6378m8994j1669j9505l4320
1077a70563K6761J3918O8770K7109L0483J6095n5581K1816k9429J64n2483K3387
1065g9553L7133l6566R941P1677j9656j8196n920K0315L940m2352L7943k7235
1053d8529j4613r98m041K0584q338k6691M4802l3518o9190O2358j5401m7616M1823
1040i9368M713K6048J1964m2299O7528N0094l7796k1900N0479k0656p8570O6653
1028b3110J3435p4515J102L3863j5766M385L2619l371M10m468n5017M9156j2478
$$ y = [-75547, -107563, -156033, -126272, -95274, -132057, -112864, -62474, -88994, -71880, -36980, -79561, -60421, -42528, -54536, -43154, -98656, -75448, -21222, -25311, -12879, -21706, -31496, -46749, -23115, -65173, -64793, -52642, -75694, -58182, -38048, 303, -56075, -105069, -116738, -136243, -170563, -143802, -129884, -61114, -34005, -3522, 12573, -43008, -21192, -50621, -50457, -102940, -79553, -42420, -78986, -69045, 2632, -17024, -35220, -41140, -20825, -16885, -59237, -21294, -48529, -63142, -64140, -68181, -47597, -55935, -82626, -37824, -71342, -140532, -78174, -93575, -141191, -99368, -94655, -68607, -56643, -98942, -31414, 18680, -19116, -41016, 9463, -11193, -89763, -23110, -9675, -84190, -83088, -49225, -64991, -60606, -27987, -31358, -30948, -35416, -90433, -41277, -53755]
1015e3755k8964P718k1052k7976K1057K9061j7167Q9683j3681o4940L8650j9246
1003f0612l4530Q6494q484l1317L4810l3195K5113O9011k6558k4337m1098l6269
991h0972L181l4310k7480N1433N2792l2205o460P0918m986j00272M0395M4615
979b3351o2566l7973K4588k1141m498j268O4652Q0125n0123j0761J11491k3305
967D5870r0592L1745k4434j7587J5127O136J7912m2792n7750O6288j1715k3004
955h4796K1071M8066j6382L440r324l4878r931o540P0727m1889k9107M7462o2037
942a04118J3475K3760K9649J2930m4525J4443M9969n8549m8092O4515J6069n0073
930h0547k2809Q3246J6227q2611K5924N9073r6347j8903J7969J4169k480L422
$$ y = [-53755, -82719, -75001, -96053, -124029, -102972, -73911, -91078, -1395, -15076, -80016, -41366, -60612, -95142, -8648, -17132, -48449, -13639, -46834, -21721, 47290, 20732, -3605, -44703, -80972, -77791, -112101, -139581, -88148, -35356, -67561, -74021, -3103, -8089, -108361, -67966, -23351, -85917, -123890, -99302, -120443, -124941, -126209, -61557, 18568, -31555, -42316, 69175, 45870, -44722, -12977, -37411, -54998, -39871, -33735, -15823, -58615, -116365, -50077, -61792, -84796, -63725, -15659, -32041, -28601, -37925, -72803, -82734, -89274, -18547, -60436, -89543, -42081, -104118, -90643, -66883, -37234, -24304, -68829, -54386, -4417, -62966, -111058, -46543, -30474, -80547, -103356, -20110, -3883, -86494, -60570, -1497, -97844, -116747, -98778, -84609, -87089, -83667]
918h3667M4114k0125r812N012O3750m12l3602L860p4168j1042L9491J1363l6869
905a02107L3870o384M7722m667R654P9293m4998k981M0742l3739r6007k1830L3674
892f7758J4407p4938K0182O2696n2403M8485L9484k1107K8919k6452j3131p893
880d9509n2089j4031J1505n1856J2919R1960m238n608M0740j6905k1875j7115
868g6102K8135L1959r0309n198N6847p416m3407L1825N7683l5767j9940R978J0196
855e1516m0670q541P0999p3970m0478O3818J3448k5097k6222R4706O3804j14517
843g4236J9046P7933j02924j9467K8450j8734J9320k4903L8299Q0420q4886L4169
$$ y = [-83667, -39553, -59678, -69490, -64478, -728, -1140, -34742, -30882, -105050, -116092, -76601, -65238, -102107, -68237, -74621, -26899, -31566, -21912, 57381, 12383, 9402, 50144, 16405, -79602, -101432, -67758, -53351, -128289, -108107, -45411, -97814, -49329, -9845, -30952, -2033, -28485, -41616, -49509, -101598, -115629, -104124, -155980, -143061, -51101, -55339, -60947, -20207, -37112, -58987, -76102, -47967, -16008, -106317, -111515, -54668, -62084, -105491, -73666, -15983, -51750, -71690, -61712, -51516, -92186, -100727, -29728, -103698, -144176, -80358, -66910, -92007, -118229, -23523, 40281, -74236, -55190, 22743, -80181, -99648, -71198, -89932, -70612, -95515, -57216, 23204, -61682, -27513]
$$ [...]
##END NTUPLES=NMR SPECTRUM
##END=
