##TITLE=1H_DE-80H_X3
 200.13MHz, d2o
 8 sc
 
 19ns.26.2.2025
##JCAMPDX= 6.0         $$ Bruker NMR JCAMP-DX V2.0
##DATA TYPE= NMR SPECTRUM
##DATA CLASS= NTUPLES
##ORIGIN= UXNMR, Bruker Analytische Messtechnik GmbH
##OWNER= pz
$$ XWIN-NMR		Version 3.5
$$ Fri Jan 30 09:49:37 2026 Russian Standard Time (UT+4h)  Yarkov@DPX200
##.OBSERVE FREQUENCY= 200.1313
##.OBSERVE NUCLEUS= ^1H
##.ACQUISITION MODE= SIMULTANEOUS
##.ACQUISITION SCHEME= undefined
##.AVERAGES= 8
##.DIGITISER RES= 18
##SPECTROMETER/DATA SYSTEM= spect
##.PULSE SEQUENCE= zg30
##.SOLVENT NAME= CDCl3
##.SHIFT REFERENCE= (INTERNAL, CDCl3, 0, 15.4428)
##AUDIT TRAIL= $$ (NUMBER, WHEN, WHO, WHERE, WHAT)
$$ ##TITLE= Audit trail, XWIN-NMR		Version 3.5
$$ ##JCAMPDX= 5.01
$$ ##ORIGIN= Bruker BioSpin GmbH
$$ ##OWNER= Yarkov
$$ C:/Bruker/XWIN-NMR/data/yarkov2/nmr/H-C/1/pdata/1/auditp.txt
$$ ##AUDIT TRAIL=  $$ (NUMBER, WHEN, WHO, WHERE, WHAT)
(   1,<2026-01-30 09:48:22.07 +0400>,<Yarkov>,<DPX200>,
      <created by zg, POWCHK disabled, PULCHK disabled
       configuration hash MD5:
       00 E9 B6 7A A2 85 ED C7 34 08 36 98 17 FE 4E 26
       data hash MD5: 16K
       D1 AD FC D7 4B 8E 65 02 F4 70 F9 8E 96 E6 3F F9>)
(   2,<2026-01-30 09:48:27.26 +0400>,<Yarkov>,<DPX200>,
      <Start of raw data processing
       efp BC_mod = 2 LB = 0.25 FT_mod = 6 PKNL = 1 PHC0 = -5219.697 PHC1 = 7.62193 SI = 16K 
       data hash MD5: 16K
       3F D6 09 F6 77 83 B5 58 E4 48 F6 D8 8B 33 D9 B5>)
(   3,<2026-01-30 09:48:50.23 +0400>,<Yarkov>,<DPX200>,
      <pk PHC0 = -77.2 PHC1 = 0 
       data hash MD5: 16K
       49 0F 65 DE 1A 9E 6C 15 02 54 D3 9E 48 F0 4C 58>)
$$ ##END=
$$ 
$$ hash MD5
$$ 47 DD B7 A4 EF D3 45 D3 C9 C6 B8 C0 32 C2 A2 DF
##$RELAX= 
##$RELAX= 
##$RELAX= 
##$RELAX= 
##$RELAX= 
##$RELAX= 
$$ Bruker specific parameters
$$ --------------------------
##$DU= <C:/Bruker/XWIN-NMR>
##$EXPNO= 1
##$NAME= <H-C>
##$PROCNO= 1
##$TYPE= <nmr>
##$USER= <yarkov2>
##$AMP= (0..31)
100 100 100 100 100 100 100 100 100 100 100 100 100 100 100 100 100 100 
100 100 100 100 100 100 100 100 100 100 100 100 100 100 
##$AQSEQ= 0
##$AQ_mod= 1
##$AUNM= <au_zg>
##$AUTOPOS= <>
##$BF1= 200.13
##$BF2= 200.13
##$BF3= 200.13
##$BF4= 200.13
##$BF5= 200.13
##$BF6= 200.13
##$BF7= 200.13
##$BF8= 200.13
##$BYTORDA= 1
##$CFDGTYP= 0
##$CFRGTYP= 5
##$CHEMSTR= <none>
##$CNST= (0..31)
1 1 145 1 1 1 1 1 1 1 1 1 1 1 1 1 1 1 1 1 1 1 1 1 1 1 1 1 1 1 1 1 
##$CPDPRG= <>
##$CPDPRG1= <>
##$CPDPRG2= <>
##$CPDPRG3= <>
##$CPDPRG4= <mlev>
##$CPDPRG5= <mlev>
##$CPDPRG6= <mlev>
##$CPDPRG7= <mlev>
##$CPDPRG8= <mlev>
##$CPDPRGB= <>
##$CPDPRGT= <>
##$D= (0..31)
0 0.7 0 0 0 0 0 0 0 0 0 0.03 0 0 0 0 0 0 0 0 0 0 0 0 0 0 0 0 0 0 0 0 
##$DATE= 1769752101
##$DBL= (0..7)
120 120 120 120 120 120 120 120 
##$DBP= (0..7)
150 150 150 150 150 150 150 150 
##$DBP07= 0
##$DBPNAM0= <>
##$DBPNAM1= <>
##$DBPNAM2= <>
##$DBPNAM3= <>
##$DBPNAM4= <>
##$DBPNAM5= <>
##$DBPNAM6= <>
##$DBPNAM7= <>
##$DBPOAL= (0..7)
0.5 0.5 0.5 0.5 0.5 0.5 0.5 0.5 
##$DBPOFFS= (0..7)
0 0 0 0 0 0 0 0 
$$ [...]
##$SUBNAM2= <"">
##$SUBNAM3= <"">
##$SUBNAM4= <"">
##$SUBNAM5= <"">
##$SUBNAM6= <"">
##$SUBNAM7= <"">
##$SUBNAM8= <"">
##$SUBNAM9= <"">
##$SW= 18.0517328524113
##$SWIBOX= (0..15)
0 0 2 0 0 0 0 0 0 0 0 0 0 0 0 0 
##$SW_h= 3612.71676300578
##$TD= 16384
##$TD0= 1
##$TE= 0
##$TE2= 300
##$TE3= 300
##$TEG= 300
##$TL= (0..7)
0 120 120 120 120 120 120 120 
##$TP= (0..7)
150 150 150 150 150 150 150 150 
##$TP07= 0
##$TPNAME0= <>
##$TPNAME1= <>
##$TPNAME2= <>
##$TPNAME3= <>
##$TPNAME4= <>
##$TPNAME5= <>
##$TPNAME6= <>
##$TPNAME7= <>
##$TPOAL= (0..7)
0.5 0.5 0.5 0.5 0.5 0.5 0.5 0.5 
##$TPOFFS= (0..7)
0 0 0 0 0 0 0 0 
##$TUNHIN= 0
##$TUNHOUT= 0
##$TUNXOUT= 0
##$USERA1= <user>
##$USERA2= <user>
##$USERA3= <user>
##$USERA4= <user>
##$USERA5= <user>
##$V9= 5
##$VALIST= <valist>
##$VCLIST= <CCCCCCCCCCCCCCC>
##$VD= 0
##$VDLIST= <DDDDDDDDDDDDDDD>
##$VPLIST= <PPPPPPPPPPPPPPP>
##$VTLIST= <TTTTTTTTTTTTTTT>
##$WBST= 1024
##$WBSW= 4
##$XGAIN= (0..3)
0 0 0 0 
##$XL= 0
##$YL= 0
##$YMAX_a= 303662
##$YMIN_a= -222155
##$ZGOPTNS= <>
##$ZL1= 120
##$ZL2= 120
##$ZL3= 120
##$ZL4= 120
##$ABSF1= 0
##$ABSF2= 0
##$ABSG= 0
##$ABSL= 0
##$ALPHA= 0
##$AQORDER= 0
##$ASSFAC= 0
##$ASSFACI= 0
##$ASSFACX= 0
##$ASSWID= 0
##$AUNMP= <proc_1d>
##$AZFE= 0.1
##$AZFW= 0.1
##$BCFW= 0
##$BC_mod= 2
##$BYTORDP= 0
##$COROFFS= 0
##$CY= -3
##$DATMOD= 1
##$DC= 0
##$DFILT= <>
##$DTYPP= 0
##$F1P= 0
##$F2P= 0
##$FCOR= 1
##$FTSIZE= 16384
##$FT_mod= 6
##$GAMMA= 0
##$GB= 0
##$INTBC= 1
##$INTSCL= 3.241238e-09
##$ISEN= 128
##$LB= 0.25
##$LEV0= 0
##$LPBIN= 0
##$MAXI= 10000
##$MC2= 0
##$MEAN= 0
##$ME_mod= 0
##$MI= 1.114404
##$NCOEF= 0
##$NC_proc= -6
##$NLEV= 6
##$NOISF1= 3.799351
##$NOISF2= 2.8
##$NSP= 0
##$NTH_PI= 0
##$NZP= 0
##$OFFSET= 15.44279
##$PC= 1
##$PHC0= -5296.897
##$PHC1= 7.62193
##$PH_mod= 1
##$PKNL= yes
##$PPARMOD= 0
##$PSCAL= 0
##$PSIGN= 0
##$REVERSE= no
##$SF= 200.1300157915
##$SI= 16384
##$SIGF1= 3
##$SIGF2= 2
##$SINO= 0.751879
##$SIOLD= 32768
##$SREGLST= <19F.Aceton>
##$SSB= 0
##$STSI= 16384
##$STSR= 0
##$SW_p= 3612.71676300578
##$SYMM= 0
##$S_DEV= 0
##$TDeff= 16384
##$TDoff= 0
##$TI= <>
##$TILT= no
##$TM1= 0
##$TM2= 0
##$TOPLEV= 0
##$USERP1= <user>
##$USERP2= <user>
##$USERP3= <user>
##$USERP4= <user>
##$USERP5= <user>
##$WDW= 1
##$XDIM= 16384
##$YMAX_p= 448496931
##$YMIN_p= -577469
$$ End of Bruker specific parameters
$$ ---------------------------------
##NTUPLES= NMR SPECTRUM
##VAR_NAME=  FREQUENCY,     SPECTRUM/REAL,   SPECTRUM/IMAG
##SYMBOL=    X,             R,               I
##VAR_TYPE=  INDEPENDENT,   DEPENDENT,       DEPENDENT
##VAR_FORM=  AFFN,          ASDF,            ASDF
##VAR_DIM=   16384,         16384,           16384
##UNITS=     HZ,            ARBITRARY UNITS, ARBITRARY UNITS
##FACTOR=    0.220516191357247, 1,           1
##FIRST=     3090.56581285553, 0,            0
##LAST=      -522.150950150254, 0,           0
##MIN=       -522.150950150254, -577469,     0
##MAX=       3090.56581285553, 448496931,    0
$$ Real data points
##PAGE= N=1
##DATA TABLE= (X++(R..R)), XYDATA
$$ [...]
9431 1128944 1189523 1169419 1153648 995968 910810 939133 881091 791469 684094 663873 666875
9420 666875 710077 685136 704424 672370 680568 780782 786911 805604 828363 804266 824363 832784
9408 832784 827327 870101 868945 824602 787579 767622 751933 722048 741290 760190 725643 708231
9396 708231 680847 610268 601341 617695 660519 631690 626242 669120 581363 571281 646395 627443
9384 627443 610884 613149 590411 652654 660446 659300 670634 603238 601987 644465 663207 666470 701739
9371 701739 685338 704506 766796 829054 825163 800169 829877 786750 846650 857951 778530 805348
9359 805348 812941 762594 769983 765119 782903 848280 840976 757694 742105 795409 802896 778820 782755
9346 782755 795020 850339 891183 884396 840227 804162 798085 729858 753254 838173 811123 858143
9334 858143 874287 882836 883105 920866 985724 1081391 1135661 1191234 1218318 1286476 1302109 1303680
9322 1303680 1264605 1205929 1203651 1174742 1091441 1073822 1052907 1049397 1056707 1093360 1150985 1113626
9310 1113626 1060246 1053311 1110759 1092990 1097880 1083814 1101964 1119196 1151779 1135778 1157002 1142122
9298 1142122 1211602 1281702 1308277 1329874 1418379 1483909 1517361 1489224 1560156 1648635 1701289
9287 1701289 1673168 1692582 1700869 1644086 1753078 1739101 1650185 1572486 1598059 1532737 1489799
9276 1489799 1434931 1384815 1448255 1459262 1424957 1524281 1521280 1507672 1509672 1519487 1470370 1572199
9264 1572199 1584121 1555241 1601644 1604161 1609093 1612687 1579184 1600987 1585944 1552862 1467678 1394460
9252 1394460 1445956 1413941 1473009 1551723 1575546 1549642 1553512 1527758 1476096 1530906 1616791 1632966
9240 1632966 1580996 1545030 1607103 1639844 1646176 1673573 1753581 1725458 1743782 1732464 1804540 1847431
9228 1847431 1870130 1887375 1908328 1974752 2008151 1996260 1994452 1986054 1968640 2012179 2083009 2074034
9216 2074034 2089068 2084135 2027846 2092064 2092376 2120184 2187674 2199966 2256934 2314492 2329375 2354989
9204 2354989 2392995 2470510 2472319 2501994 2636404 2653058 2707305 2803463 2856567 2849979 2893236 2954619
9192 2954619 3066763 3115993 3143050 3176180 3222421 3302046 3409730 3489321 3569485 3646342 3765453
9181 3765453 3794749 3896368 4038019 4137173 4247758 4359498 4466954 4574413 4733477 4907194
9171 4907194 5157016 5426720 5672086 6096094 6598996 6826578 6890946 6950628 7062401 7304121
9161 7304121 7546508 7574847 7460311 7381203 7397039 7332906 7413255 7572199 7747404 7932841
9151 7932841 8131544 8460875 8804731 9047058 9391063 9760622 10156188 10538139 10935073 11545733
9141 11545733 12219341 12937464 13780776 14521409 15315298 16280053 17128697 17766521 18331372
9132 18331372 19170514 20471128 21929899 22917612 23363090 23751780 24425965 25306712 26283079
9123 26283079 27163283 28088483 29099653 30238644 31308421 32351719 33604850 35012443
9115 35012443 36343099 37788216 39736577 42251177 45377187 48555880 51673740 55143806
9107 55143806 59705923 65365730 71633426 78837790 89027398 104397384 126197718 152126179
9099 152126179 175190458 188639981 194860671 200812898 207807820 207073976 192668176 170818565
9091 170818565 150053090 134366942 123340572 116180926 113475551 115912990 123554755 135724212
9083 135724212 150254067 163715370 175597038 188606366 201813593 207344693 199344300
9076 199344300 183283105 168305966 157754095 147297399 131940694 112850731 94419295
9069 94419295 79251244 67575840 58633311 51789069 46585444 42586700 39488949 37001464
9061 37001464 34772509 32630742 30595440 28802447 27278352 25916370 24584825 23390537
9053 23390537 22536449 21956797 21515414 21361501 21416138 21612966 21942502 22262798 22837984 23878112
9043 23878112 25456470 27507953 29281621 30498479 31234500 31759496 32295394 32327096 31650005
9034 31650005 30177984 27944750 25448000 23158618 21112689 19468608 18166132 17122270
9026 17122270 16388357 15705989 15067371 14483558 13943014 13250525 12459780 11804135 11232939
9017 11232939 10607310 10145259 9783466 9454067 9134615 8928196 8839458 8795493 8799838 8882630
9007 8882630 9148752 9558600 9977138 10357163 10574287 10883729 11135114 11312741 11323449 11147804
8997 11147804 11079480 10971922 10830389 10505454 10148335 9782784 9408801 9223533 9106202 8975341
8987 8975341 8809920 8820255 8805438 8878077 9077155 9419922 9965427 10599701 10957836 10977712
8977 10977712 10771165 10664280 10909771 11054203 10890377 10426302 9952947 9641416 9481059
8968 9481059 9324296 9293403 9321833 9329352 9428444 9614860 9767982 9976354 10318571 10839733
8958 10839733 11569954 12500956 13655568 14935400 16301604 17416803 17841024 17535454 17171195
8949 17171195 17034936 17265058 17621997 18135163 18835258 19659872 20295015 20613722 21019766
8940 21019766 21762428 22977848 24582389 26607951 29677620 34276405 40712915 48711611
8932 48711611 56515452 60280917 58232426 53224144 49147197 48151603 50019975 51334441
8924 51334441 47931198 42709963 38930926 37635526 38303331 40445206 43815034 48614923
8916 48614923 55202109 62726009 68554428 70491707 69417696 66055604 60482103 53837406
8908 53837406 47684322 42607449 38682905 35941550 34385845 34103547 35282682 37963571
8900 37963571 42528233 49262489 58170995 68006563 75675512 78138116 74672714 66625687
8892 66625687 57035350 48401329 41519609 36422146 32760175 30344372 29156529 29375843
8884 29375843 31184078 34993013 40716267 47636708 53042795 54379485 53065981 51802062
8876 51802062 51380180 50191759 46691373 41473910 35945383 31074758 27098779 23989122
8868 23989122 21827426 20471624 19824976 19922352 20803106 22699878 25711262 29609035 33789633
8859 33789633 35811011 33828092 29100793 24072167 19860674 16639460 14113680 12146008
8851 12146008 10571194 9387369 8557598 7969634 7620857 7409780 7336395 7267001 7175001 7172183
8841 7172183 7234757 7319607 7524455 7644926 7595059 7219371 6640764 6077915 5566243 5176007
8831 5176007 4916302 4661005 4516482 4371156 4234718 4168558 3962111 3787949 3617167 3431364
8821 3431364 3334989 3263339 3163891 2983553 2935546 2951820 2918562 2828532 2769823 2793918 2852569
8810 2852569 2867178 2912435 2927215 2941110 3008391 3066992 3086482 3024962 2891370 2767820 2705801
8799 2705801 2638774 2605196 2505820 2434841 2349423 2264739 2245058 2244658 2106437 2018660 1984265 1841290
8787 1841290 1831244 1830256 1797370 1706068 1595643 1570850 1532801 1537251 1579775 1589135 1577976 1641773
8775 1641773 1619400 1585749 1605726 1617331 1618676 1620430 1563734 1540445 1551659 1546928 1434310 1388945
8763 1388945 1366750 1332227 1329718 1345613 1324857 1364208 1400997 1358800 1334143 1300762 1290064 1274097
8751 1274097 1359712 1402342 1368492 1385214 1324505 1315554 1337496 1334169 1296246 1321439 1241899 1240993
8739 1240993 1109774 1009886 941698 898846 864752 851882 814105 789468 745827 695270 668588
8728 668588 701289 754529 703125 729892 771447 758482 723730 757541 804968 858069 837535 857654
8716 857654 840282 786334 784791 777753 731772 699146 746623 763836 717694 685816 705822 713669
8704 713669 662455 671626 668553 585365 508157 501632 409786 274275 241712 312362 243421 209741
8692 209741 214034 274752 247800 293288 279921 243335 324910 279988 194365 264071 217948 196438
8680 196438 113995 97059 103538 166473 198976 148643 132128 129572 102972 116908 44458 15302
8668 15302 -45447 25711 53346 10832 17288 -49687 -118030 -60383 -35676 46400 108552 33833
8656 33833 -54461 -65080 -52447 -48678 -53489 -23211 16641 26101 14814 -27332 -28855 -74399 -40774
8643 -40774 1749 30870 49949 29080 -45801 -83598 -87039 -16375 11706 1471 -1757 -19103
8631 -19103 -36347 -60220 -79523 -168444 -120753 -90010 -142897 -28946 -32642 -68038 -58769 -26148
8619 -26148 -19783 41129 -197 -10910 49578 -7825 -66308 -10262 6611 34682 -57271 -90565
8607 -90565 -83594 -87597 -26244 -46025 -83486 -22122 -32149 -39933 -53500 -93932 -102084 -18121 -60259
8594 -60259 -96418 -74734 -42278 -17276 22109 11340 -8599 -13446 -27508 3624 31260 -26237
8582 -26237 14741 59438 -15757 -30080 45155 64144 58552 59138 85607 -9576 11699 56491
8570 56491 84305 173089 172939 142923 99502 47352 94723 97907 66023 84607 50417 44382 96438
8557 96438 98859 133578 191929 207666 193993 241059 248006 167934 178060 200161 229092 222243
8545 222243 162900 162735 138154 133328 179913 202613 250275 123908 103457 143162 145058 187267
8533 187267 283711 267772 216967 176824 159307 159622 109497 46444 66611 82053 111187 153067
8521 153067 209268 112534 104423 125526 133094 209633 188210 162679 196803 181650 190487 115057
8509 115057 63096 102445 114222 112337 50259 7734 2167 -13042 52231 43628 56596 62803
8497 62803 45848 82129 97696 91221 36042 51631 44892 12276 70007 67027 66437 87229 43897
8484 43897 -366 39653 35511 -27652 -73625 -114759 -107627 -134410 -118170 -96151 -41479 3979
8472 3979 -36692 -100843 -149603 -156106 -120540 -112599 -60562 -25843 -51773 -102892 -114719 -63908
8460 -63908 -46240 -32084 -46299 -94292 -157952 -116821 -54662 -90437 -69547 -64754 -56401 41520
8448 41520 26849 13945 16759 27803 -5179 -47525 -82726 -162910 -165653 -180946 -135079 -152215
8436 -152215 -161607 -119046 -99856 -33107 -73025 -71167 -100845 -93254 -60119 -98066 -127660 -161702
8424 -161702 -202239 -207172 -199503 -128812 -153387 -160579 -118636 -208291 -178798 -153067 -141032 -109050
8412 -109050 -66929 -142525 -63138 -65751 -130718 -126185 -166045 -148785 -117736 -77791 -135646 -176345
8400 -176345 -157890 -156952 -147318 -96523 -50119 -94338 -112953 -100179 -141758 -138912 -136740 -156108 -128469
8387 -128469 -120987 -128634 -136408 -77561 -61317 -43248 -70610 -87352 -135874 -147086 -102586 -152096
8375 -152096 -125765 -137924 -103969 -53294 -46918 -76604 -99510 -124436 -106832 -133139 -167745 -162944
8363 -162944 -145191 -148761 -144131 -171938 -194551 -139260 -170417 -150648 -86571 -69581 -65716 -44295
8351 -44295 -44374 -67672 -75434 -59864 -88936 -59478 -93984 -149295 -182930 -143821 -127413 -147463 -127997
8338 -127997 -84988 -75313 -28099 -37194 -12856 -45288 -104844 -115405 -108393 -51683 -75907 -119781
8326 -119781 -141337 -130592 -36888 -52934 -73412 -36409 -23773 -23243 -51449 -30276 -6096 -19934
8314 -19934 -34103 -24242 -7268 28586 -12968 -27295 -2137 11609 -16724 -35376 -32789 -42342
8302 -42342 -97622 -84613 -59828 49894 51981 105877 50076 -13695 9133 71304 64968 8163
8290 8163 -69457 -69087 -92317 -85850 -5544 -23782 -35734 -75054 -93708 -34452 -70136 -150076 -105232
8277 -105232 -124076 -83898 -68416 -68579 -62597 -80812 -105072 -68133 -29027 -42565 -103450 -36592
8265 -36592 -27943 -58871 -115105 -213201 -185743 -180435 -96736 -82312 -120635 -93702 -63433 -66601
8253 -66601 -119650 -138409 -180998 -115511 -106757 -64264 -87618 -55603 -62560 -50371 9087 -7945
8241 -7945 -81667 -173075 -128178 -179060 -125841 -140878 -123867 -47560 -61088 -95370 -43032 -18949
8229 -18949 2453 -40829 -83691 -54062 -119231 -76109 -54075 -41693 -83860 -140375 -75356 -44864
8217 -44864 -55388 -81505 -103080 -81768 -138803 -70688 -30259 -38906 -61652 -45578 22923 -52613
8205 -52613 -84724 -146004 -64624 7848 -42594 -60573 -35998 -77835 34821 64783 24890 60552
8193 60552 117634 -167890 -237557 -188446 -120720 -88689 -233392 -178963 -136762 -75757 -42991
8182 -42991 -137063 -147233 -107455 -129798 -149020 -210509 -221196 -207176 -144752 -147123 -118032 -128980
8170 -128980 -44144 -31312 -17364 5937 -107757 -39761 15595 -19252 17088 36889 -3145
8159 -3145 -82595 -50083 -36300 -20253 -76261 -118645 -100409 -54609 -93702 -131090 -174168 -100743
8147 -100743 -89160 -72588 -38165 -59163 -74540 -63417 -60058 -59533 -172702 -161661 -136054 -124310
8135 -124310 -120671 -138603 -156448 -109828 -47547 -142599 -131588 -111402 -79687 -59612 -140220 -149089
8123 -149089 -105077 -135078 -119943 -112517 -66335 -66475 -115758 -118335 -112945 -53916 -27252 -55861 8523
8110 8523 -61315 -101404 -112592 -76567 -179229 -147652 -53370 -40542 -123622 -85375 -78449 -75967
8098 -75967 -152412 -133021 -188138 -125824 -5392 15534 59584 -9507 -51213 -89047 -44316 -52087
8086 -52087 -78008 -48347 -112410 -150733 -127395 -122467 -103679 -97404 -83107 -112638 -42544 -94478
8074 -94478 -124330 -133660 -41257 -93744 -57234 -4769 -49717 27866 15807 -25089 -46102 -92932
8062 -92932 -40874 -76615 -27058 -10826 -8317 -106740 -150178 -90464 -33258 -36168 -36501 -70074 -79438
8049 -79438 -88659 -89472 -76594 -92169 -40515 -105142 -107518 -74792 -16178 -81657 -67051 -51722 -88226
8036 -88226 -113027 -55406 6845 -6326 -82832 -97942 -61617 -124624 -174677 -155661 -91577 -49244
8024 -49244 -66981 -79611 -80087 -67257 -20562 -50023 -15126 22285 -91696 -53334 -37041 -74199
8012 -74199 -155805 -148270 -136351 -97390 -84068 -53021 -89046 -92341 -54739 -32333 -35286 -62046
8000 -62046 -122067 -91607 -24965 -11620 -28043 -52454 45543 2112 -38295 -28607 -17090 -49260
7988 -49260 -39342 -101747 -95863 -75599 -61510 -78011 -86248 -86081 -55956 -22758 53418 14585 -13589
7975 -13589 -40502 -44187 -27919 -60499 -66925 -72537 -91830 -36306 -14102 -39320 -99233 -114193
7963 -114193 -79989 -48900 -21364 -86180 -107006 -80395 -82005 -60368 -22562 -31698 -27721 -51295
7951 -51295 -24863 -41863 -177979 -169252 -76966 -92308 -51893 -4047 -57505 -96340 -47084 -60406
7939 -60406 -69799 -41037 -37586 -55015 -85347 -114082 -69059 -92631 -52075 6386 -987 -41342
7927 -41342 -84360 4715 -11899 -54734 -24104 -62927 -54623 -63882 -8043 -32118 -50996 -40179
7915 -40179 -16166 -58720 -90033 -85827 -81070 -3645 15224 58350 12723 61904 64469 -37302
7903 -37302 -5496 -63434 -22804 -39182 -57657 -10707 -25592 -40572 -41206 -75680 -79172 -35607
7891 -35607 37998 -70055 -734 -32477 -30746 -44176 -71635 -52745 -21032 36331 -40127 -4246
7879 -4246 -36863 -51789 -83358 -69726 -21536 52654 95381 49039 -38044 -68597 6392 14717
7867 14717 -65864 -65963 -34371 -48120 49150 64834 15950 25191 -32413 10743 30197 52646 30201
7854 30201 72705 15230 -1546 -2189 26577 -55641 5451 38407 29089 20998 40359 24599 -30911
7841 -30911 -26972 4853 12643 -24864 -87545 -99645 -122618 -127357 -24493 59118 63262 112188
7829 112188 92321 68142 30510 29431 108280 162704 49016 -981 7452 11498 88732 139752
7817 139752 14924 35324 92467 95356 20767 91988 109696 -23254 59097 37514 88671
7806 88671 86747 32944 58875 60210 87508 113442 83633 63432 63642 61737 55997 118808 109376
7793 109376 140472 173682 161526 151071 206449 145790 209559 197612 166108 216872 249670 172072
7781 172072 230725 257421 294106 318177 350957 354184 323031 318365 349836 371641 374259 399214
7769 399214 464983 456318 414905 396359 339140 454598 518118 509884 518556 559196 576455 593880
7757 593880 605540 646171 730577 710658 733273 802974 915366 885083 885801 906080 974096 1012274
7745 1012274 1088736 1126300 1158872 1200671 1276192 1368685 1390954 1411994 1406411 1545706 1592203
7734 1592203 1607349 1723743 1745272 1747048 1796327 1774385 1795297 1790038 1761078 1824441 1761738 1731275
7722 1731275 1689984 1675776 1744411 1627378 1560286 1491086 1437697 1377349 1311398 1231969 1221675
7711 1221675 1190068 1125998 1104610 1019221 958295 950383 929167 848627 799365 749124 710750 729006
7699 729006 716553 691849 601124 547050 548067 576052 564652 536486 482690 427724 398872 329516
7687 329516 350179 355512 343326 320581 350059 342650 345109 334290 264703 307781 297203 278550
7675 278550 221961 183174 190245 207311 272757 273015 220509 237295 232872 183412 211682 253860
7663 253860 251436 278025 272996 233682 182435 261755 276009 277667 235038 249250 244038 309324
7651 309324 288954 211997 252371 270481 222284 213923 225601 242527 233937 242748 248229 229649
7639 229649 154676 128936 97767 138261 129963 106616 160658 133231 86553 84160 120580 42244
7627 42244 73939 72531 68660 68467 7908 47781 75053 145673 96802 104946 100316 35515 50634
7614 50634 79977 135542 178012 202585 100648 34415 45624 -8610 67620 83736 -233 32819
7602 32819 58146 100995 116662 159933 156960 131361 76472 127703 68337 57015 80625 105315
7590 105315 71888 110888 92343 88598 118562 130970 105003 68314 94306 51839 64638 41910
7578 41910 -19169 63014 54316 -62701 -68453 -63401 -33948 59186 57686 -6504 6273 68495
7566 68495 122247 48040 61683 38970 76143 73375 16748 11979 24117 15119 -18349 36587
7554 36587 18688 54516 126347 121197 119310 83652 31933 70018 49691 61708 82953 99804
7542 99804 79450 40314 53405 111472 145689 169700 115530 61121 27697 84883 58236 93109
7530 93109 142065 130846 109692 107955 135683 112418 63205 102283 99937 61860 54299 53235 82889
7517 82889 95709 22637 83794 66274 873 10773 37295 73850 100203 87552 16799 60906
7505 60906 9965 -3971 39595 128026 143048 43510 -36308 38082 76414 14266 45150 91282
7493 91282 64811 50948 99055 118871 61208 73456 89466 25302 15523 88773 40502 21208
7481 21208 99814 86987 91551 108860 97038 99236 25448 17130 -19964 -7370 14923 72978
7469 72978 30887 22114 19395 31844 73968 112113 108686 34590 -39356 -6938 -19690 32215
7457 32215 92993 75636 73570 17612 23955 93988 152146 216147 177677 150272 83031 134146
7445 134146 152756 112738 180767 205551 201392 196474 139399 188838 161085 100328 119978 134214
7433 134214 156537 111348 81988 103533 77826 111273 136341 127721 108486 100385 74924 26643
7421 26643 102550 145853 151619 58644 40056 82613 65258 26932 80859 104599 120722 63233
7409 63233 92025 70606 47749 79543 96553 41775 37638 24379 72684 121390 94659 47176
7397 47176 49912 41330 29200 13845 -2134 46326 65416 97340 51314 43995 109522 74515
7385 74515 47185 46862 35803 122104 113773 115880 121722 90140 122170 108919 59145 36518 91605
7372 91605 111240 174966 115720 124930 128668 111613 161852 135259 93980 55042 50300 128109
7360 128109 110759 93231 111932 49147 37680 94989 138401 84831 77455 56795 83402 133989
7348 133989 70874 81365 108303 108667 160741 163661 229863 261463 199805 238178 248793 213402
7336 213402 142287 116891 183314 81070 123204 179180 148712 130976 145200 168073 182580
7325 182580 146574 162865 161761 130027 160143 225472 240757 195492 193774 148599 173823 174738
7313 174738 194059 142395 175393 282578 296342 253335 256015 316977 332531 256325 257077 294761
7301 294761 339318 361522 400120 363219 349632 350872 349542 345848 372700 421081 431131 406538
7289 406538 422190 474399 458842 519251 581225 633832 628744 609842 607727 689410 700526 720386
7277 720386 770518 766772 791711 902645 915385 939003 976135 1008621 1020941 1064790 1190210
7266 1190210 1249822 1243016 1302023 1393495 1488703 1570155 1630923 1702514 1762298 1781862 1817297 1803330
7254 1803330 1789872 1799922 1845877 1872298 1854867 1885917 1885064 1810696 1792881 1822459 1786198 1786552
7242 1786552 1724470 1665124 1599854 1529148 1469789 1388862 1342591 1396503 1385986 1261780 1203735
7231 1203735 1144952 1073417 980691 923626 865155 907045 880612 800537 818301 751732 672543
7220 672543 660585 630276 665009 650421 594308 584959 570986 514414 531243 457726 436115 452193
7208 452193 512225 460356 452027 415394 430539 391601 364701 408536 348219 341095 376691 418910
7196 418910 355632 378713 344854 349606 295521 245438 197720 263051 334904 275191 184723 196918
7184 196918 264529 285407 269290 291996 254557 285844 233088 216255 205771 171045 210387 229961
7172 229961 219668 266570 329808 320058 235616 179633 168686 187276 229020 139364 176648 270401
7160 270401 182433 174483 169910 205529 154128 172804 218032 173203 206006 208521 189280 188155
7148 188155 186530 166853 166745 224781 228143 212619 186037 248004 296276 314203 288473 324130
7136 324130 402661 444695 473119 426909 310740 287203 263388 203250 182896 125475 157231
7125 157231 144490 186503 197116 221687 180106 199663 172418 152670 160690 76139 80575 141991
7113 141991 153624 127345 200976 222872 220749 209015 172289 177118 217648 209722 165786 184950
7101 184950 195812 124945 117010 62985 99552 151576 101955 90280 160989 197212 108154 130374
7089 130374 170050 132694 162923 198376 175663 145235 168260 154782 116785 161553 164761 188177
7077 188177 243406 308867 146420 191807 206864 200051 156248 155206 145823 105323 81708 127528
7065 127528 123741 124739 162855 203408 169590 127097 143230 155786 175246 153467 160721 134904
7053 134904 160591 84280 67408 141514 132566 169542 187003 200056 249076 178598 114535 127291
7041 127291 115174 120542 217100 247659 204263 204629 205924 222466 206038 190135 213374 237453
7029 237453 203627 168274 242365 199646 150333 213996 197757 147056 112844 112444 156543 119624
7017 119624 171531 224920 195591 192479 230347 209801 163727 202502 258851 183138 264725 220408
7005 220408 216143 187764 121973 75897 115370 151961 138152 191679 242269 303526 241380 270874
6993 270874 246426 216924 235105 161373 120802 151749 138823 142457 210358 213219 239146 220708
6981 220708 187014 146169 137588 179034 237790 247221 226298 219390 172560 237303 246825 204983
6969 204983 182389 206526 223398 221455 218916 238143 256382 231531 306535 295191 325347 300840
6957 300840 281691 326613 309685 260331 276361 322739 328467 325415 327131 329719 259888 247461
6945 247461 235734 288111 362932 388884 367538 349131 367606 347055 310497 301751 274724 263841
6933 263841 326631 383568 357140 282333 275789 356766 328882 317972 271859 294297 310677 301673
6921 301673 373191 427215 402727 342086 317587 317193 282255 256768 302286 354250 321976 313112
6909 313112 364397 416163 422865 368630 367660 467534 444285 428833 493626 448367 415349 419455
6897 419455 427159 488283 487976 533312 588443 516999 503802 509047 511595 545768 493735 487678 585626
6884 585626 543297 447344 474084 541645 532322 538123 488884 480074 493854 540516 605487 547467
6872 547467 529438 557752 564786 587899 520138 569597 564703 546736 566023 584488 538799 474109
6860 474109 461047 456158 488079 513270 514668 533555 582781 550615 492529 476583 582019 622682
6848 622682 610682 661628 682160 634441 661832 676989 604762 659079 620134 559674 570239 518011
6836 518011 578121 604960 634370 596915 611689 588135 604171 668872 735216 729206 665838 647835
6824 647835 666639 669063 676701 693561 699019 719540 719236 738143 703720 731565 730161 734618 793219
6811 793219 818710 810013 806758 797264 793573 791479 753924 719611 837747 860129 903175 888927
6799 888927 882938 915339 881833 866091 833913 827838 805017 804604 778547 815575 816470 912897 863281
6786 863281 841353 844194 835356 836096 895562 851338 829473 875157 945066 953702 941489 981319 1039185
6773 1039185 1085264 1023016 1054205 1004992 1051274 1109693 1115147 1051682 1082162 1084984 1102732 1058642
6761 1058642 1057418 1083847 1104136 1089170 1038515 1071608 1105983 1077890 1107077 1132826 1171100 1252711
6749 1252711 1238089 1276878 1367291 1346825 1385848 1380832 1381451 1433032 1367327 1343747 1353927 1357229
6737 1357229 1306106 1377271 1394270 1389781 1386117 1372475 1402132 1412416 1536804 1564954 1583562 1648091
6725 1648091 1611828 1580902 1549509 1498679 1414243 1412485 1426377 1352242 1360489 1282320 1291334 1377669
6713 1377669 1379637 1291781 1238770 1199810 1207196 1242850 1234879 1248037 1257005 1214672 1238673 1220571
6701 1220571 1195084 1262484 1294616 1373031 1396874 1391267 1422401 1448844 1479251 1464169 1524059 1633982
6689 1633982 1671316 1692370 1703764 1798998 1793888 1870009 1953139 1950080 1976448 2083372 2092507 2103676
6677 2103676 2212051 2190251 2129044 2041452 2038532 1988934 1909339 1932185 1949257 1955461 1965542 1956751
6665 1956751 1885039 1965534 2008814 2006489 2062923 2149554 2225359 2202519 2242271 2208450 2174077 2164259
6653 2164259 2102405 2126194 2104551 2100856 2097551 2063576 2033448 2066167 2049252 2054851 2013036 1996263
6641 1996263 1990219 2014902 2074025 2077314 2107498 2081363 2079969 2091702 2078406 2109382 2144142 2081065
6629 2081065 2114249 2223304 2211867 2264839 2278627 2265833 2277864 2307376 2376538 2413549 2422946
6618 2422946 2445929 2504391 2463584 2566784 2614337 2674251 2733462 2791722 2819013 2861954 2916570
6607 2916570 2966748 3016855 3073168 3181010 3204761 3248414 3368396 3438220 3482806 3514220 3583762
6596 3583762 3751174 3757446 3774903 3912544 4037640 4188920 4330375 4404635 4510647 4621742
6586 4621742 4743551 4890463 5153394 5404324 5696206 5981484 6189516 6337252 6408038 6323525
6576 6323525 6333885 6361821 6351503 6493610 6759767 6999124 7355615 7889559 8455395 8989493
6566 8989493 9343654 9511478 9529562 9300769 9070718 8981166 8958414 8881509 8922554 8967505 9106772
6555 9106772 9284276 9447610 9661368 9995733 10423892 10882765 11441670 11900911 12229774 12411706
6545 12411706 12671743 12839969 13054875 13255355 13584654 14029126 14734473 15619025 16623769
6536 16623769 17643954 18502793 18979462 19218119 19270852 18992611 18652275 18324829 18148152
6527 18148152 18206990 18406042 18621453 18967511 19469699 19995960 20744738 21701077 22919799
6518 22919799 24346366 25793556 27132916 28199046 28981372 29653518 30270509 31067635 31972655
6509 31972655 33075151 34366317 36027011 37916683 39997635 42171694 44517638 46937997
6501 46937997 49261486 51607831 54186812 57089729 60427090 64150383 68304311 73000240
6493 73000240 78198969 83985502 90360156 96968174 103195121 108181902 111359650 112417151
6485 112417151 111541699 109039922 105361381 101022918 96243433 91430823 86685661 82298674
6477 82298674 78106443 74159240 70630082 67467570 64652136 62135859 59954142 58291960
6469 58291960 56923685 56020164 55629638 55830849 56624516 58341772 61035129 64562784 68423185
6460 68423185 72037093 74823262 76808916 78180646 79336834 80197317 80406213 79717133 78043787
6451 78043787 75889233 73503372 71129144 68769493 65777284 61830896 56969721 51746370
6443 51746370 46789475 42473731 38766243 35768659 33303602 31327232 29812563 28696508
6435 28696508 27753218 27076606 26688326 26519753 26600020 26916889 27601066 28671863 30180163
6426 30180163 32177167 34658028 37759352 41370322 45046824 48133951 49725167 49451767
6418 49451767 47209504 43584878 39375482 35180190 31251328 27707229 24611749 22024214
6410 22024214 19758939 17859021 16309476 15000495 13913992 12988357 12249004 11578973 10896686
6401 10896686 10215984 9635960 9132754 8714830 8302950 7882053 7531972 7250742 7074174
6392 7074174 6795565 6518623 6331142 6206224 5983308 5866086 5699690 5558679 5534233 5441574
6382 5441574 5223013 5067335 4956598 4855082 4768558 4645122 4601329 4476125 4309433 4313351
6372 4313351 4265939 4227348 4184683 4056052 3886688 3717381 3587302 3548594 3484050 3460336 3395831
6361 3395831 3348420 3330499 3242990 3204276 3084911 3010904 2944324 2939838 2883383 2881983 2912397 2830308
6349 2830308 2801220 2788592 2746690 2676387 2669792 2646662 2661551 2577169 2541845 2484168 2435984 2377776
6337 2377776 2257735 2246225 2234323 2203645 2175821 2134345 2129043 2099033 2020129 1976285 1938444
6326 1938444 1913054 1890547 1915310 1870672 1825909 1888472 1915670 1908550 1893154 1822776 1899603 1912826
6314 1912826 1937813 1968863 2026326 2051602 2048257 2017954 2016411 2013938 2021551 2078978 2060663 1972872
6302 1972872 1947774 1898344 1875377 1801412 1792555 1845550 1766442 1750636 1650888 1646259 1654097 1610333
6290 1610333 1596177 1583582 1582733 1586071 1568764 1475860 1457497 1406720 1441790 1465738 1421291 1373852
6278 1373852 1314220 1329542 1405631 1454408 1427431 1376136 1368457 1312523 1306182 1355604 1330732 1366546
6266 1366546 1318884 1433023 1412949 1443127 1514176 1584727 1620087 1624385 1664972 1681564 1749027
6255 1749027 1796980 1854865 1856616 1797363 1696658 1666879 1664512 1630597 1581251 1528026 1554574 1556351
6243 1556351 1583646 1607446 1589610 1609567 1662257 1697955 1694599 1622707 1651690 1662507 1644181 1629749
6231 1629749 1564273 1538606 1511213 1533343 1561881 1532750 1460954 1394561 1442976 1446366 1412898 1415704
6219 1415704 1366577 1351617 1387230 1437353 1332735 1312644 1375797 1455951 1494756 1485250 1451878
6208 1451878 1509648 1457322 1399801 1437604 1462737 1532077 1531692 1564794 1669270 1751656 1777131 1734736
6196 1734736 1706357 1768272 1857397 1857967 1885049 1911103 1991675 2045379 2157265 2175198 2191095 2155233
6184 2155233 2066350 2047479 2043523 2109969 2060810 2032531 2115713 2140541 2139974 2187954 2256784 2360887
6172 2360887 2437127 2395874 2469582 2519932 2589877 2669754 2687235 2835464 2958659 2985946 3117020
6161 3117020 3269665 3359894 3415720 3476006 3663392 3832764 3903381 4071327 4205891 4314550
6151 4314550 4426632 4655787 4915370 5195957 5596607 6087925 6642542 7394525 8399086
6142 8399086 9800931 11901132 15372608 20890538 27954549 34224077 36138409 33036947
6134 33036947 27372640 22010659 18077026 15223673 13116210 11606924 10404498 9585066
6126 9585066 9094376 8936077 8905788 9087216 9238316 9358291 9484306 9682584 9997900 10393338
6116 10393338 11061699 11988607 13067080 14521313 16339113 18768224 22250398 27373338
6108 27373338 35606388 49200253 69128355 90965367 104044726 100429365 84205613
6101 84205613 65504539 50587275 40121699 32598610 26892640 22565164 19275735 16800721
6093 16800721 15109021 13979133 13258568 12743400 12341020 11953177 11716714 11662798 11811323
6084 11811323 12242537 12918381 13857435 15152539 16684567 18779857 21790218 26056193 32841361
6075 32841361 44142610 61839220 84164481 102563334 105965755 93212052 73841132
6068 73841132 56486081 43841444 35035887 28650189 23742030 19908074 16691459 14236881
6060 14236881 12479228 11107823 10022578 9207586 8431424 7828240 7444110 7122103 7065380
6051 7065380 7175551 7370673 7650122 8038278 8545708 9249993 10392236 12284764 15403339
6042 15403339 20546777 27671396 34669020 37803015 35351373 29282245 23014035 18208010
6034 18208010 14848376 12492733 10770923 9490287 8292429 7116336 6108156 5312804
6026 5312804 4681882 4075730 3653382 3233648 2913505 2659906 2522774 2437868 2448828 2312259
6016 2312259 2201933 2076867 1969411 1871904 1790716 1752624 1727039 1725445 1669612 1656830 1615278
6005 1615278 1627181 1634476 1630283 1642306 1711369 1815291 1871701 1946355 1897440 1797850 1649892
5994 1649892 1460928 1372078 1317393 1200424 1152671 1140439 1057784 992980 896314 853575 861976
5983 861976 917789 841531 775908 748351 716880 713908 702315 656891 693355 646789 659238 640727
5971 640727 606148 551149 559062 572366 562124 567545 623380 596859 606638 639147 549249 540754
5959 540754 515665 482457 464579 487709 459535 400522 376206 326789 327263 358926 332936 297497
5947 297497 307894 337195 345914 304701 261436 316806 323941 327511 288359 368049 373305 350984
5935 350984 288433 320152 388254 407642 305077 282813 324819 225823 242846 277090 274060 265641
5923 265641 274367 267675 180542 134262 78368 19517 89603 95155 171735 158503 91451 104419
5911 104419 70508 107846 59113 78118 107691 71644 146228 133186 88665 148841 142214 146288
5899 146288 216678 207693 185955 176579 241289 248562 241703 232725 241313 295864 274610 196645 225418
5886 225418 242654 267601 250117 207041 162495 180337 177731 237577 235774 158412 88263 114379
5874 114379 111680 107823 114150 171338 191693 206610 160102 151283 172547 170237 195087 232350 210142
5861 210142 188513 276955 332266 372052 435972 566926 686201 732111 691449 632161 564903
5850 564903 499504 393483 285479 249320 224089 175339 190465 193832 195850 178803 179429 155746
5838 155746 162989 176990 169996 144404 165688 156681 188685 160408 141615 142571 198007 282847 369138
5825 369138 453274 622117 773718 793836 777880 670270 568071 528350 467440 358896 289044
5814 289044 256863 205970 206677 175414 124186 139674 90549 153552 226600 154907 191736 247985
5802 247985 300325 393331 382710 319937 268634 222626 198539 229684 287546 331712 422568 404454
5790 404454 406305 360370 324669 264156 232893 228521 202834 224067 269965 310481 271876 257937
5778 257937 247474 267826 272104 279102 280792 322716 370727 507012 633793 772846 813031 818729
5766 818729 735262 617804 538620 441635 370341 392013 457645 428902 391930 428616 578791
5755 578791 639945 735158 875383 1037505 1367402 1830813 2233327 2203537 1877939 1533775
5745 1533775 1221464 1034029 934726 871393 776630 751998 798218 868164 1012880 1120311 1143796
5734 1143796 1069213 971782 935138 895407 848097 853658 895355 931138 944263 999047 1167102
5723 1167102 1387655 1711655 2129809 2871855 4087264 5564125 6591789 6277016 5140863
5714 5140863 3970051 3084788 2466575 1967112 1645016 1436940 1278417 1150561 1094985 1111014
5704 1111014 1159071 1307379 1420057 1306553 1137970 1004827 1008938 977671 978455 1018380 1136521
5693 1136521 1178198 1317939 1418873 1731612 2256670 3068972 4329928 5858852 6740281
5684 6740281 6258219 5103802 3804737 2932399 2311453 1842766 1430520 1133069 1000356
5675 1000356 845552 747445 731289 599892 556282 583805 599452 568592 552970 544008 530927
5664 530927 502148 450500 496340 516024 599683 730516 804694 951697 1316639 1792217 2235931
5653 2235931 2390073 2163916 1721069 1316283 1144005 955966 766585 623538 559070 467147
5643 467147 430155 407793 353511 348155 352816 356696 343796 255452 200107 210543 227401 252099
5631 252099 249394 196350 258683 272151 230171 209457 234454 255110 239132 238461 185921 192280
5619 192280 182515 189756 187836 172728 175802 115321 138453 134862 134774 173509 232194 199748 146229
5606 146229 160900 217148 222795 165954 154870 196973 202112 169404 168411 236471 182031 248486
5594 248486 234441 154248 144830 163447 153998 127127 83746 105918 153511 97278 63407 63706
5582 63706 137364 166000 201956 137496 204409 120533 107340 135683 94248 69103 51664 16332
5570 16332 55735 106722 165609 123186 144968 123378 158731 173411 141836 73850 82761 66687
5558 66687 90555 131732 122162 126851 98828 135977 92378 88249 65624 27019 62975 93755
5546 93755 96721 74014 36714 19712 68417 68952 13537 80924 64412 113137 125358 83650
5534 83650 84500 98300 59780 42753 28119 72426 142089 55858 52771 86817 31954 16539
5522 16539 90896 57853 75075 147895 104773 87194 131205 154438 86896 28331 48777 44665
5510 44665 24212 22122 18704 -13757 37956 75682 68233 -15065 15727 61490 65246 49074 33887
5497 33887 102692 102676 68438 72277 114212 57056 54175 61678 34156 48553 139048 111256 103878
5484 103878 74557 117071 78879 72257 67127 120921 146046 51524 52142 138928 95686 36086
5472 36086 10861 -3034 102164 177945 97934 41433 86010 40248 57742 75545 46264 37158
5460 37158 84016 45779 13543 91254 136695 91950 144673 77430 42870 43339 49286 24742
5448 24742 30163 79607 10664 52878 83608 72507 61593 -28571 52612 157237 188224 185832
5436 185832 136502 93016 47145 67662 54030 71445 76619 71101 85916 38969 103152 131846
5424 131846 125877 97445 23497 31961 60736 95891 47242 10499 719 3848 46095 57391
5412 57391 20387 872 69864 119184 75482 88437 38590 50439 58389 84483 153922 144119
5400 144119 120372 121720 108645 126403 137077 144804 123639 106967 170432 135530 146771 239347
5388 239347 194333 149877 118421 146977 162515 190415 225517 203316 259473 317261 393243 350927
5376 350927 377803 420962 369138 436790 373360 332207 355215 348788 235259 253493 317340 314779
5364 314779 280130 267435 268232 284438 308015 280462 279398 278085 273830 262066 349275 340791 313459
5351 313459 307335 260438 346207 445712 448629 411652 382914 562908 563235 526606 530145 521563 474049
5338 474049 476633 455388 341976 292395 317832 351575 372244 358714 299997 267403 301684 280433
5326 280433 326770 374793 351513 350406 392139 383287 387934 450370 354470 353063 384032 374968 404444
5313 404444 455308 482029 525990 551834 541380 549552 542071 530794 449435 464893 425224 413827
5301 413827 482033 444234 456445 417554 427425 458563 514367 610275 631128 626715 517367 501847
5289 501847 541618 556559 538446 551428 586606 576744 613746 608833 591749 592855 563928 589607
5277 589607 528289 575171 639061 622077 682778 729436 770098 836889 813972 802196 870105 898212
5265 898212 876390 902313 877576 896485 847643 821988 816527 808265 759706 698352 750406 771028
5253 771028 823001 760255 747914 747370 717856 708862 762966 762516 797683 763424 792222 768480 818427
5240 818427 842072 898362 912825 999679 946565 988996 990708 1023350 1045792 978013 944889 883132
5228 883132 917746 892905 956362 897903 824551 776244 820778 701829 654832 689048 677037
5217 677037 609675 570160 608304 653100 672849 564223 579377 579175 584737 630730 607433 642221
5205 642221 571977 473926 513731 570147 616005 698623 673152 684225 645764 578974 590764 587480
5193 587480 526948 555617 538983 456085 491556 485346 424367 386778 327930 341951 355415 368200
5181 368200 378267 390772 398221 352546 333382 434955 432834 391960 380766 318708 299840 257021
5169 257021 286098 320308 301361 272233 379743 326497 324500 351786 343486 399878 368169 354292
5157 354292 312230 334269 272037 201370 244701 284168 270121 254497 269327 280926 276253 297109
5145 297109 241935 265173 315114 304926 308723 333644 288760 286008 291354 305647 302995 322176
5133 322176 377032 288788 270602 246732 276242 305709 289421 206872 238627 268129 302469 329655
5121 329655 314059 326849 314051 216593 235308 280232 319816 298843 312225 345718 353188 309594
5109 309594 326541 396278 346444 370038 299538 276585 285869 317063 364040 344001 323491 289966
5097 289966 286524 360459 386061 311891 331647 350523 322161 364277 383450 397107 427962 432539
5085 432539 392232 360228 399887 455347 410037 391958 409372 426364 457864 462617 390973 370551
5073 370551 417882 503281 505868 438842 505772 520026 457074 524701 526697 537858 571319 610108
5061 610108 631355 727297 790206 792225 793107 744926 681305 666368 670300 642719 683217 663760
5049 663760 688674 665443 612234 598181 632885 702672 729581 713731 690101 751022 765762 808933
5037 808933 837274 853899 912924 872942 892511 886704 830466 890837 933341 1030598 1053811 1117346
5025 1117346 1178693 1161436 1103250 1127096 1228695 1191299 1128282 1032818 1042281 1004292 939488
5014 939488 991927 946829 879438 905202 936346 859690 803742 867048 925908 935670 965782 951525
5002 951525 944846 964651 953826 954178 1009104 982331 969777 955287 1030927 1137797 1120154 1147169
4990 1147169 1176297 1211689 1148660 1089813 1082534 1141642 1105550 1141610 1133994 1163873 1249780 1267961
4978 1267961 1275572 1277277 1237619 1252132 1140335 1139113 1142929 1117610 1134507 1166989 1231526 1253204
4966 1253204 1222347 1185950 1227920 1202787 1153707 1151870 1175992 1143318 1201417 1275244 1406424
4955 1406424 1505871 1689784 1953745 2197217 2301735 2304220 2206818 2163731 2002420 1851195
4945 1851195 1829067 1741351 1686002 1658325 1705712 1658687 1549035 1467899 1452128 1489136 1506635
4934 1506635 1527713 1483552 1446908 1466309 1384576 1394857 1455087 1533516 1618728 1709153 1867929
4923 1867929 2082922 2334714 2597081 2881960 3089766 3122016 3038356 2883094 2694481 2609527
4913 2609527 2460615 2269461 2125059 1973269 1876571 1874637 1760591 1762208 1740454 1696670 1742699
4902 1742699 1713071 1733606 1763853 1701401 1682379 1756311 1808101 1941958 2086257 2244932 2502422
4891 2502422 2847335 3407310 4164556 5040192 5738542 5886485 5480221 4799028 4131852 3539124
4881 3539124 3109343 2739817 2482770 2305355 2173220 2092308 2054776 2058822 2071793 1973454 1967236
4870 1967236 1994012 2055583 2087656 2171585 2345466 2482749 2584851 2682631 2802103 3013882
4860 3013882 3302534 3730958 4422145 5379629 6327158 7145681 7657783 7560459 6936071 6019278
4850 6019278 5119538 4408169 3843335 3463638 3197049 3043295 2940507 2793268 2646639 2499360
4840 2499360 2404960 2332713 2324800 2308670 2259034 2295708 2264225 2210933 2298228 2385242 2535583
4829 2535583 2706878 2833044 3009503 3297233 3680632 4224566 4880202 5419664 5460209 5042661
4819 5042661 4509597 4045877 3670306 3447054 3278594 3136814 2939376 2835778 2710235 2726356
4809 2726356 2722554 2690491 2707979 2698908 2709135 2741521 2781423 2789784 2792966 2867984 2959202 3049799
4797 3049799 3069493 3104979 3255563 3278057 3299388 3357284 3380039 3536439 3638037 3694531 3766893
4786 3766893 3903048 3996975 4076895 4146201 4267717 4350407 4479060 4673847 4719481 4898715
4776 4898715 5056133 5163297 5394508 5632844 5822546 6066074 6393502 6664386 6972912 7352739
4766 7352739 7817466 8371528 8964239 9665239 10427937 11409653 12414651 13234053 13763687
4757 13763687 14105007 14420096 14860134 15487699 16256242 17341254 18716927 20526867 22723418
4748 22723418 25545313 29052965 33085020 37536519 41717172 44861531 46452845 46128821
4740 46128821 44217862 41342700 38054841 34963572 32173953 29843524 28020045 26846190
4732 26846190 26144058 25986824 26251458 26685256 27112085 27421263 27690921 27773465 27832952 28089323
4722 28089323 28753080 30139462 32209524 35047777 38678747 42944737 47115661 50627301
4714 50627301 53093835 54761372 56165954 57700858 59620215 61349358 62274342 62406586
4706 62406586 61935498 61100547 59777588 57952505 55107395 51112561 46495108 41972281
4698 41972281 38008868 34555623 31620443 29046103 26786039 24762823 23020123 21700403
4690 21700403 20663436 19975240 19554521 19372383 19410748 19742727 20446143 21357994 22761026
4681 22761026 24524181 26785136 29635639 32836391 36305736 39354543 41237883 41413238
4673 41413238 39886818 36984692 33288036 29449057 25833339 22641890 19766322 17307708
4665 17307708 15302432 13649025 12271752 11173348 10249149 9371920 8607033 7998236 7505237
4656 7505237 7031519 6660191 6330867 6099301 5848155 5670059 5552878 5421489 5298418 5200663
4646 5200663 5071577 4897598 4823112 4658630 4455585 4238545 4041904 3850823 3686252 3561724
4636 3561724 3414883 3311173 3182593 3070844 3002293 2917893 2881682 2754485 2754975 2714413 2693578
4625 2693578 2734616 2734178 2709063 2655350 2684312 2743764 2780359 2823954 2890948 2950367 2887845 2894138
4613 2894138 2839885 2779035 2709674 2557228 2449748 2410172 2352123 2311168 2195878 2207443 2127893
4602 2127893 2028930 2017562 1963732 1865006 1787969 1837497 1820934 1810341 1843330 1846074 1788174 1818584
4590 1818584 1912120 1842631 1859097 1931245 1918605 1903347 1963954 2028220 1987918 1851346 1815647
4579 1815647 1834533 1764205 1720723 1714377 1629222 1551957 1514083 1489044 1442737 1475584 1460801 1327494
4567 1327494 1295109 1308644 1303685 1279698 1341374 1349273 1332131 1274317 1277325 1311415 1272236 1274877
4555 1274877 1276162 1246649 1211889 1229921 1186106 1130474 1089809 1103604 1145330 1204192 1199577 1182346
4543 1182346 1199012 1227846 1266175 1378853 1372268 1336376 1347823 1350148 1417121 1381913 1336674 1346756
4531 1346756 1387989 1384188 1438979 1450060 1427732 1331770 1368076 1379288 1399428 1405213 1349286 1391896
4519 1391896 1456458 1500424 1515315 1556306 1641727 1585749 1582051 1577075 1639840 1702678 1795533 1793212
4507 1793212 1753197 1758214 1741348 1870433 1963466 2075586 2472539 3041606 3591777 3839740
4497 3839740 3587905 3076524 2626385 2252217 2032508 1848356 1725919 1676848 1627436 1585803
4487 1585803 1519430 1504594 1488112 1411350 1417458 1442500 1464827 1382719 1360007 1366140 1289347 1229796
4475 1229796 1261181 1259817 1298233 1332087 1335854 1406436 1336901 1327532 1313986 1315846 1373315 1357410
4463 1357410 1340340 1379008 1496202 1540122 1496389 1398398 1388283 1341093 1333258 1343674 1374146
4452 1374146 1382474 1351181 1414053 1462310 1458583 1433506 1397189 1369880 1364116 1344180 1346877 1314536
4440 1314536 1373465 1343548 1388538 1379146 1414250 1448020 1453944 1396898 1393905 1335397 1313672 1295746
4428 1295746 1260005 1260704 1227559 1220928 1278687 1287522 1334475 1312067 1294223 1395843 1408207 1432947
4416 1432947 1447977 1484920 1516494 1509702 1579881 1607101 1674257 1812244 1842751 1926094 1904614
4405 1904614 1900845 1856117 1760063 1737584 1675024 1695894 1694421 1703354 1751613 1746967 1793355 1981761
4393 1981761 2115294 2269204 2545552 2758562 2853335 2804139 2581106 2333894 2065671 1848019
4383 1848019 1709324 1607971 1529266 1532234 1543396 1513380 1569967 1619785 1656566 1632110 1626762
4372 1626762 1718975 1713145 1683076 1637820 1622143 1698397 1734280 1773652 1878865 1920890 1952009
4361 1952009 2059508 2271490 2528188 2740699 2926127 2924497 2754815 2506105 2252548 2099563
4351 2099563 2020396 1909824 1842570 1802504 1774423 1767963 1796741 1771369 1813731 1837922 1829729 1885117
4339 1885117 1845892 1804927 1845037 1952345 2033043 2089907 2196552 2236888 2230732 2311112 2293457
4328 2293457 2379620 2395065 2364688 2396935 2337678 2366732 2373385 2331319 2266645 2247199 2242422 2225313
4316 2225313 2275458 2331265 2370136 2412287 2468744 2500878 2558357 2629774 2732348 2829413 2874894
4305 2874894 2971098 3006456 3073852 3160723 3105123 3170239 3267077 3348068 3416536 3450089 3450848 3466447
4293 3466447 3588573 3692729 3715028 3741041 3854548 3940910 3999978 3995713 3954210 3967475 3999028
4282 3999028 4102158 4200000 4239696 4178188 4174625 4217285 4254384 4317203 4395858 4487491 4531454
4271 4531454 4626222 4767638 4882684 5014405 5091200 5174463 5305766 5459114 5564863 5587327
4261 5587327 5778005 5930472 6292234 6688922 7007227 7338174 7551905 7696814 7844610 7801135
4251 7801135 7871868 7907546 7930575 8054740 8064241 8067195 8188952 8396329 8755375 9189008 9566761
4240 9566761 9984368 10513152 11100152 11717159 12389187 13066914 13779943 14562756 15433541 16336820
4230 16336820 17257929 18253594 19522406 21172608 22995159 24872050 26474225 27983946
4222 27983946 29536704 31067534 32439482 34169554 36662045 40081227 44399614 49907682
4214 49907682 57213221 67712089 83482464 109026394 154365432 232122247 339388742
4207 339388742 433133865 448496931 381614362 288776420 212058719 159436317 122250786
4200 122250786 94136471 72595312 56886599 45488126 37771909 32695529 29100014
4193 29100014 26224098 24007852 22086637 20078856 17878100 16038749 14853146 14218974
4185 14218974 13731290 13257197 12604089 11966250 11442666 11033335 10735567 10519191 10460244 10353280
4175 10353280 10044016 9859441 9739638 9669057 9446708 9207914 9013092 8991637 8872198 8708714
4165 8708714 8558682 8392079 8218356 8138874 7956132 7706806 7533497 7406402 7343934 7398823
4155 7398823 7527386 7625958 7717212 7851658 8040504 8078411 8005766 8037967 8070873 8051753 8106156
4144 8106156 8074121 8147938 8199203 8315838 8384507 8490074 8639648 8813100 9046966 9205710
4134 9205710 9356479 9679946 9974201 10310010 10695872 11128031 11503094 11939134 12463146 12989916
4124 12989916 13524173 14157094 14887210 15793491 16813696 17892259 19068980 20232683 21315122
4115 21315122 22379665 23614456 25001162 26485832 28284579 30717347 33859586 37833101
4107 37833101 43077606 50229534 60626716 76662463 102523948 141696330 191511661
4100 191511661 236230798 253671212 235719157 195984444 154239170 120549926 95742619
4093 95742619 77234370 63251877 52863359 45348569 40190397 36989514 35120066 34032557
4085 34032557 33308886 32730912 32102421 31731096 31998813 33050507 35110887 38056779 41936342
4076 41936342 47174708 54450679 65391559 82998914 111068255 151976779 199996665
4069 199996665 237541305 245812499 222424198 182287011 142408367 110560564 86880208
4062 86880208 68933376 55320160 44848581 36873277 30981177 26500530 23156825 20660886
4054 20660886 18661151 16953829 15329815 13814937 12460637 11508349 10925211 10471145 10079068
4045 10079068 9611852 9061834 8654723 8288135 7936386 7581294 7282641 7121381 6966924
4036 6966924 6881384 6664534 6397301 6143558 6008061 5781466 5677726 5507197 5208507 4887571
4026 4887571 4606961 4419731 4233089 4079889 3870747 3703518 3548487 3475458 3441488 3444189
4016 3444189 3397834 3338787 3237867 3137208 3107406 3022698 2933929 2877228 2741112 2660304 2584529
4005 2584529 2494535 2436905 2408137 2410910 2396314 2361121 2313070 2343553 2279231 2268265 2197299 2170334
3993 2170334 2131004 2147146 2221785 2225228 2141438 2038183 2014548 1992154 1941959 1864634 1781269
3982 1781269 1690200 1636633 1621008 1617539 1606463 1497583 1447190 1415369 1318306 1316481 1311063 1269384
3970 1269384 1313985 1291311 1320149 1305993 1300329 1284796 1317192 1408913 1442657 1374599 1379409 1364897
3958 1364897 1325010 1283512 1257172 1201074 1182517 1212592 1116186 1012723 996941 994682 951997
3947 951997 969911 1007114 946121 932424 918691 834416 819525 800189 872303 924633 918269 882625
3935 882625 927784 897420 917110 939317 988147 1011601 1054764 1118521 1135089 1112494 1123256 1088785
3923 1088785 1063216 1079895 1080949 990221 905823 945846 1081105 1158549 1378543 1800741 2357016
3912 2357016 2877367 2927847 2532406 2087747 1701871 1463165 1321131 1208280 1100719 976762
3902 976762 906095 807532 752739 725657 742637 695820 720237 725740 721815 716175 680140 665066
3890 665066 661244 607332 527732 512117 458449 470092 496461 504623 523865 464631 479044 482112
3878 482112 503655 515925 532577 419459 423191 385188 406653 489027 492726 435379 421157 410389
3866 410389 407019 393776 433930 459197 480702 500131 461642 464046 512928 567393 462309 491643
3854 491643 473965 458643 446962 447486 495016 462046 418024 428768 421510 410680 367615 306117
3842 306117 306115 364742 436751 411870 317139 327728 383849 404830 397239 371621 345284 353145 422703
3829 422703 436014 493145 482994 522655 531184 446136 438980 427670 443396 511825 618294 694083
3817 694083 711712 770949 779193 817464 929103 1139819 1338452 1506952 1701940 1887249 1991355
3806 1991355 1935242 1782040 1545366 1360774 1144526 979246 911547 885586 891255 879227 832310
3795 832310 849812 751703 737700 745034 716356 802541 762697 818439 878568 851412 905485 946970
3783 946970 1070920 1272338 1558331 1947137 2465464 2888448 3052142 2840463 2462801 2063741
3773 2063741 1763940 1500224 1336012 1240724 1160828 1094583 1048613 969689 977932 929592 997087
3762 997087 981270 940244 921048 877747 859401 918085 999694 982526 882519 911993 927091
3751 927091 1023247 1108464 1232808 1354830 1471163 1547911 1515643 1495781 1446116 1325230 1262667
3740 1262667 1179549 1139305 1199941 1171408 1136552 1092640 1143444 1202289 1259238 1280786 1311579
3729 1311579 1307065 1327066 1271220 1318327 1419849 1468407 1411044 1375768 1376974 1362558 1353857 1354225
3717 1354225 1418116 1490836 1491210 1489346 1474269 1531933 1584603 1669451 1662646 1757784 1725027 1687446
3705 1687446 1767514 1735072 1783712 1822732 1727997 1688813 1746784 1771616 1775227 1722889 1718410 1819348
3693 1819348 1809066 1767873 1713421 1694257 1687852 1751066 1714010 1692004 1678104 1697949 1710437 1750672
3681 1750672 1817023 1839480 1848716 1821203 1854505 1935849 1950891 2012096 1965607 1926261 1806002
3670 1806002 1748183 1625497 1574348 1528672 1526529 1518272 1512795 1553340 1582378 1562252 1570908 1538935
3658 1538935 1530309 1549347 1567389 1558830 1569057 1568552 1598626 1633470 1583326 1568882 1545859 1592784
3646 1592784 1589821 1544388 1554344 1545421 1504097 1512284 1514687 1497745 1471140 1388018 1345243 1394432
3634 1394432 1412457 1425090 1426621 1447825 1470227 1503884 1555005 1563096 1667875 1668178 1572936 1647448
3622 1647448 1735412 1773787 1703702 1611011 1597286 1682142 1666935 1654802 1743238 1751891 1723329 1752290
3610 1752290 1745645 1829659 1891080 1852037 1843600 1904851 1914178 1921076 1932448 1976153 2076233 2127948
3598 2127948 2165791 2256070 2237908 2318175 2405188 2490498 2507250 2584374 2619059 2634704 2733600
3587 2733600 2735812 2731132 2826135 2835771 2823452 2883058 3015036 3147282 3167637 3107628 3244450
3576 3244450 3303913 3440445 3525887 3631802 3643831 3711327 3798032 3918100 4049238 4116260 4210813
3565 4210813 4405623 4492076 4611372 4745436 4874770 4995889 5134004 5310606 5594719 5760372
3555 5760372 6010239 6179235 6423338 6679369 6913747 7112030 7419300 7738406 8075427 8438686
3545 8438686 8902934 9459792 10141181 10670498 11222725 11643526 12128376 12619312 13377609 14318679
3535 14318679 15583171 16985593 18547667 20262394 22751267 26282200 31859240 41028412
3527 41028412 57255545 82401113 111127087 125076671 113447631 90368235 69606725
3520 69606725 55368304 45604456 38431386 33054442 29310524 26802344 25341131 24701352
3512 24701352 24561280 24673754 24819090 24884510 24934197 25103226 25511734 26228711 27442576 29124470
3502 29124470 31322563 33619718 36255145 39855869 45263946 53691472 67581705 92451496
3494 92451496 135263908 193182769 238706653 232695741 189221037 142136397 106965898
3487 106965898 83489060 65973607 52518605 42360231 35203653 30042912 26859900
3480 26859900 24388178 22501105 20927904 19714019 18490857 17592808 16928431 16730245 16969517
3471 16969517 17675796 18597302 19660243 20804344 22319970 24783057 28640940 34823242
3463 34823242 45564331 64333625 92115862 120268890 128328646 111007528 85501375
3456 85501375 63963539 49235066 38682222 30812682 24652998 20188211 16863051 14610494
3448 14610494 12892505 11511297 10280544 9272675 8359224 7667739 6985523 6621148 6357876
3439 6357876 6299638 6251310 6166008 5995581 5980027 6002279 6161544 6407846 7046603 8213669
3429 8213669 9755716 10654676 10227657 9130057 8149557 7609820 7324570 6935577 6264533
3420 6264533 5509888 4801625 4317432 4021017 3754633 3592711 3420634 3247267 3057916 2843804
3410 2843804 2750838 2726913 2722807 2698597 2668082 2630721 2529470 2443233 2479922 2522456 2493498
3399 2493498 2500344 2513591 2590998 2726921 2946033 3274974 3834424 4691432 5756054 6426301
3389 6426301 6184492 5397897 4497025 3767521 3271690 2838339 2536553 2305678 2054853 1881629
3379 1881629 1725868 1652608 1626671 1636728 1581449 1473924 1392128 1342376 1355003 1390463 1464985
3368 1464985 1472090 1474312 1497943 1510771 1733184 1980479 2339058 2810956 3397717 3882911 4109315
3357 4109315 3904869 3386655 2801675 2392495 2065776 1762554 1535149 1424775 1308621 1184154
3347 1184154 1029997 956714 945377 907920 828897 715346 661108 719299 659480 689031 653753
3336 653753 643115 651755 610054 658164 718155 838109 981724 1014794 1063644 1095532 1020807
3325 1020807 873310 805075 752101 696219 684501 631994 547692 553774 452551 438283 385802
3314 385802 404292 372424 349251 350732 296455 182350 70628 107719 90905 78163 138010
3303 138010 124991 164271 226370 207325 136828 121217 152761 151759 79044 28971 85179 44060
3291 44060 48869 128140 157133 159970 146252 170505 180305 200289 239439 234940 178556 114058 49894
3278 49894 60528 56585 2146 16910 -6735 16435 54158 111326 12303 38618 97485 125414
3266 125414 140044 106333 65645 -29606 -24426 80468 109398 114724 138996 209910 225045 187947
3254 187947 204863 217892 259299 312502 292923 310460 270980 258025 243885 226063 221750 244520
3242 244520 284107 218039 268002 312514 359755 501465 720888 808946 783206 663210 527636
3231 527636 454041 433358 411303 344926 476172 449101 458342 469240 386792 424164 483523 470880
3219 470880 488748 499683 461489 481931 542761 534838 483897 502173 597244 646626 669319 776987
3207 776987 885866 1020010 1230616 1559546 1894435 1982711 1880566 1732562 1514391 1425379
3197 1425379 1501055 1478299 1460671 1429873 1465430 1447061 1427532 1498591 1511811 1428104 1338811
3186 1338811 1400336 1362644 1310779 1304345 1292514 1323373 1372892 1364675 1448571 1519156 1573208 1648071
3174 1648071 1740385 1879710 2145576 2434552 2777282 3052230 3164465 3228968 3163592 3011938
3164 3011938 2729089 2466170 2230775 2005411 1869561 1747816 1589292 1529863 1415191 1352371
3154 1352371 1308440 1234444 1224397 1314461 1297588 1219362 1219085 1304757 1328170 1318893 1281094 1316841
3142 1316841 1368973 1396866 1403635 1444848 1509914 1594326 1526099 1446470 1394724 1343165 1196740
3131 1196740 1061358 1003746 965354 930213 816307 796043 746431 683791 718036 706042 725658
3120 725658 762423 712436 745219 642831 560633 522609 469698 442401 420252 365930 361084 296668
3108 296668 322105 284571 286492 227665 182881 224569 250414 272476 260606 180125 84423 175972
3096 175972 189589 130340 116799 69765 36721 90323 16536 -20440 60797 49751 66727 63521
3084 63521 26031 -22077 -15042 -45933 -47214 -16782 -27523 -73248 -67021 -38767 -8191 -29083
3072 -29083 -47783 -50403 -118747 -75828 -27376 -33999 -31990 -40506 -83489 -168830 -171429 -169682 -135339
3059 -135339 -153955 -169230 -113811 -112290 -112787 -30657 -82296 -193717 -166947 -124329 -157536 -144561
3047 -144561 -93218 -90425 -73146 -56608 -129571 -106972 -108869 -170692 -170635 -202774 -180464 -196030 -205473
3034 -205473 -220067 -161230 -200001 -204709 -155210 -143850 -121676 -203845 -233067 -178513 -99977 -120067
3022 -120067 -149349 -202774 -257905 -248719 -196635 -164459 -134125 -198557 -241241 -160574 -178432 -146587
3010 -146587 -209972 -264482 -226238 -285270 -302953 -233802 -184875 -185140 -187774 -185060 -205665 -172071
2998 -172071 -232246 -199752 -148821 -123202 -145806 -251220 -338480 -322863 -223435 -219569 -251833 -233949
2986 -233949 -195484 -207336 -212423 -241234 -225131 -264329 -311040 -352767 -283320 -274544 -228408 -194536
2974 -194536 -222995 -282488 -297373 -211354 -211444 -213699 -264255 -295043 -313204 -293161 -267411 -278260
2962 -278260 -275686 -302747 -319307 -282371 -334912 -270416 -284872 -302505 -295800 -307010 -241446 -264699
2950 -264699 -280090 -249463 -228696 -197403 -272842 -283587 -293506 -277574 -282306 -334242 -335847 -354114
2938 -354114 -322498 -274035 -243457 -242308 -284708 -234758 -207589 -214955 -269802 -324297 -295021 -217146
2926 -217146 -220571 -226378 -208041 -232662 -290825 -311791 -327633 -312875 -304655 -317305 -285236 -307439
2914 -307439 -281856 -255588 -248966 -195601 -193285 -245581 -245405 -330952 -348761 -244540 -278029 -329826
2902 -329826 -321387 -341895 -336446 -325645 -334159 -387550 -376681 -337685 -373824 -355078 -234491 -284618
2890 -284618 -316129 -244114 -261824 -265173 -262846 -273898 -224806 -215483 -199445 -200160 -253823 -306889 -331016
2877 -331016 -298973 -198348 -185468 -183848 -196237 -242179 -280810 -282084 -270657 -277892 -272519 -268460
2865 -268460 -264536 -263325 -344042 -383078 -382087 -374683 -339428 -308756 -313233 -333545 -292242 -292440 -290535
2852 -290535 -239118 -181215 -203547 -238854 -283784 -318364 -334853 -290521 -262676 -268916 -261412 -246000
2840 -246000 -285203 -305758 -331217 -303822 -297706 -324137 -314044 -311038 -323606 -380610 -368098 -353407
2828 -353407 -317532 -299598 -285895 -310667 -290170 -294762 -309620 -231891 -239007 -203615 -201872 -255811
2816 -255811 -258661 -287258 -305096 -295476 -360484 -338230 -287344 -307200 -268232 -233631 -246309 -228237
2804 -228237 -244444 -313190 -283097 -226207 -262448 -245104 -261348 -322424 -260395 -275448 -235576 -231647
2792 -231647 -241867 -272622 -290896 -271907 -296145 -318244 -312686 -308791 -264731 -207406 -213220 -203359
2780 -203359 -241770 -228212 -310883 -354784 -251450 -310213 -329520 -287028 -269877 -266509 -272001 -269990
2768 -269990 -211223 -224795 -254223 -303508 -286863 -279018 -290363 -285156 -235425 -251845 -314481 -269107
2756 -269107 -295368 -299397 -235882 -263550 -223221 -133170 -155898 -146896 -221495 -209423 -166577 -252680
2744 -252680 -295309 -259230 -190249 -231254 -280615 -282145 -281212 -342301 -340158 -284939 -240204 -249775 -216152
2731 -216152 -228496 -241920 -238409 -261628 -264578 -251142 -253000 -230046 -217315 -215369 -260790 -234798
2719 -234798 -179517 -257588 -202026 -156338 -193846 -262910 -204663 -197655 -246125 -333179 -312330 -337820
2707 -337820 -289204 -264770 -242023 -216990 -211433 -218835 -207066 -258782 -267405 -304007 -296862 -224612
2695 -224612 -190372 -241617 -276824 -239041 -187268 -215010 -183459 -179662 -214342 -254016 -257276 -278244
2683 -278244 -230329 -185049 -169402 -192225 -278917 -202018 -174417 -277700 -255160 -196227 -262777
2672 -262777 -211099 -201920 -191726 -222946 -218041 -223900 -191673 -186675 -267238 -260105 -254952 -287366 -232837
2659 -232837 -241029 -229098 -164380 -218897 -228290 -189391 -264602 -317286 -232549 -206429 -208019 -189877
2647 -189877 -202203 -203620 -241536 -196198 -159874 -104211 24035 245 -20684 35042 151317
2636 151317 257808 368264 371460 295828 269353 104513 23935 13486 -18786 -92391 -114342
2625 -114342 -70413 -132315 -177786 -179666 -191431 -150167 -111113 -126394 -156409 -77194 -52650 -146212
2613 -146212 -270581 -227155 -166508 -209564 -181338 -154325 -199187 -151436 -180941 -137869 -127029
2602 -127029 -132092 -158492 -197496 -228630 -189218 -146532 -220717 -238583 -179573 -188851 -182512 -194679
2590 -194679 -152812 -104221 -149537 -203175 -232459 -220923 -228174 -196050 -231995 -249204 -237994 -164402
2578 -164402 -98306 -188251 -223206 -279703 -254525 -219476 -216651 -166044 -151260 -165830 -128758 -151497
2566 -151497 -221327 -132213 -94796 -82050 -119220 -122478 -114922 -77341 -102729 -125076 -81112 -44938
2554 -44938 13857 -49480 -90257 -97449 -137893 -94004 -73646 -65225 -73373 -64545 -119568 -141736 -161874
2541 -161874 -171723 -184654 -151370 -48613 24610 -119696 -181391 -117838 -70885 -104542 -66860
2530 -66860 -130686 -138795 -75674 -105526 -92590 -145323 -127749 -114281 -56071 -50592 -97152 -31469
2518 -31469 -36006 -126444 -121340 -83332 -100248 -77021 -90166 -134907 -28832 -31138 -77078 -92005
2506 -92005 -116095 -130593 -70316 32498 53164 20745 9786 49543 39552 68399 39662 28747
2494 28747 51775 -3871 31436 42296 19148 -27919 -20199 -25867 -25548 55120 69522 7299 51714
2481 51714 42977 31584 43097 -3685 55666 156066 154145 146760 148653 177008 152829 159290 191705
2468 191705 205508 229195 198461 159781 183390 211635 261389 291422 234085 273009 281278 235501
2456 235501 246643 273737 350341 377407 331060 294710 392915 415522 379823 368614 339315 357424
2444 357424 365790 349005 475264 466568 426996 426954 468773 525060 568034 636206 579209 636035
2432 636035 644431 664903 654897 709009 768510 772143 770752 799585 784868 801592 880521 956972
2420 956972 992108 1034369 1165121 1176911 1225934 1264510 1320251 1346920 1358266 1417587 1470916
2409 1470916 1486499 1457899 1495176 1548386 1699046 1755235 1932065 2068276 2248354 2284365 2399522
2398 2399522 2561677 2790048 3029512 3216643 3420985 3729204 3901303 4168076 4521811 4981160
2388 4981160 5658682 6301038 6868702 7750230 8785309 9623876 9637730 9580420 9726501 10306337
2378 10306337 11146296 12295945 13942091 16527994 19942055 25258689 33446353 49072076
2370 49072076 75239720 108441858 125511602 110435119 83050544 59749389 45009257
2363 45009257 34894839 26968528 20528869 15837263 12353825 10060420 8748538 7967286
2355 7967286 7681245 7715710 7492652 6564607 5315369 4317380 3718367 3342684 3110124 2832647
2345 2832647 2596798 2343827 2171834 2047986 1953607 1851388 1823555 1762575 1670720 1599449
2335 1599449 1539868 1492640 1419147 1346121 1249084 1245601 1172296 1071071 1027723 970292 938844
2324 938844 844633 775764 705430 666862 617267 560161 547984 591427 613219 646659 605432 601468
2312 601468 533624 540116 495937 406065 412608 416297 325776 288706 307050 197255 124358 187793
2300 187793 185407 263546 256839 207931 113709 147978 127537 163559 187071 173303 118646 93451
2288 93451 117052 158318 108122 124893 75899 92661 119912 120401 68429 56831 80843 50498
2276 50498 70869 26528 -10613 -45464 31416 64460 -8876 -47215 -81994 -88640 -49856 -12032
2264 -12032 13791 -21275 -89556 -55117 -95541 -66810 -64666 -69364 -38394 -34178 -52222 -110016
2252 -110016 -77455 -70375 -153635 -136982 -127853 -143437 -183373 -207835 -218440 -254232 -207124 -210535
2240 -210535 -200109 -156191 -177032 -142395 -131349 -160125 -165465 -180942 -111621 -164969 -229257 -250671
2228 -250671 -209848 -142661 -166016 -211892 -200226 -193305 -220165 -205314 -189742 -222130 -251512 -234958
2216 -234958 -177096 -188711 -178982 -171978 -237205 -282983 -239972 -220258 -173529 -198026 -238852 -181842
2204 -181842 -235689 -284401 -280446 -276830 -231859 -287655 -333589 -226939 -283381 -273941 -240028 -225299
2192 -225299 -259682 -193461 -229140 -273499 -231861 -259428 -250323 -295966 -247185 -323526 -313823 -258657
2180 -258657 -243531 -305064 -272996 -238804 -252331 -211223 -246934 -254365 -273429 -257907 -236566 -274907
2168 -274907 -288523 -318784 -340266 -335164 -271267 -291134 -298630 -290871 -282325 -259190 -252421 -322944 -280966
2155 -280966 -230498 -223695 -200719 -265433 -253486 -221288 -223194 -196064 -288943 -339930 -246782 -297013
2143 -297013 -347828 -287817 -295309 -327528 -301315 -338933 -295368 -242607 -315487 -327781 -322088 -271189
2131 -271189 -228844 -255198 -217949 -167971 -158105 -188687 -166789 -190552 -220264 -219703 -281981 -249264
2119 -249264 -336829 -365813 -283274 -178675 -226568 -224387 -211461 -199494 -179595 -218692 -263598 -247978
2107 -247978 -197708 -187264 -135363 -149542 -92170 -42818 66710 233304 244006 211096 137426
2096 137426 100463 49458 -49895 -182833 -205874 -195689 -141563 -191090 -189940 -176078 -176387 -227079
2084 -227079 -267356 -350672 -311431 -243374 -327443 -369402 -296830 -238725 -260026 -242287 -256476 -240716
2072 -240716 -259684 -206410 -187005 -164356 -238909 -282558 -329598 -303038 -340510 -373501 -336976 -257466
2060 -257466 -263810 -271696 -268232 -272077 -276484 -241288 -225024 -206998 -263666 -273521 -299539 -287305 -268394
2047 -268394 -262480 -371344 -318826 -337372 -299667 -272403 -329038 -251464 -225519 -289803 -251362 -249820
2035 -249820 -275733 -256471 -254825 -278917 -323870 -292616 -271803 -277494 -304610 -316991 -353809 -270302
2023 -270302 -279959 -264362 -186031 -148779 -173736 -251309 -245818 -268749 -268327 -220763 -239517 -255444
2011 -255444 -293537 -297841 -252846 -280836 -252816 -319408 -308340 -316836 -353965 -253394 -269013 -281618
1999 -281618 -250149 -248566 -275621 -299736 -335115 -342924 -256052 -298751 -353225 -346125 -339920 -271778
1987 -271778 -314651 -320207 -266084 -265289 -298747 -287083 -242297 -165167 -233743 -273151 -304599 -299293
1975 -299293 -212137 -264531 -331779 -256833 -244039 -329163 -312166 -258411 -291838 -252924 -223522 -232503
1963 -232503 -201964 -219558 -249449 -242012 -248815 -272289 -323825 -261767 -299573 -349688 -278677 -224317
1951 -224317 -262608 -270270 -343888 -329110 -250567 -269623 -325693 -274499 -248391 -239253 -264554 -286581
1939 -286581 -317473 -339264 -344136 -291963 -214940 -261693 -266604 -224271 -234688 -286183 -220627 -241513
1927 -241513 -252882 -219054 -246714 -248182 -217574 -193089 -226602 -257792 -285831 -254325 -250889 -254966
1915 -254966 -270276 -291565 -257954 -253264 -226413 -195806 -287835 -295825 -213282 -191942 -222110 -196693
1903 -196693 -202820 -229986 -270925 -305101 -315433 -322316 -261591 -342581 -339273 -344105 -342349 -266889 -239272
1890 -239272 -331223 -357138 -281539 -292108 -329290 -252903 -238733 -358732 -345401 -347717 -309003 -250635
1878 -250635 -316632 -343152 -273684 -282072 -328999 -371474 -305612 -254273 -286223 -288193 -293136 -261871
1866 -261871 -255851 -258756 -233544 -208786 -288395 -282909 -262079 -321850 -329647 -323099 -331026 -267868 -235997
1853 -235997 -292558 -276791 -260292 -296215 -269904 -335295 -280628 -317557 -308123 -244405 -249129 -279733
1841 -279733 -240808 -261673 -314080 -279204 -218376 -163312 -197406 -229801 -229546 -181084 -190757 -201574
1829 -201574 -221626 -262308 -249526 -255859 -249476 -286661 -281881 -248352 -164072 -200453 -318954 -301132
1817 -301132 -271009 -299547 -285819 -267784 -230347 -223649 -277814 -241667 -211635 -225982 -196912 -178978
1805 -178978 -253491 -229199 -262968 -301960 -244990 -257366 -184804 -196008 -281165 -297109 -275092 -183627
1793 -183627 -187292 -204326 -220396 -278375 -300585 -312218 -358006 -313236 -216539 -181790 -207431 -257392
1781 -257392 -216308 -220206 -180075 -210442 -273820 -257023 -276097 -226991 -289614 -265587 -264626 -280624
1769 -280624 -256537 -204076 -224266 -189600 -220311 -275880 -327684 -315093 -291096 -261229 -142439
1758 -142439 -186792 -282977 -286417 -261787 -168133 -207506 -285209 -157096 -182007 -241693 -238785 -317523
1746 -317523 -301880 -210231 -270764 -224182 -171208 -214881 -243198 -275350 -282350 -274959 -278776 -313696
1734 -313696 -277533 -261884 -251051 -199643 -241344 -319506 -307951 -262373 -256686 -314963 -316956 -251366
1722 -251366 -280881 -272152 -261142 -256714 -279920 -251392 -201553 -249103 -245024 -293485 -371483 -320473
1710 -320473 -295849 -235215 -229288 -273699 -247354 -252271 -306216 -320842 -258089 -234608 -259037 -332741
1698 -332741 -250040 -189732 -188161 -221370 -270782 -281870 -293167 -238711 -167101 -218134 -274970 -279692
1686 -279692 -237556 -227066 -208545 -284299 -259258 -260658 -251091 -191864 -261410 -227162 -214603 -234060
1674 -234060 -266388 -224368 -238391 -284768 -310860 -276238 -219369 -229412 -230669 -241945 -221422 -167783
1662 -167783 -160831 -187327 -253977 -268828 -238111 -208139 -145899 -157982 -235463 -259874 -217983 -160136
1650 -160136 -253636 -308470 -360263 -335341 -279022 -303539 -337985 -342772 -309458 -213848 -218184 -263019
1638 -263019 -231832 -253350 -285531 -242505 -280606 -294535 -203361 -173424 -180433 -180362 -190725 -232147
1626 -232147 -250005 -245200 -290197 -263020 -258833 -293259 -286607 -314974 -309119 -316304 -310088 -345345 -294721
1613 -294721 -235466 -219022 -271885 -286105 -280287 -231816 -221075 -201780 -149446 -180558 -214295 -170563
1601 -170563 -195668 -258402 -251790 -234003 -242941 -243821 -220569 -282026 -314813 -288847 -253610 -225840
1589 -225840 -267540 -266797 -305069 -324357 -276894 -255757 -216753 -261896 -282629 -294985 -313432 -287487
1577 -287487 -279269 -268321 -214118 -259139 -187007 -222047 -235368 -268520 -272344 -283836 -315534 -267566
1565 -267566 -293663 -297238 -282253 -256753 -233845 -242658 -272060 -247498 -260204 -261433 -257210 -298985
1553 -298985 -278465 -295285 -210186 -161220 -257094 -247198 -208657 -158241 -224412 -278781 -275922 -253250
1541 -253250 -180491 -185747 -235157 -197794 -180950 -199118 -238909 -261637 -228888 -244171 -226993 -249992
1529 -249992 -271631 -246131 -284585 -258947 -282901 -254588 -220362 -247783 -217960 -275467 -347813 -323367
1517 -323367 -265809 -236714 -236791 -241106 -228293 -164325 -170340 -174516 -181160 -178812 -244225 -342927 -250444
1504 -250444 -221120 -285296 -267301 -276826 -320183 -282631 -189696 -203731 -256981 -253043 -289798 -284790
1492 -284790 -264077 -290072 -260438 -231389 -203371 -226080 -222955 -249849 -284532 -289145 -248132 -225808
1480 -225808 -244211 -269704 -214554 -182139 -154671 -147933 -186679 -198655 -198352 -196760 -206859 -232411
1468 -232411 -249620 -269046 -256665 -233630 -245901 -173226 -216161 -199056 -179622 -139369 -130593 -143128
1456 -143128 -202752 -249383 -237037 -208643 -209552 -184884 -242446 -298899 -284789 -256928 -233712 -275096
1444 -275096 -268666 -322773 -290445 -195325 -213606 -285766 -246105 -311328 -321392 -242727 -187877 -230068
1432 -230068 -257566 -242232 -245429 -256106 -255795 -260890 -266326 -196945 -201834 -220187 -317219 -271098 -223253
1419 -223253 -229695 -250891 -277284 -270401 -249783 -191258 -229725 -213896 -209968 -198421 -220304 -212410
1407 -212410 -263788 -311382 -266594 -210157 -238451 -257651 -237216 -274794 -255084 -254919 -241496 -218711
1395 -218711 -196329 -174203 -176744 -246914 -287241 -299875 -313103 -279114 -260963 -287108 -231381 -200658
1383 -200658 -162199 -236905 -255158 -247686 -298964 -254211 -230445 -187066 -178217 -223645 -228806 -241870
1371 -241870 -236582 -216493 -230317 -266325 -242008 -217312 -188557 -176850 -213879 -199981 -202595 -185845
1359 -185845 -208144 -221431 -197783 -298372 -305378 -291942 -300187 -233236 -255260 -295396 -259470 -201760
1347 -201760 -237100 -313756 -289505 -246553 -286216 -288826 -341657 -270904 -249672 -235157 -252371 -268551
1335 -268551 -251929 -246462 -224823 -243703 -210541 -209200 -273014 -250589 -121160 -126928 -212412 -248638
1323 -248638 -242221 -275352 -279015 -257830 -293192 -329263 -271260 -290568 -262663 -211986 -167155 -231431
1311 -231431 -268702 -207541 -265004 -282047 -268217 -228672 -178060 -195698 -179114 -243623 -200054 -186714
1299 -186714 -224390 -233644 -246061 -190249 -212084 -249456 -358516 -293173 -193863 -204302 -234470 -244688
1287 -244688 -271098 -295016 -265879 -215435 -187495 -162371 -164484 -167407 -137970 -168485 -210310 -195272
1275 -195272 -213055 -232734 -238293 -260001 -227651 -236257 -263140 -252082 -262809 -258121 -245811 -251242
1263 -251242 -284304 -269071 -267273 -243037 -233246 -155502 -196501 -258013 -249391 -272062 -233345 -210294
1251 -210294 -247871 -242056 -203461 -243577 -299516 -365942 -319061 -231127 -208200 -195257 -200598 -276385
1239 -276385 -248895 -211737 -322950 -319334 -302790 -258762 -250821 -272929 -277143 -231131 -194690 -180465
1227 -180465 -181934 -236933 -217598 -231972 -219167 -241600 -201194 -236085 -253435 -204617 -221271 -282092
1215 -282092 -281080 -229246 -247762 -283506 -296652 -274355 -235503 -224899 -213204 -228368 -236543 -251013
1203 -251013 -291816 -250493 -265216 -349305 -307932 -275316 -202130 -224183 -234928 -215746 -245764 -239631
1191 -239631 -284551 -229016 -215754 -236072 -208538 -205880 -234123 -268587 -310275 -308448 -331297 -241500
1179 -241500 -185559 -218817 -259715 -246200 -216685 -311205 -256685 -256833 -240883 -303756 -263520 -179405
1167 -179405 -209705 -208012 -196165 -214076 -271566 -296356 -245474 -210551 -232348 -201466 -230682 -228173
1155 -228173 -273273 -303490 -319241 -241593 -276254 -291028 -223474 -185874 -219708 -196637 -166096 -193918
1143 -193918 -207484 -185516 -157796 -174828 -222027 -266834 -205507 -221447 -275703 -241630 -204394 -171122
1131 -171122 -187032 -209456 -243487 -178270 -139241 -201612 -150768 -233181 -217219 -167180 -222410 -284224
1119 -284224 -294466 -247919 -174043 -242403 -288071 -260452 -283507 -225811 -231341 -217238 -206590 -256733
1107 -256733 -283918 -263220 -244557 -256838 -217319 -226828 -256949 -258986 -260636 -194598 -151345 -204115
1095 -204115 -196677 -180328 -147540 -124194 -146678 -210255 -218580 -219342 -214129 -219354 -242790 -257944 -251491
1082 -251491 -215661 -247436 -258097 -252797 -217704 -199682 -160225 -168713 -187500 -190687 -125886 -104135
1070 -104135 -173626 -191384 -158076 -162888 -246162 -236704 -165583 -253273 -279790 -213812 -246838 -208128
1058 -208128 -198906 -184571 -230336 -203630 -132761 -154967 -259475 -260743 -253346 -261929 -265651 -230447
1046 -230447 -197100 -224062 -233843 -279034 -253065 -249389 -231611 -253322 -239221 -273916 -248370 -243414
1034 -243414 -299543 -250382 -246113 -219890 -213560 -266302 -186926 -192658 -233090 -264347 -278354 -300027
1022 -300027 -212658 -194916 -203411 -178749 -247695 -303626 -287864 -185048 -208493 -218638 -234145 -248725
1010 -248725 -230208 -251821 -213103 -211536 -232289 -221120 -206473 -264541 -353363 -190959 -157727 -250989
998 -250989 -184655 -158564 -234578 -246228 -230910 -305660 -247412 -186855 -197556 -231879 -238640 -195587
986 -195587 -167600 -217655 -266492 -282130 -206907 -170489 -166428 -150526 -182168 -210676 -178125 -238234
974 -238234 -267070 -228930 -234212 -211088 -218154 -223048 -242883 -238573 -237361 -190358 -168102 -151120 -236234
961 -236234 -285856 -343411 -319164 -235734 -188493 -251857 -301329 -270998 -226293 -229391 -235393 -236693
949 -236693 -254654 -261454 -237454 -161012 -143295 -205551 -172796 -159985 -212084 -209082 -200825 -218036
937 -218036 -215406 -220512 -283867 -244617 -229304 -240687 -214581 -224164 -224858 -196697 -214827 -257826 -290586
924 -290586 -238585 -201260 -230601 -261299 -258023 -213964 -201190 -251864 -249580 -210687 -189983 -143216
912 -143216 -185475 -227394 -224559 -204470 -236049 -166493 -186074 -184211 -140836 -243584 -242650 -215649
900 -215649 -202596 -163617 -181138 -275301 -243649 -163444 -199351 -205380 -231642 -248835 -296096 -310950
888 -310950 -242962 -243029 -275298 -296619 -247107 -247189 -201949 -216794 -191517 -205653 -205227 -249406 -226926
875 -226926 -178289 -235442 -252908 -265593 -328091 -286569 -144299 -128039 -116566 -208634 -249019 -234047
863 -234047 -195077 -198338 -258251 -253099 -329671 -329478 -291850 -347108 -270083 -223072 -222081 -235805 -301922
850 -301922 -301280 -270653 -215567 -275525 -278260 -232458 -174899 -199970 -249831 -268326 -273224 -228374 -246631
837 -246631 -227097 -171149 -214465 -165013 -165511 -167536 -152081 -203482 -241822 -277024 -223235 -233250
825 -233250 -256431 -242780 -242038 -156256 -197437 -238608 -227502 -250034 -212801 -264431 -236574 -227445
813 -227445 -311572 -263027 -214902 -270107 -265548 -258567 -292663 -250062 -222518 -238992 -263130 -241997
801 -241997 -183364 -221138 -228631 -235194 -247402 -286539 -294306 -270665 -226496 -193582 -242130 -311495
789 -311495 -323045 -312790 -294604 -286340 -220837 -227098 -245620 -234753 -149842 -146934 -146094 -170944 -237361
776 -237361 -223440 -212849 -187124 -72455 -116395 -180678 -153337 -172859 -195983 -201188 -257677 -294142
764 -294142 -216672 -226745 -279205 -282810 -290377 -361807 -256389 -250835 -285393 -249507 -213202 -209640
752 -209640 -233285 -251873 -216081 -239701 -229720 -265873 -239061 -184786 -178195 -173967 -189168 -186585 -195482
739 -195482 -171774 -138672 -129089 -206946 -187041 -137011 -120697 -216064 -231672 -280504 -222928 -294674
727 -294674 -292231 -217611 -214774 -238398 -236062 -206413 -261781 -214731 -197832 -232839 -196705 -192706 -175727
714 -175727 -179915 -261006 -216191 -260045 -278974 -270488 -266909 -310766 -301668 -257340 -289301 -276439 -217274
701 -217274 -241084 -226679 -198619 -308914 -307001 -266015 -238300 -207707 -229658 -213231 -230807 -203209
689 -203209 -213706 -244107 -216315 -227661 -285511 -252804 -243062 -232563 -241454 -228029 -243337 -218659
677 -218659 -223267 -260523 -285532 -249237 -244793 -271607 -270892 -260674 -250338 -250076 -239693 -190271 -153964
664 -153964 -201461 -197071 -210483 -212964 -182242 -158802 -224101 -192436 -205259 -243847 -167048 -223578
652 -223578 -227163 -243339 -185586 -102625 -157679 -197954 -244690 -252681 -213768 -198634 -178359 -183672
640 -183672 -154602 -155163 -171859 -219519 -252137 -253169 -290828 -280717 -257580 -266160 -218888 -240556 -255965
627 -255965 -224315 -207355 -221707 -242778 -234760 -244958 -176229 -218092 -249044 -291893 -314610 -274888
615 -274888 -202831 -208527 -206468 -201573 -192193 -231347 -189118 -198117 -254143 -282270 -270464 -189150 -191503
602 -191503 -193052 -158985 -182303 -265113 -293645 -269385 -261456 -255629 -278998 -338162 -308543 -252377
590 -252377 -220258 -179895 -229003 -210564 -256586 -236340 -260139 -252638 -285128 -257276 -195589 -221524
578 -221524 -204443 -198628 -189540 -206667 -162252 -199487 -212131 -187946 -207131 -206197 -166991 -213205 -265607
565 -265607 -213255 -184011 -253518 -217391 -220087 -256541 -248014 -240670 -199048 -226956 -216408 -188464
553 -188464 -234127 -240276 -244420 -241643 -224515 -172928 -153330 -135059 -142249 -151711 -206069 -185234 -170003
540 -170003 -234397 -152753 -146882 -229666 -280773 -232181 -203099 -255851 -196444 -151657 -204806 -238864
528 -238864 -257941 -233641 -199318 -188858 -197974 -236812 -203357 -187735 -228828 -253611 -281185 -264378
516 -264378 -227412 -209021 -208902 -261284 -284344 -313022 -296512 -255197 -217079 -233866 -265701 -232728
504 -232728 -250080 -244533 -261118 -263859 -267429 -216006 -170249 -203082 -229268 -267998 -193924 -201778 -241510
491 -241510 -238151 -224931 -167846 -148731 -209932 -181491 -249086 -206344 -254203 -260842 -220416 -258439
479 -258439 -271000 -308750 -312999 -282518 -238919 -230921 -201190 -193860 -177249 -213819 -220123 -213048 -236639
466 -236639 -247341 -254105 -250700 -226593 -178971 -197801 -217561 -164512 -194170 -190443 -161782 -122433
454 -122433 -116889 -87732 -60729 -140088 -163909 -185476 -182612 -183966 -174998 -168957 -180573 -223977 -299939
441 -299939 -260996 -219003 -232083 -240546 -219735 -248701 -260408 -277111 -214217 -227601 -192818 -182204
429 -182204 -220891 -243332 -195403 -190186 -198296 -171795 -181398 -137728 -188407 -275232 -253178 -221717
417 -221717 -159674 -178336 -234891 -212476 -236617 -233125 -174389 -119229 -129753 -162042 -175417 -191225
405 -191225 -198548 -238636 -237079 -185412 -229389 -247841 -162183 -237358 -230383 -159301 -128535 -155192
393 -155192 -216381 -234918 -207322 -194854 -288684 -242820 -182152 -162847 -188177 -240720 -271595 -295218
381 -295218 -252727 -232804 -194877 -180642 -195281 -161933 -197309 -186893 -169498 -236018 -274770 -222874
369 -222874 -207922 -268600 -256447 -238348 -267987 -219802 -260633 -303605 -270793 -254789 -183146 -224212
357 -224212 -324099 -272992 -195842 -133973 -168949 -154256 -181075 -214188 -214543 -207055 -230009 -235419 -150089
344 -150089 -134705 -187852 -209893 -248196 -159212 -147972 -152948 -172435 -258941 -252564 -235894 -223140
332 -223140 -241805 -249898 -288713 -246800 -241397 -312543 -320295 -236750 -188312 -178134 -168924 -152837 -174819
319 -174819 -166286 -142229 -147530 -154540 -180665 -250627 -281229 -234365 -273631 -287488 -196742 -180321
307 -180321 -196335 -217278 -223604 -213066 -190359 -191676 -222835 -225871 -235767 -224137 -192971 -203062 -209603
294 -209603 -284058 -256725 -188730 -272063 -267146 -174471 -242674 -269093 -203495 -184968 -206491 -241965
282 -241965 -206576 -201582 -155556 -209796 -219490 -214577 -209750 -207338 -248610 -252853 -269334 -286007 -262047
269 -262047 -236876 -183821 -139413 -184920 -165673 -186157 -236154 -280426 -289669 -258482 -227740 -244505
257 -244505 -211858 -243627 -251012 -217211 -180969 -217415 -217208 -214237 -245225 -199467 -196617 -139395 -152416
244 -152416 -246720 -250407 -180527 -202345 -235726 -198259 -192816 -159823 -181221 -282435 -232408 -235661
232 -235661 -213580 -134188 -135609 -162021 -213527 -186623 -188022 -236575 -180835 -171412 -199039 -194090 -262642
219 -262642 -230239 -219892 -214879 -203172 -199059 -232258 -265963 -251233 -213925 -196536 -222246 -192556
207 -192556 -208545 -225932 -285676 -295374 -277421 -229216 -248767 -278829 -291287 -251045 -194883 -190988
195 -190988 -234642 -203995 -186941 -174065 -201127 -224627 -214734 -217886 -207374 -230835 -264264 -231347
183 -231347 -272279 -297194 -257112 -213190 -205389 -236196 -253283 -237996 -225991 -198489 -190150 -237324
171 -237324 -250366 -195660 -180222 -198689 -178686 -202801 -173005 -182983 -207686 -311604 -360063 -325410
159 -325410 -285972 -331844 -275070 -285570 -242218 -216228 -193614 -154405 -175803 -231798 -227511 -253505
147 -253505 -267854 -296848 -287011 -226920 -276565 -274637 -271618 -253835 -185825 -175466 -226966 -248885
135 -248885 -267178 -271279 -262348 -259900 -258918 -268359 -296667 -310622 -260060 -186811 -212415 -211635 -250212
122 -250212 -250515 -289696 -235430 -211774 -309299 -304288 -314857 -273836 -247473 -285873 -306785 -271469
110 -271469 -318881 -302175 -271046 -293767 -292380 -285524 -264353 -278547 -281914 -257776 -220768 -262858
98 -262858 -272986 -312116 -294462 -296008 -230934 -206257 -292305 -295682 -287903 -252876 -313156 -320083 -316710
85 -316710 -365512 -298724 -265121 -280463 -313883 -321610 -327386 -334591 -305322 -274033 -250610 -321219 -377145
72 -377145 -350914 -333777 -313844 -305247 -318401 -323846 -347184 -273132 -256482 -284496 -305610 -348964
60 -348964 -370498 -295459 -297526 -343334 -360005 -357176 -341406 -353064 -337707 -339534 -348775 -402433 -356247
47 -356247 -289113 -294821 -329974 -341324 -351419 -373687 -377760 -336339 -322586 -344811 -437637 -424172
35 -424172 -371309 -367564 -395082 -353490 -353719 -317268 -281638 -325510 -399100 -419872 -339242 -376169 -413194
22 -413194 -385383 -415094 -387158 -393424 -435762 -411599 -365889 -352107 -395258 -402324 -356112 -325197
10 -325197 -331257 -391441 -403240 -368861 -352879 -386483 -375868 -333945 -391847 -381829
0 -381829
$$ Imaginary data points
##PAGE= N=2
##DATA TABLE= (X++(I..I)), XYDATA
16383 -567227 -563680 -566900 -512133 -555807 -523694 -489935 -470291 -447503 -459089 -473999 -462309 -416001
16371 -416001 -346090 -347032 -322979 -273992 -262238 -315034 -324572 -206324 -175335 -224227 -210338 -189174
16359 -189174 -195673 -178864 -156498 -108308 -83980 -88941 -1528 -10324 -39823 -45073 -7509 24791
16347 24791 32591 42692 94062 44140 40771 54200 24604 166200 226633 183812 168099 179307
16335 179307 220717 257348 281612 242847 282636 352447 319295 340412 351710 365798 350324
16324 350324 379910 383686 431357 419101 448149 436173 457934 458302 522050 544985 560556 582621
16312 582621 582318 655093 598088 556393 569072 616733 618875 627361 594782 654048 688248 695719
16300 695719 711020 665889 652455 685465 735263 812877 854365 883420 851279 820665 857962
16289 857962 890224 871469 932363 923544 978407 1018734 1002390 977018 933614 902907 953851 984323
16277 984323 978263 980421 944683 1008739 1078308 1059992 1044149 1098397 1137710 1156577 1128842 1164448
16265 1164448 1144591 1156054 1185045 1146477 1215951 1207678 1200078 1165335 1165215 1210307 1226654 1253279
16253 1253279 1303637 1282796 1303927 1330233 1342901 1311429 1324237 1349159 1316311 1306124 1350981
16242 1350981 1365079 1337070 1374732 1346302 1379040 1327435 1349559 1380837 1381213 1409928 1412890 1451629
16230 1451629 1503193 1495136 1493490 1506560 1581467 1537522 1497007 1460866 1532285 1580818 1599340 1589516
16218 1589516 1567047 1565713 1532219 1597237 1605360 1554603 1603826 1643899 1609887 1609251 1583486 1593611
16206 1593611 1620899 1623024 1602025 1638390 1684327 1677983 1623545 1635914 1644783 1716476 1729638 1744929
16194 1744929 1727407 1698986 1661637 1680857 1725655 1823164 1841099 1787861 1786154 1717445 1718259 1779320
16182 1779320 1816683 1810329 1819152 1763694 1833447 1867872 1872426 1849226 1810556 1828905 1803261 1827838
16170 1827838 1842496 1821284 1816894 1825030 1847590 1854983 1927864 1901442 1808064 1798367 1796030 1793880
16158 1793880 1768459 1800057 1857206 1831462 1861162 1891709 1886334 1937171 1916629 1866482 1890338
16147 1890338 1875948 1923281 1934261 1961781 1995746 1948092 1919381 1918869 1920681 1916490 1938010 1955783
16135 1955783 1988718 2024345 1980891 1941040 1936215 1943252 1981866 1946525 1922271 1877572 1874753 1882362
16123 1882362 1841018 1891414 1961377 1950023 1981230 2058768 2040946 2044864 2059182 2021109 2007088
16112 2007088 2047098 2096703 1975299 1942416 2034793 1995101 1929383 1975300 1962412 1912080 1934731
16101 1934731 1969569 1980611 1990021 1907615 1898534 1993360 2015757 2043650 1997636 2049361 2060087 2007229
16089 2007229 1906906 1930147 1976717 1970477 1987171 2002209 2064693 2065328 2064032 2018869 2122068 2100817
16077 2100817 2026996 2045561 2048261 2108921 2123190 2097118 2030770 2072245 2086054 2069839 2066077 2024685
16065 2024685 2057881 2003521 2045847 2040625 2030807 1981139 2017705 2017310 1983380 2069229 2069084 2133953
16053 2133953 2141212 2096618 2087056 2111596 2144863 2178838 2082206 1999922 2056510 2064569 2041536 2040382
16041 2040382 2017872 2053395 2111367 2066014 2104396 2171619 2095900 2089834 2077003 2089956 2119017
16030 2119017 2092156 2065505 2073856 2127199 2079076 2051565 2030249 2072975 2091215 2064014 2116588
16019 2116588 2076406 2055628 2069283 2081713 2065669 2039549 2077673 2109815 2117376 2076456 2026545
16008 2026545 2023930 2106481 2105451 2108595 2102788 2097648 2047184 1992605 2054612 2072124 2023378 2062955
15996 2062955 2124442 2051523 2031337 2058672 2049952 2093693 2081096 2071078 2087945 2060538 1987766
15985 1987766 2015407 2027956 2068966 2090657 2084988 2069362 2088093 2166505 2087075 2080402 2094571 2178023
15973 2178023 2163419 2187170 2131502 2053595 2119947 2189241 2125923 2126329 2111394 2132267 2144738 2128297
15961 2128297 2089337 2085027 2017591 2013981 2123030 2189487 2158143 2162463 2154881 2139936 2126630 2056349
15949 2056349 2043035 2102218 2149870 2090972 2112713 2135202 2110644 2071737 2072848 2046578 2106376
15938 2106376 2133534 2113219 2141384 2130162 2156342 2116949 2122853 2113478 2114248 2128567 2057798 2070363
15926 2070363 2119819 2111117 2115125 2155685 2107248 2101889 2087918 2093484 2139301 2092330 2034115 2036322
15914 2036322 2060740 2116776 2074980 2010517 1968248 2026856 2034756 2073600 2073440 2130064 2142151 2088695
15902 2088695 2102819 2142262 2156258 2208770 2101024 2075135 2086225 2061665 2103354 2071233 2133064
15891 2133064 2082370 2109575 2155238 2110487 2070840 2037483 2165800 2184925 2082270 2105266 2128722
15880 2128722 2126534 2158344 2174269 2084210 2079660 2147378 2109898 2011631 2077363 2137432 2178029 2171522
15868 2171522 2146040 2166528 2092108 2096841 2161698 2138846 2102767 2105959 2125522 2136494 2062548 2101267
15856 2101267 2128745 2090255 2156685 2148168 2114120 2165967 2210231 2126129 2105591 2074070 2050952
15845 2050952 2058014 2069446 2129693 2132253 2114484 2109193 2072235 2056440 2153862 2176705 2196098 2100379
15833 2100379 2093367 2095712 2160070 2174344 2129691 2113607 2126822 2132962 2110401 2109299 2098518 2123333
15821 2123333 2101212 2093719 2124429 2101413 2148090 2193874 2155543 2182220 2154071 2157888 2147766 2142656
15809 2142656 2106613 2119657 2128660 2062963 2118171 2126759 2144870 2154101 2072775 2077344 2093017 2163889
15797 2163889 2161088 2134324 2136388 2101668 2167273 2235580 2212455 2196640 2157694 2166042 2079479 2035968
15785 2035968 2080110 2116006 2115142 2085828 2084765 2187110 2216250 2214866 2134593 2118926 2123555 2177606
15773 2177606 2186058 2218786 2234729 2145144 2194598 2209819 2116942 2090350 2102055 2158022 2190546
15762 2190546 2166296 2153890 2176328 2201097 2219868 2161267 2206980 2214278 2174828 2133888 2114763
15751 2114763 2120343 2054325 2121114 2175767 2127895 2168166 2198063 2179549 2145631 2210732 2227966
15740 2227966 2227108 2264241 2178453 2249932 2193549 2093354 2089291 2163444 2179077 2167106 2124251 2175406
15728 2175406 2144848 2143354 2155660 2120900 2133248 2095548 2017117 2074461 2089798 2102019 2156262
15717 2156262 2145437 2117843 2166124 2156110 2163401 2181313 2198306 2201128 2209455 2198205 2142060 2175282
15705 2175282 2144624 2139805 2140089 2148743 2223765 2199482 2159664 2173879 2161373 2163608 2208602 2249529
15693 2249529 2216875 2218343 2244465 2228449 2285619 2224975 2206691 2228558 2235821 2222732 2181074 2129321
15681 2129321 2157599 2204806 2223755 2186537 2108076 2141566 2152600 2145703 2075724 2080418 2176956 2154599
15669 2154599 2171892 2195695 2174719 2165870 2244981 2219730 2157052 2186497 2076835 2097333 2121890
15658 2121890 2065338 2115874 2199651 2191058 2201671 2233491 2197147 2199625 2251658 2191378 2176042 2226683
15646 2226683 2145033 2135462 2104486 2095459 2160074 2150850 2205702 2210378 2183068 2182461 2158879 2150762 2201056
15633 2201056 2167559 2162455 2133945 2154440 2150447 2137703 2176123 2175921 2180575 2168751 2119355 2185514
15621 2185514 2201742 2152382 2134258 2216228 2223151 2218811 2317942 2286977 2229832 2232664 2212495 2191410
15609 2191410 2198277 2127553 2120290 2162564 2162664 2204185 2214970 2184295 2144940 2189952 2153139 2137835
15597 2137835 2191093 2214821 2272875 2273604 2201601 2196237 2232823 2264250 2272570 2268593 2270858 2240834
15585 2240834 2239862 2230212 2211215 2212131 2289049 2248340 2139587 2157569 2222429 2224102 2182317 2155280
15573 2155280 2212697 2192338 2180821 2214488 2207576 2182262 2238737 2254933 2227575 2278015 2238709
15562 2238709 2241556 2209770 2197743 2237586 2214022 2235233 2255896 2193800 2184207 2185696 2188646 2167010
15550 2167010 2167135 2172286 2184396 2179169 2135470 2169626 2152873 2198842 2266763 2306168 2231482 2205949
15538 2205949 2220264 2161329 2183217 2245888 2226422 2261543 2279045 2232621 2165781 2174056 2160232
15527 2160232 2150057 2177560 2192512 2148649 2158130 2225370 2214933 2213641 2190515 2248216 2262112 2204169
15515 2204169 2168269 2191145 2161178 2197487 2204533 2199025 2212056 2207353 2263011 2236896 2268473 2245547
15503 2245547 2174405 2156616 2167508 2238694 2241519 2264894 2236650 2264669 2249767 2222414 2259279
15492 2259279 2217957 2198564 2168042 2153573 2228873 2284619 2270846 2249851 2238362 2221891 2179792
15481 2179792 2211955 2277591 2311643 2303952 2290133 2260194 2253283 2300508 2351383 2307743 2235128 2197183
15469 2197183 2250933 2250363 2186487 2180006 2223729 2222341 2216158 2295719 2320507 2243826 2283167 2296453
15457 2296453 2313229 2287258 2255567 2251201 2192624 2115799 2213693 2277666 2261753 2255552 2286855 2250067
15445 2250067 2210711 2253892 2289376 2259390 2164994 2253065 2271068 2237536 2212919 2255808 2260055
15434 2260055 2206743 2201239 2246636 2272087 2250182 2223594 2269682 2217105 2212830 2243869 2300862 2351829
15422 2351829 2360889 2350278 2331741 2293615 2288516 2273390 2290294 2299095 2301957 2301345 2315405 2320965 2242376
15409 2242376 2264432 2280564 2217813 2165042 2252512 2299064 2273522 2206603 2225781 2234807 2226277 2267211
15397 2267211 2158849 2200886 2241071 2249587 2266102 2291919 2342488 2323990 2350767 2371855 2375692
15386 2375692 2268882 2239639 2275759 2225655 2182561 2195939 2299172 2257437 2191626 2235984 2256013
15375 2256013 2303799 2293414 2233751 2276905 2297442 2247838 2239796 2246678 2291288 2290763 2240779 2213626
15363 2213626 2284430 2332823 2256686 2258347 2288504 2225032 2247297 2267314 2300161 2285394 2222742
15352 2222742 2216493 2257145 2310207 2301306 2269806 2272895 2327607 2302133 2295905 2358445 2316234 2294719
15340 2294719 2301907 2263493 2286723 2280618 2313975 2288523 2318318 2285341 2255327 2240830 2255749 2314075
15328 2314075 2350188 2350862 2347606 2356102 2324031 2304846 2237567 2231430 2273789 2290600 2320258 2290760
15316 2290760 2229082 2221079 2169621 2231750 2315692 2316127 2240350 2228532 2279886 2311120 2358461 2339297
15304 2339297 2296729 2328721 2313947 2328945 2279334 2304022 2309817 2250869 2219231 2189124 2216445
15293 2216445 2251208 2273197 2238330 2264515 2350204 2305888 2284413 2277381 2307301 2324979 2289778
15282 2289778 2359800 2344312 2299702 2270397 2300143 2349359 2382339 2323115 2261940 2325069 2376593
15271 2376593 2281188 2251463 2299817 2279938 2284477 2321865 2298195 2318873 2316757 2344492 2394078 2373505
15259 2373505 2374996 2394300 2331837 2315180 2354364 2306203 2280266 2300035 2291839 2320007 2343593 2338783
15247 2338783 2281618 2207350 2157591 2207364 2254072 2197066 2254653 2300699 2295157 2346823 2359685
15236 2359685 2336404 2330582 2323487 2303569 2234785 2311305 2245796 2253078 2214373 2183628 2260448 2291377
15224 2291377 2245744 2262631 2280135 2299959 2351204 2314672 2307272 2368702 2341153 2324107 2342679
15213 2342679 2292542 2366741 2407796 2370290 2303967 2277537 2346503 2348953 2324518 2299014 2296206 2336836
15201 2336836 2295602 2319838 2347853 2358928 2321867 2301452 2302979 2313283 2331720 2411167 2371002
$$ [...]
##END NTUPLES=NMR SPECTRUM
##END=
