##TITLE=1H_DE-80H_X3
 200.13MHz, d2o
 8 sc
 
 19ns.26.2.2025
##JCAMPDX= 6.0         $$ Bruker NMR JCAMP-DX V2.0
##DATA TYPE= NMR SPECTRUM
##DATA CLASS= NTUPLES
##ORIGIN= UXNMR, Bruker Analytische Messtechnik GmbH
##OWNER= pz
$$ XWIN-NMR		Version 3.5
$$ Fri Jan 23 11:12:07 2026 Russian Standard Time (UT+4h)  Yarkov@DPX200
##.OBSERVE FREQUENCY= 200.1313
##.OBSERVE NUCLEUS= ^1H
##.ACQUISITION MODE= SIMULTANEOUS
##.ACQUISITION SCHEME= undefined
##.AVERAGES= 8
##.DIGITISER RES= 18
##SPECTROMETER/DATA SYSTEM= spect
##.PULSE SEQUENCE= zg30
##.SOLVENT NAME= CDCl3
##.SHIFT REFERENCE= (INTERNAL, CDCl3, 0, 15.4659)
##AUDIT TRAIL= $$ (NUMBER, WHEN, WHO, WHERE, WHAT)
$$ ##TITLE= Audit trail, XWIN-NMR		Version 3.5
$$ ##JCAMPDX= 5.01
$$ ##ORIGIN= Bruker BioSpin GmbH
$$ ##OWNER= Yarkov
$$ C:/Bruker/XWIN-NMR/data/yarkov2/nmr/H-C/1/pdata/1/auditp.txt
$$ ##AUDIT TRAIL=  $$ (NUMBER, WHEN, WHO, WHERE, WHAT)
(   1,<2026-01-23 11:11:17.70 +0400>,<Yarkov>,<DPX200>,
      <created by zg, POWCHK disabled, PULCHK disabled
       configuration hash MD5:
       00 E9 B6 7A A2 85 ED C7 34 08 36 98 17 FE 4E 26
       data hash MD5: 16K
       8D 6D 94 C5 B6 29 34 11 A9 F4 EA 80 D6 5E B0 DC>)
(   2,<2026-01-23 11:11:24.92 +0400>,<Yarkov>,<DPX200>,
      <Start of raw data processing
       efp BC_mod = 2 LB = 0.25 FT_mod = 6 PKNL = 1 PHC0 = -5297.497 PHC1 = 7.62193 SI = 16K 
       data hash MD5: 16K
       58 62 26 76 1E 36 BB 38 DF EA 8C 47 6A 13 EB A0>)
$$ ##END=
$$ 
$$ hash MD5
$$ 7B E0 66 31 50 E0 3C FD 21 D9 C5 64 6C 88 77 75
##$RELAX= 
##$RELAX= 
##$RELAX= 
##$RELAX= 
##$RELAX= 
##$RELAX= 
$$ Bruker specific parameters
$$ --------------------------
##$DU= <C:/Bruker/XWIN-NMR>
##$EXPNO= 1
##$NAME= <H-C>
##$PROCNO= 1
##$TYPE= <nmr>
##$USER= <yarkov2>
##$AMP= (0..31)
100 100 100 100 100 100 100 100 100 100 100 100 100 100 100 100 100 100 
100 100 100 100 100 100 100 100 100 100 100 100 100 100 
##$AQSEQ= 0
##$AQ_mod= 1
##$AUNM= <au_zg>
##$AUTOPOS= <>
##$BF1= 200.13
##$BF2= 200.13
##$BF3= 200.13
##$BF4= 200.13
##$BF5= 200.13
##$BF6= 200.13
##$BF7= 200.13
##$BF8= 200.13
##$BYTORDA= 1
##$CFDGTYP= 0
##$CFRGTYP= 5
##$CHEMSTR= <none>
##$CNST= (0..31)
1 1 145 1 1 1 1 1 1 1 1 1 1 1 1 1 1 1 1 1 1 1 1 1 1 1 1 1 1 1 1 1 
##$CPDPRG= <>
##$CPDPRG1= <>
##$CPDPRG2= <>
##$CPDPRG3= <>
##$CPDPRG4= <mlev>
##$CPDPRG5= <mlev>
##$CPDPRG6= <mlev>
##$CPDPRG7= <mlev>
##$CPDPRG8= <mlev>
##$CPDPRGB= <>
##$CPDPRGT= <>
##$D= (0..31)
0 0.7 0 0 0 0 0 0 0 0 0 0.03 0 0 0 0 0 0 0 0 0 0 0 0 0 0 0 0 0 0 0 0 
##$DATE= 1769152277
##$DBL= (0..7)
120 120 120 120 120 120 120 120 
##$DBP= (0..7)
150 150 150 150 150 150 150 150 
##$DBP07= 0
##$DBPNAM0= <>
##$DBPNAM1= <>
##$DBPNAM2= <>
##$DBPNAM3= <>
##$DBPNAM4= <>
##$DBPNAM5= <>
##$DBPNAM6= <>
##$DBPNAM7= <>
##$DBPOAL= (0..7)
0.5 0.5 0.5 0.5 0.5 0.5 0.5 0.5 
##$DBPOFFS= (0..7)
0 0 0 0 0 0 0 0 
##$DE= 6
##$DECBNUC= <off>
##$DECIM= 32
##$DECNUC= <off>
##$DECSTAT= 4
##$DIGMOD= 1
##$DIGTYP= 9
##$DL= (0..7)
0 120 120 120 120 120 120 120 
##$DP= (0..7)
$$ [...]
##$SUBNAM2= <"">
##$SUBNAM3= <"">
##$SUBNAM4= <"">
##$SUBNAM5= <"">
##$SUBNAM6= <"">
##$SUBNAM7= <"">
##$SUBNAM8= <"">
##$SUBNAM9= <"">
##$SW= 18.0517328524113
##$SWIBOX= (0..15)
0 0 2 0 0 0 0 0 0 0 0 0 0 0 0 0 
##$SW_h= 3612.71676300578
##$TD= 16384
##$TD0= 1
##$TE= 0
##$TE2= 300
##$TE3= 300
##$TEG= 300
##$TL= (0..7)
0 120 120 120 120 120 120 120 
##$TP= (0..7)
150 150 150 150 150 150 150 150 
##$TP07= 0
##$TPNAME0= <>
##$TPNAME1= <>
##$TPNAME2= <>
##$TPNAME3= <>
##$TPNAME4= <>
##$TPNAME5= <>
##$TPNAME6= <>
##$TPNAME7= <>
##$TPOAL= (0..7)
0.5 0.5 0.5 0.5 0.5 0.5 0.5 0.5 
##$TPOFFS= (0..7)
0 0 0 0 0 0 0 0 
##$TUNHIN= 0
##$TUNHOUT= 0
##$TUNXOUT= 0
##$USERA1= <user>
##$USERA2= <user>
##$USERA3= <user>
##$USERA4= <user>
##$USERA5= <user>
##$V9= 5
##$VALIST= <valist>
##$VCLIST= <CCCCCCCCCCCCCCC>
##$VD= 0
##$VDLIST= <DDDDDDDDDDDDDDD>
##$VPLIST= <PPPPPPPPPPPPPPP>
##$VTLIST= <TTTTTTTTTTTTTTT>
##$WBST= 1024
##$WBSW= 4
##$XGAIN= (0..3)
0 0 0 0 
##$XL= 0
##$YL= 0
##$YMAX_a= 55569
##$YMIN_a= -50737
##$ZGOPTNS= <>
##$ZL1= 120
##$ZL2= 120
##$ZL3= 120
##$ZL4= 120
##$ABSF1= 0
##$ABSF2= 0
##$ABSG= 0
##$ABSL= 0
##$ALPHA= 0
##$AQORDER= 0
##$ASSFAC= 0
##$ASSFACI= 0
##$ASSFACX= 0
##$ASSWID= 0
##$AUNMP= <proc_1d>
##$AZFE= 0.1
##$AZFW= 0.1
##$BCFW= 0
##$BC_mod= 2
##$BYTORDP= 0
##$COROFFS= 0
##$CY= -3
##$DATMOD= 1
##$DC= 0
##$DFILT= <>
##$DTYPP= 0
##$F1P= 0
##$F2P= 0
##$FCOR= 1
##$FTSIZE= 16384
##$FT_mod= 6
##$GAMMA= 0
##$GB= 0
##$INTBC= 1
##$INTSCL= 3.241238e-09
##$ISEN= 128
##$LB= 0.25
##$LEV0= 0
##$LPBIN= 0
##$MAXI= 10000
##$MC2= 0
##$MEAN= 0
##$ME_mod= 0
##$MI= 1.114404
##$NCOEF= 0
##$NC_proc= -8
##$NLEV= 6
##$NOISF1= 3.799351
##$NOISF2= 2.8
##$NSP= 0
##$NTH_PI= 0
##$NZP= 0
##$OFFSET= 15.46593
##$PC= 1
##$PHC0= -5297.497
##$PHC1= 7.62193
##$PH_mod= 1
##$PKNL= yes
##$PPARMOD= 0
##$PSCAL= 0
##$PSIGN= 0
##$REVERSE= no
##$SF= 200.130011161233
##$SI= 16384
##$SIGF1= 3
##$SIGF2= 2
##$SINO= 0.751879
##$SIOLD= 32768
##$SREGLST= <19F.Aceton>
##$SSB= 0
##$STSI= 16384
##$STSR= 0
##$SW_p= 3612.71676300578
##$SYMM= 0
##$S_DEV= 0
##$TDeff= 16384
##$TDoff= 0
##$TI= <>
##$TILT= no
##$TM1= 0
##$TM2= 0
##$TOPLEV= 0
##$USERP1= <user>
##$USERP2= <user>
##$USERP3= <user>
##$USERP4= <user>
##$USERP5= <user>
##$WDW= 1
##$XDIM= 16384
##$YMAX_p= 491907491
##$YMIN_p= -19690742
$$ End of Bruker specific parameters
$$ ---------------------------------
##NTUPLES= NMR SPECTRUM
##VAR_NAME=  FREQUENCY,     SPECTRUM/REAL,   SPECTRUM/IMAG
##SYMBOL=    X,             R,               I
##VAR_TYPE=  INDEPENDENT,   DEPENDENT,       DEPENDENT
##VAR_FORM=  AFFN,          ASDF,            ASDF
##VAR_DIM=   16384,         16384,           16384
##UNITS=     HZ,            ARBITRARY UNITS, ARBITRARY UNITS
##FACTOR=    0.220516191357247, 1,           1
##FIRST=     3095.19674052618, 0,            0
##LAST=      -517.520022479599, 0,           0
##MIN=       -517.520022479599, -19690742,   0
##MAX=       3095.19674052618, 491907491,    0
$$ Real data points
##PAGE= N=1
##DATA TABLE= (X++(R..R)), XYDATA
$$ [...]
5226B33433k81450O9905J705839Q91844p32350j79473K60600j723991k91874m18940
5216d66457J972096L57024j425369k24166K31265j85309R2852j655068o3182J694517
5206C28203O88814Q14151J74527L81845p19772k009362M3252J51411L90153R47048
5196A190270n52460K34623m4298l72160J33J5122N85796n33320O08202K69297
5186A401205j93980M71271Q6547p36855r74600k42591P66528J840586o0775j672895
5176F84441l73360K81396M9751l49306p37040k02505j96533Q72612j7257Q03483
5166H15682J94179J10137K36702o4446j168155L60410L19937p50693r83999M69932
5156d60314R07745J219137P56838q39985j690574j20777O59942L20239O92922
$$ plain form
5226 233433 -48017 21888 1727727 2619571 1887221 1707748 1968348 244357 -47517 -466457
5216 -466457 1505639 1862663 437294 213128 444393 259084 351936 -1303132 -1366314 328203
5206 328203 1017017 1831168 2005695 2387540 1667768 -341594 -298342 -146931 243222 1190270
5196 1190270 637810 872433 828135 455975 456108 471230 1057026 523706 1131908 1401205
5186 1401205 1207225 1678496 1765043 1028188 53588 -189003 577525 2418111 2357336 684441
5176 684441 311081 592477 642228 292922 -444118 -646623 -843156 29456 12199 815682
5166 815682 1009861 1119998 1356700 1292254 124099 484509 804446 53753 -930246 -460314
5156 -460314 447431 1666568 2423406 1583421 -107153 -227930 432012 752251 1445173
5147A445173p63596n03796R95917q9723r30944O94293R08330k5152o47175l36192
5137G47135O94559j23450j79867M0564m32626J61142o08179N92096R4313p53157
5127B32530L70027j052042l74365K009032K58056P7147m54359l47130J197115
5118A916011j82624j310260k90102o24142L80404J054767l4145N29860q58211
5109E81558j206063Q63155K07678O44592N00706o40768k95949j92212J02603k08956
5099C56344R76696R85243j145712r14938J239781O78641o37821J05233n20563
5090A122904j143090K55775J095167j046169k8944P88892j169872L0534Q46531
5081G51728R4919O40760R8185K30984q69601p3877l03299m36429J002282m06592
$$ plain form
5147 1445173 681577 177781 1173698 1083975 153031 847324 1755654 1730502 1083327 747135
5137 747135 1441694 1318244 1138377 1178941 746315 907457 299278 891374 985687 232530
5127 232530 602557 -449485 -823850 1185182 1443238 1520385 1066026 718896 1916011
5118 1916011 1733387 423127 133025 -491117 -110713 944054 909909 1439769 581558
5109 581558 -624505 238650 446328 1090920 1591626 950858 654909 462697 565300 356344
5099 356344 1333040 2318283 1172571 257633 1497414 2176055 1538234 1643467 1122904
5090 1122904 -20186 235589 1330756 284587 255643 1044535 -125337 -94803 751728
5081 751728 846647 1487407 1585592 1816576 946975 873098 569799 133370 1135652 729060
5071G29060k63483Q50992L66502N00479j86562k337300J271931M07341j408911
5062f9951J527680L68066j516329j2135J26502K096685O15583j685043m22554
5053A028504r4978l09987K78713n47801J269460K67315j254802N61602O30323
5044A828349M26925J05100K01769L14931p63213j023449K31759J055684J22437
5035B500292r29618m50214R6565N60109K79506k58164M65357K28127J3158j51207
5025B353911J98340m22494l73934L55436j047850o07035O54657N60660J15576
5016A787267O4853O6675m34168L28134R00734m39791k38112r0648Q20116K12635
5006B977695n04093k17987L72249K33532N76814r54763P72267M60829j516138
$$ plain form
5071 729060 465577 1316569 1683071 2183550 1996988 -340312 931619 1338960 -69951
5062 -69951 1457729 1825795 309466 297331 423833 2520518 3136101 1451058 1028504
5053 1028504 933526 623539 902252 354451 1623911 1891226 636424 1198026 1828349
5044 1828349 2255274 2360374 2562143 2877074 2113861 1090412 1322171 2377855 2500292
5035 2500292 1570674 1120460 1217025 1777134 2056640 1798476 2263833 2491960 2505118 2353911
5025 2353911 2552251 2129757 1755823 2111259 1063409 456374 1111031 1671691 1787267
5016 1787267 1852120 1918795 1484627 1812761 2713495 2273704 2035592 1944944 2765060 2977695
5006 2977695 2473602 2255615 2627864 2861396 3438210 2483447 3255714 3716543 2200405
4997B200405k25999P11466Q08432N35807j177445J68951J212788o13589m32895
4988C187921P18239R76481J240397p24176j376880J7042q65162M66596J249908
4979D890366K05640J2005j65707M26745j42237k75805k2034P70523O32736L89865
4969F722097J207805N60942m05566J48394J37187N29943J196720m1160R22198
4960A0978560J726646p16508k82236K784039K312935J295590K024299K222462
4952B2345787J497902M124970P309853J0762290J5532191J7168802J4496937O438923
4944I9677655n710262j1953147j4514669j2652989q090660o666276o638980l375751
4936C0074921l185708j211289l17707j806608q65359l73104l0362J628504J099944
$$ plain form
4997 2200405 1974406 2685872 3494304 4030111 2852666 3021617 4234405 3620816 3187921
4988 3187921 3906160 4882641 6123038 5398862 4021982 4039024 3173862 3640458 4890366
4979 4890366 5096006 5108011 4942304 5369049 5226812 4951007 4928973 5699496 6332232 6722097
4969 6722097 7929902 8490844 8085278 8233672 8370859 8900802 10097522 10056362 10978560
4960 10978560 12705206 11988698 11706462 14490501 16803436 18099026 20123325 22345787
4952 22345787 23843689 27968659 35278512 46040802 61572993 78741795 93238732 99677655
4944 99677655 93967393 82014246 67499577 54846588 46755928 40089652 33450672 30074921
4936 30074921 26889213 25677924 25360217 23553609 22688250 22315146 22284784 23913288 25013232
4927B5013232J907443L976983L171166K347083J171535k15395J519387M936712
4919D3828146O825622J0480106J6128322J8553686J8665409J9272212J5873655
4912A49627158O307880m998796j6392652k1867513k0715885j6703486j2708362
4905F2548344p710778m507466n398053n279378m439241l295120l894638k931133
4897B5092537j137004p79638j65984j40226j580887o97670N98883J349136Q63859
4888B3403006J664739K255723L479013M557848P595422J0732812J4105812J5516685
4880H3311060R868104k906898j1021129j3205262j3052517j0496469p778604o303204
4872B8415081m676350l979837j290667j903066k500520j402788k153487k015018
$$ plain form
4927 25013232 26920675 30897658 34068824 36415907 37587442 37372047 38891434 43828146
4919 43828146 50653768 61133874 77262196 95815882 114481291 133753503 149627158
4912 149627158 155935038 150936242 134543590 112676077 91960192 75256706 62548344
4905 62548344 54837566 50330100 44932047 39652669 35213428 31918308 28023670 25092537
4897 25092537 23955533 23175895 23009911 22869685 21288798 20591128 21190011 22539147 23403006
4888 23403006 25067745 27323468 30802481 35360329 42955751 53688563 67794375 83311060
4880 83311060 93179164 90272266 79251137 66045875 52993358 42496889 34718285 28415081
4872 28415081 23738731 19758894 18468227 16565161 14064641 12661853 10508366 8493348
4864H493348O31720M63408o23577K27507K47070j474305j638004L55026r47064
4855E735129j390020M22784K83327M42765Q38598J42647M31621r48418j561266
4846D397167j171688J2814J069029O1464o19562P56469k03998n00928q62580n6537
4836B881650o10773m35125P36245O20180p53944R24787L23730q16356o7329r7989
4826B705076r24044J199501J125758j514080j360281O48045m07429o68276N47772
4817A352042k76116n42421J928904O95402j096810L90265K62978n79964n46479
4808A587801p67463Q94034J212489n92525j536280p57600J216766L02243o93686
4799H65779M86217P19153J27770j190197n59251J087393n7733M33474K71450j248176
$$ plain form
4864 8493348 9125068 9588476 8964899 9192406 9439476 7965171 6327167 6682193 5735129
4855 5735129 4345109 4767893 5051220 5493985 6332583 6475230 6906851 5958433 4397167
4846 4397167 3225479 3238293 4307322 4368786 3749224 4505693 4301695 3800767 2938187 2881650
4836 2881650 2270877 1835752 2571997 3192177 2438233 3363020 3686750 2870394 2803065 2705076
4826 2705076 1781032 2980533 4106291 2592211 1231930 1879975 1472546 804270 1352042
4817 1352042 1075926 533505 2462409 3157811 2061001 2451266 2714244 2134280 1587801
4808 1587801 820338 1714372 2926861 2334336 798056 40456 1257222 1559465 865779
4799 865779 1351996 2071149 2198919 1008722 449471 1536864 1479131 1912605 2184055 935879
4789I35879n17151P02577Q40375j141280o71444P26188m07426O78826O09736K33258
4779A989538Q06022l53457j648792j49751K66717r1894o17030P24554N99878o05562
4769I20223M02020J148668j126300j14258j0373O71779l95760m82117J64055R5658
4759A273595K87975k01737j157180Q85453N41468j143285o17113L21631L45347
4750E36154k7796L13738N00595N36906l61039k12522J371642m48677j567946P16151
4740A357206l0959l05205Q59727p4666r16814p01400l12729N13923P54386J105105
4730B248574N52118r29010j57314l38451k82328K37840o008M84287k4219o37813
4720A147676l18789L46997n19594L02515K55984l37308O46281J81125j752154
$$ plain form
4789 935879 418728 1121305 1961680 820400 148956 875144 467718 1146544 1756280 1989538
4779 1989538 2795560 2442103 793311 643560 910277 818383 201353 925907 1525785 920223
4769 920223 1322243 2470911 1344611 1230353 1219980 1891759 1495999 1013882 1177937 1273595
4759 1273595 1561570 1359833 202653 1088106 1629574 486289 -130824 190807 536154
4750 536154 508358 822096 1322691 1859597 1498558 1286036 2657678 2209001 641055 1357206
4740 1357206 1326247 1021042 1880769 1806103 889289 187889 -124840 389083 1143469 2248574
4730 2248574 2800692 1871682 1714368 1375917 1093589 1331429 1325421 1809708 1785489 1147676
4720 1147676 828887 1175884 656290 958805 1214789 877481 1523762 1704887 -47267
4711d7267L46242M76342N93867j54891K65706k75880r53060M19771M88996j047909
4701A11917R60731L69836j21111P51296k36161O20618M74951j64709Q673k420625
4691C55416m89311J049837n5593J624043P48724p61412l39466l3274L46582j593109
4681H52437r08246K64993N90756P65812L47704P75127J79627j655648k07956N1198
4671A055804j010445Q88550J120693M51484l86393r55292P38075J073795L57253
4662C333524l87758j262693J712307L59162n66085o14508l62883M03777m14123
4653B200720p64479L6558n01774Q46126P43642m61877O40346L98744j153054m50758
4643A534194M96236N3870J55936o7148Q296n43075k91548J567712K33272m18764
$$ plain form
4711 -47267 298975 775317 1369184 1214293 1479999 1204119 251059 670830 1159826 111917
4701 111917 1072648 1442484 1321373 2072669 1836508 2457126 2932077 2767368 2776041 355416
4691 355416 -133895 915942 860349 2484392 3233116 2471704 2132238 2098964 2445546 852437
4681 852437 -55809 209184 799940 1565752 1913456 2688583 2868210 1212562 1004606 1055804
4671 1055804 45359 933909 2054602 2506086 2119693 1164401 1902476 2976271 3333524
4662 3333524 2945766 1683073 3395380 3754542 3188457 2573949 2211066 2614843 2200720
4653 2200720 1436241 1472799 971025 1817151 2560793 2098916 2739262 3138006 1984952 1534194
4643 1534194 2030430 2084300 2240236 2173088 2181384 1638309 1346761 2914473 3147745 2728981
4633B728981R05142j64370j366840J042035M66636k05768L54270R37117m83105
4624D214098j660590N36392J661142j007339j174876j616649l16480O59692n380
4615A290010p1343J545837J179375j204127j322798K36353l3012n71642M04606
4606A453259N07740J427221J399465k65821m31454j012362M36413J451124p11774
4597D253811o00608j62690n03617J50229K32659K36964M50920P34320o56404k341817
4587A793767j120050k52712J99299J03509L56874J730116Q02838q19396N04860
4578C299105m48670j145767J00643o96884k89544L6080o87049J221128K66005
4569A655047L89230P97835J123248n28578j155354j349961n59839L36701O47331
$$ plain form
4633 2728981 3634123 3469753 2102913 3144948 3611584 3405816 3760086 4697203 4214098
4624 4214098 2553508 3089900 4751042 3743703 2568827 952178 635698 1295390 1290010
4615 1290010 1218667 2764504 3943879 2739752 1416954 1653307 1620295 1048653 1453259
4606 1453259 1960999 3388220 4787685 4521864 4090410 3078048 3514461 4965585 4253811
4597 4253811 3653203 3490513 2986896 3137125 3369784 3606748 4057668 4791988 4135584 1793767
4587 1793767 673717 421005 620304 723813 1080687 2810803 3613641 2794245 3299105
4578 3299105 2850435 1704668 1805311 1108427 818883 854963 167914 1389042 1655047
4569 1655047 2044277 2842112 3965360 3436782 2281428 931467 371628 708329 1355660
4560A355660J95673O02109j49412J21757k6676o68090J15398K01887p61766P09753
4550A696293O06806l21342L76337j4924n96139q38688P01262R26992o30428j712032
4540A94137j563745Q88540N68081l42210J312188J857825R0247p53154r42091
4531A309818l08257r0048p12748M17755M38802J04456O34N95158k57132n42428
4521I56010k65247l35321Q00796P5175j017987m2127m18181R67817O48790K01687
4511A571412P50426n45883j097998q36168k23925J184388q68871l69175J818994
4502A383200k95253j310853j141556L80513J153782P19166n25623O44388P23321
4493A731085P65622r01945r08399j39079P75464Q05308j912515r31741J192798
$$ plain form
4560 1355660 1551333 2153442 2004030 2125787 2099111 1431021 1546419 1748306 986540 1696293
4550 1696293 2303099 1981757 2358094 2343170 1747031 908343 1609605 2536597 1906169 194137
4540 194137 -1369608 -481068 87013 -255197 1056991 2914816 3005063 2251909 1309818
4531 1309818 1001561 911513 198765 616520 1055322 1159778 1160412 1755570 1498438 956010
4521 956010 690763 355442 1156238 1231413 213426 171299 -246882 720935 1369725 1571412
4511 1571412 2321838 1775955 677957 -158211 -382136 802252 -66619 -435794 1383200
4502 1383200 1087947 -222906 -1364462 -983949 169833 888999 363376 1007764 1731085
4493 1731085 2496707 1594762 686363 547284 1322748 2128056 215541 -716200 476598
4484D76598j065170K55709J579292K22524L9811q57797M81945O85209P64163o89483
4474A892801j164851N9158J00864j607605M66354K65518Q62346O92232r63878
4465F02939k34914Q9940l90197o23511j06949J967609P96731r43406K24914P40577
4455B123733j305992j996022Q0843J715045l89831j690100L98406K075349O05201
4446A616632j192594p53089P32925R32265m51246j164214M3713J134247O65122
4437A563761o26540j218969J118597J020359L70950L55261n41248r64937j93525
4428H83709p4879l02504P0355o7578j11315o30724J2734j07678o53882j94516
4418a176278m38269J670344J109781r83692Q44034L45755j174734o06135J244598
$$ plain form
4484 476598 -588572 -332863 1246429 1468953 1508764 650967 1132912 1818121 2582284 1892801
4474 1892801 727950 787108 887972 -719633 -253279 12239 874585 1566817 602939
4465 602939 368025 457965 67768 -555743 -662692 1304917 2101648 1158242 1383156 2123733
4455 2123733 817741 -1178281 -1097438 617607 227776 -1462324 -1063918 1011431 1616632
4446 1616632 424038 -329051 403874 1336139 884893 -279321 -235608 898639 1563761
4437 1563761 937221 -281748 836849 1857208 2228158 2583419 2042171 1077234 883709
4428 883709 808830 506326 576681 509103 397788 -232936 -220202 -327880 -981762 -1176278
4418 -1176278 -1614547 55797 1165578 181886 1025920 1371675 196941 -409194 835404
4409H35404N13766j012857l92615M88962J034483M08908n00071N07235R471r97713
4399H94973j175441p43206M71734O46705k02313M15363Q60054p3879l75257q00012
4389h1279j85719P72179K73167m52483n70889P33003L45775q75756O99906J143279
4379A801183j39753r18433p44841o70270L32005Q04371Q27468M90549o58119j67039
4369I57121j372473r2498K734955P16347p32239j689693o73722J47956l68444
4360c72690Q31426K381921L952j564432l51404k35148M24218Q88335m87421K67447
4350A786204M16803o70373j616290P7583J871939J92373r60715L49365Q06891
4341B253780q7921j76190k60235P35363R98606j109730k082666K79591J162220
$$ plain form
4409 835404 1349170 336313 -56302 432660 1467143 1876051 1375980 1883215 1892686 894973
4399 894973 -280468 -1023674 -551940 94765 -107548 307815 1167869 1093990 718733 -81279
4389 -81279 -266998 505181 778348 325865 -245024 487979 833754 -42002 657904 1801183
4379 1801183 1661430 742997 -1844 -672114 -340109 464262 1291730 1782279 1124160 957121
4369 957121 -415352 -507850 2227105 2943452 2211213 521520 -152202 -4246 -372690
4360 -372690 458736 2840657 2844609 1280177 928773 693625 1117843 2006178 1518757 1786204
4350 1786204 2203007 1532634 -83656 -6073 1865866 2058239 1097524 1446889 2253780
4341 2253780 2165859 1989669 1729434 2464797 3463403 2353673 271007 550598 1712818
4332A712818m58794l67206O64755P50586j531379r20889j9766j48844P72387J126472
4322A580140O47675J071244P08723m18872j786923m66014J263276r25810j215004
4313D58435O89850N92950J93962N67553P25963p73610p17300K99273n6996J02175
4303B082255J521430J01145n18014J646370N4950k226841R41463R4850q01002
4294B896606o07883m33246L87188L00961l88820p90616r3701J354705l00734j815186
4284E09274p00159L40308q8363j52060J019356R11236L54482l38o16153j380084
4274A97499K08877N57527M20845k93693M52392Q49803J82235j85368N32421p08131
4264B214407m70521l72032p95791j169041J112553J827960K13637l27891J40786
$$ plain form
4332 1712818 1254024 886818 1551573 2302159 770780 -150109 -169875 -318719 453668 1580140
4322 1580140 2227815 3299059 4007782 3588910 1801987 1335973 2599249 1673439 458435
4313 458435 1148285 1741235 1935197 2502750 3228713 2455103 1737803 2037076 1980080 2082255
4303 2082255 3603685 3704830 3186816 4833186 4888136 2661295 3602758 3697608 2896606
4294 2896606 2288723 1855477 2242665 2543626 2154806 1364190 1270489 2625194 2324460 509274
4284 509274 -190885 149423 61060 -91000 928356 1839592 2194074 2193736 1577583 197499
4274 197499 406376 963903 1384748 1091055 1543447 2393250 2575485 2390117 2922538 2214407
4264 2214407 1743886 1371854 576063 -592978 519575 2347535 2561172 2233281 2374067
4255B374067n00269m05229k89989p57876M5642M45647n14902n39601k90644O18468
4245A85314M46624N52325R05127J46296l90778p8694m64615o5001l73816M96206
4235A358988J40087n58738j52466K17877o94341M48970P5240j228550L40921N33424
4225D81412q20405n09621P29635N74337m92857r3154Q83996L88362j02091M01209
4215A440823o75291N5170m59877j44445J068215J39660M09319k12159o61969r02820
4205E6626j041498J910778J216548k04620O88963M41702m40560j076786q74761
4196F76392j81649K12414J107515P10322p79898l10754p33074M66134J61384j532514
4186b03728K04287O90473J61148Q00463p96874R86434M67348j5293j222013m97166
$$ plain form
4255 2374067 1873798 1468569 1178580 420704 466346 911993 397091 -142510 -433154 185314
4245 185314 631938 1184263 2089390 2235686 1844908 1766214 1301599 1236598 862782 1358988
4235 1358988 1499075 940337 787871 1005748 311407 760377 835617 -392933 -52012 481412
4225 481412 -338993 -848614 -118979 455358 -37499 -130653 753343 1141705 1039614 1440823
4215 1440823 765532 820702 360825 216380 1284595 1424255 1833574 1621415 959446 56626
4205 56626 -984872 925906 2142454 1937834 2626797 3068499 2627939 1551153 676392
4196 676392 494743 707157 1814672 2524994 1745096 1434342 701268 1167402 1328786 -203728
4186 -203728 559 691032 852180 1652643 855769 1842203 2309551 2294258 1072245 575079
4176E75079O09408q78876n65575R37934M09552k97584o86704m1448J054142R73851
4166B089779p03783q88216M05151p76290j412018J059698P28747L72631J520530
4157B396229j55420j458649J68501M01968O21582l18442N34791n39510j129809
4148E21241m19531J51677O22129J194743K11714N06061r15899j104497q44480
4139g6842L17328J381083J60535n8025M71312J60555l64776q36002o41334N47460
4129A061294p89425K76394j57826K14290J78944j0744k64248J72431P65378L42338
4119A788826n02090r0477n41292O09783J86660j067825k21254k56962L88134K88578
4109E82081J48384M00886L78617o77340J50103L41547O68943P1267m74976L49764
$$ plain form
4176 575079 1184487 305611 -259964 677970 1087522 789938 103234 61786 1115928 2089779
4166 2089779 1385996 497780 902931 126641 -1285377 -225679 503068 875699 2396229
4157 2396229 2240809 782160 950661 1352629 1974211 1655769 2190560 1651050 521241
4148 521241 101710 253387 875516 2070259 2281973 2788034 1872135 767638 -76842
4139 -76842 240486 1621569 1782104 1724079 2195391 2355946 1991170 1155168 513834 1061294
4129 1061294 271869 548263 390437 604727 783671 772927 508679 681110 1446488 1788826
4119 1788826 1286736 1196259 654967 1264750 1451410 383585 162331 -94631 293503 582081
4109 582081 730465 1131351 1509968 832628 982731 1324278 1993221 2064488 1589512 1939276
4099A939276N96491j251902J51852Q97930j020675n38084J066737K40984K58006
4090B340615J053789p77432j925333r58578m18181Q59632J543883r03620j104012
4081b89237j51761R84844O61729n61312J115708J105906p64216m04574r11332
4072G85755L15814R21929K25003q30172j137828o42296J245416P27035O2689l87252
4062A286093p89137m77673O72936n29784l47181r1505J517300l74367J26079J335841
4052B328602j143786j051685P13345m41906j04084j42778J13740J094207J71429
4043A537084p32316R4506M00568M08749l50827j395930J119858R89351N14987
4034B586030J51097J63370j130257j305859L1314O99399k58141o73354n61686
$$ plain form
4099 1939276 2535767 1283865 1435717 2333647 1312972 774888 1841625 2082609 2340615
4090 2340615 3394404 2616972 691639 -266939 -685120 174512 1718395 814775 -289237
4081 -289237 -440998 543846 1205575 644263 1759971 2865877 2101661 1697087 785755
4072 785755 1101569 2023498 2248501 1418329 280501 -361795 883621 1610656 1673345 1286093
4062 1286093 496956 19283 692219 162435 -184746 -276251 1241049 866682 992761 2328602
4052 2328602 1184816 133131 846476 404570 300486 157708 271448 1365655 1537084
4043 1537084 804768 899274 1299842 1708591 1357764 -38166 1081692 2071043 2586030
4034 2586030 2737127 2900497 1770240 464381 495695 1195094 936953 263599 -298087
4025b98087P9420k04563K33486L22345l30388J041993P76829j201910m75107Q52501
4015G96519j22837n0131N0246M58241m94294J76408R26688r05679l91681k95723
4005A47757q76557J230095m3073p36792j53832J042651J601430k13550p95040
3996A203089m51399q50229N02088n08797r64332J248209L01130P90870P98297
3987B068926o81881j462091K05912L44614O73519j12778m70550P52851Q88569
3978B207091o08848j723793j753364Q57394J119460k57460q29966l61806J222196
3969a29096J678256n19361o35459J1466N12824p38582q17677k25228M39547M10889
3959a2421M01441O08140R84907q75335o42998J015697J7450n90605j127536m95819
$$ plain form
4025 -298087 -218667 -423230 -189744 132601 -197787 844206 1621035 419125 -55982 796519
4015 796519 673682 623551 673797 1132038 637744 814152 1740840 835161 443480 147757
4005 147757 -728800 501295 458222 -278570 -432402 610249 2211679 1998129 1203089
3996 1203089 751690 -98539 403549 -105248 -1069580 178629 479759 1270629 2068926
3987 2068926 1387045 -75046 130866 475480 1148999 1036221 565671 1318522 2207091
3978 2207091 1598243 -125550 -1878914 -1021520 97940 -159520 -989486 -1351292 -129096
3969 -129096 1549160 1029799 394340 405806 918630 180048 -637629 -862857 -423310 -12421
3959 -12421 389020 997160 1982067 1106732 463734 1479431 1496881 906276 -221260 -717079
3949g17079O46777J38936l15562N37547J152947M40148r75689M40435l81023r94521
3939b7084O91118L35519K07804q26338j741272J567780J357003k89485j8579j125507
3929A30959J24285O04532j359276J83628o32904J687978K010482p29957q05907
3920A213820p26809P30661M2112k092816K11954Q27291P8560O2648p26674R97662
3910F18409m13502j12583M52207j603572l23295O36715J294790K637959p48779
3901B438349j365764k65512r16954m40689p484J269738M45716j022513M28577
3892E63464j095637O12658J707934n73081J05089p75672j681886J44440J182931
3883A90240J143128r8234o31656Q7598p03195m0056J14279j41917P38951J368598
$$ plain form
3949 -717079 -70302 68634 -246928 290619 1443566 1883714 908025 1348460 967437 -27084
3939 -27084 664034 999553 1207357 381019 -1360253 207527 1564530 1275045 1256466 130959
3929 130959 255244 859776 -499500 -315872 -948776 739202 2749684 2019727 1213820
3920 1213820 487011 1217672 1259784 -833032 -621078 206213 284773 347421 -379253 618409
3910 618409 204907 92324 544531 -1059041 -1382336 -745621 549169 3187128 2438349
3901 2438349 1072585 807073 -109881 -550570 -558054 711684 1157400 134887 563464
3892 563464 -532173 80485 1788419 1215338 1320427 544755 -1137131 -992691 190240
3883 190240 1333368 1235134 603478 691076 -12119 -52175 62104 -79813 659138 2027736
3873B027736O2172m45628K03896j106408j254043J391096l85632o98770J854654
3864A649073q6150j130801n57054o44747J655074M48636R44940k37056j462779
3855E79136K58080j253270J26089J300517o22008J15689Q08485K65730L15898
3846A894346o67701J92978n53704K24706N89751r23862l40229O67509k72758J59642
3836I70678l15498R31990Q7003o66238r8636o7617l02066n53774P70235m88924
3826B67153p77304J654089l06677r88031J419782o80292O61667Q75640P61545
3817B887572n83930r42733K75599k37453j367783R98073j56824j079200N33565
3808C26886m00428o66815J034598Q68133R89235Q56627m77479r22805O05419J131231
$$ plain form
3873 2027736 2089908 1644280 1848176 741768 -512275 878821 493189 -205581 1649073
3864 1649073 1562923 432122 -124932 -769679 885395 1334031 2278971 2041915 579136
3855 579136 837216 -416054 -289965 1010552 388544 504233 1312718 1578448 1894346
3846 1894346 1226645 1419623 865919 1090625 1680376 756514 416285 1083794 811036 970678
3836 970678 655180 1587170 1674173 1007935 909299 841682 539616 -14158 756077 267153
3826 267153 -510151 1143938 837261 -150770 1269012 588720 1250387 2126027 2887572
3817 2887572 2303642 1360909 1636508 1399055 31272 1029345 872521 -206679 326886
3808 326886 -73542 -740357 294241 1162374 2151609 3008236 2530757 1607952 2213371 3344602
3798C344602k9863l29033n71221n12790N55866r2884l12725j04070M02682M24748
3788B775312p10860O28952J260189J39585N37630j84664l92630R80787j04819
3779D929482Q20626K245163O26061n72531m10782J196539P86181O55134K701628
3770A2977501K346633M002119O035689O714042R219992J0872988P318420N03895
3762E9991279o443955q669725r160377p718282n703962m214964l943768k896841
3754A1239405j754726n31149l95621r35453p76374r25217j207168j323358p09344
3745B680995K26813J84484J76537k85114l01279L7282j044770O00283P93009p28447
3735B339793O73975p85687o83697n3567o26990P28854j5973J094872R12135j302006
$$ plain form
3798 3344602 3314739 2985706 2414485 1901695 2457561 2364677 2051952 1947882 2350564 2775312
3788 2775312 2064452 2693404 3953593 4093178 4630808 4446144 4053514 5034301 4929482
3779 4929482 5750108 7995271 8621332 8048801 7638019 8834558 9620739 10275873 12977501
3770 12977501 15324134 19326253 25361942 32075984 41295976 52168964 59487384 59991279
3762 59991279 53547324 44877599 35717222 27998940 22294978 18080014 14136246 11239405
3754 11239405 9484679 8953530 8557909 7622456 6846082 5920865 4713697 3390339 2680995
3745 2680995 2907808 3092292 3268829 2983715 2682436 2719718 1674948 2275231 3068240 2339793
3735 2339793 3013768 2228081 1544384 1490817 863827 1592681 1576708 2671580 3583715 2281709
3725B281709k06402l69039Q1066k83732l75507J034339P7823j648988o04290p28359
3715g41380L11537J224873J076338j62464p51657N9066q70667L02976J330374
3706A778996l67959k560N53461K26129J67162j554265j164461K23735n05501L41387
3696c03876n19476Q75852J711436r78556l41576J68432j352202N57036o9241j05747
3686c57918J640500j201821o986R76854J83512n4422j098404Q50299J215613j548517
3676E98710o0205j34259L13903N9469j36067N23315J06605j157484k83849K0818
3666a49044L18618o7340P35121J264116j192650j751897M32768J427768J370805
3657B388265L33404j267778j169662o76887n02660P8205P13018O95337J362243
$$ plain form
3725 2281709 2075307 1706268 1787334 1503602 1128095 2162434 2240257 591269 -13021 -741380
3715 -741380 -429843 795030 1871368 1708904 957247 1016313 145646 448622 1778996
3706 1778996 1411037 1408477 1961938 2188067 2355229 800964 -363497 -139762 -645263 -303876
3696 -303876 -823352 52500 1763936 785380 443804 612236 -739966 -182930 -252171 -357918
3686 -357918 1282582 80761 73775 1050629 1234141 1179719 81315 931614 2147227 598710
3676 598710 538505 404246 718149 777618 641551 1164866 1271471 113987 -169862 -149044
3666 -149044 169574 102234 837355 2101471 908821 -843076 -410308 1017460 2388265
3657 2388265 2721669 1453891 284229 -392658 -895318 -817113 -104095 591242 1953485
3648A953485j56181j481589q09593K94910J93185o95126L60491L17213M31752
3639D08547m69379o23488K0622m67602J29941O26925P79173J104894n94487m41296
3629D73850L20477n88705Q70832P84881o59799j01778M42091j025754K31106M41169
3619A188370r47739m48403k28183p1713j60504J38874Q47629j128132P32783O55393
3609E78375j502134J686024J111437r17730M19178q69750J82999P93665j63086
3600A318978o77913j270065J589459L23007j057399N02424m41434j696460l42536
3591a751939M74417L71587J32818J637289L37484j306541m22462R71639J295560
3582A739852o60372k06257N4497q61255K50963M03148k71926R80801k86946j909955
$$ plain form
3648 1953485 1797304 315715 -493878 -198968 -5783 -700909 -340418 -23205 408547
3639 408547 -60832 -684320 -663698 -1131300 -1001359 -374434 404739 1509633 915146 473850
3629 473850 794327 205622 1076454 1861335 1201536 1099758 1541849 516095 747201 1188370
3619 1188370 240631 -207772 -435955 -507668 -668172 -529298 318331 -809801 -77018 578375
3609 578375 -923759 762265 1873702 955972 1375150 505400 688399 1482064 1318978
3600 1318978 641065 -629000 960459 1283466 226067 728491 287057 -1409403 -1751939
3591 -1751939 -1277522 -905935 -773117 864172 1201656 -104885 -527347 444292 1739852
3582 1739852 1079480 873223 927720 66465 317428 720576 448650 1429451 1142505 -767450
3572g67450n06076J016397P94738j240974Q40736J099946j900156Q858J902566
3563A248585r45404N54115M74015p81701m9112l14048L16029J99011K21539L93138
3553A316167j106505J300959J201367k181408j042891P33495K90094k56378M13470
3544F68370o66496j292481N65278R03702J4923M81625J68243r54328j009872Q22128
3534b98908l7542l21787J228316n22489m75704j41024o28400J764901R21085L79214
3524A867662k75543j180255J095712R60735k92182l82934j838412o22239p62303
3515a429759O83540L06743l18608J049813N72109m02087L63942L49468J11819
3506A286980j033049K46973N98902r89902O96665K54184j406641K34589J82849
$$ plain form
3572 -767450 -1273526 -257129 537609 -703365 137371 1237317 -662839 -653981 1248585
3563 1248585 303181 857296 1331311 549610 500498 186450 502479 701490 923029 1316167
3553 1316167 209662 1510621 2711988 530580 -512311 221184 511278 254900 668370
3544 668370 1874 -1290607 -725329 178373 193296 674921 843164 -111164 -1121036 -298908
3534 -298908 -336450 -658237 570079 47590 -428114 -569138 -1197538 567363 1488448 1867662
3524 1867662 1592119 411864 1507576 2468311 2176129 1793195 -45217 -667456 -1429759
3515 -1429759 -746219 -439476 -758084 291729 863838 461751 825693 1175161 1286980
3506 1286980 253931 500904 1099806 109904 806569 1060753 -345888 -111299 71550
3497G1550Q358l13071P43299L25042j061031J81975N60566k99931k17778m67827
3487d68848p33789O17503J636673R67380o62405q96884m98692n59435J067855
3478D69358R43569J07519J309195o22717k141604k35727J33605M73447K90454
3469G27099K62724J80384p26499r44474J44942J134021k91520j15299j46850p99620
3459e75092K50188n86332j251851J471956N61167n7042K19381L52910l62939q7780
3449f5434O50926P37472l58408j01699l07327k53510l81177J249859M07446j428157
3439A49991J01986q75805j426041O32056r8321K66557P36084O5335K18794M20741
3429A91377J794035N93079j746285j49579P231o13606L96748N04600L15822K62478
$$ plain form
3497 71550 79908 -233163 510136 835178 -225853 -43878 516688 216757 -1021 -468848
3487 -468848 -1202637 -585134 1051539 2018919 1356514 459630 -39062 -598497 469358
3478 469358 1412927 1520446 2829641 2206924 65320 -170407 -36802 436645 727099
3469 727099 989823 1170207 443708 -500766 -355824 778197 486677 371378 224528 -575092
3459 -575092 -324904 -911236 -2163087 -691131 -129964 -187006 32375 385285 22346 -65434
3449 -65434 585492 1322964 964556 862857 555530 302020 -79157 1170702 1578148 149991
3439 149991 251977 -623828 -2049869 -1417813 -1516134 -1249577 -513493 -448158 -229364 191377
3429 191377 1985412 2578491 832206 682627 689858 76252 473000 977600 1293422 1555900
3419A555900j197603n88408K30460N75583N97699m14752j70994j17616q08051
3410c37782L62887k4439J68057P31494j302080M04078m36440j930067P76186Q03805
3400g84301J050220J167321l11802j12683o65898j020531o54509K84760J429613
3391C82190J25516k23652j81137n98862M18335K65436L53726K9704k94102p3357
3381B03797j268930j004738J051399O17388N97653J128190j06688p22018o4729
3372D31324q08529n17837J212364J133560K22861Q1935J110040p05028j620601
3363E40089q4149l30500l30883k47318M88715J83488P5415Q08004p22095n74883
3353a94117q49543j629949J013328Q98587L04591J345617k43437J91863m80244
$$ plain form
3419 1555900 358297 -230111 349 575932 1173631 758879 587885 470269 -337782
3410 -337782 25105 666 168723 900217 -401863 2215 -434225 -2364292 -1588106 -784301
3400 -784301 265919 1433240 1121438 1008755 342857 -677674 -1332183 -1047423 382190
3391 382190 507706 284054 102917 -495945 -77610 187826 541552 571256 277154 203797
3381 203797 -1065133 -2069871 -1018472 -401084 196569 1324759 1218071 496053 431324
3372 431324 -377205 -895042 317322 1450882 1673743 1755678 2865718 2160690 540089
3363 540089 455940 125440 -205443 -452761 35954 219442 294857 1102861 380766 -194117
3353 -194117 -1043660 -2673609 -1660281 -761694 -457103 888514 645077 836940 356696
3344C56696o75060J62449O72064J55287N31836O9329j261286L45698K29873j267134
3334f80248m56127Q15854m76723Q15473J041678J85061L93563M68096o55609j557051
3324a06033n41174k50968j656185R61583K118159k98114p34912Q66909j25240
3315B34025r11075O36493l35990o31518J206590N41555p84913O83554J398683
3306B037404j48150l99079k07901o40403j641315L82556J087417j290622o63636
3297a483729Q03743l76546M69688Q55088Q00803p70888K07189o090j93413l46506
3287d0661l12956k70282R62255L63900J42789L73750o35778o52726j153644j91114
3277a414467R30383r03012R43728J415697o10014K73729J209844J79256j158730
$$ plain form
3344 356696 -318364 -155915 516149 671436 1203272 1272601 11315 357013 586886 -680248
3334 -680248 -1136375 -320521 -797244 18229 1059907 1244968 1638531 2106627 1451018 -106033
3324 -106033 -647207 -898175 -2554360 -1592777 525382 227268 -507644 359265 234025
3315 234025 -677050 -40557 -376547 -1008065 198525 740080 -44833 638721 2037404
3306 2037404 1889254 1490175 1282274 641871 -999444 -616888 470529 -820093 -1483729
3297 -1483729 -679986 -1056532 -586844 268244 1069047 298159 505348 499258 305845 -40661
3287 -40661 -353617 -623899 338356 702256 845045 1218795 583017 -69709 -1223353 -1414467
3277 -1414467 -484084 -1387096 -443368 972329 362315 636044 1845888 2025144 866414
3268H66414q20975j059263j79697J52955N66986J213360J433687O26162j421612
3259A378017j506033N62870j368305r16014M98465O9823o9134K10435P05791J451360
3249A017275J78511K13890p35049n07242J36927N14603m48445j03753o30356n74275
3239i37914m81548k51459R71278J079629q00012J173971P92040j595600o29429
3230f79044P0149M81038J581394J82583q332N20432r49515j201999n17288P96012
3220B75430O39594n63616O04873L98798q99036k72329K09490P68945R37459j703696
3210C95912j177760K98733n1056r01353m17282N37441o10745l43027J228654M33618
3200f06865J246136K28284j412537l34005J26086p67385R52467Q48760K95858
$$ plain form
3268 866414 45439 -1013824 -1193521 -1040566 -473580 739780 2173467 2799629 1378017
3259 1378017 -128016 434854 -933451 -1849465 -1351000 -1281177 -1350311 -1139876 -434085 1017275
3249 1017275 1195786 1409676 674627 167385 304312 818915 370470 266717 -363639 -937914
3239 -937914 -1419462 -1670921 -699643 379986 -420026 753945 1545985 -49615 -679044
3230 -679044 -608895 -127857 1453537 1636120 1627788 2148220 1198705 -3294 -520582 275430
3220 275430 915024 351408 956281 1355079 456043 183714 393204 1162149 2099608 395912
3210 395912 -781848 -483115 -534171 -1435524 -1852806 -1315365 -1926110 -2269137 -1040483 -606865
3200 -606865 639271 867555 -544982 -878987 -752901 -1520286 -567819 280941 576799
3191E76799n5474n5052P00813j22129k61423o49677J40800n51200j20659Q25966
3181D28764M30117j21851j26112n99251L46657j66462l32414L65939j90319r7354
3171f2286Q63062o19369m64963O59379R30725m4423p89825O1407Q30791q92646
3161D71852j457591L12801J106839J78738k92813m51905J74979j097258o29424
3152a683782o2985O69162J872623k73009r71674J903244K55239k085502K14987
3143a61697M93651m03461K40647K53151l3331J30273o2378m28544K23920J044478
3133A296709j99175j132112j02010Q780j67527K70912O29662Q29621l79667n43436
3123E11757n56857k02552k65232j007539m09774j5790R64483Q72937N25859r8495
$$ plain form
3191 576799 521325 466273 1167086 1044957 783534 133857 274657 -276543 -397202 428764
3181 428764 858881 737030 610918 11667 358324 191862 -140552 225387 35068 -62286
3171 -62286 800776 181407 -283556 375823 1306548 1262125 472300 533707 1364498 471852
3161 471852 -985739 -672938 433901 612639 319826 -132079 42900 -1054358 -1683782
3152 -1683782 -1746767 -1077605 795018 522009 -449665 1453579 1708818 -376684 -161697
3143 -161697 331954 -71507 169140 422291 388960 519233 456855 28311 252231 1296709
3133 1296709 1097534 -34578 -136588 -127808 -295335 -24423 605239 1434860 1055193 511757
3123 511757 -45100 -247652 -512884 -1520423 -1930197 -1945987 -981504 -108567 417292 318797
3113C18797L02594O80389l6925n2363P96309m6059m49296j074178j082898L24623
3103c19007J400349k80794q73198p07808M66175P0022n54228J140678J48387m84802
3093E774j90435r90104M434J787276O22131r44575P18213q12865j394850J42460
3083a052541K88808N98271J5069P34733O44734l80412N72337R1992n18058M35982
3073A430915j47782q66573N69327k07244q47583O84391J403238m53656j882023
3064c16990n6956P07041j131202o3273J570025k44395j556057N66694J200835
3055F75722k43401o81839k7546O53427n8691j57100m93229n7607Q76446M8448
3045E34630l72760r9175q98979l25040j165711J98148N41375K35667J019866J344070
$$ plain form
3113 318797 621391 1301780 1264855 1212492 2008801 1962742 1513446 439268 -643630 -319007
3103 -319007 1081342 800548 -72650 -780458 -314283 -244261 -798489 342189 490576 5774
3093 5774 -184661 -1174765 -1170331 616945 1239076 294501 1012714 199849 -1195001 -1052541
3083 -1052541 -763733 -165462 -150393 584340 1229074 848662 1420999 1512991 994933 1430915
3073 1430915 1283133 416560 985887 778643 -68940 615451 2018689 1565033 -316990
3064 -316990 -373946 333095 -798107 -861380 708645 464250 -1091807 -525113 675722
3055 675722 432321 -249518 -277064 376363 317672 160572 -332657 -390264 486182 534630
3045 534630 161870 62695 -836284 -1161324 -2327035 -2128887 -1587512 -1351845 -331979 1012091
3035A012091p78826M39340O40862m76439P95629R55197j775858o90481k11131
3026h9616j84398L11572J450223J18559n63617L92336q86303j922699n0707J104729
3016c19921J91407o22901L12873j07675J307400Q82567r02056j459056M6065k39157
3006i10454l43247P76678P60085j80427J28063Q21374K27234j089874j09321P90277
2996H70388K95259j14546j003092m44082M93030q65299r48O16270P90440J262934
2986A900354o88829j514766O00923O0169j87921L69021P3471Q470m72943r2176
2976E5773N31090j39639J56985o46572j143751N51978M18861n50824l16579N65620
2966e17058K70877M76297q30702N57591K92671Q22242p1295j739813q64440J077238
$$ plain form
3035 1012091 233265 672605 1313467 837028 1632657 2587854 811996 121515 -89616
3026 -89616 -274014 37558 1487781 1606340 1042723 1435059 548756 -1373943 -1424650 -319921
3016 -319921 -128514 -751415 -438542 -546217 761183 1643750 741694 -717362 -671297 -910454
3006 -910454 -1253701 -477023 283062 102635 230698 1052072 1279306 189432 80111 870388
2996 870388 1165647 1051101 48009 -396073 96957 -768342 -769290 -153020 637420 1900354
2986 1900354 1211525 -303241 297682 357851 169930 538951 612422 620892 147949 55773
2976 55773 586863 447224 604209 -42363 -1186114 -634136 -215275 -766099 -1082678 -517058
2966 -517058 -246181 230116 -600586 -42995 249676 1071918 1000623 -739190 -1603630 -526392
2956e26392L78871P40209p90242q0755J061201L27239j580885N11071k55759O3982
2946a51460M82147P79588n81188j501961n37292R39644N95073Q62477J82062m84677
2936E84413j144640k264K29821l16906k16168J302449L1026n00537k06076l33350
2926e72232M89749M33715j00801N82333N59347l13131M7983n04502j130105P591
2916e00053k18994J54578O95576J38074L8887L41075l95364k01410k76231K47620
2906B3758R54606K9774m45129m62547J29677J23119K13210r40837q9402N22826
2896E9055k22878K87149N34792j601489N64568O61134K0031N11114j073538n10157
2886g70219J439423n23786q75946O31722J042680n70166j22748O39980p57661
$$ plain form
2956 -526392 -147521 592688 -197554 -278309 782892 1110131 -470754 40317 -215442 -151460
2946 -151460 330687 1110275 529087 -972874 -1510166 -570522 24551 887028 1069090 584413
2936 584413 -560227 -562491 -332670 -649576 -865744 436705 467731 -32806 -238882 -572232
2926 -572232 -82483 351232 250431 832764 1392111 1078980 1126963 622461 -507644 -500053
2916 -500053 -719047 -564469 131107 269181 308068 649143 253779 52369 -223862 23758
2906 23758 978364 1008138 563009 100462 230139 353258 566468 -374369 -463771 59055
2896 59055 -163823 123326 658118 -943371 -378803 282331 302362 813476 -260062 -770219
2886 -770219 669204 145418 -730528 -98806 943874 373708 250960 890940 133279
2877A33279P6079o832j275393P94455N31187k19975L05891N88263K35988o78355
2867D84587j210112N50919l98751n12532j56251K87198N28885R73360o30506k0013
2857a03216O18794l15181j455648L71221j035868l27984K095548Q38125n6500
2848F29291Q44302q86082q78179P42271r2095l82477J30713P06678N58084k94340
2838A078166r2755j3813n31707O82918M28359j587486q71636J162814N67544M73277
2828A295681p45280l92408K2067p08171L70173N96681k77288M39549Q50036M34058
2818A885098j449330n61376K99361l41139M82541n08300l41703P99107j65904
2809I8355r3689l14338j311332M16442J005402l57061k60766J11593O68810J94074
$$ plain form
2877 133279 209358 202526 -1072867 -278412 252775 32800 338691 926954 1162942 484587
2867 484587 -725525 -174606 -573357 -1085889 -1242140 -954942 -426057 547303 -83203 -103216
2857 -103216 515578 200397 -1255251 -884030 -1919898 -2247882 -152334 685791 629291
2848 629291 1473593 587511 -290668 451603 359508 -22969 107744 814422 1372506 1078166
2838 1078166 985411 971598 439891 1122809 1551168 -36318 -907954 254860 822404 1295681
2828 1295681 550401 157993 180060 -528111 -157938 438743 161455 601004 1451040 1885098
2818 1885098 435768 -125608 173753 -167386 315155 -193145 -534848 264259 98355
2809 98355 4666 -309672 -1621004 -1204562 -199160 -556221 -816987 -705394 -36584 157490
2799A57490R0033L73175k6094J4022j41783l14463l38144L3452k58413j24689
2789e35414N04551l96827q29761K030791R2024j112629J049305q0783k77663J25482
2779E69076j139723l10965l34356R02097Q75117k78784J819707m48936j576507
2770G6726Q80601p68648p13182J003956j13525K95540K59177J52260q74140Q32199
2760A030964J418027j156468j102130O658k083581Q00464J588838N35299j34480
2751I03591n1827N97903j645220j512494R94374l08974L71668R46244j05383o27400
2741d37518R4477Q57862j87887J95520P63768r26318n62413M97357l36516l83481
2731d25149n69752k01752P51268m9710K56804k26359j45133P81627k19816j87017
$$ plain form
2799 157490 247523 620698 594604 608626 466843 152380 -185764 -152312 -410725 -535414
2789 -535414 -30863 -427690 -1257451 773340 865364 -247265 802040 721257 443594 569076
2779 569076 -570647 -881612 -1215968 -313871 561246 282462 2102169 1653233 76726
2770 76726 957327 188679 -524503 479453 365928 661468 920645 1072905 198765 1030964
2760 1030964 2448991 1292523 190393 197051 -1886530 -1086066 502772 1038071 903591
2751 903591 851764 1449667 -195553 -1708047 -713673 -1022647 -650979 295265 189882 -437518
2741 -437518 -343041 514821 326934 522454 1286222 359904 -202509 294848 -41668 -425149
2731 -425149 -994901 -1196653 -445385 -495095 -238291 -464650 -609783 171844 -47972 -234989
2721b34989R62643L76552M61083j82022m13766N9906k53107j008204n2180m07299
2711f91383M29488N55960Q54496K41670j16179R8825m13949j049057p91440M95383
2701c86186m06770k73857P75900M88014J544953l04178j313315Q51920o93832
2692B82649j821406P71564J013477J056937n09716j153196P14714m97464l36261
2683d78702O08510P20089N35006L3430j395851n72083Q04715R39156p38154K15828
2673F71944O90002J12778j054925k23234j268434L09373J012046n35943Q9217
2664a97176K295423J26804j398149n64391N4832j414973j44518P90945j8427j78604
2654f48234J299388K67096q49708K22656O43316l78620O43146J95052O1092q66534
$$ plain form
2721 -234989 727654 1104206 1565289 1383267 969501 1029407 776300 -231904 -284084 -691383
2711 -691383 -261895 294065 1148561 1390231 1274052 1372877 958928 -90129 -881569 -386186
2701 -386186 -792956 -1066813 -290913 197101 1742054 1437876 124561 976481 282649
2692 282649 -1538757 -767193 246284 1303221 793505 -359691 355023 -142441 -478702
2683 -478702 129808 849897 1384903 1418333 22482 -549601 255114 1194270 456116 671944
2673 671944 1361946 1474724 419799 196565 -1071869 -762496 249550 -286393 -197176
2664 -197176 2098247 2225051 826902 262511 317343 -1097630 -1242148 -451203 -469630 -648234
2654 -648234 651154 918250 68542 291198 934514 555894 1199040 1394092 1455184 588650
2644E88650j162354n2797o59458M28J616474J24553j34133N94264j356611q06772
2634a247756O77905K31336P24123O99811l7094N67650q62280j372149J37803J308530
2624H27879O92552K11160m23058Q0653j05671n54003K17150J95631J786330M52524
2614C381147r22902k40138j804877M69296R26384j162434L75889M00493j147853
2605B75005L40819P86956J287089J15045j800639p06185m94130L38229O10826
2596G53015M5838O96695M01303p89410n23104m86993L2422K55531l46516J68248
2586B07029P97651N33248l98073p8132p49643o23318l4994p0438o34974N41888
2576e09756l00588N43560Q34844J0344J57965O23986J98446p02733q05766R2470
$$ plain form
2644 588650 -573704 -626501 -1285959 -1285531 330943 455496 321363 915627 -440984 -1247756
2634 -1247756 -569851 -338515 385608 1085419 1048325 1615975 753695 -618454 -480651 827879
2624 827879 1520431 1731591 1308533 1389186 1283515 729512 946662 1142293 2928623 3381147
2614 3381147 2458245 2218107 413230 882526 1808910 646476 1022365 1422858 275005
2605 275005 615824 1402780 2689869 2804914 1004275 298090 -196040 142189 753015
2596 753015 798853 1495548 1896851 1107441 584337 97344 129766 385297 38781 207029
2586 207029 1004680 1537928 1139855 1061723 312080 -311238 -346232 -416670 -1051644 -509756
2576 -509756 -810344 -266784 568060 578404 736369 1360355 1558801 856068 50302 142772
2566A42772M29297L8060N7192j009924Q69032R54318m95607P36577o15349K60897
2556A367265q07273j026483J145611Q30354o32882k99842K75179P74808n2569
2547A574168j159434j35290P60009p00088N3074J310075O2281l70518k49859j200958
2537e6540k38758O83750p28797J46657Q87158K92357o19766r65497J334038J082896
2527A817498j55436j021788o15452J027581o93752r78627P87572O27199P70180
2518A564975m27094q52848k54318L49418N20998j84443N44265O65107n08736p22992
2508F94332Q65733Q1301M07743l8845m27816P17290K18402j853631n61804K136349
2498B239054M51854j299809q4579n11488k68239m2115m47522r1408r9509O01546
$$ plain form
2566 142772 572069 610129 667321 -342603 526429 1480747 985140 1721717 1106368 1367265
2556 1367265 559992 -466491 679120 1509474 876592 576750 851929 1626737 1574168
2547 1574168 414734 279444 1039453 339365 392439 1702514 1764795 1394277 1144418 -56540
2537 -56540 -295298 388452 -340345 -193688 693470 985827 366061 -599436 734602 1817498
2527 1817498 1662062 640274 24822 1052403 358651 -619976 167596 794795 1564975
2518 1564975 1137881 285033 30715 380133 901131 716688 1260953 1926060 1417324 694332
2508 694332 1560065 1641366 2049109 2010264 1582448 2299738 2518140 664509 102705 2239054
2498 2239054 2690908 1391099 1306520 795032 526793 484678 37156 -54252 -153761 447785
2488D47785l21843K83477J820398l81874q5619R71763J34057k07040j001294q47603
2478H12207K37771R20183l678q67387J6848J008990j243162l04658O52195m62949
2468G66360K01036L57739L19868k03981K2982o24988m70501J03821N62083n1700
2458I82719L10221P78397R96429j160577O4352o2679j37533O43336J93457J79704
2448B787826P60262n92236n55118k57781m46915l8794L33075N13762q9200n35110
2438A879771Q95018P52716l29901o0981m43765J68440N18417k79322n31631K05540
2428B774302K95150K40034k30154q1772l54886J64862r3262l22913P25480K02491
2418C319332n46854J436790P38976j38804j46851l74591r53005k32105L40981
$$ plain form
2488 447785 125942 409419 2229817 1847943 1762324 2734087 2868144 2661104 1659810 812207
2478 812207 1049978 1970161 1966483 1099096 1115944 2124934 881772 577114 1229309 766360
2468 766360 967396 1325135 1645003 1441022 1464004 839016 368515 472336 1034419 982719
2458 982719 1292940 2071337 3067766 1907189 1971541 1908862 1771329 2414665 2608122 2787826
2448 2787826 3548088 2955852 2400734 2142953 1696038 1657244 1990319 2504081 2414881 1879771
2438 1879771 2774789 3527505 3197604 3136623 2692858 2861298 3379715 3100393 2568762 2774302
2428 2774302 3069452 3309486 3079332 2997560 2642674 2807536 2714274 2391361 3116841 3319332
2418 3319332 2772478 4209268 4948244 4809440 4662589 4287998 3334993 3102888 3443869
2409C443869N12624O84714j29460j60376P9028p79612O59524P59732n17467R42238
2399E494814R33815M4185M22394j52409p72394M85142J020270j32450L54239L73737
2389H071343j86732n50960O5499M90195J035707N24022J24218J10298m67134o65706
2379H550750Q0690J041103J471545J058357N89526J075187K149618n55283J176239
2370A6637732K958470M36914J028056J923347K705266L393729L443096L930082
2362C6456692M440276K033276L55708N96317K373938L895189O297871Q226394
2354F4675661J1468003J4383851K1722225L6666702O6614766R8951997J16439406
2347D30922611O0984880l5153648q3052814r0625821p1061135m7746440l4360591
$$ plain form
2409 3443869 3956493 4641207 4511747 4351371 4430399 3650787 4310311 5070043 4552576 5494814
2399 5494814 6428629 6472814 6895208 6742799 5970405 6455547 7475817 7343367 7697606 8071343
2389 8071343 7884611 7333651 7399150 7889345 8925052 9449074 9573292 9683590 9216456 8550750
2379 8550750 8631440 9672543 11144088 12202445 12791971 13867158 16016776 15461493 16637732
2370 16637732 19596202 20033116 21061172 22984519 25689785 29083514 32526610 36456692
2362 36456692 40896968 42930244 43285952 43882269 46256207 50151396 56449267 64675661
2354 64675661 76143664 90527515 112249740 148916442 215531208 314483205 430922611
2347 430922611 491907491 456753843 373701029 283075208 212014073 164267633 129907042
2340A29907042k7628193k0272492j5600052j1722044p821234m888276j967165
2333D0007586m26324k475588m131631k956823k153205l004808k354932k101335
2325B0402940k267731j869245j878055N2789m02896o98645n85129j558630m54492
2316A0740906j57710j144718M26376P66693l63045j222734r52401p54935m87826
2307F850606o68965L06053K336866P71462j846653n04475n28401j857107l27306
2298D532080j97845l38001K96778N04740p2308l86100P1239L12989k50501k44798
2288D228273p42227P55130R3236n38590K93911m3283O35022Q8857j071218k80595
2278C418516o42329O7853k23422n73321M48636K44688o92000M01897p52564n3782
$$ plain form
2340 129907042 102278849 82006357 66406305 54684261 46863027 41974751 40007586
2333 40007586 39581262 37105674 32974043 30017220 27864015 24859207 22504275 20402940
2325 20402940 18135209 16265964 14387909 14440698 14037802 13339157 12754028 11195398 10740906
2316 10740906 10583196 9438478 9864854 10631547 10268502 9045768 8093367 7338432 6850606
2307 6850606 6181641 6487694 8824560 9596022 7749369 7244894 6716493 4859386 4532080
2298 4532080 4334235 3996234 4293012 4797752 4725444 4339344 4410583 4723572 4473071 4228273
2288 4228273 3486046 4241176 4334412 3795822 4089733 4046450 4681472 4770329 3699111 3418516
2278 3418516 2776187 2844040 2620618 2047297 2495933 2740621 2048621 2450518 1697954 1644172
2268A644172O67394n87537q7523r62218K24827O18028O84393P73509m3898J42812
2258C073959j8368j639926j22155k81935j37943M86556m21105M24372L31172o73252
2248A021375J18065j000358J42782J167079o8439N5702m54220l4434Q8429O6878
2238A102859n40511j07211P96593j63131m9389Q79951l66367m4560l46898j457512
2228b96176j514494n4198J501339N45119L54400O32098m89495l91824P04187O58443
2218A649399N49874M89091l62385q94891k58222j265383L4315M75486p34791l7535
2208c55042R31298k94976K63370n9085j105803J47828j06739m05278Q36328M54255
2198C06156k21640q0830N294n80935L12713J247722k3297L25910P69772j484462
$$ plain form
2268 1644172 2311566 1724029 1636506 674288 899115 1517143 2201536 2975045 2931147 3073959
2258 3073959 3055591 1415665 1293510 1011575 873632 1360188 939083 1363455 1694627 1021375
2248 1021375 1139440 139082 281864 1448943 1380504 1436206 981986 947552 1035981 1102859
2238 1102859 562348 455137 1251730 1088599 1039210 1919161 1552794 1508234 1161336 -296176
2228 -296176 -1810670 -1864868 -363529 181590 535990 1168088 678593 286769 990956 1649399
2218 1649399 2199273 2688364 2325979 1431088 1172866 -92517 -58202 417284 -317507 -355042
2208 -355042 576256 281280 544650 485565 -620238 -472410 -579149 -984427 -148099 306156
2198 306156 84516 3686 8980 -571955 -259242 988480 965183 1291093 2060865 576403
2188E76403n49117J75284o02519k32210K75618J186421o7035q75480J039394r04801
2178B1958J21962J282470j453199J06483J319891J72461L57168m54919l77057
2169A097218l91440j263080m68776J8823J585989K20120m01373p9787N41144n38130
2159C20708j071502n63771k20042L6506P29723R24748J572188K2996j280686n83376
2149a12508o426k15055j62194Q20335O81145J39208j179942j001354Q45253J095987
2139I04449j30891r89676m05336L67265P72739O84519O08222m81240j586779o77460
2129i34188m51811R27542K26114j26036M82059P6380m56435K88345j49033k95302
2119d12365N43081J91073o56628o82005N02538o53966l2014J411155q5363M91162
$$ plain form
2188 576403 27286 202570 -399949 -632159 -356541 829880 762845 -112635 926759 21958
2178 21958 143920 1426390 -26809 79674 1399565 1572026 1929194 1474275 1097218
2169 1097218 705778 -557302 -1026078 -1007255 578734 798854 397481 317694 858838 320708
2159 320708 -750794 -1314565 -1534607 -1498101 -768378 156370 1728558 1751554 470868 -112508
2149 -112508 -118934 -333989 -496183 324152 1005297 1144505 -35437 -1036791 -191538 904449
2139 904449 773558 -216118 -621454 -254189 518550 1203069 1811291 1330051 -256728 -934188
2129 -934188 -1385999 -458457 -232343 -358379 123680 200060 -256375 31970 -117063 -412365
2119 -412365 130716 321789 -334839 -1016844 -514306 -1168272 -1200286 210869 125506 616668
2109F16668j99614j356540R37179q5065P9731J349992L48735o8466j499288j359701
2099a236369J98518K11687R68628L54888J89412M57748r58498o02818L86547L15685
2089B85428L53798k98975j0155n49040k26611N24667K29093Q89098J181922M85739
2079B864964O96629m30413j768274o08291m62537N76066N91167o26809j71387
2070F61115l57359K10067K52001k39400K43357o4180n32066q60395Q9569J76081
2060d21210J46840O14971N4120K22892L38557k96680o02335l82084p40752n98785
2050a664466L48049k2683M73446L05389j96489J105648j07917o24187K40223k67120
2040d10107O07375M94029m00164L6055l6571M88438n36223m19236J53242k15344
$$ plain form
2109 616668 417054 -939486 -2307 -87372 -7641 1342351 1691086 1622620 123332 -1236369
2099 -1236369 -1037851 -826164 142464 497352 686764 1144512 186014 -416804 -30257 285428
2089 285428 639226 340251 330096 -218944 -445555 79112 308205 1197303 2379225 2864964
2079 2864964 3561593 3131180 1362906 754615 292078 868144 1459311 832502 661115
2070 661115 303756 513823 765824 526424 769781 705601 173535 -686860 -597291 -421210
2060 -421210 -274370 340601 394721 617613 956170 659490 57155 -324929 -1065681 -1664466
2050 -1664466 -1316417 -1339100 -865654 -560265 -756754 348894 240977 -383210 -142987 -410107
2040 -410107 197268 691297 291133 327188 290617 779055 242832 -176404 -23162 -238506
2030b38506k65834Q59265n67379q46247J98402L83260J526659L50676l14796n95211
2020D90289j75178N79405r06948p20636K86371J86080P32164p5961k47675n3302
2010I4609o64053j140490j6880J395350O42954o97810J037010K96937j418182
2001d70555P8530R8929N54561K1974p73668N55528l33981j07196n74393r66603
1991a916874M83633P67596R98263P44656k87087J057128P9463j001498n66184
1982C59096o30939J90873j12553k88570m1788n03370l97899j66005J056907O38128
1972A03880l66947M53756K21606J67084N03035j218496k08266O69392k65500p48225
1962f88681k02055R53845l49302J06344J467476r07039n56598Q53643o25157k75574
$$ plain form
2030 -238506 -504340 354925 -212454 -1058701 -860299 -477039 1049620 1400296 1085500 490289
2020 490289 315111 894516 -12432 -733068 -446697 -260617 471547 395586 147911 94609
2010 94609 -569444 -1709934 -1726814 -331464 311490 -386320 650690 947627 -470555
2001 -470555 -392025 -293096 261465 283439 -490229 65299 -268682 -375878 -950271 -1916874
1991 -1916874 -1433241 -665645 332618 1077274 790187 1847315 1926778 925280 359096
1982 359096 -271843 -80970 -193523 -482093 -523881 -1027251 -1425150 -1591155 -534248 103880
1972 103880 -263067 190689 412295 579379 1082414 -136082 -344348 325044 59544 -688681
1962 -688681 -890736 63109 -286193 -179849 1287627 380588 -176010 677633 52476 -223098
1952b23098K16858m70586q09145O29494P16821q28569R97779J462794j323225
1943C69123l99187J37105q09193R32893M40326J35099j87146j61468M5296o57875
1933a55027l04641L721o66296p8076J695312O42420j437642k67240M31686m04728
1923e40511Q14351k76388n49022J454728o88389o80119Q83284k2635J79840r8508
1913D76631O81975o32324j040286P1712o463k3177j43929J25906j91442R8312
1903e83085P24111l61632k51463O80818j388789p88768J811179q58203n6605P91170
1893b81267M17234K95134J8806j72863j97731O7508o88826o63842J567339P08925
1883A070417k53789j7615j87094j93373n77129L44123J85565r89287P34976K65455
$$ plain form
1952 -223098 -6240 -476826 -1285971 -656477 60344 -768225 229554 1692348 369123
1943 369123 -30064 107041 -702152 230741 671067 806166 619020 457552 502848 -155027
1933 -155027 -459668 -455947 -1122243 -1200319 494993 1137413 -300229 -567469 -135783 -540511
1923 -540511 273840 -2548 -551570 903158 214769 -465350 417934 395299 575139 476631
1913 476631 1158606 526282 -514004 -442292 -448755 -471932 -615861 -489955 -681397 -583085
1903 -583085 141026 -220606 -472069 208749 -1180040 -1968808 -157629 -1015832 -1072437 -281267
1893 -281267 135967 431101 449907 277044 79313 146821 -542005 -1205847 361492 1070417
1883 1070417 816628 799013 611919 418546 -158583 185540 371105 -618182 116794 382249
1873C82249j307600J093840p42816j87785J618558p84186M30140m09515j093279
1864a000394O52244R69709K91503o60770l42425N68599o23501J56675r25567K15256
1854f98671J721044j187489j82304L51776j003135P49834L3762L31741N50143
1845F66701m97812K45667j427315r61503J134842P91443N71910j6315n66389l20323
1835c79094k63898P33454j38560P59242O73952j629487o96556M06583m36924Q17540
1825a53748N22886K15764J641857j036986k480148O111Q88000J20255J86957M28642
1815C39590M07695m59772q01433r62009o04436J504291R32038K83285N84462J1631
1805A235342j380312m92349J021212M28030l31662j58807q37395R71262L70871
$$ plain form
1873 382249 -925351 168489 -574327 -762112 856446 72260 502400 92885 -1000394
1864 -1000394 -348150 621559 913062 252292 -90133 478466 -145035 11640 -913927 -698671
1854 -698671 1022373 -165116 -347420 4356 -998779 -248945 -215183 116558 666701
1845 666701 168889 414556 -1012759 -1974262 -839420 -47977 523933 507618 -58771 -379094
1835 -379094 -642992 90462 -48098 711144 1385096 -244391 -940947 -534364 -971288 -153748
1825 -153748 369138 584902 2226759 1189773 -1290375 -1284264 -396264 -276009 -89052 339590
1815 339590 747285 287513 -513920 -1475929 -2080365 -576074 355964 639249 1223711 1235342
1805 1235342 -144970 -637319 383893 811923 480261 321454 -515941 455321 826192
1796H26192j460491l23213K32665o97979P64010m74305R37581J691183j358715
1787A36928k218562J187961Q59370r27581L06257P75642k47964K67157K529p36937
1777e95200Q49849J34129j363394Q59312J469921o41269l44124J87069m97090
1768E9203r92859k19J303172q7686J394627N78030j970528p08761M81774j124954
1758a068201j64822J544234l46865L58307L62615j093944J38954J03013m58619
1749f25328L97J538303M88625j543941l46968o4954O12115j81963R0573J80375
1739A47234j4279j163501o87639J349158J063499o72883q9506p66652q49075M79833
1729a203811J532812M95496m1712n42910p95701n12824P63967K68226r42817J927141
$$ plain form
1796 826192 -634299 -957512 -724847 -1422826 -658816 -1133121 -195540 1495643 136928
1787 136928 -2081634 -893673 -34303 -961884 -655627 120015 -127949 139208 141737 -595200
1777 -595200 254649 388778 -974616 -115304 1354617 713348 369224 556293 59203
1768 59203 -933656 -933875 369297 281611 1676238 2254268 283740 -425021 56753 -1068201
1758 -1068201 -1233023 311211 -35654 322653 685268 -408676 -269722 -166709 -625328
1749 -625328 -624931 913372 1401997 -141944 -488912 -553866 58249 -123714 -33141 147234
1739 147234 132955 -1030546 -1718185 -369027 694472 21589 -67917 -834569 -1683644 -1203811
1729 -1203811 329001 824497 782785 239875 -555826 -1068650 -304683 -36457 -979274 947867
1719I47867L98164j676590R99214q90292J93904J482930M62061n82458l54973
1710I79827n26449l64752j28688n77428j09160N37391l37973O7398n78934j66050
1700a204818n019J67200Q92468j05400p91488j08843J152355J75461K95769J025349
1690A493034k22396m63855r05829q5110Q23153m6824j318942j26566J007131j74879
1680b1083m21882o43571j12347r3008n51617J089289N06859O02497n9269n04779
1670b08911j051057o78996J608776J900571L40315p64341o36375J17417o41992
1661a4593j355500O54566Q17962J25944o26785K70692O05620M6385j410132J377813
1651D91972N74398l68322M19812k4035l50491j075101p74607J645086Q90817k96198
$$ plain form
1719 947867 1346031 -330559 668655 -221637 -27733 1455197 1917258 1334800 979827
1710 979827 453378 88626 -40062 -617490 -726650 -189259 -527232 -459834 -1038768 -1204818
1700 -1204818 -1209837 -1042637 -150169 -255569 -1047057 -1155900 -3545 171916 467685 1493034
1690 1493034 1270638 806783 -99046 -184156 638997 592173 -726769 -853335 153796 -21083
1680 -21083 -442965 -1086536 -1198883 -1291891 -1843508 -754219 -247360 355137 295868 -208911
1670 -208911 -1259968 -1938964 -330188 1570383 1910698 1146357 509982 627399 -14593
1661 -14593 -1370093 -715527 102435 228379 -398406 -127714 477906 524291 -885841 491972
1651 491972 1066370 698048 1117860 1093825 743334 -331767 -1106374 538712 1429529 1133331
1641A133331k25328j018687r23652K88581j02333J31472M77373L76596P7823j96337
1631A8839p51196n74895M87353P78576k11747l00448k26723Q16571L06496r16117
1621e73291q67305j72651J75621n81957L36269Q76960q7463P27218k87675N32625
1611G8351J173494j044722o66717O04880R28986K52307j051971Q58790J045940
1602B179338l0342K28943j914814j236816O31442J36398o0616J68655K82181M4252
1592D28621N1168R4141p73497j208558M03935K40507k80694N86908M69082N59693
1582E71306J116836p46449j528447n19450Q07237L58094J35526M72519n79265
1573H7907j050321J73219J48081K15536L24332j37109J60257L16576r83400P6262
$$ plain form
1641 1133331 908003 -110684 -1034336 -745755 -848088 -716616 -239243 137353 215176 18839
1631 18839 -732357 -1307252 -819899 -41323 -253070 -553518 -780241 36330 342826 -573291
1621 -573291 -1440596 -1613247 -1437626 -2019583 -1683314 -806354 -893817 -166599 -454274 78351
1611 78351 1251845 207123 -459594 145286 1074272 1326579 274608 1133398 2179338
1602 2179338 2148996 2377939 463125 -773691 -142249 -5851 -66467 102188 384369 428621
1592 428621 479789 573930 -199567 -1408125 -1004190 -763683 -1044377 -457469 11613 571306
1582 571306 1688142 941693 -586754 -1106204 -298967 59127 194653 667172 87907
1573 87907 -962414 -789195 -641114 -425578 -101246 -238355 -78098 238478 -744922 -668660
1563f68660J829096j19260q02431j67212j55512j155400R31478J2694O53289Q07209
1553A165291o30860l45235M96657j720694j64285K025670K95107j60175n53314
1544D08162l21845l25279j668949N60252J079816N11904J105918m75402p10116
1535A64461N34476j325588M1041J136936O16406o86976n47376j25222Q02558J69229
1525G79945l85254m12353n86688O59162j185232o34874R21941K79883L40400M02196
1515A79126q96253l02000J20254J99388N29604L26887K9144p31510j83851J574550
1505H45339N69077p00085n37994k00880j08654p52171n19673P48569J469308L8717
1495H51553m23030K67120L0381k10155K14683M40485P49959j084202m02311L57044
$$ plain form
1563 -668660 1160436 1041176 238745 71533 -83979 -1239379 -307901 -295207 358082 1165291
1553 1165291 534431 189196 685853 -1034841 -1199126 826544 1121651 961476 408162
1544 408162 86317 -238962 -1907911 -1347659 -267843 244061 1349979 874577 164461
1535 164461 698937 -626651 -585610 551326 1167732 480756 -66620 -191842 610716 779945
1525 779945 394691 -17662 -604350 54812 -1130420 -1765294 -843353 -563470 -223070 179126
1515 179126 -717127 -1019127 -898873 -699485 -169881 157006 186150 -545360 -729211 845339
1505 845339 1414416 714331 176337 -24543 -133197 -885368 -1405041 -656472 812836 851553
1495 851553 428523 695643 726024 515869 730552 1171037 1920996 836794 434483 791527
1485G91527p1488J44389p59344j23460N22745j003636r51538L49019M16717J564390
1475H79321O9444j231147N79380K34623j004588l47386o19478J445269L84000
1466C89438j217858N62039o72879m71134Q54261k92643O91616P71412r50800K79254
1456e7294N46226L84427j028419j010729J430141K02454k19669R584J17720K40116
1446F14557o26068n62679N15306o4118k36384m8238O74488Q18156o16181r82103
1436e13264L55695o46754p95400k1288R15757J496741J912860p27769j477925
1427D98653k80651q70675o49356M18428J201218J192802k48010j724930M259r6749
1417e55011J017630J020176J6194n05399q02572n72050j66106o17150M8504P90067
$$ plain form
1485 791527 720039 864428 105084 -18376 504369 -499267 -1450805 -1101786 -685069 879321
1475 879321 948765 -282382 296998 531621 -472967 -820353 -1439831 5438 389438
1466 389438 -828420 -266381 -939260 -1410394 -556133 -848776 -157160 614252 -336548 -57294
1456 -57294 488932 873359 -155060 -1165789 264352 466806 247137 256721 374441 614557
1446 614557 -11511 -574190 -58884 -123002 -359386 -407624 266864 1085020 468839 -513264
1436 -513264 -157569 -804323 -1599723 -1621011 -705254 791487 2704347 1976578 498653
1427 498653 218002 -652673 -1302029 -883601 317617 1510419 1262409 -462521 -458262 -555011
1417 -555011 462619 1482795 1498989 993590 191018 -381032 -547138 -1164288 -1115784 -325717
1407c25717p02930M01973K94727j07380R37553J014030k25281j29702j413750
1398b56477j109444L17295Q81502n67159r675O61021k66320n65858Q33652k64271
1388c45734M37124R66520O843p76774j080716p45813J152696J090260l76470J7631
1378C45567R4928l04538j81477N73250M42943j159k73708l28597k30725J49268
1368B85752J25989L79569N60328p0302j117464j063294l41555j79279m01858R51097
1358h71017l4949L1477R17526r501k1594K34786r05977N92965K20160k23172K1185
1347d8111J111527L99596j329282m65511J512318j544470j577020J903257m13828
1338d51524o38328O15752j88075O71633J38198l41413o37225N16451Q37656m87742
$$ plain form
1407 -325717 -1028647 -626674 -331947 -439327 498226 1512256 1286975 1157273 -256477
1398 -256477 -1365921 -1048626 -167124 -734283 -743958 -82937 -349257 -915115 -81463 -345734
1388 -345734 91390 1057910 1064753 287979 -792737 -1538550 -385854 704406 327936 345567
1378 345567 440495 135957 -45520 527730 970673 969514 695806 367209 136484 285752
1368 285752 411741 791310 1351638 1281336 163872 -899422 -1240977 -1420256 -1822114 -871017
1358 -871017 -905966 -874489 43037 33536 11942 246728 -659249 -66284 153876 -69296 -48111
1347 -48111 1063416 1463012 133730 -331781 1180537 -363933 -1940953 -37696 -451524
1338 -451524 -1089852 -474100 -662175 9458 147656 -193757 -830982 -314531 523125 35383
1328C5383N88849P45165K34776k05470j644730p42503l10533j9543J097481O41702
1318D20577k25371J26399m43516r89365k82257O48123m21527J092183J292779
1309A218025k97100n04428N57021o46013K05408o03284l4188m26890n9154R59821
1299C69218j199283j39069K128556j84115j42741N62487j210181m87260L6158
1290b66230R08046P92830m31081k55647n33229j250481o51953p4954N81209O09107
1280e72383j75896j43118P86237p7083m90433J92784L67965r17373l28705J097333
1270b60672O75440j023300l27715J167466K44652L13846J231058k69215n96587
1261A154973j306608n02430r2562l51355j20992O35028l50139N15575k78423K0277
$$ plain form
1328 35383 624232 1369397 1604173 1398703 -246027 -988530 -1299063 -1318606 -221125 420577
1318 420577 195206 321605 -121911 -1111276 -1393533 -745410 -1166937 -74754 1218025
1309 1218025 920925 416497 973518 327505 532913 -70371 -104559 -531449 -590603 369218
1299 369218 -830065 -969134 1159422 975307 832566 1395053 184872 -302388 -266230
1290 -266230 641816 1434646 1003565 747918 214689 -1035792 -1687745 -1762699 -1181490 -572383
1280 -572383 -748279 -891397 -105160 -182243 -672676 -479892 -111927 -1029300 -1358005 -260672
1270 -260672 414768 -608532 -936247 231219 475871 789717 2020775 1751560 1154973
1261 1154973 -151635 -654065 -746627 -1097982 -1218974 -583946 -934085 -418510 -696933 -676656
1251f76656J87383O88379r30911M16607L29447M10876o924K03974J71879j80247
1241F13807n56870m0508J056392q2543j062371P35723O98843p99645m48466r00583
1231g86221k63941Q27942K12653p28158K26393q79785j87057J231014P89135K31284
1221F73259P48080p63224j043912K52324l30315J40108J193955P5053L60775o93417
1211F12686n87491P74193p70900q2429m44489q62691Q08154R09619p62438o41244
1201a047030O79579m74317k92027O77505L03861j64558M67845j3039j78352J856761
1191A816228N45221j236619k02257o40106j595053K21789K172810j48152j205062
1182b71201m85705M71593Q18289n98318Q0426k09750j389925L45058K09822J21154
$$ plain form
1251 -676656 -489273 199106 -731805 -315198 14249 425125 418201 622175 794054 613807
1241 613807 56937 16429 1072821 990278 -72093 663630 1362473 562828 114362 -786221
1231 -786221 -1050162 -222220 -9567 -737725 -511332 -1391117 -1578174 -347160 441975 673259
1221 673259 1421339 658115 -385797 -133473 -463788 -323680 870275 945328 1306103 612686
1211 612686 25195 799388 28488 -53941 -498430 -1361121 -552967 356652 -405786 -1047030
1201 -1047030 -367451 -841768 -1133795 -456290 -152429 -316987 150858 137819 -40533 1816228
1191 1816228 2361449 1124830 922573 282467 -1312586 -1090797 1082013 933861 -271201
1182 -271201 -756906 -285313 532976 -65342 15084 -194666 -1584591 -1239533 -1029711 -908557
1172i08557O56155N3199N68828M7778j001775J570375K48201q86898P2256j036071
1162f16509K18191M25774n12114M25780o5170j64412m58036K25198J20508K41015
1152a59775J006390o30154l72892J389492o88148o03442m39560j009049j05976
1143a613114P50821J199521m07405o79864L67850O89974M12024j71294n35189
1134A3324J51597m78339J414909o32925q75998J329969p77924O1361M35771m43139
1124A98606R76075k15773k018012q70994J67748J504482P13150m9756M21863k20730
1114F06659n13388J93743j215269o66399M13195J273683J68084m96N30165n7122
1104G32855q35554q95045k96552J63643L54857O08313M93054n13286m73473L65644
$$ plain form
1172 -908557 -252402 -199203 369625 417403 -584372 986003 1234204 347306 419562 -616509
1162 -616509 -398318 27456 -484658 -58878 -124048 -288460 -746496 -521298 -400790 -159775
1152 -159775 846615 216461 -156431 1233061 544913 -58529 -498089 -1507138 -1613114
1143 -1613114 -862293 337228 -70177 -750041 -382191 307783 719807 548513 13324
1134 13324 164921 -313418 1101491 468566 -407432 922537 144613 205974 641745 198606
1124 198606 1174681 958908 -1059104 -1930098 -1762350 -257868 455282 405526 827389 606659
1114 606659 93271 287014 -928255 -1594654 -1181459 92224 260308 259812 789977 732855
1104 732855 -102699 -997744 -1294296 -1130653 -775796 -167483 325571 -187715 -661188 -295544
1094b95544J324247l27705j067794n06119M69356Q36421o03293O9364J397017
1085A295950o81403j854314r3835j88814J873147K80212p24575J094050M29983
1076A430401m24474j518466r55676Q39049k84349j013230J449174J097380N98005
1067A217814R1438q16512p39198J96575m59123m64097J58345K06667O90464O92388
1057G74761o20937m1138N46168o09729o00283J129677j06590j170560L1571M85124
1047a81936L29545M22649m05097n63922J735229L04590j457948r07840o16326
1038a341056N19426n74049k30445J752990J124701l40812q32361p07614J317120
1029F87900N91464q73753n37729N36736j318548l09015J51444N27464J123757
$$ plain form
1094 -295544 1028703 700998 -366796 -872915 -403559 432862 -170431 -101067 1295950
1085 1295950 614547 -1239767 -1333602 -1522416 350731 630943 -93632 1000418 1430401
1076 1430401 1005927 -512539 -1468215 -629166 -913515 -1926745 -477571 619809 1217814
1067 1217814 1309252 492740 -246458 -49883 -509006 -973103 -814758 -608091 82373 774761
1057 774761 153824 112686 658854 49125 -551158 578519 471929 -698631 -667060 -181936
1047 -181936 147609 570258 165161 -398761 1336468 1641058 183110 -724730 -1341056
1038 -1341056 -821630 -1395679 -1626124 126866 1251567 910755 78394 -629220 687900
1029 687900 1279364 405611 -132118 404618 -913930 -1222945 -1071501 -544037 579720
1020E79720M34508n46541m51047p69885n22560O79846j63507J349735q4685m60534
1010D5050N56465o74785M2941K58987j497649N93503J632224M1345l03026L69332
1000A064387l09998j074098J77811Q65263n13365j247610l93326k0311n9437N01660
990a009024Q72304J71635J00450L81333k22970p02209K26996j33828l40654J220297
980E64330R14713j376556L8039K39021j020771K14045P31984q0241k13665R548
970B0447N4843Q81965K11407r87801l66609N89679n32100j303826K37049J705038
960E10092j79451j25888M91823n083N24635n36722p32030O43096q79406n73037
950h61971K5727M23644J582075m8172j155713P86734r43369p17853L41843K50825
$$ plain form
1020 579720 1014228 467687 16640 -753245 -1275805 -595959 -759466 590269 505584 45050
1010 45050 601515 -73270 -30329 228658 -1268991 -675488 956736 998081 695055 1064387
1000 1064387 754389 -319709 -141898 723365 210000 -1037610 -1430936 -1451247 -1510684 -1009024
990 -1009024 -136720 34915 135365 516698 293728 -408481 -181485 -315313 -655967 564330
980 564330 1479043 102487 140526 379547 -641224 -427179 304805 224564 10899 20447
970 20447 75290 957255 1168662 180861 -185748 403931 -128169 -1431995 -1194946 510092
960 510092 330641 204753 696576 691493 1216128 679406 -52624 590472 -288934 -861971
950 -861971 -836244 -412600 1169475 1121303 -34410 752324 -191045 -908898 -567055 -316230
940c16230J539121R6913j796059J86161J139303n43373j221962L80169N54610
931A8653o27627M1521j61215r94976O92867J21664K90734J220400p6731j97231
921C28059M430Q44110j089243p73549M74893N20740M59145o5280n04030K12953
911D12228o71754j092223j31408P02219O91728k45625J00970J418108j05369p55679
901C23195J47130n0747Q28110j13298r15613L47335p38672q72136N02804O33873
891I1981P37421j24594q0747l27544n59347o7372p31540q96205J122111L53078
881d82758n92183K43853J122041O38651k47055o20115N5810p48793j96937L95494
871d31992Q41076P26417N90568l32437j471001k01160L27924n8684l05846p58807
$$ plain form
940 -316230 1222891 1319804 -476255 -290094 849209 305836 -916126 -535957 18653
931 18653 -608974 -567453 -728668 -1723644 -1030777 -909113 -618379 602021 525290 328059
921 328059 332489 1176599 87356 -686193 -211300 309440 768585 703305 199275 412228
911 412228 -259526 -1351749 -1483157 -780938 -89210 -334835 -233865 1184243 1078874 323195
901 323195 470325 419578 1247688 1134390 218777 566112 -172560 -1044696 -541892 91981
891 91981 829402 704808 624061 296517 -262830 -330202 -1061742 -1957947 -835836 -482758
881 -482758 -1074941 -831088 290953 929604 682549 62434 118244 -630549 -827486 -431992
871 -431992 409084 1135501 1726069 1393632 -77369 -278529 49395 -9289 -315135 -1073942
861a073942N11458k87603l08401Q53337N33014m0261j74439q8489J79009P4469
851A78152j044067M15890L04400P87131K5429o27176L62464j89904j000742M12774
841c75649k74896j97910k0886p85560Q88998J262187P62464L68369j702135n43288
831f18306R96310m89215M5964J094734o54972j121944j236657o7878J330518J633293
821I11847R27157o27609j052733L60717p31997j431536J308929J027250m57245
812B34780K50947K18237p30131l25862l08797j180523J68184J087141R29607J201190
802A544773P38619j122822j699779J09401J71149n56152M06687j26568j163005
793a697697J294770J174665K65524Q3453j292552N42235P1180j021836J054669
$$ plain form
861 -1073942 -562484 -850087 -1158488 -305151 227863 187602 13163 -75326 103683 178152
851 178152 -865915 -450025 -145625 641506 666935 39759 402223 212319 -788423 -375649
841 -375649 -650545 -848455 -869341 -1654901 -765903 496284 1258748 1627117 -75018 -618306
831 -618306 378004 -111211 -65247 1029487 374515 -747429 -1984086 -2051964 -721446 911847
821 911847 1839004 1211395 158662 519379 -212618 -1644154 -335225 692025 234780
812 234780 485727 703964 -26167 -352029 -660826 -1841349 -1673165 -586024 343583 1544773
802 1544773 2283392 1160570 -539209 -429808 -258659 -814811 -408124 -534692 -1697697
793 -1697697 -402927 771738 1037262 1120715 -171837 370398 441578 -580258 474411
784D74411j42006j198097N34901l32090J636262j2199q62487m81036j042977O71123
774g54195Q51042p08723O15151M83989j93815M48494l25912O05494L83540j026095
764C78970j212169k05179j21221J436076J153213L03265j160321j371026n73939
755a372331N28035l7278R82283N87785K9177J90763l45683j33629L18956j377096
745f29018q10006O67250M91617O43967J141334p94271j210716J25193j65283n30940
735a070873l8167R04732o40005k43089R72826L27337l21974j9948r03768n44713
725a577642K394585M67850j362460n13935l00695J457080L79843k52304J10800
716H03122r94803p23399j024354q18639K427107P42098N36073J381822l15908
$$ plain form
784 474411 332405 -865692 -330791 -662881 973381 961182 98695 -382341 -1425318 -754195
774 -754195 96847 -611876 3275 487264 293449 741943 416031 1021525 1405065 378970
764 378970 -833199 -1038378 -1159599 276477 1429690 1732955 572634 -798392 -1372331
755 -1372331 -844296 -881574 100709 688494 717671 908434 562751 429122 748078 -629018
745 -629018 -1439024 -771774 -280157 363810 1505144 710873 -499843 -374650 -539933 -1070873
735 -1070873 -1109040 -204308 -844313 -1087402 -114576 212761 -109213 -129161 -1032929 -1577642
725 -1577642 816943 1284793 -77667 -591602 -892297 564783 944626 692322 803122
716 803122 -191681 -915080 -1939434 -2758073 -330966 411132 947205 2329027 2013119
707B013119j373192k40911Q98154j03726j715451r70169N00144J096095R31746
698A035809J00659J45187j154752p05408o34153o26144J249469Q06342m87822
689b70813K79714K04509K342j158116L74909N38670J55388l7337J22021L60943
679E72230N01098j341211p53993J023667M14456n31673n78220J93901K70675j26087
669c55157P90268L11254j042252J445333m02374j783060O29906M95518r83999
660h94563J147225L20941n8075o4274n43558K61670L31112k45440J85712k7805
650D12945m80833p54940R4517P88424K31507o4174m56170j47027Q0705K16473
640g8573l83946l86100O44745K37852n97670L53832O89431M88066k83436o00341
$$ plain form
707 2013119 639927 399016 1297170 1193444 -522007 -1492176 -992032 104063 1035809
698 1035809 1136468 1281655 126903 -578505 -1212658 -1838802 -589333 217009 -270813
689 -270813 8901 213410 215752 -942364 -567455 -28785 126603 89266 211287 572230
679 572230 1073328 -267883 -1021876 1791 416247 -115426 -693646 -499745 -229070 -355157
669 -355157 435111 746365 -295887 1149446 747072 -1035988 -406082 89436 -894563
660 -894563 252662 573603 515528 451254 -92304 169366 500478 255038 440750 412945
650 412945 -67888 -822828 -728311 60113 291620 227446 -228724 -375751 -295046 -78573
640 -78573 -462519 -848619 -203874 33978 -563692 -209860 479571 967637 684201 83860
630H3860l75985M42754M50586q67516m48292M50695m76220M27721J508191N4039
620A249833j060276L30997n98224j095678n74656O59020J217959L47104m93778
611a7699k63277m2948L92379R0678l14864L74934J334879l71850m26241l64639
601C91352j545826J29026O090J083454j47559q32523J72416P29491L92457K44634
591F23012k8449M29261j072931n36400O77731N47083N14682l19096j310236O7123
581d08220o71887k16069J128028K68611j097102j83647O55765N52193N68388N41524
571A137584j95665q66889J130j42819L27816L35547k25591l05424j155612O3671
561a026252J279158n2182k15218O85839n49129o94410Q9244Q65604n2000n85534
$$ plain form
630 83860 -292125 150629 601215 -266301 -714593 -263898 -740118 -312397 1195794 1249833
620 1249833 189557 520554 -77670 -1173348 -1748004 -1088984 128975 476079 -17699
611 -17699 -280976 -323924 68455 159133 -155731 219203 1554082 1182232 755991 391352
601 391352 -1154474 -1025448 -1019358 64096 -83463 -915986 -743570 -14079 378378 623012
591 623012 594563 1023824 -49107 -585507 92224 639307 1153989 834893 -475343 -408220
581 -408220 -1080107 -1296176 -168148 100463 -996639 -1180286 -524521 27672 596060 1137584
571 1137584 941919 75030 76160 -66659 261157 596704 371113 65689 -1089923 -1026252
561 -1026252 252906 200724 -14494 671345 122216 -572194 -482950 382654 330654 -254880
551b54880J089702L73761j72251J52156j934311j357486L39641Q59759J216365
542C12456q38503O15699m51568j394697L05697J398098J278133M43692j454202
533B14805R510O6080o45056j71505J56303P31892n07597j000123J610918J303848
523A769075r68762m38776m64085j183658l19570J672186K75685k00797L99287
514E40585J98434n16647j484193n45353P81906J219012L75977l47806K30497J351096
504A803508N57889k298156j240131J416110l34889O17150J63673l15461k42387
495A27306n52338l15324R66771K30308j129257j043573J476386Q01592j000662
486d38791j06441R46338P9074o02231k83949N31112L5289L46075J07273j169226
$$ plain form
551 -254880 834822 1208583 1036332 1188488 -745823 -2103309 -1763668 -903909 312456
542 312456 -526047 89652 -361916 -1756613 -1450916 -52818 1225315 1669007 214805
533 214805 224315 290395 -354661 -526166 -369863 362029 -145568 -1145691 465227 1769075
523 1769075 800313 361537 -102548 -1286206 -1605776 66410 342095 141298 540585
514 540585 739019 222372 -1261821 -1807174 -1025268 193744 569721 221915 452412 1803508
504 1803508 2361397 63241 -1176890 239220 -95669 521481 685154 369693 127306
495 127306 -425032 -740356 226415 456723 -672534 -1716107 -239721 561871 -438791
486 -438791 -545232 401106 480180 -122051 -406000 125112 160401 506476 613749 -555477
476e55477N80119j0897r42952N20065K88384M63969m5039j393232M31820O8226
466e95014m60876P5571P40454K39908R02657j156285k90820J287655O4359j382479
456e74870N61884L59544k49202J95936r36360o50140J612657L43872N68204n3011
446A178514l35343o92419p98912j39554O31512J309404P55527N09148q67463j462495
436H7919r86882j228282j70763J688159O9501M38614N65090K12866l96756n81540
426c02074j288673N91034P50040p18150O80472R78010j073508o25179J186575
417A78547N46850J10772n06025r48978k81622J50680J372159P72538o53480l26719
407D14722q96029L9556J62352J92560K63747P3853q70108j935720N13035J876261
$$ plain form
476 -555477 24642 13745 -929207 -409142 -120758 343211 298172 -1095060 -663240 -595014
466 -595014 -1055890 -980319 -239865 43 902700 -253585 -544405 743250 807609 -574870
456 -574870 -12986 346558 97356 293292 -643068 -1293208 319449 663321 1231525 1178514
446 1178514 843171 150752 -648160 -787714 -156202 1153202 1908729 2417877 1550414 87919
436 87919 -898963 -2127245 -2298008 -609849 -540348 -101734 463356 676222 279466 -302074
426 -302074 -1590747 -999713 -249673 -967823 -287351 690659 -382849 -1008028 178547
417 178547 725397 836169 330144 -618834 -900456 -749776 622383 1394921 741441 414722
407 414722 -481307 -441751 -279399 -86839 176908 250761 -619347 -2555067 -2042032 -165771
397a65771m40162K19961J507511k4679K30659n87579j218602j27225p8065K3765
387f60187N96104J038453J734899j644502j166047L00157j118065L59574O47804
378H8190K71839j100844o37972J068171K79217Q69659k47221k95326J651135n74897
368A371951j740159O69442m68934q42760o07010J053473J799750k41772K0806
359A014787K96121j068225P4977l48220M38998P12501j147841j229110r23352
350b179364L17488O88422l5556n9974l43022m72896J337980J82130p50863N5838
340a259817R54551P82335Q78272K4809Q20679j070854o05574J246829L07408m01217
330A677421k62482q79009j095058j639915j93760J503687J224930R64061j341487
$$ plain form
397 -165771 -605933 -385972 1121539 1096860 1327519 739940 -478662 -605887 -683952 -660187
387 -660187 -64083 974370 2709269 1064767 -101280 198877 -919188 -559614 88190
378 88190 360029 -740815 -1378787 -310616 -31399 838260 591039 295713 1946848 1371951
368 1371951 -368208 301234 -167700 -1010460 -1617470 -563997 1235753 993981 1014787
359 1014787 1310908 242683 317660 -30560 408438 1120939 -26902 -1256012 -2179364
350 -2179364 -1861876 -1173454 -1209010 -1268984 -1612006 -2084902 -746922 -564792 -1315655 -1259817
340 -1259817 -305266 477069 1355341 1380150 2200829 1129975 524401 1771230 2078638 1677421
330 1677421 1414939 535930 -559128 -2199043 -2392803 -889116 335814 1299875 -41612
321d1612j130084J168441N02419j610681J060118J365469j078159n8314J145318
312A322915q3710L0799K67530j568030m99541P10642l7349J88379k63726J76369
302B44278K2627j260951K98120j50811j5648P18699j59850q47693P19992J157726
292G26489q89288j172032P18848P69993R4430M03937o24550L5689L31797l21433
282G3880M47360l6865j182433O76326j3458O19334J73311j732353L31939O53588
272A0629j462308q5499J856460M65401j76977j7859k06515r88803R0448O05027
262I0004j94621M47508J221060j55980n51623o95668n02612L2867l43871K77137
252c75799Q1750R97994N00772j223791j15403P23551m25250k9652q13071l75313
$$ plain form
321 -41612 -1171696 -3255 499164 -1111517 -51399 1314070 235911 177597 1322915
312 1322915 1239205 1270004 1537534 -30496 -530037 180605 143256 331635 67909 244278
302 244278 266905 -994046 -695926 -846737 -862385 -143686 -303536 -1151229 -431237 726489
292 726489 -162799 -1334831 -615983 154010 248440 652377 27827 63516 395313 73880
282 73880 521240 484375 -698058 -21732 -35190 584144 757455 -974898 -642959 10629
272 10629 -1451679 -1537178 319282 784683 607706 589847 383332 -605471 -515023 90004
262 90004 -104617 342891 1563951 1407971 856348 160680 -341932 -309065 -652936 -375799
252 -375799 -294049 703945 1204717 -19074 -134477 589074 163824 134172 -678899 -1054212
242a054212L37807O73764M89437j023230J99673M53682j366620m99598J68254
233a621043O44251K22779N05909J805595J2776m51929q79055j411693L82963N55577
223b33870o89366J436636J330362j015865j241588o9056J58474K16734O12334
214E04795j0420j217929p84865J073151N08371P59031J29561q85973l24274K82062
204C3510o78527k420M33356M02689j52806J39585M2377p10267K15411J46338Q82462
193G51708q76428k79235O65461j63810K40919k63076j156828N15340J42128k05704
183f29525M26499j50579L17392L85253k91019M12100K05208j187429P43622J076697
173A308219J24271j297877l81818K89457j62086N3095r518l12614K00171k23902
$$ plain form
242 -1054212 -716405 -42641 446796 -576434 -376761 76921 -1289699 -1789297 -1621043
233 -1621043 -976792 -754013 -248104 1557491 1570267 1118338 239283 -1172410 -789447 -233870
223 -233870 -923236 513400 1843762 827897 -413691 -482747 -324273 -107539 504795
214 504795 494375 -723554 -1508419 -435268 73103 832134 961695 75722 -248552 33510
204 33510 -645017 -647437 -214081 188608 35802 175387 217764 -492503 -277092 -130754 751708
193 751708 -124720 -403955 261506 97696 338615 75539 -1081289 -565949 -423821 -629525
183 -629525 -203026 -353605 -36213 349040 58021 470121 675329 -512100 231522 1308219
173 1308219 1432490 134613 -247205 42252 -119834 -66739 -76257 -388871 -188700 -412602
163d12602q11273j87619K52088J274610O74223j032587p48870L88219M36060Q49047
153F81296m00874q10821R93919O88172j424495n81024q52399M91505Q34278O73341
143B92898J158406J30575l69682l55108j502925P1996L02558p84180K59111O55062
133a41289J002203m03861m20840M02857N5819m37959j119494p17590J044532J132668
123C97046Q51511O142k08156j70688k59809K50711o12860q91505M54970r7551
113b80189r99262Q1953j44038J45389J194265J226439k78149j183688n36566j92089
103i65935N41053j26804m37008P65461R40820m18536k69410j03736M08005K86443
93F20353j027806o66551m94354n16082J590599J540408J73860J76907p11861o48583
$$ plain form
163 -412602 -1223875 -1411494 -1159406 115204 789427 -243160 -992030 -603811 -167751 681296
153 681296 280422 -530399 463520 1151692 -272803 -853827 -1706226 -1214721 -380443 292898
143 292898 1451304 1581879 1212197 857089 -645836 -573840 -271282 -1055462 -796351 -141289
133 -141289 860914 457053 36213 439070 494889 56930 -1062564 -1780154 -735622 397046
123 397046 1248557 1254699 1046543 875855 616046 866757 253897 -637608 -182638 -280189
113 -280189 -1279451 -1197498 -1341536 -1196147 -1882 1224557 946408 -237280 -773846 -965935
103 -965935 -424882 -551686 -988694 -223233 717587 299051 29641 -74095 333910 620353
93 620353 -407453 -1074004 -1568358 -2084440 -493841 1046567 1220427 1397334 685473 36890
83C6890o7460l19330O2067K9206n55154N04811M23362k34069j51954k6270O02441
72C04540M54448n39389o06636Q28698M21789o49393o95837K31779J57110K36491
62A43600l4393k05907K72943J78206o84571k27616j87304l28233K4688O70046
52c78541Q67455k37260j12149N2107m33101j144440o7113K4477P26937R61635
42B60007O8116l83059N66407m38499n32450m46128m50109L55243O92066M26539
32A18133O5471k14698R11833J02991j136548k17647k875m27738k88922N71708
22e18292J218202M71799k12505l70582k94036Q9285j95491k20853j7202J64369
12A14694m81713k8258K09476M38127K97711K24528l43943j15429j89311l22k21825
$$ plain form
83 36890 -30570 -349900 -287833 -258627 -813781 -308970 114392 -119677 -271631 -297901 304540
72 304540 758988 219599 -387037 441661 863450 214057 -481780 -250001 -92891 143600
62 143600 109207 -96700 176243 354449 -330122 -557738 -745042 -1073275 -1048587 -378541
52 -378541 488914 251654 139505 191612 -241489 -1385929 -1453042 -1428565 -701628 260007
42 260007 328123 -54936 511471 72972 -459478 -905606 -1355715 -1000472 -308406 118133
32 118133 183604 -31094 880739 983730 -152818 -370465 -373340 -801078 -1090000 -518292
22 -518292 699910 1171709 959204 588622 294586 383871 188380 -32473 -49675 114694
12 114694 -367019 -395277 -185801 252326 550037 774565 430622 315193 125882 125560 -96265
1i6265p3294
0a69559
$$ plain form
1 -96265 -169559
0 -169559
$$ Imaginary data points
##PAGE= N=2
##DATA TABLE= (X++(I..I)), XYDATA
16383g53126o42552M96195P67153r26086j2722Q27019K9769m46385R55730L66871
16373F61866j88287j59158j02865m97007J38011q97319o45848J079193J74264
16364d37150M4486P25471M1140j69981n70170K67900K80153M34521r986k64785
16354C41599L80683K86083n26320q42833q6444N44634l63834r84057l61710J028895
16344e83304J362210k75736L6830J011979p64695p66617k84431p50111K63418
16335g50457j02581M90580M34770k87008r4387k54861P15648R06911j93092K4752
16325H90275R3610J57793m77902r23462Q25223R62777N27475j80744j313049j81336
16315C80660J89859j266278q24709J94353O82126Q00489l2905l36743J895866
$$ plain form
16383 -753126 -1395678 -899483 -132330 -1058416 -1071138 -244119 -214350 -660735 294995 661866
16373 661866 473579 314421 211556 -285451 -147440 -1044759 -1690607 -611414 -437150
16364 -437150 -392664 332807 373947 203966 -366204 -98304 181849 616370 606384 341599
16354 341599 722282 1008365 482045 -360788 -447232 97402 -266432 -1250489 -1612199 -583304
16344 -583304 778906 503170 540000 1551979 787284 20667 -263764 -1013875 -750457
16335 -750457 -853038 -362458 72312 -214696 -309083 -563944 151704 1058615 865523 890275
16325 890275 983885 1141678 663776 -259686 565537 1528314 2055789 1875045 561996 380660
16315 380660 570519 -695759 -1520468 -1326115 -643989 156500 123595 -213148 1682718
16306A682718J112953j453421q3270M67725j230412K504k15174J31099P41583
16297A156305n01866m72378N81311O10052o00402k69806Q99431o77601r15473
16288a90427j64267k92210Q31816L82463J30938L50769P4613l44599l25755n14111
16278f0770L67410n2368L51949n12129L0030J122886j31013L24123O70158p40713
16268A369563K28495q10134l65950l91445J25081P27169m27975K58146L45827
16259A058777k19405L05608j14154l03355J116171L10306l11342O4157m83120
16250A423643j9812p9821q685k58669p3234R90004K69058r39974j050830p4229
16240A77451r951l09179Q37835M53196k02278J130645j27854q41677q38298P9349
$$ plain form
16306 1682718 2795671 1342250 1258980 1726705 496293 498797 283623 414722 1156305
16297 1156305 654439 182061 763372 1373424 773022 503216 1402647 725046 -190427
16288 -190427 -354694 -646904 184912 567375 698313 1049082 1123695 779096 453341 -60770
16278 -60770 306640 254272 606221 94092 124122 1247008 1115995 1440118 2110276 1369563
16268 1369563 1598058 787924 421974 30529 155610 882779 454804 712950 1058777
16259 1058777 839372 1144980 1030826 727471 1843642 2153948 1842606 1906763 1423643
16250 1423643 1403831 1324010 1315325 1056656 983422 1973426 2242484 1302510 251680 177451
16240 177451 167500 -141679 696156 1149352 947074 2077719 1949865 1108188 269890 349239
16230C49239L25448p14110j45696O09619M40967L81933m24260L65243O12131q56042
16220I44472j150127P32521P16923m35116k95609M65409K58470J40562N46662
16211A924167K01870o07276M5476j5797p36378K72888n52660K68510p4616P76948
16201A503132N97525n30628l23823M74262r62334p83901o09525j96462J177344
16192C45590J902563M87379L29612M13156k08404r58098j285307R63347k17978
16183A771860p35715m48170J185188L68351j093238p16641Q68857P34730M7080
16174A982302j191618L16134J190093J9305j38406L42824j74747K7736j538538
16165H35085K3205n01519j280189J181473J158688L5304O47982o63727o92664
$$ plain form
16230 349239 674687 -39423 -185119 424500 865467 1247400 823140 1188383 1800514 944472
16220 944472 -205655 526866 1243789 808673 513064 978473 1236943 1377505 1924167
16211 1924167 2126037 1518761 1564237 1548440 812062 1084950 532290 800800 726184 1503132
16201 1503132 2100657 1570029 1246206 1720468 758134 -25767 -635292 -831754 345590
16192 345590 2248153 2735532 3065144 3478300 3269896 2311798 1026491 1989838 1771860
16183 1771860 1036145 587975 1773163 2141514 1048276 331635 1200492 1935222 1982302
16174 1982302 790684 1106818 2296911 2316216 2177810 2520634 2345887 2373623 835085
16165 835085 858290 356771 -923418 258055 1416743 1452047 2100029 1436302 743638
16156G43638L60573k68625N13010j69840q5791P26827j122358o67085L07182M60831
16146G98362P55171k11093K98649O0310j4206J208338n27615m55922J142758p64157
16136B290595k85011p01214l61559P83356P15459j59300L50293K80926L72537
16127C286082j190405j070936l52607j070720l99986J395911M67752J62444P91312
16118B018847j031049n85380P19859L20907l13518j77789L13671P14314J99101
16109B178963l76111J115122M84709j534822l1156j173649p98469R07162J167960
16100A939709L95516O7481r03345l17055M1772j197410N40899P14323M01401Q4710
16090A768001K51512K10595j060061N67395J349080m74393K09284q75188l64920
$$ plain form
16156 743638 1104211 835586 1348596 1178756 1092965 1819792 697434 30349 337531 798362
16146 798362 1553533 1342440 1641089 1701399 1687193 2895531 2367916 1911994 3054752 2290595
16136 2290595 2005584 1304370 942811 1726167 2441626 2282326 2632619 2913545 3286082
16127 3286082 2095677 1024741 672134 -398586 -798572 597339 1065091 1227535 2018847
16118 2018847 987798 402418 1122277 1443184 1129666 951877 1265548 1979862 2178963
16109 2178963 1802852 2917974 3402683 1867861 1836705 663056 -135413 771749 1939709
16100 1939709 2335225 2402706 1499361 1182306 1224078 26668 567567 1281890 1683291 1768001
16090 1768001 2019513 2230108 1170047 1737442 3086522 2612129 2821413 1946225 1581305
16081A581305N3782j039648o66116K24932K52235J127245j06819m93042O49783
16072A583657n47218l79339R06194J20672K68533J09743J197861k11274r73407
16063B075422m19639p42234P73142J771432j180876m11073R81206L74104j204064
16054B017420j441227m08520n37050N60434J193810r6138Q8809J24389o3679n85184
16044H53064q30248J230493j1834J55926J138436L19335n48709P31784o78998
16035B359249K351n82973Q4313q39132o814N58743j81436k45563M00120q20886
16025G27972K63815P10192l35063j131R63450Q04451m83591k92389m65695n25369
16015A366642n63947n70493j10915P53989L90895J76236p8430j5923Q8752Q2862
$$ plain form
16081 1581305 1635087 595439 -70677 154255 406490 1533735 1426916 933874 1583657
16072 1583657 1036439 657100 1563294 1683966 1952499 2062242 3260103 3048829 2075422
16063 2075422 1655783 913549 1686691 3458123 2277247 1866174 2847380 3221484 2017420
16054 2017420 576193 167673 -369377 191057 1384867 1288729 1377538 1501927 1438248 853064
16044 853064 22816 1253309 1241475 1397401 2535837 2855172 2306463 3038247 2359249
16035 2359249 2361600 1778627 1862940 1023808 1016994 1575737 1394301 1148738 1548858 727972
16025 727972 991787 1701979 1366916 1365785 2329235 3133686 2650095 2357706 1892011 1366642
16015 1366642 802695 232202 121287 875276 1266171 1442407 1363977 1348054 1436806 1519668
16005A519668M55510J26245l83690n85472m83230Q94259j136825j522284Q63262
15996b52557R65485J408543O50963n57911L42346K67594p52135K33340m39692
15987A865976K32378J078102p50890j186861L30915J845723K74744q91246l59406
15978B439435l18171q78420o62178Q821K03545J51022L40999o42657M12089N32602
15968A587087l76366o15632p4259K62013L6588O43995J23308o55371o4596J46270
15958A013037p28464J039767Q69821q31878m1663L38785J78784M02925M19536
15949B660650K62038l26223j875484q85442r32022J205913J196716p18165N38878
15940A126859K039511j174303r469j43656M18632P69461J13416m8936O89424J65795
$$ plain form
16005 1519668 1975178 2101423 1717733 1132261 649031 1543290 406465 -1115819 -252557
15996 -252557 712928 2121471 2772434 2214523 2556869 2824463 2072328 2305668 1865976
15987 1865976 2098354 3176456 2425566 1238705 1569620 3415343 3690087 2798841 2439435
15978 2439435 2121264 1242844 580666 589487 793032 944054 1285053 642396 1054485 1587087
15968 1587087 1210721 595089 520830 782843 819431 1463426 1586734 931363 866767 1013037
15958 1013037 284573 1324340 2194161 1362283 1320620 1659405 1838189 2241114 2660650
15949 2660650 2922688 2596465 720981 -164461 -1096483 109430 1306146 587981 1126859
15940 1126859 3166370 1992067 1982598 1838942 2257574 3027035 3140451 3091515 3780939 3946734
15930C946734j065368j211540l14266l81786o68163m75971Q32474Q84862r11870
15921F35106J799943Q03930j522137o95187J020019k62570j050087q30851J288581
15912A186747Q552P34786O56804m00317O82507n5950j894554l28042n16012J241927
15902A316448j02056L38424L35955r00738R88340J057380r98965J95447n34066
15893A696169j130691N0217L60146j17990O69328R6753P3284o12458q9273l20323
15883F75162N88163J094488J75505j59177m563J084360L00688q39885k14381q07481
15873A892879n45625J671420l59552n09361q18777J56629K7993k33680L19645
15864A601571P18796m01124r04853j342461J234973N26478n5861J0602k7186K81057
$$ plain form
15930 3946734 2881366 1669826 1355560 973774 305611 -170360 662114 1546976 635106
15921 635106 2435049 3238979 1716842 1021655 2041674 1779104 729017 -101834 1186747
15912 1186747 1195299 1930085 2586889 2186572 2869079 2813129 918575 590533 74521 1316448
15902 1316448 1214392 1552816 1888771 988033 1976373 3033753 2034788 2230235 1696169
15893 1696169 565478 615695 975841 857851 1527179 1623932 1697216 1084758 995485 675162
15883 675162 1263325 2357813 2533318 2374141 2369578 3453938 3754626 2914741 2700360 1892879
15873 1892879 1347254 3018674 2659122 2149761 1330984 1487613 1515606 1281926 1601571
15864 1601571 2320367 1919243 1014390 -328071 906902 1433380 1377519 1388121 1360935 1641992
15854A641992J33901q43898J11041J062010K38459m86196J33316L31174m78225
15845A843574r4246m63881J74286M71552n94879p780m98653j61K40830j006403
$$ plain form
15854 1641992 1775893 931995 1043036 2105046 2343505 1857309 1990625 2321799 1843574
15845 1843574 1749328 1285447 1459733 1931285 1336406 1328626 829973 829812 1070642 64239
$$ [...]
##END NTUPLES=NMR SPECTRUM
##END=
