##TITLE=1H_DE-80H_X3
 200.13MHz, d2o
 8 sc
 
 19ns.26.2.2025
##JCAMPDX= 6.0         $$ Bruker NMR JCAMP-DX V2.0
##DATA TYPE= NMR SPECTRUM
##DATA CLASS= NTUPLES
##ORIGIN= UXNMR, Bruker Analytische Messtechnik GmbH
##OWNER= pz
$$ XWIN-NMR		Version 3.5
$$ Wed Jan 21 10:28:04 2026 Russian Standard Time (UT+4h)  Yarkov@DPX200
##.OBSERVE FREQUENCY= 200.1313
##.OBSERVE NUCLEUS= ^1H
##.ACQUISITION MODE= SIMULTANEOUS
##.ACQUISITION SCHEME= undefined
##.AVERAGES= 8
##.DIGITISER RES= 18
##SPECTROMETER/DATA SYSTEM= spect
##.PULSE SEQUENCE= zg30
##.SOLVENT NAME= CDCl3
##.SHIFT REFERENCE= (INTERNAL, CDCl3, 0, 15.488)
##AUDIT TRAIL= $$ (NUMBER, WHEN, WHO, WHERE, WHAT)
$$ ##TITLE= Audit trail, XWIN-NMR		Version 3.5
$$ ##JCAMPDX= 5.01
$$ ##ORIGIN= Bruker BioSpin GmbH
$$ ##OWNER= Yarkov
$$ C:/Bruker/XWIN-NMR/data/yarkov2/nmr/H-C/1/pdata/1/auditp.txt
$$ ##AUDIT TRAIL=  $$ (NUMBER, WHEN, WHO, WHERE, WHAT)
(   1,<2026-01-21 10:27:02.71 +0400>,<Yarkov>,<DPX200>,
      <created by zg, POWCHK disabled, PULCHK disabled
       configuration hash MD5:
       00 E9 B6 7A A2 85 ED C7 34 08 36 98 17 FE 4E 26
       data hash MD5: 16K
       AE 54 C6 B6 DB 5F 98 11 DD C4 73 A3 D3 65 2C 6C>)
(   2,<2026-01-21 10:27:13.04 +0400>,<Yarkov>,<DPX200>,
      <Start of raw data processing
       efp BC_mod = 2 LB = 0.25 FT_mod = 6 PKNL = 1 PHC0 = -5297.497 PHC1 = 7.62193 SI = 16K 
       data hash MD5: 16K
       9E C1 2A 88 A6 08 57 31 98 16 8C 89 3E 4B 06 15>)
$$ ##END=
$$ 
$$ hash MD5
$$ 21 01 69 FD 4C D4 2E 9D 3F D3 D0 CB 42 1B 13 ED
##$RELAX= 
##$RELAX= 
##$RELAX= 
##$RELAX= 
##$RELAX= 
##$RELAX= 
$$ Bruker specific parameters
$$ --------------------------
##$DU= <C:/Bruker/XWIN-NMR>
##$EXPNO= 1
##$NAME= <H-C>
##$PROCNO= 1
##$TYPE= <nmr>
##$USER= <yarkov2>
##$AMP= (0..31)
100 100 100 100 100 100 100 100 100 100 100 100 100 100 100 100 100 100 
100 100 100 100 100 100 100 100 100 100 100 100 100 100 
##$AQSEQ= 0
##$AQ_mod= 1
##$AUNM= <au_zg>
##$AUTOPOS= <>
##$BF1= 200.13
##$BF2= 200.13
##$BF3= 200.13
##$BF4= 200.13
##$BF5= 200.13
##$BF6= 200.13
##$BF7= 200.13
##$BF8= 200.13
##$BYTORDA= 1
##$CFDGTYP= 0
##$CFRGTYP= 5
##$CHEMSTR= <none>
##$CNST= (0..31)
1 1 145 1 1 1 1 1 1 1 1 1 1 1 1 1 1 1 1 1 1 1 1 1 1 1 1 1 1 1 1 1 
##$CPDPRG= <>
##$CPDPRG1= <>
##$CPDPRG2= <>
##$CPDPRG3= <>
##$CPDPRG4= <mlev>
##$CPDPRG5= <mlev>
##$CPDPRG6= <mlev>
##$CPDPRG7= <mlev>
##$CPDPRG8= <mlev>
##$CPDPRGB= <>
##$CPDPRGT= <>
##$D= (0..31)
0 0.7 0 0 0 0 0 0 0 0 0 0.03 0 0 0 0 0 0 0 0 0 0 0 0 0 0 0 0 0 0 0 0 
##$DATE= 1768976822
##$DBL= (0..7)
120 120 120 120 120 120 120 120 
##$DBP= (0..7)
150 150 150 150 150 150 150 150 
##$DBP07= 0
##$DBPNAM0= <>
##$DBPNAM1= <>
##$DBPNAM2= <>
##$DBPNAM3= <>
##$DBPNAM4= <>
##$DBPNAM5= <>
##$DBPNAM6= <>
##$DBPNAM7= <>
##$DBPOAL= (0..7)
0.5 0.5 0.5 0.5 0.5 0.5 0.5 0.5 
##$DBPOFFS= (0..7)
0 0 0 0 0 0 0 0 
##$DE= 6
##$DECBNUC= <off>
##$DECIM= 32
##$DECNUC= <off>
##$DECSTAT= 4
##$DIGMOD= 1
##$DIGTYP= 9
##$DL= (0..7)
0 120 120 120 120 120 120 120 
##$DP= (0..7)
$$ [...]
##$SUBNAM2= <"">
##$SUBNAM3= <"">
##$SUBNAM4= <"">
##$SUBNAM5= <"">
##$SUBNAM6= <"">
##$SUBNAM7= <"">
##$SUBNAM8= <"">
##$SUBNAM9= <"">
##$SW= 18.0517328524113
##$SWIBOX= (0..15)
0 0 2 0 0 0 0 0 0 0 0 0 0 0 0 0 
##$SW_h= 3612.71676300578
##$TD= 16384
##$TD0= 1
##$TE= 0
##$TE2= 300
##$TE3= 300
##$TEG= 300
##$TL= (0..7)
0 120 120 120 120 120 120 120 
##$TP= (0..7)
150 150 150 150 150 150 150 150 
##$TP07= 0
##$TPNAME0= <>
##$TPNAME1= <>
##$TPNAME2= <>
##$TPNAME3= <>
##$TPNAME4= <>
##$TPNAME5= <>
##$TPNAME6= <>
##$TPNAME7= <>
##$TPOAL= (0..7)
0.5 0.5 0.5 0.5 0.5 0.5 0.5 0.5 
##$TPOFFS= (0..7)
0 0 0 0 0 0 0 0 
##$TUNHIN= 0
##$TUNHOUT= 0
##$TUNXOUT= 0
##$USERA1= <user>
##$USERA2= <user>
##$USERA3= <user>
##$USERA4= <user>
##$USERA5= <user>
##$V9= 5
##$VALIST= <valist>
##$VCLIST= <CCCCCCCCCCCCCCC>
##$VD= 0
##$VDLIST= <DDDDDDDDDDDDDDD>
##$VPLIST= <PPPPPPPPPPPPPPP>
##$VTLIST= <TTTTTTTTTTTTTTT>
##$WBST= 1024
##$WBSW= 4
##$XGAIN= (0..3)
0 0 0 0 
##$XL= 0
##$YL= 0
##$YMAX_a= 162351
##$YMIN_a= -99661
##$ZGOPTNS= <>
##$ZL1= 120
##$ZL2= 120
##$ZL3= 120
##$ZL4= 120
##$ABSF1= 0
##$ABSF2= 0
##$ABSG= 0
##$ABSL= 0
##$ALPHA= 0
##$AQORDER= 0
##$ASSFAC= 0
##$ASSFACI= 0
##$ASSFACX= 0
##$ASSWID= 0
##$AUNMP= <proc_1d>
##$AZFE= 0.1
##$AZFW= 0.1
##$BCFW= 0
##$BC_mod= 2
##$BYTORDP= 0
##$COROFFS= 0
##$CY= -3
##$DATMOD= 1
##$DC= 0
##$DFILT= <>
##$DTYPP= 0
##$F1P= 0
##$F2P= 0
##$FCOR= 1
##$FTSIZE= 16384
##$FT_mod= 6
##$GAMMA= 0
##$GB= 0
##$INTBC= 1
##$INTSCL= 3.241238e-09
##$ISEN= 128
##$LB= 0.25
##$LEV0= 0
##$LPBIN= 0
##$MAXI= 10000
##$MC2= 0
##$MEAN= 0
##$ME_mod= 0
##$MI= 1.114404
##$NCOEF= 0
##$NC_proc= -7
##$NLEV= 6
##$NOISF1= 3.799351
##$NOISF2= 2.8
##$NSP= 0
##$NTH_PI= 0
##$NZP= 0
##$OFFSET= 15.48797
##$PC= 1
##$PHC0= -5297.497
##$PHC1= 7.62193
##$PH_mod= 1
##$PKNL= yes
##$PPARMOD= 0
##$PSCAL= 0
##$PSIGN= 0
##$REVERSE= no
##$SF= 200.130006752521
##$SI= 16384
##$SIGF1= 3
##$SIGF2= 2
##$SINO= 0.751879
##$SIOLD= 32768
##$SREGLST= <19F.Aceton>
##$SSB= 0
##$STSI= 16384
##$STSR= 0
##$SW_p= 3612.71676300578
##$SYMM= 0
##$S_DEV= 0
##$TDeff= 16384
##$TDoff= 0
##$TI= <>
##$TILT= no
##$TM1= 0
##$TM2= 0
##$TOPLEV= 0
##$USERP1= <user>
##$USERP2= <user>
##$USERP3= <user>
##$USERP4= <user>
##$USERP5= <user>
##$WDW= 1
##$XDIM= 16384
##$YMAX_p= 466103336
##$YMIN_p= -599263
$$ End of Bruker specific parameters
$$ ---------------------------------
##NTUPLES= NMR SPECTRUM
##VAR_NAME=  FREQUENCY,     SPECTRUM/REAL,   SPECTRUM/IMAG
##SYMBOL=    X,             R,               I
##VAR_TYPE=  INDEPENDENT,   DEPENDENT,       DEPENDENT
##VAR_FORM=  AFFN,          ASDF,            ASDF
##VAR_DIM=   16384,         16384,           16384
##UNITS=     HZ,            ARBITRARY UNITS, ARBITRARY UNITS
##FACTOR=    0.220516191357247, 1,           1
##FIRST=     3099.6076111632, 0,             0
##LAST=      -513.109151842582, 0,           0
##MIN=       -513.109151842582, -599263,     0
##MAX=       3099.6076111632, 466103336,     0
$$ Real data points
##PAGE= N=1
##DATA TABLE= (X++(R..R)), XYDATA
$$ [...]
7536C64195o1868j5980J86806p133k26161K0666J53847j33363j58060J965J66442
7525B91356l9141j86437J52129N8450r711m5903P4479p5685J3904K55142Q7139
7514E75722j11111j17938M348q8593J52945P6096l7221L6892o2397J8849j35209
7503C12383O5202O8600p1573J8478K33398J9035j95694p2650J34808j12464l5404
7492C64119j8541J41431K6564j23934q2252J15594M5512j01810L1549K3069K0422
7481D41723J46290k5119j26014J62228O8760l8410R3629N0784j95753j14226J97343
7470F61235J25157k45568p2371n231j64738L7330Q8299l9628O0219M4954l379
7459D86279k82251J1771J14002l4504J38031Q591j21044q9516R4407L1019j19782
$$ y = [364195, 302327, 286347, 473153, 466020, 239859, 260525, 414372, 281009, 122949, 124914, 291356, 252215, 65778, 217907, 276357, 266646, 220743, 295222, 219537, 233441, 488583, 575722, 464611, 346673, 351021, 262428, 415373, 491469, 454248, 491140, 428743, 447592, 312383, 377585, 446185, 374612, 393090, 626488, 645523, 449829, 377179, 511987, 399523, 364119, 345578, 487009, 513573, 389639, 307387, 422981, 468493, 366683, 398232, 421301, 441723, 588013, 562894, 436880, 599108, 667868, 629458, 723087, 773871, 578118, 463892, 661235, 786392, 540824, 468453, 463222, 298484, 335814, 424113, 384485, 444704, 489658, 486279, 204028, 215799, 329801, 295297, 433328, 441919, 320875, 231359, 325766, 356785, 237003]
7448B37003J50082J61873q3825l19064r9186K38116M23428p3436r1495N2734j24428
7437D71802n8552K04263r190q4986K1780j8721M9378l3444p3177n7300J24889
7426E36742J82715k7846j16668o2676K63958j68304k94813K57285P5567J23700
7416G69660j2419k26575k12513K18831J40451r3683o7718J49600k7244n3990k32661
7405C51739Q1097J89653M4917o515L1191j79654k23975K6572K15162L03303l4082
7394G99408k26603k2462J21980Q662m4202o5908J3924J11550O564k3195J31977
7383H11695K77099M3469N1147J9687K21405O1686K0609K07470K54165J80574j51552
7372A997454k6783M5611o7252j21736J9144J10497j36011l78370j03034K28293
$$ y = [237003, 387085, 548958, 465133, 146069, 46883, 284999, 708427, 634991, 543496, 596230, 471802, 413250, 617513, 608323, 523337, 545117, 526396, 575774, 542330, 469153, 411853, 536742, 719457, 691611, 574943, 512267, 776225, 607921, 313108, 570393, 645960, 769660, 757241, 530666, 318153, 536984, 677435, 583752, 516034, 665634, 638390, 584400, 351739, 432836, 622489, 667406, 660891, 692082, 512428, 288453, 315025, 530187, 833490, 799408, 572805, 550343, 672323, 680985, 636783, 570875, 584799, 696349, 702913, 679718, 811695, 1088794, 1132263, 1183410, 1203097, 1424502, 1486188, 1506797, 1714267, 1968432, 2149006, 1997454, 1970671, 2016282, 1949030, 1827294, 1846438, 1956935, 1820924, 1442554, 1339520, 1567813]
7362A567813J0623k29577k03994N4945M04905K8574J02011J43127J09752J96890
7352B185069J32271p9342Q529j61611j61310j95591k09054j30268j50727j26072
7342A111894l6856R883j00598n0668j69727R3796R6404j19837N4602O5720k04999
7331G49614j46707J8361J98796J88085p5889k25476k35322K84881K07244k22504
7321G41083j60490J15658P7207j53847o7311K70362J90840k00265p7895Q9993
7311H25335K18485q9802j26697j65449L2722K71028q0019o2467N8663J20904j8405
7300I84298N1516N7957J70949p0445j25388m8478J72199k0260q9300n1154J69162
7289A201056P1493j38122k79216o3032N2474J7058j54075q1444L6687j33846k87969
$$ y = [1567813, 1578436, 1348859, 1144865, 1199810, 1604715, 1633289, 1735300, 1878427, 1988179, 2185069, 2317340, 2237998, 2246527, 2084916, 1923606, 1728015, 1518961, 1388693, 1237966, 1111894, 1075038, 1084921, 984323, 933655, 763928, 857724, 954128, 834291, 888893, 954613, 749614, 602907, 621268, 820064, 1008149, 932260, 706784, 471462, 756343, 963587, 741083, 580593, 696251, 773458, 619611, 552300, 822662, 1013502, 813237, 735342, 825335, 1043820, 954018, 827321, 661872, 694594, 965622, 885603, 823136, 881799, 1002703, 984298, 1035814, 1093771, 1264720, 1194275, 1068887, 1020409, 1192608, 1172348, 1083048, 1031894, 1201056, 1272549, 1134427, 855211, 792179, 844653, 861711, 707636, 626192, 662879, 529033, 241064]
7278B41064N8928L24458K43221j14328l18815q8876L22100K802j65224k2281J26169
7267F09218l1363q8044n8812r0660J19442J85867J85132j1049N7927k51626o1913
7256E64119J39735J68595j82343n6104K1501j08521O7918m6700l4535R3832j03070
7245E24427k29239j11430J42405J56443n3246j9911J72942L6144J9865l18369
7235C20031j98996L9325K47179l8738J11012J24625k03801k04616K99420K09617
7225G05058j48747j28526J30245P1590j25258r8273J37728K83322J81075m642
7215A003572k79569l60580Q6266J65077j0959o5903J2224Q3724j17146l58629
7205A58077O8972J75633K30650P7415j27225l91607j52183J70981J96972K87973
$$ y = [241064, 299992, 624450, 867671, 753343, 434528, 345652, 667752, 670554, 505330, 483049, 609218, 577855, 489811, 430999, 340339, 459781, 645648, 830780, 819731, 877658, 626032, 564119, 703854, 872449, 690106, 634002, 655503, 546982, 614900, 568200, 533665, 627497, 524427, 295188, 183758, 326163, 482606, 429360, 409449, 582391, 618535, 638400, 320031, 121035, 160360, 407539, 368801, 479813, 604438, 400637, 196021, 495441, 705058, 556311, 427785, 558030, 629620, 504362, 406089, 543817, 827139, 1008214, 1003572, 724003, 363423, 449689, 614766, 603807, 537904, 550128, 633852, 516706, 158077, 227049, 402682, 633332, 710747, 583522, 191915, 39732, 210713, 407685, 695658]
7195F95658j91459r7659M1917m754n3489k05550J21726J85875J01043j80205k93520
7184A19583O87J10011J56596o052K0675j52827j5728J67826J5998j63977J68814
7173D21606J92739j44724j74495j33157j31344J76466L15828k5009l45922J70799
7163C22787L07361k31279k57610J54003L53354N2727k68481k11708k38945J3569
7153d222K31779J60441J38893m1534j40309n8912l1795J47414j049J34494R8716
7142F33916j72202j70383N3011K19225K65763J44945j92461l52594j93273j202
7132B34745K19829K4183k9092M0815J4531l51868k02223J69621J86196O2479J23759
7121D92975L0844j37025j14321j2010k00128J5865K34900R7328j36015j76713
$$ y = [695658, 504199, 406540, 448457, 443703, 390214, 184664, 306390, 492265, 593308, 413103, 119583, 120270, 230281, 386877, 380825, 401500, 248673, 232945, 400771, 416769, 252792, 421606, 614345, 469621, 295126, 161969, 30625, 207091, 522919, 497910, 151988, 322787, 630148, 398869, 141259, 295262, 648616, 701343, 432862, 221154, -17791, -4222, 227557, 387998, 526891, 485357, 345048, 286136, 254341, 401755, 400706, 535200, 633916, 461714, 291331, 344342, 563567, 829330, 974275, 781814, 429220, 235947, 234745, 454574, 478757, 449665, 490480, 505011, 153143, -49080, 120541, 306737, 369216, 492975, 523819, 386794, 272473, 260463, 60335, 76200, 311100, 408428, 272413, 95700]
7111I5700P8259l3056m306K91157P649k8401o7618m3186n7353o750J01063m3646
7099B89512l5780J09697J64229k62782j74154P7782N2258j6904P4253L702n8658
7088B23155m0378J29142r301J46709Q6996j53476k49415j26717Q4255R0951q4180
7077I7741K72902J23466l05231k82658J14338K51995r7864m3424j155P2375J07725
7066C10210j06424k17887J83823K65814k5789k28175K6682q2015j10879M5173
7056F0533K26866J19332j83953r813J1378j21470N025q204K52807n2045j96839
7045A03617L4398l1658l8757m1460J34538J59796J7532j44060l4144q7573K1555
7034I3784n0821J42398J90166j25773k10916N7887P7918J54115Q997q0409j39918
$$ y = [95700, 173959, 140903, 136597, 427754, 435403, 407002, 339384, 296198, 238845, 232095, 333158, 289512, 253732, 363429, 527658, 264876, 90722, 168504, 220762, 203858, 278111, 281813, 223155, 182777, 311919, 302618, 449327, 536323, 382847, 133432, 6715, 90970, 181921, 97741, 370643, 494109, 188878, -93780, 20558, 272553, 174689, 131265, 130110, 202485, 310210, 203786, -14101, 169722, 435536, 409747, 181572, 208254, 126239, 15360, 60533, 287399, 406731, 222778, 212965, 224343, 102873, 107898, 99694, 352501, 300456, 103617, 138015, 106357, 67600, 26140, 160678, 320474, 338006, 193946, 159802, 72229, 93784, 42963, 185361, 375527, 249754, 38838, 96725, 174643, 328758, 337755, 257346, 117428]
7023A17428O2095j9942k7478q2382L085L02939j059k22450J78288J51529n1585
7012D10468J15418m397q0623k0779k59775r7554j0356J11431J35078Q4614N4666
7001D38191j52234k46528M9428K21278P7336k1499j36298p1177J9689O6899P1341
6990C16426j67606J04483Q7421m8963l75810j3308M05064J22088j11996j21581
6980A96218O6963l6550q6774Q4024K0200m8515J19702J05440k3858l06878K23266
6969C13238O2407m3491J6469K7138o1660l1224l1449K2355P5622P8204j41420
6958B86189p3826P4338m2100j78628J66753n764P8927j1603q9359m6496o3667
6947I4764J86995J25016N8545J33622j54690l28489j96778K70112K91316j58800
$$ y = [117428, 179523, 159581, 132103, 49721, 52806, 355745, 354686, 132236, 310524, 462053, 410468, 525886, 521489, 440866, 420087, 160312, 62758, 52402, 163833, 298911, 383525, 438191, 285957, 39429, 88857, 310135, 387471, 365972, 229674, 158497, 178186, 245085, 316426, 148820, 253303, 340724, 291761, -84049, -97357, 307707, 429795, 317799, 196218, 263181, 226631, 139857, 223881, 244081, 195566, 315268, 420708, 396850, 89972, 313238, 375645, 332154, 348623, 375761, 314101, 282877, 251428, 273783, 349405, 427609, 286189, 212363, 286701, 244601, 65973, 232726, 226962, 305889, 294286, 204927, 158431, 94764, 281759, 406775, 465320, 598942, 444252, 115763, -81015, 189097, 480413, 321613]
6937C21613k73248J02040K01549p0498l0449J07075P376o9910j7379j19713Q3925
6926B42381K5445Q4433J12819q5129j34216j60283J1706K54539P5464o8741j19421
6915B38997M3154j05443M0779k7507l5527P8134J38045p4993k29442P1135K42271
6904C79603n2552n7360J13897n4982j32390j07318J43662l1372j46990N6889K30672
6893C41759R7894j59811j45270n0538K32429J17557k5159j37531k969K45174p9220
6882D34315k47692j3389J56517N0948q5209n7181n3508q3921M00137p2230j53673
6871B75114l7734j20686J53561k4529P8079j04883j12051J97741J49266k29376
6861B24502q2043J29179K13354j7634l07294p4575O6577J23866J86616k62159
$$ y = [321613, 48365, 150405, 351954, 281456, 251007, 358082, 365458, 295548, 278169, 158456, 242381, 267826, 352259, 465078, 379949, 245733, 85450, 97156, 351695, 427159, 358418, 238997, 282151, 176708, 217487, 189980, 154453, 232587, 370632, 295639, 66197, 137332, 379603, 327051, 269691, 383588, 328606, 196216, 88898, 232560, 201188, 54198, 111087, 341759, 439653, 279842, 134572, 84034, 316463, 434020, 408861, 271330, 268361, 513535, 434315, 186623, 173234, 329751, 380699, 295490, 238309, 184801, 100880, 501017, 428787, 275114, 237380, 116694, 270255, 245726, 323805, 218922, 106871, 304612, 453878, 224502, 142459, 271638, 484992, 467358, 160064, 85489, 152066, 275932, 462548, 200389]
6851B00389j65776J83043J54705o4833k58076J21837K56130P0243j76863q2041
6841B38758r8376J36008Q4956L3143o8913r8729J9031J8565j09347n0743J6987
6830A21340J41478O0970r7496j68130p0055K15534K48348R4769r3646j81432r8441
6819A73239R5089R6926m1014j95151K82547K73589k38726l20130m0540M22799
6809E08628J21361k50536k46766L8983K85480O4484j64082R7935K29137o6586
6799F18038j36684l4226J69308j8564N5255R9460p5170j18635r3175j12655J52738
6788E05690K4232L5513j16036n9413P3731n5613l62118o725K93920J81198j80083
6777C34296l00600J08330K21931J742l7645N573J0163j28612J8001o6082N0610
$$ y = [200389, 34613, 217656, 372361, 307528, 49452, 171289, 427419, 497662, 320799, 238758, 140382, 276390, 361346, 394489, 325576, 226847, 245878, 264443, 155096, 104353, 121340, 262818, 323788, 226292, 58162, -11893, 203641, 451989, 546758, 453112, 271680, 173239, 268328, 365254, 324240, 129089, 411636, 685225, 446499, 126369, 85829, 508628, 629989, 379453, 132687, 171670, 457150, 521634, 357552, 455487, 684624, 618038, 481354, 447128, 616436, 597872, 653127, 752587, 677417, 558782, 465607, 352952, 505690, 529922, 565435, 449399, 389986, 463717, 408104, 45986, 39261, 333181, 514379, 334296, 33696, 142026, 363957, 365699, 328054, 333627, 343790, 215178, 233179, 167097, 217707]
6766B17707K66948L6263j58144j68218N1629O0482p6956l3097K03784m8550j37396
6755B14452k66534J35524K30284n8325J6949R1081p032p3188k54375J23657J91227
6744C43720J61336n6567j57408o9852m4830N4039J12392N0409q814J51479K0730
6733E56634k53749j0879J39694k1101j12882J02553M8750k67495n8998K81656
6723D04183J87971j78925j76707M0066M2215m381o4326j01853o1558J76419J36127
6712C99231j38690k07613Q0952K79697m2467q0680q5286J76263L3908j82072k20338
6701A2905K46429J76182L8161M399j18770j52238K0879j8453J58946M8268j04862
6690C11846J14614l4001j46406j61329J22251K64450l920k19324J0840q7710J15972
$$ y = [217707, 484655, 520918, 362774, 194556, 246185, 306667, 229711, 196614, 400398, 351848, 214452, -52082, 83442, 313726, 255401, 272350, 363431, 356399, 283211, 28836, 152493, 343720, 505056, 448489, 291081, 221229, 176399, 230438, 342830, 393239, 384425, 535904, 556634, 302885, 292006, 431700, 410599, 297717, 400270, 449020, 181525, 122527, 404183, 592154, 413229, 236522, 276588, 318803, 314422, 250096, 148243, 86685, 263104, 399231, 260541, 52928, 133880, 413577, 371110, 290430, 205144, 381407, 415315, 233243, 12905, 259334, 435516, 473677, 478076, 359306, 207068, 227947, 209494, 368440, 416708, 311846, 426460, 392459, 246053, 84724, 206975, 471425, 467505, 248181, 259021, 171311, 287283]
6679B87283J01355m5702j03010l3646M3231P8458K5135j38804O1261J11675L237
6668C90473j53933n4559l2281K05487J28879j86922j02738M5601K59763l4288
6658D65482p6310j49477R9878K28943j15224j88997n6192R9878J55883j04227
6648C59637r5953n556q673M0101K35179j32616j70454j06857K39494O9947j60543
6637B63706R3283p0167R3432R8812n5824k72047K18355J69003p7937j63815J22250
6626D19051M04598K008j96692k28218M5243M6530o2837j44646M6162J72613J29958
6615F33770j57125j01833R4760m9588m4805J22843K35632k01369r5742J08120
6605E44663K58132j36677j22808P4282P1519P3202l1040j21475q2176R7722L8186
$$ y = [287283, 388638, 342936, 239926, 206280, 249511, 327969, 353104, 214300, 275561, 387236, 390473, 236540, 181981, 149700, 355187, 484066, 297144, 194406, 240007, 499770, 465482, 389172, 239695, 339573, 568516, 453292, 264295, 208103, 307981, 463864, 359637, 263684, 258128, 249455, 289556, 524735, 392119, 221665, 114808, 354302, 424249, 263706, 356989, 286822, 380254, 479066, 423242, 151195, 369550, 538553, 460616, 296801, 419051, 823649, 825657, 628965, 400747, 445990, 492520, 429683, 285037, 331199, 503812, 633770, 476645, 374812, 469572, 419984, 375179, 498022, 733654, 532285, 436543, 544663, 802795, 666118, 543310, 617592, 689111, 762313, 731273, 609798, 527622, 625344, 663530]
6594F63530n0863j23717P9172o6481j09633k3771J76876M2171O1579j56096j16839
6583C75928R4491N1538J24164J08315Q0692J521k03551j88019J72380J51131L9784
6572H08374N823k4547j18396P024j63703l4731M3885J84816R6850o5161j19340
6561F20894P5541O019J68113K39043m1600n173n5722k2216J29098J66787j72286
6550A108498j36722N8973R4074k22923p5729J93685K37428J41765o7817k70624
6540A060608Q1856J17870Q0936k3958r9595K27517L9398k10592k12667J22865
6530A184238J96464J15941k00211L3831J76195k43165k03946J00543J78118J46474
6520A484482j38407k4017j75656j80258o0893L2317M04913J26354k21163k64069
$$ y = [663530, 612667, 488950, 568122, 501641, 392008, 368237, 545113, 587284, 648863, 492767, 375928, 470419, 521957, 646121, 754436, 835128, 836649, 633098, 445079, 617459, 768590, 808374, 814197, 789650, 671254, 678278, 514575, 479844, 523729, 708545, 805395, 740234, 620894, 696435, 702454, 870567, 1109610, 1068010, 1062837, 1007115, 984899, 1113997, 1280784, 1108498, 971776, 1030749, 1124823, 901900, 826171, 1019856, 1257284, 1399049, 1331232, 1060608, 1142464, 1260334, 1341270, 1317312, 1217717, 1445234, 1484632, 1274040, 1061373, 1184238, 1380702, 1496643, 1296432, 1330263, 1506458, 1263293, 1059347, 1159890, 1338008, 1484482, 1346075, 1322058, 1146402, 966144, 905251, 937568, 1342481, 1468835, 1247672, 983603]
6510I83603j3434J82418j0880m2933j38583Q9226J59023j24056k42965J09463
6500I50882N58979J1207n49742n1232J79433p9098j66683R4861K68094J34897
6490A351598j54047k99871M4937K03889K19199J04262O120J04408J457j57390
6480A424562J40439M26773Q5160l18111l30906M4878J80246l6480j08948K40360
6470A747973J55497r1239l46369n8973L66581q3015l40008r8634N27132q5504
6460A693441k61582j53820M64745L24690K2289K89243J17715q0387k95374j64230
6450A956730k20946m8727R055p8510k23428k09024Q321j00664l1754K73090K20314
6439A554457j60311k71328p2147K14740J12408J12655J29475R7318K0746J1707
$$ y = [983603, 970169, 1152587, 1141707, 1098774, 960191, 1049417, 1208440, 1084384, 841419, 950882, 1509861, 1521068, 971326, 920094, 1099527, 1020429, 853746, 948607, 1216701, 1351598, 1197551, 897680, 942617, 1146506, 1365705, 1469967, 1476087, 1580495, 1581952, 1424562, 1565001, 1991774, 2076934, 1758823, 1427917, 1472795, 1653041, 1616561, 1507613, 1747973, 1903470, 1812231, 1465862, 1406889, 1773470, 1690455, 1350447, 1251813, 1778945, 1693441, 1431859, 1278039, 1742784, 2067474, 2089763, 2379006, 2496721, 2416334, 2120960, 1956730, 1735784, 1687057, 1696112, 1617602, 1394174, 1185150, 1193471, 1092807, 1061053, 1334143, 1554457, 1394146, 1122818, 1050671, 1265411, 1377819, 1490474, 1619949, 1717267, 1738013, 1749720]
6429A749720j08412K31630J87807j45379k26862P848M4798k46277j74908K8531
6419A348496J53113j9522j27145k43905r3385K60534Q4629q1869J02117N2478
6409A435541j65462j69462K12409L04212k54k54735P5677J01894k20498K1112
6399A340434K45708J75060j02458p3298M7749K1728j75952k9984J76510J14623
6389A740120J61629j13471L8585L2502n3837R6820N6057K06023K19009j42698
6379B240739j29420J64236N1103j21578J84428q252j52284J3426r3730j12178
6369B036490N3965J57729J43068O9806m8120q5713j34835O2357K47927K14181
6359B716855p715j80080m0258P1388J83885J00384L5432J02894K18287j51090
$$ y = [1749720, 1641308, 1872938, 2060745, 1915366, 1688504, 1696352, 1741150, 1494873, 1319965, 1348496, 1501609, 1482087, 1354942, 1111037, 1017652, 1278186, 1362815, 1280946, 1383063, 1435541, 1270079, 1100617, 1313026, 1617238, 1616984, 1362249, 1437926, 1539820, 1319322, 1340434, 1586142, 1761202, 1658744, 1585446, 1633195, 1654923, 1478971, 1448987, 1625497, 1740120, 1901749, 1788278, 1826863, 1859365, 1805528, 1902348, 1958405, 2164428, 2383437, 2240739, 2111319, 2275555, 2326658, 2205080, 2389508, 2381256, 2228972, 2242398, 2148668, 2036490, 2090455, 2248184, 2391252, 2461058, 2412938, 2327225, 2192390, 2254747, 2502674, 2716855, 2709140, 2529060, 2488802, 2560190, 2744075, 2844459, 2879891, 2982785, 3201072, 3049982]
6349C049982j41584J09739L81241K19671k06548k818M6238r719J1954K00513K20482
6338C879151J38901K43869n4408j67176Q4655J65131n3255K52097K60267J68349
6328D917581j0136L91435P49291Q65295R08227Q90617R37713P0798q03256q37316
6318H080249l54088j08295k4470k36399j20687L21187Q70930P56498L35813J23990
6308I644728P5082q1722J32423O00799Q80598P72545K82316m07131m85942l85536
6298A1028160n75392m14300M27486Q37763J97258L4858j9664k44405n16742k28833
6288A0526189M30850P24424N88776Q05119J250179J496188J081742K0281n50796
6279A6372952l73486j86332k4487K55810N82268R70000J506005J929124K388137
$$ y = [3049982, 2908398, 3018137, 3399378, 3619049, 3412501, 3409683, 3455921, 3446202, 3458156, 3658669, 3879151, 4018052, 4261921, 4207513, 4040337, 4124992, 4290123, 4236868, 4488965, 4749232, 4917581, 4907445, 5298880, 6048171, 6913466, 7821693, 8712310, 9650023, 9720821, 8917565, 8080249, 7726161, 7617866, 7593396, 7356997, 7236310, 7557497, 8428427, 9184925, 9520738, 9644728, 9719810, 9638088, 9770511, 10371310, 11251908, 12024453, 12306769, 11899638, 11413696, 11028160, 10452768, 10038468, 10465954, 11303717, 11500975, 11535833, 11516169, 11271764, 10755022, 10526189, 10957039, 11681463, 12270239, 13075358, 14325537, 15821725, 16903467, 16923748, 16372952, 15999466, 15813134, 15788647, 16044457, 16626725, 17596725, 19102730, 21031854, 23419991]
6270B3419991L430002M176402M215626L816699L000574K139766J534707O32405
6262D6366172l69695j441755k625077l056539k887024k388693k002304j517614
6254C0077471p44587m26373J25726R01369J446130J880549K906983M366491O104324
6245D6638083P840435R203591R013448O886747M477456K554848J545319J41995
6237H8301922k192081n288145p699863q556876q411458o896315n311776m065380
6229C9880028l010536k078224j424704p59245L617P57927J282423K504818L711957
6220D0868061M620164M669505L776776K801496K061036J638095R76176r706j247714
6211F0153889k714466l644355k641198q18398J712257N554213Q854469Q952668
$$ y = [23419991, 26849993, 31026395, 35242021, 39058720, 42059294, 44199060, 45733767, 46366172, 45996477, 44554722, 41929645, 38873106, 35986082, 33597389, 31595085, 30077471, 29332884, 28906511, 29032237, 29933606, 31379736, 33260285, 36167268, 40533759, 46638083, 54478518, 63682109, 72695557, 79582304, 84059760, 86614608, 88159927, 88301922, 86109841, 80821696, 73121833, 64564957, 56153499, 49257184, 43945408, 39880028, 36869492, 34791268, 33366564, 32607319, 32610936, 33368863, 34651286, 37156104, 40868061, 45488225, 50157730, 53934506, 56736002, 58797038, 60435133, 61411309, 61401603, 60153889, 57439423, 53795068, 51153870, 50335472, 52047729, 57601942, 66456411, 75409079]
6203G5409079M228188k520086o924858q298801p507796n938091m209802k213264
6195D2024569k56199K425626N353309O961904N078459O18247k359343k075104
6187E7771468J218412N215028P362063O582204K335800l003989o654571p501963
6179F3324452n927521k927582P74365L882760L340731n02074m359606o125789
6171E1479736n517562l757825k205624O4771K699714O313660J0364109J1383455
6163G0824434O627776j486052p568769j0460318j0173209q053173o214224m973687
6155B8522778l818359l273194k251900j361565r54715q84501l54642k02122l28903
6146A5092877n23276k29584k42004m67815o02997m06684m10798n62402n31332
$$ y = [75409079, 79637267, 77117181, 70192323, 61893522, 54385726, 48447635, 44237833, 42024569, 41768370, 44193996, 49547305, 56509209, 61587668, 62205915, 59846572, 57771468, 58989880, 64204908, 71566971, 78149175, 80484975, 77480986, 70826415, 63324452, 57396931, 54469349, 55243714, 59126474, 62467205, 61965131, 57605525, 51479736, 45962174, 42204349, 39998725, 40063496, 42763210, 49076870, 59440979, 70824434, 77452210, 75966158, 68397389, 57937071, 47763862, 39710689, 33496465, 28522778, 24704419, 21431225, 19179325, 17817760, 16863045, 15978544, 15623902, 15421780, 15092877, 14569601, 14340017, 14098013, 13630198, 13027201, 12620517, 12209719, 11647317, 11115985]
6137A1115985l98147j87430j52613k56969l92943j0556j27798l2595J15276K83242
6127I955452L83454K86874M77751O48981O04647N77775K46291R2305m1864m48358
6117A2783308n25692p10216o59882q10195p07544p15368p44624m58793k99542
6108G151452l78753m2280M289j72652k29573m6912R6697J37243K85494L87854
6098G192859K28296l0791L08251J87566L1816k6868l05301l82936m18608o11196
6088F173088m44555m81781k91790j69485l51801l95980k57931P5176Q9227j12440
6078C831728j46329l1908J01978j47961m13889j06156K93650P2386j40518j57516
6068C155465J11765j40775j68096J13564Q5320r5451j51625L6326k71466k25689
$$ y = [11115985, 10717838, 10530408, 10377795, 10120826, 9727883, 9717327, 9589529, 9556934, 9672210, 9955452, 10338906, 10625780, 11103531, 11752512, 12357159, 12934934, 13181225, 13273530, 13231666, 12783308, 12257616, 11547400, 10887518, 10077323, 9369779, 8654411, 7909787, 7450994, 7151452, 6772699, 6730419, 6734708, 6562056, 6332483, 6285571, 6382268, 6519511, 6805005, 7192859, 7421155, 7390364, 7698615, 7886181, 7917997, 7891129, 7585828, 7202892, 6784284, 6173088, 5728533, 5246752, 4954962, 4785477, 4433676, 4037696, 3779765, 3854941, 3944168, 3831728, 3685399, 3653491, 3755469, 3607508, 3193619, 3087463, 3381113, 3453499, 3312981, 3155465, 3267230, 3126455, 2958359, 3071923, 3157243, 3061792, 2910167, 2946493, 2675027, 2449338]
6058B449338k67487J66067K28233l4646l65969m06339K8610L50388N9374q6615
6048B120954J49480J07267j55327k04355k6116P0675K57456J43893j12963k85132
6038B065832j23851J7727J15522N4521m3908p2251p2609k53649k5104O0953J22256
6027A845439M6009P2496j37223l17921o4522Q6629K03174J39455k69698k60640
6017A343198J34489K34185k09419q6529O9717L20406N8472l12632k29801J03409
6007A425495K68297J1475p6434l913j49882j19156R3148L710R384l9112K07378
5996A630390L824k32623k53924J06701K12107J98968j06829k77469k37307n2404
5986I91434J46600K40442m1583l7022M9452p006j34014k16072J69059L40376J05641
$$ y = [2449338, 2181851, 2347918, 2576151, 2541505, 2175536, 1769197, 1797807, 2148195, 2207569, 2120954, 2270434, 2377701, 2222374, 2018019, 1991903, 2062578, 2320034, 2463927, 2350964, 2065832, 1941981, 1959708, 2075230, 2129751, 2085843, 2013592, 1940983, 1687334, 1662230, 1723183, 1845439, 1891448, 1963944, 1826721, 1508800, 1444278, 1530907, 1734081, 1873536, 1603838, 1343198, 1477687, 1711872, 1502453, 1415924, 1485641, 1806047, 1864519, 1551887, 1322086, 1425495, 1693792, 1705267, 1628833, 1624920, 1475038, 1355882, 1449030, 1452740, 1462124, 1423012, 1630390, 1634214, 1401591, 1147667, 1254368, 1466475, 1665443, 1558614, 1281145, 1043838, 991434, 1138034, 1378476, 1336893, 1299871, 1349323, 1342317, 1208303, 992231, 1161290, 1501666, 1607307]
5975A607307l75692j12815J50556J20885j4134q7825M8128J32497o8483j49334
5965A251090j79666K43461O7294Q6994r8312q5348J58952J52048n7723L6533J28244
5954A703567L4976r1546m726o8920q8666K45970K901L3252L8505O0510k74083
5943A591740j57328N2358K06887J52751k5323l8568K2868j72530m923J63232K96890
5932B088054J17785o9222j92009J24796J62952O87K1673R7345J01476j35453k90966
5921B027118J4773L41797q6661j24460J1631k6981P1087n6991n5359j10220J14987
5910B120721L06061m1049k04244Q6451K9177j7834Q8584K8654P8849j9900j08125
5899B347345o0821J10628J18480k71400q7789K70053R5757j04518r9892L02725
$$ y = [1607307, 1231615, 1118800, 1269356, 1390241, 1376107, 1288282, 1336410, 1468907, 1400424, 1251090, 1071424, 1314885, 1382179, 1469173, 1370861, 1285513, 1444465, 1596513, 1538790, 1575323, 1703567, 1738543, 1646997, 1642271, 1573351, 1484685, 1730655, 1733556, 1766808, 1805313, 1865823, 1591740, 1434412, 1486770, 1693657, 1846408, 1821085, 1782517, 1805385, 1632855, 1627932, 1791164, 2088054, 2205839, 2136617, 1944608, 2069404, 2232356, 2233043, 2254716, 2352061, 2453537, 2318084, 2027118, 2041891, 2383688, 2297027, 2172567, 2184198, 2157217, 2228304, 2171313, 2115954, 2005734, 2120721, 2426782, 2385733, 2181489, 2267940, 2297117, 2279283, 2367867, 2396521, 2475370, 2455470, 2347345, 2286524, 2397152, 2515632, 2244232, 2156443, 2426496, 2522253, 2417735, 2317843, 2620568]
5889B620568J39856j48583m6334J41100J89915J7930q5592j960J60516J68155
5879C155571j23153j83584J69793L91774J13461j02343P9683K12661p7769j51720
5869C484374J08805J42653J93652K04342l0014j34192J14970J24801J44467J42975
5859D496833P1915p0944j37529L50883K50676j99951N2670O0106J18047j17532
5849D875174j39431J00819K55408O3172j10012k7294k22625J21358J72099J16126
5839E204794l97218j31951J91708Q4067M2140r759q9898P4563J97638r6487j47681
5828D921916m747M9619J028J47369J02080M7368M6860K05543j07195l5785J60288
5817E534344J31644m4803M1532L37924J54877M2860J86947K06278K2386L00674
$$ y = [2620568, 2760424, 2611841, 2565507, 2706607, 2896522, 2914452, 2828860, 2826900, 2987416, 3155571, 3032418, 2848834, 3018627, 3410401, 3523862, 3421519, 3501202, 3713863, 3636094, 3484374, 3593179, 3735832, 3929484, 4133826, 4103812, 3969620, 4084590, 4209391, 4353858, 4496833, 4568748, 4497804, 4360275, 4711158, 4961834, 4761883, 4814553, 4874659, 4992706, 4875174, 4735743, 4836562, 5091970, 5155142, 5045130, 5017836, 4795211, 4916569, 5088668, 5204794, 4807576, 4675625, 4867333, 4951400, 4993540, 4983781, 4893883, 4968446, 5166084, 5069597, 4921916, 4917169, 4966788, 4967816, 5115185, 5217265, 5264633, 5311493, 5517036, 5409841, 5374056, 5534344, 5665988, 5621185, 5662717, 6000641, 6155518, 6198378, 6385325, 6591603, 6613989, 6914663]
5807F914663K19971J34545J3474J28601K84024K34779K00756L3313J24951L03464
5797H592541L71339M09254L94957L68129M67413P81983J081050J584739K176426
5788A6227831J636565Q19567L65830J52675J20851O32576J206599J412055K025756
5779B4600305L043380M642836N531351N402835M234844K976459K081753J343195
5771E3856958J288306J787730R87633j045422l390015m757551m604994l692425
5763D0430220k820390j842189o68250J16411P9105L48350J037354J938228L512081
5754D2130920N829344Q001909R727607R682261P367797M515438K431768J556121
5746I1243165P74126j380940m161193p114635r300553r430916q380842o358105
$$ y = [6914663, 7134634, 7269179, 7282653, 7411254, 7695278, 7930057, 8130813, 8164126, 8289077, 8592541, 8963880, 9373134, 9768091, 10136220, 10603633, 11385616, 12466666, 14051405, 16227831, 17864396, 18683963, 19049793, 19202468, 19323319, 19955895, 21162494, 22574549, 24600305, 27643685, 32286521, 37817872, 43220707, 47455551, 50432010, 52513763, 53856958, 55145264, 56932994, 57920627, 56875205, 53485190, 48727639, 44122645, 40430220, 37609830, 35767641, 35099391, 35215802, 35294907, 35643257, 36680611, 38618839, 42130920, 47960264, 55962173, 65689780, 75372041, 82739838, 87255276, 89687044, 91243165, 92017291, 90636351, 86475158, 79360523, 70059970, 60629054, 52248212, 45890107]
5738D5890107n156558m255429l133147k145686j171010p52465l4285Q52952J626948
5729C1721427K694641L232340L637320L165470K041108O73277O6310j16078n76973
5720D6538842j569317k752359l730628l949296m067917l463197k810079k228313
5712B1967736k071469j840650j282912q44900o15178n80842m10169l57523m19706
5703A3544387l67322l12135l04200k67401l02141l52008k50299m68236l72586
5694A0548059L7248J91577m6761l78052k79692j98855N1329J43145K16990K36236
5684A0521224J059913J014846L44896m64630p64151o60352m58894m60330n55409
5675I577113l97066l03406k10880j72978j6180J08212j4982o7537P4122j48798
$$ y = [45890107, 40733549, 36478120, 33344973, 31199287, 30028277, 29275812, 29241527, 30094479, 31721427, 34416068, 37648408, 41285728, 44451198, 46492306, 47165583, 47231893, 47115815, 46538842, 44969525, 42217166, 38486538, 34537242, 30469325, 27006128, 24196049, 21967736, 19896267, 18055617, 16772705, 15927805, 15312627, 14731785, 14321616, 13964093, 13544387, 13177065, 12864930, 12560730, 12293329, 11991188, 11639180, 11388881, 10920645, 10548059, 10585307, 10776884, 10730123, 10352071, 10072379, 9873524, 9924853, 10067998, 10284988, 10521224, 11581137, 12595983, 12940879, 12476249, 11712098, 11051746, 10592852, 10132522, 9577113, 9180047, 8876641, 8665761, 8492783, 8476603, 8584815, 8569833, 8502296, 8576418, 8427620]
5665H427620j86491K2770L14089J02501O22K6880J33722J48867K00552j8817J52727
5654I325042N25593N48807N61492P73243N70002j6738n09488o34910m41805k52798
5644A0448440j99759p2454K01243O2815J00180J66366K9602J65123M03252K59893
5634A1564701K59518K23319M44815K06516J51008M37143O67619N16483N94993
5625A5066115P91933P75045P94844O13226Q47042J546569J925223J920896J618567
5616B5899460K063942K712679L508129M925965P545344J1395267J3263452J0215887
5608H1530125K479278m494024q149884q382603o696398m888071k617098p43492
5600D8037833K175607N359346O637795M539204K59866k547921k576909q37290
$$ y = [8427620, 8241129, 8263899, 8577988, 8680489, 8681111, 8707991, 8841713, 8990580, 9191132, 9172315, 9325042, 9850635, 10399442, 10960934, 11734177, 12304179, 12287441, 11777953, 11143043, 10701238, 10448440, 10248681, 10176227, 10377470, 10440285, 10540465, 10706831, 10736433, 10901556, 11304808, 11564701, 11824219, 12047538, 12492353, 12698869, 12849877, 13287020, 13954639, 14471122, 15066115, 15858048, 16633093, 17427937, 18041163, 18888205, 20434774, 22359997, 24280893, 25899460, 27963402, 30676081, 34184210, 39110175, 46655519, 58050786, 71314238, 81530125, 84009403, 79515379, 71365495, 62982892, 56286494, 51398423, 48781325, 48037833, 50213440, 55572786, 62210581, 66749785, 67009651, 64461730, 61884821, 61047531]
5592F1047531K515883O445119R338731Q535279L932830j795759n621548o522902
5584G7875164m362810j060763J575998J279934j769801m919288o276123n225455
5576E7116856l184658j306936J64628J913252M421489Q232648J0810717R900532
5568H8068528M588923j374387n268585n441578l860228j478328J252035L678396
5560H0164776N722075O674734P352681P461557P450184Q388146R306830R693282
5552A42214265P887480L683715j200276n413179p838836q141708p351715p135157
5544A16704589p758082q416534q617839q444894p921486o911151n934753n266663
5536E7433187m855243m286999l912045l594374l165074k613516k253121k192720
$$ y = [61047531, 63563414, 70008533, 79347264, 87882543, 91815373, 90019614, 84398066, 77875164, 73512354, 72451591, 74027589, 75307523, 73537722, 68618434, 62342311, 57116856, 53932198, 52625262, 52789890, 54703142, 59124631, 67357279, 78167996, 88068528, 92657451, 91283064, 86014479, 80572901, 76712673, 75234345, 76486380, 80164776, 85886851, 92561585, 99914266, 107375823, 114826007, 123214153, 132520983, 142214265, 150101745, 153785460, 152585184, 147172005, 139333169, 131191461, 123839746, 116704589, 108946507, 100529973, 91912134, 83467240, 75545754, 68634603, 62699850, 57433187, 52577944, 48290945, 44378900, 40784526, 37619452, 35005936, 32752815, 30560095]
5528C0560095k032721j789863j445484j538334j181852q34319j020931j065020
5520A9651571q85987q17585o40477o85294n09329m68369n58267n05063n09328
5511A4071872l73931m50291l93849m55912k26632j02242m44218l98260l17810
5502A0908727l62837l86318q3790j26870k34822k79426m29217l41737J18819r8181
5492H684348k79818k92919j00796l3122j67040j59321j98971J24461M456l42793
5482G238485j79933o6087j78504p6741J00418j52152m38668l71833j53149m0904
5472E680932j03043j87231R8638Q0480l0455l24032k93960k5091J55483m6467
5462E005254k11265p2607M6833l6868n1717k18497m6438L63638J72824j44037
$$ y = [30560095, 28527374, 26737511, 25292027, 23753693, 22571841, 21737522, 20716591, 19651571, 18765584, 17947999, 17307522, 16622228, 16112899, 15644530, 15086263, 14581200, 14071872, 13697941, 13247650, 12853801, 12397889, 12171257, 12069015, 11624797, 11226537, 10908727, 10545890, 10159572, 10075782, 9948912, 9714090, 9434664, 9005447, 8663710, 8782529, 8684348, 8404530, 8111611, 8010815, 7977693, 7810653, 7651332, 7452361, 7576822, 7581278, 7238485, 7058552, 6992465, 6813961, 6737220, 6837638, 6685486, 6246818, 5874985, 5721836, 5680932, 5577889, 5390658, 5489296, 5569776, 5539321, 5215289, 4921329, 4896238, 5051721, 5005254, 4793989, 4721382, 4768215, 4731347, 4679630, 4461133, 4414695, 4778333, 4951157, 4807120]
5452D807120k35498j10171N822K52838n2372r6634k5525N3924P0069K23939p1739
5441D821773N2526K30268M12488L20057O17403J185986P47067j46961q01094j178434
5431F261079o51601l78532l96235l48649j32155l9140J53020k61227m41706j84926
5421C579928O1728N0034l8941m837j93741j11639j1577m4877n4986j98527k2390
5410C010175K15598k4584j24171k79920K2636K33900K52251j50949l26430L3193
5400B861699Q3666j1649O460J0527R0829n4497p5197l05889k8925K35448L6777
5389B849249j69569J09000J62629l55363k94864O5579K98890K8655L2398r3259
5379B633345l09082k05024k17248J46293L41231P2028k58143j95122O0517J53395
$$ y = [4807120, 4571622, 4461451, 4467273, 4720111, 4667739, 4571105, 4545580, 4599504, 4669573, 4893512, 4821773, 4874299, 5104567, 5517055, 5837112, 6454515, 7640501, 8387568, 8240607, 7439513, 6261079, 5609478, 5230946, 4834711, 4486062, 4353907, 4314767, 4467787, 4206560, 3764854, 3579928, 3641656, 3691690, 3652749, 3647912, 3454171, 3342532, 3330955, 3286078, 3231092, 3032565, 3010175, 3225773, 3201189, 3077018, 2797098, 2819734, 3053634, 3305885, 3154936, 2828506, 2861699, 2945365, 2933716, 2940176, 2950703, 3041532, 2987035, 2911838, 2605949, 2577024, 2812472, 2849249, 2679680, 2788680, 2951309, 2595946, 2301082, 2366661, 2665551, 2694206, 2726604, 2633345, 2324263, 2119239, 1901991, 2048284, 2389515, 2461543, 2203400, 2008278, 2068795, 2222190]
5369B222190k24046j46204K08911L85601k53968n95254l4978K70579O6619m2320
5359A857130j31530M2394r798j36792k70246m7829M09821J46944k22897k12058
5349A425139m0036L8855Q0111J9092J24322L7355m6105m7315J55L2447j32550
5338A491470j52652J77452K60680j57223l83170K040L37690k6907j30516J50293
5328A569157N6893k07204j23045m8210J67671K47726J68194m7014j54404j91633
5318A438131J56242Q6327o1281R2948j1884j92394q3355K03446k61925m0588M29951
5307A755618K53479m39998l07129o6636K50069J82260K5866j05980l3203j49559
5297A364787m5860R3154J55833K46743j97048n3268J48762l2891j88301K40115
$$ y = [2222190, 1998144, 1851940, 2060851, 2446452, 2192484, 1597230, 1562252, 1832831, 1899450, 1857130, 1725600, 1767994, 1758196, 1621404, 1351158, 1303329, 1713150, 1860094, 1637197, 1425139, 1385103, 1423958, 1504069, 1523161, 1647483, 1684838, 1638733, 1591418, 1591573, 1624020, 1491470, 1338818, 1516270, 1776950, 1619727, 1236557, 1238597, 1576287, 1549380, 1418864, 1569157, 1626050, 1418846, 1295801, 1247591, 1415262, 1662988, 1831182, 1784168, 1629764, 1438131, 1594373, 1680700, 1619419, 1712367, 1700483, 1508089, 1424734, 1628180, 1366255, 1325667, 1755618, 2009097, 1569099, 1261970, 1195334, 1445403, 1627663, 1653529, 1547549, 1514346, 1364787, 1318927, 1412081, 1567914, 1814657, 1617609, 1564341, 1713103, 1680212, 1491911, 1732026]
5287A732026K58363Q1363k7354o7127n4557n5391K1166j19377O0900O8787j7902
5276A880897j13381r2345L51399K72485j44954j45755M36246L8058m9394N86718
5266C019974R46050L02299k04739k55790m97232m36870k77647m9874j60903n7713
5256B327555O5740j44442k57384l5867L36456O8144J58483m7831k61325J29054
5246B338583J39806O7963J13107O2282j00415j80894R8487J90626j39824j54090
5236B435631K28041K89553k72330l22489o5351J93051O1165L1382k22574m4451
5226B311628Q9065K38169j53572k62821L17178M12463k27788l09315M0512J07887
5216B563406J87242O3602k68677j17744K44075r842k27111J4500J67800J15223
$$ y = [1732026, 1990389, 2071752, 2044398, 1977271, 1922714, 1867323, 1888489, 1769112, 1830012, 1898799, 1880897, 1767516, 1675171, 2026570, 2299055, 2154101, 2008346, 2444592, 2482650, 2433256, 3019974, 3966024, 4268323, 4063584, 3807794, 3310562, 2873692, 2596045, 2546171, 2385268, 2327555, 2393295, 2248853, 1991469, 1955602, 2292058, 2360202, 2518685, 2470854, 2209529, 2338583, 2478389, 2546352, 2659459, 2721741, 2621326, 2440432, 2538919, 2729545, 2589721, 2435631, 2663672, 2953225, 2680895, 2358406, 2293055, 2486106, 2547271, 2578653, 2356079, 2311628, 2400693, 2638862, 2485290, 2222469, 2539647, 2952110, 2724322, 2415007, 2455519, 2563406, 2750648, 2814250, 2545573, 2427829, 2671904, 2662062, 2434951, 2449451, 2617251, 2732474]
5206B732474j2781J28765l3532m8931R3041K26834J97910M837j00368J2000L74950
5195C575199M91542O2115J3072L90130L59461J21605k58401K02793L40260o4254
5185E233522n35456l54638J4753j21087n12306l28349O0219k5985j6439k21691
5175C192543l47644k5937J41879L5567K82558j22441l55601L9712J00646J47054
5165C088336j98553J14110R9425k952j09959j89125j43003K23789J50928j44445
5155B888551p0976R9408J06754j49567p9841L0155m798Q6081l0327m3172N4070
5144B886338n8016J99533J13585l2275Q1228R3644L8182J68295J56837R6351J27453
5133C871155P7372L22600J77094J68025O54706O47307J84516l11342j66750M0590
$$ y = [2732474, 2719693, 2848458, 2814926, 2765995, 2859036, 3085870, 3283780, 3288617, 3188249, 3200249, 3575199, 4066741, 4128856, 4141928, 4532058, 4891519, 5013124, 4754723, 4957516, 5297776, 5233522, 4698066, 4343428, 4358181, 4237094, 3724788, 3396439, 3456658, 3430673, 3414234, 3192543, 2844899, 2818962, 2960841, 2996408, 3278966, 3156525, 2800924, 2840636, 2941282, 3088336, 2889783, 3003893, 3103318, 3100366, 2990407, 2801282, 2658279, 2882068, 3032996, 2888551, 2817575, 2916983, 3023737, 2874170, 2794329, 2824484, 2819686, 2905767, 2875440, 2832268, 2886338, 2828322, 3027855, 3141440, 3109165, 3190393, 3284037, 3322219, 3490514, 3647351, 3743702, 3871155, 3948527, 4271127, 4448221, 4616246, 5270952, 5918259, 6102775, 5791433, 5624683, 5665273]
5123E665273J72771J95997L04631P56372O86300O95957J599015K918379N898372
5114A8893067R409812R364083K756359l796368o843826o630204m876116l602690
5106A4674117k674305k023835j335661j055558o73359o21248k85770j20853R7584
5097E981112n1318r3696J43949M99311L81763J95460j60617k36436m57156k92459
5087E909913j84407k31997l86099K16333K06755j41866k3582K34458j9333k15975
5077E364200j69840K11920q104J9716J17182J4058K84075K59840K60030J49964
5067F503041l11031l44252r900n3874r8361M0811J6390l28569k41397O3994N353
5056E242205k4371L8610J1611m2854R0774m0736P1009r1592n3600J26860K10097
$$ y = [5665273, 5838044, 6034041, 6338672, 7095044, 7781344, 8477301, 10076316, 12994695, 18893067, 28302879, 37666962, 40423321, 36626953, 29783127, 23152923, 18276807, 14674117, 11999812, 9975977, 8640316, 7584758, 6911399, 6290151, 6004381, 5883528, 5981112, 5929794, 5836098, 5980047, 6479358, 6861121, 7056581, 6895964, 6659528, 6202372, 5909913, 5725506, 5493509, 5107410, 5323743, 5530498, 5388632, 5365050, 5599508, 5580175, 5364200, 5194360, 5406280, 5398176, 5417892, 5535074, 5549132, 5833207, 6093047, 6353077, 6503041, 6192010, 5847758, 5837858, 5783984, 5685623, 5726434, 5742824, 5414255, 5172858, 5236852, 5242205, 5217834, 5256444, 5268055, 5225201, 5315975, 5275239, 5346248, 5254656, 5201056, 5327916, 5538013]
5045E538013K99707M5105L25318L82912J36460k17527O0038J94730P7793j73703
5035F668846P1847j26846j94373K29352J10907p4614J95241K98580K05885j09966
5025G274859j334J21661J20861k2655O0232O9608K430Q641K72964L38363J21104
5014H366734M8041K39385J99181J68960j31148L15617K84067L41781k6218K14256
5004A0020656J88857K72656J34595L58008L06797K62503K36142N06145M28607
4995A2714966J87754L33052N85317O04046O74593O10376Q97256R90606J330638
4986A8928604J711683K261117J895616J064547L03993l8371O6252M07034P09764
4977B7310239R65662J230408J361521J433015K286382K822639K850502K354168
$$ y = [5538013, 5837720, 5882825, 6208143, 6591055, 6727515, 6509988, 6570026, 6764756, 6842549, 6668846, 6740693, 6613847, 6419474, 6648826, 6759733, 6685119, 6880360, 7178940, 7384825, 7274859, 7273525, 7395186, 7516047, 7493392, 7553624, 7623232, 7625662, 7634303, 7907267, 8245630, 8366734, 8414775, 8654160, 8853341, 9022301, 8891153, 9206770, 9490837, 9832618, 9806400, 10020656, 10209513, 10482169, 10616764, 10974772, 11281569, 11544072, 11780214, 12286359, 12714966, 12902720, 13235772, 13821089, 14425135, 15099728, 15710104, 16607360, 17597966, 18928604, 20640287, 22901404, 24797020, 25861567, 26165560, 26127189, 26193441, 26600475, 27310239, 28275901, 29506309, 30867830, 32300845, 34587227, 37409866, 40260368, 42614536]
4969D2614536K446562K227612K257896J922494K191944K687247L511187M188598
4961F4048076M794403N397850O796091Q932613J3283186K1561615M1722400Q2388389
4953B48924623J18477526R2368675O332512n6121289q1492962p1061279n1040294
4946B06387512l6329141k6510241k0143580j3873132q833793m954847l423903
4939I2318875k941410l234861k742043k255182j361244o06714L07566L31872M33906
4930H0250765K37174O45177J152414K012100K425288K653222K153431J868449
4922I3398020J577754R11043Q8019j093031j996117k070244k333437k506897k150433
4913H3824677q17832M04926J602015K942477M822221N834961N783833M396619
$$ y = [42614536, 45061098, 47288710, 49546606, 51469100, 53661044, 56348291, 59859478, 64048076, 68842479, 74240329, 81036420, 89969033, 103252219, 124813834, 166536234, 248924623, 367402149, 459770824, 466103336, 409982047, 328489085, 257427806, 206387512, 170058371, 143548130, 123404550, 109531418, 100697625, 95742778, 92318875, 89377465, 86142604, 83400561, 81145379, 79784135, 79177421, 79484987, 79816859, 80250765, 80487939, 81133116, 82285530, 84297630, 86722918, 89376140, 91529571, 93398020, 94975774, 95886817, 95974836, 94881805, 92885688, 90815444, 88482007, 85975110, 83824677, 83006845, 83411771, 85013786, 87956263, 92778484, 98613445, 104397278, 108793897]
4905A08793897K762627N28975k232961n136787p100944q467661q592766p746507
4897G2807873o265299n042365l447268k336192o63287J436626L649054O196569
4889F6335711Q452163Q728554N892580N04974m415357p612543q461544q006270
4881F1418268p136253n987358m823238l824783k907887k230877j464542r53530
4873C2089800n14050l12461l09J02641L07618M60232N12348O07847M96514K4379
4863C3774559o41635j426960j593401j646162j877022j782921j294819p74741
4855B2736898o73389q48140j38117L06278j42446j17679j59983m54262j005662
4846A9503498j196726r10963r19533q28081o69969m81196l67066l60206l94861
$$ y = [108793897, 111556524, 112085499, 109852538, 104715751, 97614807, 89147146, 80554380, 72807873, 66542574, 61500209, 58052941, 55716749, 55053462, 56490088, 60139142, 66335711, 74787874, 83516428, 89409008, 89913982, 85498625, 77886082, 69424538, 61418268, 54282015, 48294657, 43471419, 39646636, 36738749, 34507872, 33043330, 32089800, 31575750, 31263289, 31262980, 31365621, 31673239, 32133471, 32645819, 33253666, 33750180, 33774559, 33132924, 31705964, 30112563, 28466401, 26589379, 24806458, 23511639, 22736898, 22063509, 21215369, 21077252, 21383530, 21241084, 21123405, 20963422, 20509160, 19503498, 18306772, 17395809, 16476276, 15648195, 14978226, 14497030, 14129964, 13769758, 13374897]
4837A3374897k80062r8371k9348r254j59609q8081K18760K73114J01216J20501
4827A3423763L47829O94191Q55483J474727J935734J532138L15752o09291p59148
4818A9211178k28498L64187R26604J572032K159012K380732K708096K823180K546929
4809C4463452J685626N12925p25135j414164k072928k441356l020651k811681
4801B4176088k109128j977703k281226j951767j193106j015326r63181r25278
4793A1759373n41900o86568o84739l89493p1447l41627l26112k07935r6528j13413
4783H299611k95549k45690M6006R3623l07478k50995o687L42702k67269m03973
4773G004301j70571J45379M7972j43815k33882l03825k6456J32735J8021p022
$$ y = [13374897, 13094835, 12996464, 12967116, 12957862, 12798253, 12710172, 12928932, 13202046, 13303262, 13423763, 13771592, 14465783, 15321266, 16795993, 18731727, 20263865, 20579617, 19970326, 19211178, 18982680, 19346867, 20273471, 21845503, 24004515, 26385247, 29093343, 31916523, 34463452, 36149078, 36662003, 35936868, 34522704, 32449776, 30008420, 26987769, 24176088, 22066960, 20089257, 17808031, 15856264, 14663158, 13647832, 12684651, 11759373, 11217473, 10530905, 9846166, 9456673, 9385226, 9043599, 8717487, 8509552, 8413024, 8299611, 8004062, 7758372, 7804378, 7898001, 7590523, 7339528, 7332841, 7675543, 7408274, 7004301, 6833730, 6979109, 7027081, 6883266, 6649384, 6345559, 6319103, 6451838, 6469859, 6462837]
4763F462837J44342k42379k46183L6724J59643j51153l00165M2266P8404j86878
4753E797458j52173O4833J93689J77263n1086Q0924m6513n518j64688n6481N9944
4742E897652K4092P0547j46991m3937J29370J46039l34381j62450o7208p3993
4732E438740l0353j01659k0074m6191r1393N3992q514J9557R7028K4057K46103
4721E581293o0763j44880q4145J81357J79493j09939J8125L9024m4135O520P6833
4710E638783J99908j44526J31649J73212r8766p999K82675L50377J61154J34091
4700F820558j84165j02687P1396p266p8389r4903P4890J90821J44394j15200J02111
4689F821560K60153J54084J65247J66511L64385N2663P9216J51882M8764K42387
$$ y = [6462837, 6607179, 6364800, 6118617, 6155341, 6314984, 6163831, 5863666, 5905932, 5984336, 5797458, 5645285, 5710118, 5903807, 6081070, 6029984, 6110908, 6064395, 6058877, 5894189, 5837708, 5897652, 5921744, 5992291, 5845300, 5801363, 5930733, 6076772, 5742391, 5579941, 5512733, 5438740, 5408387, 5306728, 5286654, 5240463, 5149070, 5203062, 5194548, 5214105, 5311133, 5335190, 5581293, 5520530, 5375650, 5291505, 5472862, 5652355, 5542416, 5560541, 5599565, 5555430, 5561950, 5638783, 5838691, 5694165, 5825814, 5999026, 5900260, 5892261, 6174936, 6525313, 6686467, 6820558, 6636393, 6533706, 6605102, 6597836, 6519447, 6424544, 6499434, 6690255, 6834649, 6719449, 6821560, 7081713, 7235797, 7401044, 7567555, 7931940, 7984603, 8063819, 8215701, 8264465, 8506852]
4679H506852N9516J42702K73776J98596Q3696L75806O70913N42585Q9069L53667
4669A1297178L58460M57368N08266J28933L03745N03010L67068J92805N34658
4660A4651491P72453O98565O26123N72219P77778J131437Q39458J260574J713987
4651B3044085J780082J766224K061092K484805K815024L054329L473467L605522
4643D4084630L969109M480387N456493O536435Q192034J0328536J4078417K0046310
4635A17172351K9490013M3948238N7803427N8573138L5743945j353744l1570049
4628C09807319m5620889m4890034l7177123k8845561k1148677j5138959j1720979
4621A05265097j0434980j0186884r372777q228811p177275o254518m951446l797424
$$ y = [8506852, 8566368, 8709070, 8982846, 9181442, 9265138, 9640944, 10311857, 10854442, 10943511, 11297178, 11655638, 12113006, 12621272, 12750205, 13053950, 13556960, 13924028, 14116833, 14651491, 15423944, 16122509, 16748632, 17320851, 18098629, 19230066, 20069524, 21330098, 23044085, 24824167, 26590391, 28651483, 31136288, 33951312, 37005641, 40479108, 44084630, 48053739, 52534126, 57990619, 64527054, 72719088, 83047624, 97126041, 117172351, 146662364, 190610602, 248414029, 306987167, 342731112, 341377368, 309807319, 264186430, 219296396, 182119273, 153273712, 132125035, 116986076, 105265097, 94830117, 84643233, 75270456, 67041645, 59864370, 53609852, 48658406, 44860982]
4613D4860982l117298k851207k469336k057628j883296j683592j401171j474538
4605B7922916j573336j755545j257426o51966o39016r40296r40165o85061p39074
4596A8741031p96073p14534l02464l12791l25284m94989k40591k40780j07045
4587A5206480j07967p7577J07331J30064k59761k92824j37086n85098o57455j53143
4577A3172964l9230j43629k37350j36890J87693K67463Q4231m11605k23439m8901
4567A2471307n95915q29179m99212k86387m50573l38599k84884l40508l61391
4558H484659j76673l57681k80254J77958q5382m63890k31407n1852p4800k34714
4548F705964J42031K9894k36432j20670k4827J34875J15977k26867k5167J38540
$$ y = [44860982, 41743684, 38892477, 36423141, 34365513, 32482217, 30798625, 29397454, 27922916, 26349580, 24594035, 23336609, 22684643, 22045627, 21105331, 20165166, 19480105, 18741031, 17944958, 17230424, 16927960, 16615169, 16289885, 15794896, 15554305, 15313525, 15206480, 15098513, 15020936, 15128267, 15258331, 14998570, 14705746, 14568660, 13983562, 13326107, 13172964, 13133734, 12990105, 12752755, 12615865, 12803558, 13071021, 13155252, 12743647, 12520208, 12471307, 11875392, 11046213, 10547001, 10260614, 9810041, 9471442, 9186558, 8846050, 8484659, 8307986, 7950305, 7670051, 7848009, 7762627, 7298737, 7067330, 7015478, 6940678, 6705964, 6847995, 6877889, 6641457, 6520787, 6495960, 6630835, 6746812, 6519945, 6494778, 6633318]
4538F633318J05872l22968j52872Q5195l0155o6960j52056J2405J86295p7976
4528F220098j90801m7180J46536p209o8295M6440l0319k35895k88469J01017J25121
4517E771044J59671R2936j2679J28495J08772q0470l7712K87739L6587n42830
4507E911553n59459j48038K6903J7843J0580l0334j67943q3033j00142n7773K02766
4496E022923J45840L8284j28646j96116m7115p0823J7394J06997p8151P0200n5835
4485D824952k15238o7293L9775M4655Q2837K25453K40979k1383J29327J63372
4475E447436J16607j17607j69704K0572l2238m04277j68748j8783J8017J79288
4465D870563K04904k40262m39296K0150r0578l3935J2945K89885q7651m24480
$$ y = [6633318, 6739190, 6416222, 6263350, 6348545, 6318390, 6251430, 6099374, 6111779, 6298074, 6220098, 6029297, 5982117, 6128653, 6121444, 6053149, 6099589, 6069270, 5833375, 5544906, 5645923, 5771044, 5930715, 6023651, 6010972, 6139467, 6248239, 6167769, 6130057, 6417796, 6454383, 5911553, 5352094, 5204056, 5230959, 5248802, 5259382, 5229048, 5061105, 4978072, 4877930, 4820157, 5022923, 5168763, 5207047, 5078401, 4882285, 4835170, 4764347, 4781741, 4888738, 4810587, 4880787, 4824952, 4609714, 4542421, 4582196, 4626851, 4709688, 4935141, 5176120, 5154737, 5284064, 5447436, 5564043, 5446436, 5276732, 5297304, 5265066, 4860789, 4692041, 4673258, 4691275, 4870563, 5075467, 4835205, 4395909, 4416059, 4325481, 4291546, 4304491, 4594376, 4506725, 4082245]
4455D082245M7037O9534J33210M2648J86238j09446j74070j58439j1754p4833
4445D032370J21666J38099n7432m26604j96104O916l993L6614J69514N6805j17861
4434C759990j18121j62288N4937J66773M5038j77599L4406Q2672l05400j53348
4424C227060M54618K06537j09560j05581O1048K09606J88364j00295m5029L5771
4414D022539K92168L14648j05733R4056J038096J663824J163583R4766o22915
4405G955032j050194j030008n62154l22689p6166j46020J24447J59876J34704
4396E186828o6839j55881M0710n3885j70724p22786k44253J17780O2733k24695
4386C768988q2461K09648R6408j95169n7607q8077N7390J92245r5908o33507l45491
$$ y = [4082245, 4129282, 4198816, 4332026, 4374674, 4560912, 4451466, 4277396, 4118957, 4107203, 4032370, 4154036, 4292135, 4234703, 3808099, 3611995, 3618911, 3614918, 3651532, 3821046, 3877851, 3759990, 3641869, 3479581, 3534518, 3701291, 3746329, 3568730, 3603136, 3685808, 3380408, 3227060, 3681678, 3888215, 3778655, 3673074, 3734122, 3943728, 4132092, 4031797, 3986768, 4022539, 4314707, 4629355, 4523622, 4617678, 5655774, 7319598, 8483181, 8577947, 7955032, 6904838, 5874830, 5312676, 4989987, 4913821, 4767801, 4892248, 5052124, 5186828, 5119989, 4964108, 5004818, 4950933, 4780209, 4057423, 3813170, 3930950, 3993683, 3768988, 3686527, 3896175, 3992583, 3797414, 3739807, 3651730, 3709120, 3901365, 3805457, 3171950, 2826459]
4375B826459o4291n362R2859J4777j97146k54869J7793P1993j10341K1468K17470
4364B630810j47965o6893q6185j37743J4542K33987K17294k04843l7153L422J6591
4353B435864Q198k71085L7560J03863Q826j24276j85914k4707J17735J88223m7228
4342B247059j39243o6920J47872M6971r3838k2957k1419J54513K00558k8187j82729
4331B241680J13192M54609L81608J35384K17626k5992l31150p9650k12956k83320
4321B611031j00716p7776j55718l27532J36064Q7454J47617R3538j57247l07985
4311A948730m246K1529J9128j603J42957R6477j33833O201J66667L53143N9236
4300B674386J16536o6257m17794l12641p2611J67446q983j33394q0648j9244j5390
$$ y = [2826459, 2762168, 2756806, 2849665, 2864442, 2667296, 2412427, 2430220, 2502213, 2391872, 2413340, 2630810, 2482845, 2415952, 2329767, 2192024, 2206566, 2440553, 2657847, 2453004, 2415851, 2419273, 2435864, 2444062, 2172977, 2210537, 2314400, 2323226, 2198950, 2013036, 1988329, 2106064, 2294287, 2247059, 2107816, 2040896, 2188768, 2235739, 2141901, 2118944, 2097525, 2252038, 2452596, 2424409, 2241680, 2354872, 2809481, 3191089, 3326473, 3544099, 3518107, 3186957, 3107307, 2894351, 2611031, 2510315, 2432539, 2276821, 1949289, 2085353, 2172807, 2320424, 2413962, 2256715, 1948730, 1944484, 1966013, 1985141, 1983538, 2126495, 2222972, 2089139, 2095340, 2262007, 2615150, 2674386, 2790922, 2724665, 2306871, 1994230, 1921619, 2089065, 2080082, 1946688, 1866040, 1846796, 1831406]
4289A831406j59008K9313J12476J75510j11385j67540l9701Q0119j7054j10479
4279A623657L7918R0440O8847j28329k19898j45455J7851J51220J1478j20840
4269A386889L7807j55905j86681Q4104K56875R8088L6640N3256k42618l02409
4259A066046M4505L93103j4924r5052J16960M4519k91756J6955J99798J02988
4249A583142J00310R2707n4165n9471o8475M4632R4860J7794j2057l77883k13108
4238A148286J4070J11927j75293j8902J3288M8239k5806Q9116J91493q1146J5235
4227A330507k0740r0918l2710K0980o7989q4421P5372l7115J09935j33468p0102
4216I99331J0827j14022O3780J43778N479k6069j20878r2711J01927L8939n8818
$$ y = [1831406, 1672398, 1701711, 1814187, 1989697, 1878312, 1710772, 1671071, 1751190, 1734136, 1623657, 1661575, 1752015, 1820862, 1692533, 1472635, 1327180, 1345031, 1496251, 1507729, 1386889, 1424696, 1268791, 1082110, 1166214, 1423089, 1521177, 1557817, 1611073, 1368455, 1066046, 1110551, 1503654, 1488730, 1393678, 1510638, 1555157, 1263401, 1280356, 1480154, 1583142, 1683452, 1776159, 1721994, 1662523, 1594048, 1638680, 1733540, 1751334, 1739277, 1361394, 1148286, 1162356, 1274283, 1098990, 1080088, 1093376, 1141615, 1115809, 1204925, 1396418, 1315272, 1330507, 1309767, 1218849, 1186139, 1207119, 1139130, 1054709, 1130081, 1092966, 1202901, 1069433, 999331, 1010158, 896136, 959916, 1103694, 1109173, 1083104, 962226, 869515, 971442, 1010381, 951563]
4205I51563N8155L20988q5449j50751k0844J34626J08064j48772q2143Q205j3925
4194A079717k08746j48522J52697J61376k984l3144j81980l5273K77473J87913
4184A248527j30527r008N9287l07622m751K49769Q5914l45140k0963J97993p5784
4173I47695k09715j03643P3051K74566M2445j22450J503J69799p8188m41495J1315
4162E64883L01083J4890p1485P0696J11141k87170j95621J08005K23853L9043
4152H79318j66878j44569j1559J3023l6577j50277Q1936L98780M7381o13316k52822
4141D4440M90549K23434j69134j87134J61550R9683r3019j33362M6428J63719
4131F47154K9868n0270j35475m7663J74530n730N9824n365p4884j82935m0262
$$ y = [951563, 1009718, 1330706, 1245257, 1094506, 1073662, 1208288, 1316352, 1167580, 1085437, 1093642, 1079717, 870971, 722449, 875146, 1036522, 1033538, 1000394, 818414, 783141, 1060614, 1248527, 1118000, 1108992, 1168279, 860657, 855906, 1105675, 1191589, 846449, 825486, 1023479, 947695, 737980, 634337, 707388, 981954, 1024399, 901949, 903452, 1073251, 995063, 553568, 564883, 865966, 880856, 809371, 880067, 991208, 704038, 508417, 616422, 840275, 879318, 712440, 567871, 556312, 569335, 532758, 382481, 464417, 863197, 910578, 297262, 44440, 534989, 758423, 589289, 402155, 563705, 663388, 570369, 437007, 483435, 647154, 677022, 626752, 491277, 443614, 618144, 612414, 672238, 666873, 591989, 409054, 368792]
4120C68792J88462k5166r3986R9670J47893p0034j31375j01669p4040J94589K05665
4109G08801q7266M1580K34068N5634j84876j90243Q9555R7915J06936m4316j34149
4098F93639k19116j85722K19019J90733k1785L095j45024j27841L8102p2502N7348
4087D29946L17202K64033k63077n64865M5027K73109j07998M0361J29829n2404
4077E11163l8226j27102m8723Q5545J49868P2377k8006j81850j72052q7238K52359
4066C88115J56004J02281j65171k32330O9392J40477j86135j16374J93401J43047
4056D92707j08299k35424k4105P2920J20918J24978r7131K4264l0032p5414p7054
4045A88328O0385K61224J27514o9249r2308k04786m4036K80036J85125j9475j15462
$$ y = [368792, 557254, 532088, 438102, 537772, 685665, 615631, 484256, 382587, 308547, 503136, 708801, 621535, 663115, 897183, 952817, 767941, 577698, 667253, 765168, 872104, 827788, 693639, 474523, 288801, 507820, 698553, 676768, 679863, 534839, 406998, 445100, 372598, 429946, 747148, 1011181, 748104, 183239, 228266, 501375, 393377, 433738, 563567, 511163, 472937, 345835, 297112, 382657, 532525, 604902, 576896, 395046, 222994, 135756, 388115, 544119, 646400, 481229, 248899, 318291, 458768, 272633, 156259, 349660, 492707, 384408, 148984, 124879, 197799, 318717, 443695, 346564, 370828, 340796, 265382, 188328, 248713, 509937, 637451, 568202, 475894, 271108, 227072, 507108, 692233, 672758, 557296]
4034E57296q6037o3127q2815l1882L43944K15141M6112M8011j61173k63763K6676
4023E48383J33224O3726R462l7218j45813j78078J21428K43924k4453K8409J62617
4012I25611J30188k56121J27298R6543J23150j45227j77355k69577P3955Q5107
4002G13572p2597K9544J88740K9248j86934j30902J42107l8366k10187J46375
3992F10600O1993J7218j00005j94047R6163J97312j22241j58188m5573n340J0213
3981C68105j03363j4221L26176L23401k87932k54293k7116Q2618j40583k288P0469
3970C40973L7250k54098k14242k1649K05284K59347l8842k7473m0775N7932j39307
3959A64400J6934K21499J32400j20785k12191P0982n1091L5355J88302L584j15552
$$ y = [557296, 471259, 408132, 325317, 293435, 637379, 852520, 898632, 946643, 785470, 521707, 548383, 681607, 745333, 754795, 717577, 571764, 393686, 515114, 759038, 734585, 762994, 925611, 1055799, 799678, 926976, 1023519, 1146669, 1001442, 824087, 554510, 628465, 713572, 640975, 670519, 859259, 888507, 701573, 570671, 712778, 674412, 464225, 610600, 672593, 689811, 589806, 395759, 491922, 689234, 566993, 408805, 363232, 357892, 368105, 264742, 250521, 576697, 900098, 612166, 357873, 330757, 413375, 272792, 270504, 340973, 378223, 124125, -90117, -111766, 93518, 352865, 314023, 286550, 245775, 303707, 164400, 181334, 402833, 535233, 414448, 202257, 273239, 222148, 257503, 445805, 449389, 333837]
3948C33837j58353J366r5806J24564J03870o0006r0929K88336j58995j19993K7876
3937A95767J74025J32059k23201j25557J06927O9766K0782k69493R7087K79632
3927D57794r0798j22125N4309N5662L1629j63111P9849R4775p7182k18511m9923
3916E2368K00527o5938r3136K94681J77989j07747k97670n9490J92079L62036
3906F55699O2429l14428k17178J16924j17691J4578J28982K49415o5243j91745
3896C21742L3567K7574j69238P1446L61004Q2603l30565k84606J51075L64823
3886F29425n7910l27874J56872P7667K4646j69342q3518J36720K39261k31397
3876C94550l68975M6929J39588j3545K3743K6192J1045l8445m9095l617J81003
$$ y = [333837, 175484, 176850, 81044, 205608, 309478, 249472, 158543, 446879, 287884, 167891, 195767, 369792, 501851, 278650, 153093, 260020, 329786, 350568, 81075, 178162, 457794, 366996, 244871, 299180, 354842, 386471, 223360, 303209, 397984, 320802, 102291, 52368, 252895, 186957, 93821, 388502, 566491, 458744, 161074, 101584, 293663, 655699, 718128, 403700, 186522, 303446, 185755, 200333, 329315, 578730, 513487, 321742, 355309, 382883, 213645, 285091, 646095, 728698, 398133, 113527, 264602, 629425, 571515, 243641, 400513, 478180, 502826, 333484, 249966, 386686, 625947, 394550, 25575, 72504, 212092, 198547, 222290, 248482, 259527, 221082, 171987, 168370, 349373]
3865C49373q443n9524O7960K61989o1058k32128j86098J95437J20854n6530j10138
3854B81694J23160K20002j32370l45991j23240L63715L44752j84002k69120L5695
3844C14295J09405P2305o3495J68477l970j71221r7543M8854P6945q0757Q3360
3833D56655Q9590J23524k90535k50411J93481J28490R1080M1455o6421r9472o2448
3822C54988r2000r7780L31632J56664j08083k87016K7899J60048N2109n2043j76081
3811B70337J14169J0726j35722J36923K00921o5521l11182J48919J66415j95544
3801C40441q3585K91663J34587j37806q1195P5020J98753j04668k53642M7115
3791D26683J9858m3681n2129m3446L6064M278k3867n1535Q7410K18503O4140r5283
$$ y = [349373, 340930, 281406, 349366, 611355, 550297, 318169, 132071, 327508, 448362, 391832, 281694, 404854, 624856, 492486, 146495, 23255, 386970, 731722, 547720, 278600, 314295, 423700, 496005, 432510, 600987, 597017, 425796, 328253, 377107, 454052, 373295, 456655, 546245, 669769, 379234, 128823, 322304, 450794, 541874, 583329, 516908, 417436, 354988, 262988, 165208, 496840, 653504, 545421, 258405, 286304, 446352, 498461, 446418, 270337, 384506, 395232, 259510, 396433, 597354, 531833, 220651, 369570, 535985, 340441, 256856, 548519, 683106, 545300, 464105, 539125, 737878, 633210, 379568, 426683, 446541, 402860, 350731, 307285, 343349, 347627, 323760, 272225, 359635, 578138, 642278, 546995]
3779E46995j3900m4172j1769j13159k12745K83262O0971k10783p530K13454J30757
3768F21381j07689k11268N7478K10050j27784k102j78828L8129K6074n8840K8838
3757B95439M7307k7549J01021L2332j0144Q370P7145K8879L0548m6327o3571j17546
3745C55904m2276J53795J91153M4068k25294l9870r0509R0229K80837k3929J1741
3734G05849j14558o7799j58400o8198J47058K75394O1954j41132j85364q5470
3724C69334K68792K05796j13896k9672m7985K4512j21127P8540J37746p7695k878
3713F91467o0169R1932j08911j34973J73495K53644N6934j77630l7098J1334J10987
3702H71012j88969k08969J02781J36580M4035j20120P2664j02902j61378J596
$$ y = [546995, 533095, 488923, 477154, 363995, 151250, 434512, 495483, 284700, 277170, 490624, 621381, 513692, 302424, 359902, 569952, 442168, 440066, 261238, 299367, 325441, 266601, 295439, 342746, 315197, 416218, 448550, 438406, 446776, 523921, 552800, 583348, 537021, 473450, 355904, 313628, 467423, 658576, 702644, 477350, 437480, 346971, 437200, 718037, 694108, 705849, 591291, 523492, 365092, 296894, 443952, 719346, 781300, 640168, 454804, 369334, 638126, 843922, 730026, 700354, 652369, 676881, 555754, 634294, 772040, 694345, 691467, 631298, 723230, 614319, 479346, 652841, 906485, 963419, 785789, 748691, 760025, 871012, 682043, 473074, 575855, 712435, 756470, 636350, 709014, 606112, 444734, 446330]
3692D46330J71398J08726j21571j79451p8055J11684K0701J36195j5109r8939
3682E01909m5718j74257k09602M00817M75550q3674k46788p5718N594R262J8027
3671E75402J10648Q5155j04858r8034j26736L492r9J67926k1464o6829j17292
3660D07311l5989M9479J98168N0210M4488j15121j87551J20875N1851j04204k12654
3649B66863R8351K11726J07888p9271r6622J4872o7837K116M9037K13043m7641
3638F72525k46616J68460j615k24177K00003L01132j10115m28189R8467K02524
3628F32399J45932o1613K6492J32287r5119k29298j65554K20405Q6071O0118j07090
3617F45030J6789l6748r6418P0692K31344J56048n3764j45248j33214J54315j982
$$ y = [446330, 617728, 726454, 604883, 425432, 347377, 459061, 479762, 615957, 600848, 501909, 456191, 281934, 72332, 473149, 948699, 865025, 618237, 542519, 548113, 557375, 575402, 686050, 771205, 666347, 568313, 441577, 445069, 444970, 612896, 591432, 524603, 407311, 371322, 420801, 618969, 669179, 713667, 598546, 410995, 531870, 583721, 479517, 266863, 365214, 576940, 684828, 605557, 508935, 523807, 455970, 458086, 507123, 720166, 672525, 425909, 594369, 592754, 368577, 568580, 869712, 759597, 331408, 429875, 632399, 778331, 716718, 743210, 875497, 780378, 551080, 385526, 605931, 692002, 752120, 645030, 661819, 625071, 528653, 599345, 830689, 986737, 932973, 787725, 654511, 808826, 806844]
3606H06844k80405L1151L26425j3656k13385L765J94432J42493l6537j97432O4425
3595H28120J43512j46914j65253P6492J17856l874n6978L4558J5341j16575l2972
3584F93313K17722J3898o8783M131M3929J5679j7262m8317P3991R9957J32204
3573A160462q6104J9697j27101R9112J19306j93259p5134J34229O8778q0219j17353
3562I22414j30364K08039J64988q9344q6373J96176J00338p7399J09995J89770
3552A508240o2174j27985J53592N4990j85609n204J83049P0482r3793p2886m847
3541A417855J99863J03861p6808j44653n9101K09966J80776j90864n4904K7875
3531A613866N3822R2735k3619O4867J00388J27957J96422j26088k5554L35764
$$ y = [806844, 526439, 557590, 884015, 870359, 656974, 660739, 855171, 997664, 961127, 763695, 828120, 971632, 824718, 659465, 735957, 853813, 849939, 792961, 827519, 842860, 726285, 693313, 911035, 924933, 856150, 860281, 904210, 919889, 902627, 854310, 928301, 1028258, 1160462, 1074358, 1094055, 966954, 1066066, 1185372, 992113, 916979, 1051208, 1119986, 1039767, 922414, 792050, 1000089, 1165077, 1075733, 989360, 1185536, 1285874, 1208475, 1318470, 1508240, 1446066, 1318081, 1471673, 1526663, 1341054, 1335850, 1518899, 1589381, 1495588, 1422702, 1417855, 1617718, 1721579, 1644771, 1500118, 1441017, 1650983, 1831759, 1640895, 1585991, 1613866, 1667688, 1760423, 1736804, 1801671, 1902059, 2030016, 2226438, 2100350, 2074796, 2410560]
3521B410560K07551L8848M9114k12965r5100M3919K49965j58534j00684M0555
3511B473229J62229r9456p132Q9189n9863L1653K24335R2961k26540R7671L33650
3500C111926m3686k65634J51189L85837L20947m7017j62769J9116K86812J54455
3490C911176Q950K31005P0713N7720K53270K25010J75354R5168K24999K36588
3480E489953L39624J81101L96128N53328L78154M08964M41193P64378O70159Q31105
3470A0454087P97155M51417M98994L55669J58497O3673o4630Q1177L12364L17746
3460A3426149m1809n62694r82763r64593q58816p65879l60198m28449m13394j57240
3450G890314q8652l28957l54359m0528n3782j75706q1077m9837j72174k49015
$$ y = [2410560, 2618111, 2656959, 2706073, 2493108, 2398008, 2441927, 2691892, 2533358, 2432674, 2473229, 2635458, 2536002, 2528870, 2618059, 2558196, 2589849, 2814184, 2907145, 2680605, 2778276, 3111926, 3068240, 2802606, 2953795, 3339632, 3660579, 3613562, 3450793, 3469909, 3756721, 3911176, 3920126, 4151131, 4221844, 4279564, 4532834, 4757844, 4933198, 5028366, 5253365, 5489953, 5829577, 6010678, 6406806, 6960134, 7338288, 7747252, 8188445, 8952823, 9622982, 10454087, 11251242, 11702659, 12201653, 12557322, 12715819, 12779492, 12714862, 12796039, 13108403, 13426149, 13384340, 12821646, 11838883, 10874290, 10015474, 9249595, 8889397, 8460948, 8047554, 7890314, 7801662, 7472705, 7118346, 7077818, 7024036, 6848330, 6767253, 6717416, 6545242, 6296227]
3440F296227k32996r9042j01134k2394j96819k93942P0027J25804K23157P35917
3430F504805J624081J825776N93278r47784j216253j254753j021027p40337n94983
3421D772803n79078l45159l84321r7725l0618p6130j01775k00588l5801n0321
3411B871287k44816Q5453J55473l1120k17332l9559J56175o9067o641O2639J9472
3400B741964J52066O21254Q32728N38403J41697j05647o84992n43244n92217n77926
3390B524086j85288j55297j75043k15003P8478M4887j87397p9188q4792J03077
3380A668520J65626L7030J0051k23025k71789J00637L44047q946q5250M2816k93863
3369A485854j31480J66978o728r3315J56552R0467j99467l91316K54741K87107
$$ y = [6296227, 6063231, 5964189, 5863055, 5840661, 5643842, 5349900, 5419927, 5545731, 5768888, 6504805, 8128886, 9954662, 10547940, 9600156, 8383903, 7129150, 6108123, 5367786, 4772803, 4193725, 3848566, 3464245, 3366520, 3335902, 3259772, 3157997, 2957409, 2921608, 2871287, 2626471, 2711924, 2867397, 2836277, 2618945, 2579386, 2735561, 2666494, 2659853, 2722492, 2741964, 2894030, 3515284, 4348012, 4886415, 5028112, 4922465, 4237473, 3694229, 3102012, 2524086, 2338798, 2183501, 2008458, 1793455, 1871933, 1916820, 1729423, 1650235, 1565443, 1668520, 1834146, 1871176, 1881227, 1658202, 1386413, 1487050, 1831097, 1822151, 1736901, 1779717, 1485854, 1354374, 1521352, 1514624, 1421309, 1577861, 1668328, 1468861, 1077545, 1332286, 1619393]
3359A619393m6257o4375k05454n9412J06457q5448j05098r258J92023Q9786j50370
3348A281987k16564J33574K61698k65534j62583J87000P7475j36974K09J36236
3338A296524p5634j06287o9043Q49J83929N532k42005k29098J88393L09732k30899
3327A031993r4119L42068l4954l34930r3150K79711J35241n6494j01538j96615
3317H77213o1898J60155J5204K6183O1451j37015j73670J8176K44955N9323K9125
3306A119202J42438j46581k19092j05767J34144n7831j47238J35872J37211j79554
3296H12804k6364J94240Q8970j53265m4195M2742j25222k28179J29982J14150
3286H05663j10939L1889m228k8992l8987J54460J08208k12607P3865J43905j89233
$$ y = [1619393, 1573136, 1508761, 1303307, 1243895, 1350352, 1264904, 1159806, 1150548, 1342571, 1432357, 1281987, 1065423, 1198997, 1460695, 1195161, 1032578, 1219578, 1297053, 1160079, 1160288, 1296524, 1220890, 1114603, 1045560, 1046409, 1230338, 1235870, 993865, 764767, 953160, 1262892, 1031993, 937874, 1279942, 1244988, 910058, 816908, 1096619, 1231860, 1175366, 1073828, 877213, 815315, 975470, 990674, 1016857, 1078308, 941293, 767623, 785799, 1030754, 1090077, 1119202, 1261640, 1115059, 895967, 790200, 924344, 866513, 719275, 855147, 992358, 812804, 786440, 980680, 1069650, 916385, 872190, 914932, 789710, 561531, 691513, 805663, 694724, 726613, 722385, 693393, 654406, 808866, 917074, 704467, 778332, 922237, 733004]
3275G33004N8865J97117k20383j48307J41393J71143j76038o3804J43690j07141
3265G29539l10279J45288L47523M8754q425l07354j47827P2188M8109o0286N8351
3254F15581L3810J79224j10332l0825J68280j70671k74640J87214M5642q332k68369
3243C66582P5288K91351j33584p543J44526p8875j75553R9096Q1700j34411R0038
3232F18615J84104j47504j35731R7952P3792j47547O8678m4471n9870J72083K8220
3221G08321p2908m2790J91900R5497j08286q7474R139K3004j07046n4385J28580
3210F83552n1995l3838J503q1254M3644K16635m5851l8874J59058o0708j23996
3199F67876P0432R7642M2279j25583k4919K13546j3172k0348j09550L6379R398
$$ y = [733004, 791869, 988986, 768603, 620296, 761689, 932832, 756794, 692990, 836680, 729539, 419260, 564548, 912071, 960825, 952400, 645046, 497219, 569407, 617516, 557230, 615581, 649391, 828615, 718283, 687458, 855738, 685067, 410427, 597641, 643283, 634951, 366582, 441870, 733221, 599637, 592094, 736620, 657745, 482192, 581288, 662988, 528577, 618615, 802719, 655215, 519484, 617436, 691228, 543681, 612359, 567888, 508018, 680101, 708321, 635413, 592623, 784523, 880020, 771734, 684260, 693399, 716403, 609357, 554972, 683552, 631557, 597719, 599222, 517968, 561612, 778247, 732396, 693522, 852580, 791872, 667876, 738308, 835950, 878229, 752646, 727727, 941273, 928101, 907753, 798203, 834582, 843980]
3188H43980k4212q0748l8460K48914J90241j65268q291p8497O4690O9101j07837
3177I13613K2699J0340J1502K29271n8768p5786J06479J31033l2900j04772K18483
3166A371194P754N4595M8669l4085l07336M3127N30169K14452k34045j45378L02872
3155A851988m2891n9256K036J63281J53583k9629J7769j93535L7057J58997j1983
3144B047417J05202J72394k58961j68031L14365K96206L0661k14735O7204K61285
3134B653007J10475k9114Q7673L13863L21931R5409K0495K02162M70367J17674
3124D363942k51978k39919j00111m1069l70995k76094l6786J11145k04954q5422
3114B867759J18226j98147R5642N5888L5092P6239J76963l9220L6634M33621J81189
$$ y = [843980, 819768, 739020, 700560, 949474, 1139715, 974447, 966156, 887659, 952349, 1021450, 913613, 936312, 946652, 958154, 1187425, 1128657, 1052871, 1159350, 1290383, 1257483, 1152711, 1371194, 1378948, 1433543, 1482212, 1448127, 1140791, 1183918, 1714087, 1928539, 1694494, 1549116, 1851988, 1809097, 1749841, 1751877, 1915158, 2068741, 2039112, 2056881, 1863346, 1900403, 2059400, 2047417, 2152619, 2325013, 2066052, 1898021, 2212386, 2508592, 2539253, 2324518, 2391722, 2653007, 2763482, 2734368, 2822041, 3135904, 3457835, 3553244, 3573739, 3775901, 4246268, 4363942, 4111964, 3872045, 3771934, 3730865, 3359870, 3083776, 3046990, 3158135, 2953181, 2867759, 2985985, 2787838, 2883480, 2939368, 2974460, 3050699, 3227662, 3188442, 3225076, 3658697, 3839886]
3103C839886p6751l9420K64581K05799M5823j05205l25970N332M5736j87636k56237
3092C415938j36891M7268l03397k47038O1730l7539k16689j12737K6197K455q218
3081B491079J79453K13895j46523k63010j01860L50109J19050k23707j65805N9910
3071B512591Q1860j69338j83267p8690j23804j62965o3197j78753n744o6539j09404
3060A452750J45541n1972l89321q359N6034j94165R7477K2702l1165j06124n8085
3049I35313j40206p8368J74011o5845R9447J723R903k5770r1940q517j02084l26521
3037C81146Q5362L33551r957j49738j22593P1056M9740n6984l8345m0083l4038
3026D69117j86579j58003K17853L02335n8656q4545j60284o2889j29868j34443
$$ y = [3839886, 3763135, 3723715, 3988296, 4194095, 4239918, 4134713, 3808743, 3814075, 3859811, 3672175, 3415938, 3279047, 3326315, 3022918, 2775880, 2837610, 2800071, 2583382, 2470645, 2496842, 2499297, 2491079, 2670532, 2884427, 2737904, 2474894, 2373034, 2723143, 2842193, 2618486, 2452681, 2512591, 2594451, 2425113, 2241846, 2163156, 2039352, 1876387, 1813190, 1634437, 1628693, 1562154, 1452750, 1598291, 1546319, 1156998, 1148639, 1204673, 1010508, 1107985, 1130687, 1099522, 993398, 935313, 795107, 716739, 890750, 824905, 924352, 926075, 935978, 910208, 818268, 809751, 707667, 381146, 466508, 800059, 790102, 640364, 517771, 588827, 638567, 581583, 543238, 503155, 469117, 282538, 124535, 342388, 644723, 586067, 501522, 341238, 278349, 148481, 14038]
3016A4038K77837L50056j24638k95998J6682J44896p603P4784J82750K7879l23012
3005C37671j24646o1985J97960K51956J66997k99347k61602K165r7479J17354
2995B29044J08310J1581j1054l234j6308o5825p2763J95173j14658L9319J09138
2984D08723K0386l03875r5948J51562J12748k536k9584k9903n8839k06740N3336
2973A9330P3772j555J97789q5124k27687L9617K13877l5930j43738J26618J46781
2962C23750k37543r7722L8685m754k9727K05405J8019j02182k39190M60J20025
2951d774J84732m7092l9657R6871j17477m2582j70966J53120J79858R641p358
2940A94316J5817j64790j60297O8679L42160R8366k87586j32290J15870R1736
$$ y = [14038, 291875, 641931, 517293, 221295, 237977, 382873, 375270, 450054, 632804, 660683, 337671, 213025, 151040, 349000, 600956, 767953, 468606, 207004, 209169, 111690, 229044, 337354, 348935, 337881, 334647, 318339, 252514, 179751, 374924, 260266, 299585, 408723, 429109, 125234, 29286, 180848, 293596, 291060, 261476, 231573, 172734, -34006, 19330, 93102, 91547, 289336, 204212, -23475, 16142, 230019, 194089, 50351, 176969, 323750, 86207, -11515, 27170, 22416, -7311, 198094, 216113, 113931, -125259, -124799, -4774, 179958, 132866, 93209, 190080, 72603, 30021, -140945, 12175, 192033, 201674, 194316, 210133, 45343, -114954, -46275, 295885, 394251, 106665, -25625, 90245, 181981]
2930A81981j96320l9688N2886m4730J63742l2911m5022J0389K36601O3122k31311
2919A18739n177n0624j19942J08183J50694p2810k83919J02367J0542R5200R4396
2908A47649j02057l2754O3622J7969M618j38310O7324J27904j42260j42040J06260
2897b2075J65747r6919M0386l2880j99136p7899L46155J05605j81906o0670K07281
2886A93689J58569j71779j82344j9684J82249P1371k37133p7744N9240K08836
2876A85270L7572k75288J5929K54777O6639k31562P3788m4297l9432k844O599
2865D7151P9235J50125k81445k09267K71620P4414j68404j87092L02100J25797
2855B04234k31142p4039J71090J64973m9767k67035p4714J00318J67085P2301
$$ y = [181981, -14339, -54027, -1141, -45871, 117871, 84960, 39938, 50327, 286928, 350050, 118739, 113562, 62938, -57004, 51179, 201873, 129063, -154856, -52489, -41947, 53253, 147649, 45592, 12838, 76460, 94429, 99047, -39263, 28061, 155965, 13705, -128335, -22075, 143672, 46753, 87139, 54259, -144877, -222776, 123379, 228984, 47078, -13592, 193689, 352258, 180479, -1865, -21549, 160700, 232071, -5062, -82806, -23566, 185270, 222842, -52446, -36517, 218260, 284899, 53337, 127125, 82828, 43396, 40552, 47151, 126386, 276511, -4934, -214201, 57419, 131833, -36571, -223663, 78437, 204234, -26908, -100947, 70143, 235116, 185349, -81686, -156400, -56082, 111003, 183304]
2845A83304j33651j61720R5084J68061j50375m8754J65341R3879L0365j4884j31203
2834I5447l1519J9793m9984M1723j5543K2910J56507l3970m6239R112j19426j9350
2822B9461K2338l2080n3485J3810p2555R3237R6229J1556j20089Q9615n9466o4558
2810d5987j2250J02612J13734J1620j16883q3854K3196J47334m7011j69582M7947
2799b9124J10572R9203j33663r7733O5505J41514M2639m7081k14197J32296P3258
2788A43189q5951j58484K4365K22541k7745j04960k892K42281k42458r7392L27214
2777B39708J25532l11395k37145R551K22939n6985l7951o430L09602Q1729m50287
2766a11132j06764J74548J90226k5157L0555J0130j27008j76338J64006J6188
$$ y = [183304, 49653, -112067, -16983, 151078, 703, -48051, 117290, 211169, 241534, 226650, 95447, 63928, 83721, 33737, 75460, 59917, 82827, 239334, 205364, 159125, 168237, 48811, 29461, 51799, 19719, -33766, -19956, -92511, 726, 96955, 108511, -11578, 78037, 18571, -45987, -58237, 44375, 158109, 169729, 52846, -31008, -7812, 139522, 92511, -77071, -29124, 81448, 180651, 46988, -50745, 14760, 156274, 198913, 151832, -62365, 69931, 143189, 57238, -101246, -76881, 145660, 117915, 12955, 10063, 252344, 9886, -87506, 239708, 365240, 53845, -183300, -173749, 49190, -7795, -45746, -52176, 257426, 339155, -111132, -217896, -43348, 146878, 121721, 152276, 162406, 35398, -140940, 23066, 39254]
2756C9254M8308K4853j68751n0095j31003R523K69040J12888K272l312j27966
2745B5011k24854n5719J88537O9270J8073Q2382o1136j61713j56149J33141K2882
2734a20275J71306K4160j3200j48193o362J45039J53167Q6336j40912j38378L4538
2723D7226k6277o5121j8912O0290j8075J2294J15136k30498m1050j3837L62475
2712A83651N5310j62631p7815K3947J36736J2610j92576J499o9217N4093j4980
2701d9373Q7609K6519J711J17873P077j22149l45006J19011K64537O4195j04977
2690F7027n6820j4476J25336N8076l14532j98760K99076K81254K7934l32277k71848
2679c30010J26770L93728K5701k01888n9804J91265J1042j53342R122J83661o1084
$$ y = [39254, 87562, 112415, -56336, -106431, -237434, -227911, 41129, 154017, 156289, 152977, 25011, -199843, -255562, -67025, 2245, 20318, 102700, 41564, -120149, -276298, -143157, -120275, 51031, 75191, 61991, -86202, -92564, 52475, 205642, 291978, 151066, 12688, 47226, 20949, -44172, -63084, -2794, -20869, -8575, 106561, -123937, -164987, -178824, 183651, 238961, 76330, -1485, 22462, 159198, 171808, -20768, -19269, -88486, -34393, -49373, 38236, 64755, 66466, 184339, 191416, 69267, -275739, -156728, 107809, 172004, 67027, 10207, -4269, 121067, 179143, -135389, -334149, -35073, 246181, 274115, -58162, -330010, -203240, 190488, 216189, 14301, -45503, 145762, 156804, 3462, 12584, 196245, 135161]
2668A35161o6189M23M5256j79233j65403N7844K70310M480j26222j16044J34912
2657d705K0281l6728j21191J57576L67320J61719m48269m23631L08985L16321
2647B97678r5315q6880R3002J46561j88877k88613J3106J11521L5632M0815M1248
2636A19878J02290j92771k84051J46184K26531J96264k26851j20429J58973P8957
2626B04975j46844j19387P1708J85126j7712q4196j79531J16922N20573j10217
2616D41417m89524J95919J90642k40544k22374L46993P0324j70096K3016J46828
2606B92601q5064j35567M5609J27452J86502J32825k09891j01549K56170L37859
2596H46947Q5110K6994J58556K83109l18116l35855o5450q4959j44431j64894
$$ y = [135161, 68972, 69395, 114651, -64582, -229985, -172141, 98169, 102649, -23573, -139617, -4705, 15576, -21152, -142343, 15233, 382553, 544272, 96003, -327628, -18643, 297678, 202363, 115483, 208485, 355046, 166169, -122444, -109338, 2183, 37815, 78630, 119878, 222168, 29397, -254654, -108470, 118061, 314325, 87474, -32955, 126018, 204975, 58131, -61256, 10452, 195578, 177866, 93670, -85861, 31061, 551634, 441417, -48107, 147812, 338454, 97910, -124464, 222529, 292853, 122757, 145773, 292601, 207537, 71970, 117579, 245031, 431533, 564358, 354467, 252918, 509088, 846947, 932057, 959051, 1117607, 1400716, 1082600, 746745, 681295, 596336, 451905, 287011]
2586B87011j65290k40441K74774K0305j12505J46994J00703l9402j66770O0349
2576A65728J10162l13825j2724M52984N4022l77730k02675K02105Q3817k2019
2566A39845q8755j01906J06157L31531k29857l37761J17326M16288K561l23476
2556C1953m6953J01776L8701J14380p8910q7750k7770M8008P0378L4392J6034
2545B14239q4168p580R5735J04123j11584k20600L00197K35786j66925l00340
2535E8883J11386J09771j38113j82877Q5322M9727J35322J90908l39260j27686
2525d6617K51393R5329l1422j77806J65848J31117j90421j7042J34109J22082
2515D36570o0063M5052j45647p2308J72734N3199j10153q1490K4791L9347j4624
$$ y = [287011, 121721, -118720, 156054, 176359, 63854, 210848, 311551, 272149, 105379, 165728, 275890, -37935, -50659, 402325, 456347, 78617, -124058, 78047, 161864, 139845, 51090, -50816, 55341, 386872, 157015, -180746, -63420, 352868, 355429, 31953, -15000, 86776, 125477, 239857, 160947, 73197, 45427, 93435, 163813, 198205, 214239, 130071, 122491, 218226, 322349, 210765, -9835, 290362, 526148, 359223, 58883, 170269, 280040, 141927, -40950, 44372, 94099, 229421, 420329, 81069, -46617, 204776, 300105, 268683, 90877, 256725, 387842, 197421, 180379, 314488, 436570, 376507, 421559, 275912, 203604, 376338, 429537, 319384, 237894, 262685, 302032, 287408]
2504B87408j1738k04358r8972r2416K40988Q15k50123L114J83093J36025J22310
2493C16146j10407j40536J48806J45251j60996n2752n5829R6953K59535p8111
2483C68060p7109m6527P6910J46109r0533j25646O0855J89960o2671r3717j14429
2472B31262J00481J83809J07376l10217j72157L325K66617M1858L1348J79684
2462F63386N1193j50936p580J5490j13888j9634J10346P5653r1753k66648Q5848
2451C51477K58901N9072k88179J42107J27909L9017k28989P7162J05967J06162
2441G50606r1849k32477K2639P5505J14017R5335L6718p6218m9883M9061j0931
2430F82523O5870M0346l6185j4084P3694k11678m2929J68180J89228N0250j20842
$$ y = [287408, 275670, 71312, -27660, -120076, 120912, 121727, -128396, -125282, 57811, 193836, 316146, 205739, 65203, 214009, 359260, 198264, 145512, 89683, 186636, 446171, 368060, 290951, 244424, 321334, 467443, 376910, 251264, 312119, 502079, 439408, 345691, 231262, 331743, 515552, 622928, 312711, 140554, 143879, 410496, 452354, 483702, 663386, 714579, 563643, 556063, 571553, 457665, 438031, 548377, 624030, 532277, 265629, 351477, 610378, 669450, 381271, 523378, 651287, 690304, 461315, 538477, 644444, 750606, 658757, 426280, 448919, 524424, 638441, 733776, 770494, 694276, 644393, 693454, 682523, 748393, 788739, 752554, 738470, 812164, 600486, 557557, 725737, 914965, 965215, 844373]
2419H44373J10824O3683K4608j44847m0704J48120P6870q2273J05124J33907R9666
2408A339351j97041m000J32818N9096O0687Q6057P4789J06007j26077l4054R649
2397A507282Q6796o3675N2281K2978P2218M5418m316P5573J96005M8008k0265
2386B018303j49799J65044K78937J78506k04697Q140J76161J47162l8807j6380
2376B562570J14491R740j49037J41248J72930j4747P9646K82459J13602O8771
2366C381673R0303K51945K54250K19859j59413M4374L85264M72468K05357K57925
2356E404005R4763K18867J78711M79352L22667N94080M81585P10384L92526Q78530
2346I755470J308246K397523K604915K515679P65850J87907q0988J233183J402624
$$ y = [844373, 955197, 1018880, 1043488, 898641, 857937, 1006057, 1082927, 1000654, 1105778, 1239685, 1339351, 1142310, 1138310, 1271128, 1330224, 1390911, 1476968, 1551757, 1657764, 1531687, 1497633, 1507282, 1594078, 1530403, 1582684, 1605662, 1677880, 1723298, 1718982, 1794555, 1990560, 2038568, 2018303, 1868504, 2033548, 2312485, 2490991, 2286294, 2294434, 2470595, 2617757, 2578950, 2562570, 2677061, 2686801, 2537764, 2679012, 2851942, 2837195, 2916841, 3199300, 3312902, 3381673, 3471976, 3723921, 3978171, 4198030, 4038617, 4082991, 4468255, 4940723, 5146080, 5404005, 5498768, 5717635, 5896346, 6375698, 6698365, 7292445, 7774030, 8484414, 8876940, 9755470, 11063716, 13461239, 16066154, 18581833, 19347683, 19535590, 19454602, 20687785, 22090409]
2337B2090409K251960K530522M196236M989131P660564J2090509K7771577N6471412
2329A40052320P5201930M2746744j4314295m3576862n2067822l8125792k7083432
2322H2832791j9054446j5283562j1452095q901902n502861l437765k043121o93937
2314A6463102N75988K84216j021529j813053j675825j330069j143463j208697
2306I130670q04989n80146n27892n71691m47482N2k13982o87052n47128J09725
2296D860085k3563m19276k97593M8818j44398l03852j10059k2607J03489j31366
2286C559678k68875p1156n4847j94098l36581P7012J87078J784n37592j65995
2276B196408K45553n6835m30209L5716J63080l10440j70919Q5474r6075j0684
$$ y = [22090409, 24342369, 26872891, 31069127, 36058258, 43718822, 55809331, 83580908, 140052320, 215254250, 258000994, 243686699, 200109837, 148042015, 109916223, 82832791, 63778345, 48494783, 37042688, 28140786, 22637925, 19200160, 17157039, 16463102, 17039090, 17323306, 16301777, 14488724, 12812899, 11482830, 10339367, 9130670, 8325681, 7745535, 7217643, 6645952, 6198470, 6198522, 5984540, 5297488, 4750360, 4860085, 4836522, 4417246, 4119653, 4168471, 4024073, 3720221, 3610162, 3587555, 3691044, 3559678, 3290803, 3219647, 3164800, 2970702, 2634121, 2711133, 2898211, 2899995, 2362403, 2196408, 2441961, 2385126, 1954917, 1990633, 2153713, 1843273, 1672354, 1757828, 1661753, 1651069]
2266A651069Q405l7062j7957o9119N8724p8554j31141K29609j38594k12915j52954
2255A109511K4944j13969m312J09257K06067p1468j6542k36155j11514J19174
2245A014993J06764j55808L5590r6326j04581j38124Q1171J54322j30640j64531
2235F02830J75788K1360k073o1412N2058k126Q3592J55j56858j94314j19134J04500
2223E04366J294J7057K33683j00403l51843q7747K98024l5568n4462J51478J00802
2212F76681k70811j62445J56496O4290P7947j50932R7991J03779k5614k03391
2202C63991r1906L13673l2947l05258q1367M3627J6131j71850o2261J55134J32843
2191B79810j01768j68558k7428J60038q2211n0386K90701P4137j02310j86390
$$ y = [1651069, 1659474, 1622412, 1604455, 1535336, 1594060, 1515506, 1384365, 1613974, 1475380, 1262465, 1109511, 1134455, 1020486, 1016174, 1125431, 1331498, 1260030, 1243488, 1007333, 895819, 1014993, 1121757, 965949, 1001539, 905213, 800632, 662508, 743679, 898001, 767361, 602830, 778618, 799978, 797905, 736493, 788551, 786425, 870017, 870172, 713314, 519000, 399866, 504366, 505660, 522717, 756400, 655997, 304154, 216407, 514431, 478863, 424401, 575879, 676681, 405870, 243425, 399921, 464211, 542158, 391226, 489217, 592996, 567382, 363991, 272085, 585758, 552811, 247553, 166186, 209813, 225944, 54094, -8167, 146967, 279810, 178042, 9484, -17944, 142094, 59883, 9497, 300198, 374335, 272025, 85635]
2181H5635m0511J80052j0284j56409R1097K59656j39097l35551K7075K13208K22942
2170C97813j32706j06222K1600r700J4974q9919K26510L20316r6176k89895q5802
2159A70793K9227q2099J369J38908P0613n0515n4408r6108K1816K3092o2967r2941
2147A6780L798k02345p875J51068l8801J04341N5804L244j35801J90241P9550
2136B20004j00782j51166P5112J07652k19067N2546J7023K8192r0283J03792N8228
2125A01251l6256j25015m8851L10404P1387l46873J10438L31031k35976k75776
2115a44236r5384K01208J6963k1536m1794J7654M0609l2740r7982M1354J83616
2104F7732O8561j04852k33563m0248p4262J2109K24393J54716R8853j57134j07165
$$ y = [85635, 45124, 225176, 214892, 58483, 149580, 409236, 270139, -65412, -38337, 174871, 397813, 265107, 158885, 180485, 170785, 185759, 95840, 322350, 642666, 546490, 256595, 170793, 200020, 117921, 119290, 258198, 328811, 278296, 223888, 127780, 149596, 172688, 109721, 16780, 20578, -181767, -189642, -38574, -77375, 26966, 82770, 86014, -49787, 140454, 220004, 119222, -31944, 43168, 150820, -68247, -15701, 1322, 29514, -60769, 43023, 101251, 64995, -60020, -108871, 201533, 272920, -73953, 36485, 367516, 131540, -144236, -239620, -38412, -21449, -42985, -84779, -67125, -26516, -59256, -157238, -115884, 67732, 136293, 31441, -202122, -242370, -316632, -304523, -80130, 74586, 173439, 16305, -90860]
2093i0860N3392J42784j05772j27003P3117J94283j66334k88697J37238L42804
2083A64952L8082k75770k20590M16324K42773k63043k42667L9239J85996P5327
2073A60623r0169k45478l5403K30875L3101j10216j8731K08450j56591n6034J32900
2062E3327J77424J03424L12978M21435K4245k66810j46312j50784K0615j20540
2052D29002j41706j30076j10584k0328o8202j45034J55075K28353J08423j25586
2042A79337k01961j68170o2683K35503P9264m2299j55072P6356p3658j86676J14186
2031b05873L58746J74188j02456j69121k43896j046J51088K9963l6902R3308m0893
2020G106k30721j52440J76341J33917j28196L60160J30363k44890k48100P3253
$$ y = [-90860, -37468, 105316, -456, -127459, -54342, 139941, -26393, -315090, -177852, 164952, 203034, -72736, -293326, 122998, 365771, 102728, -139939, -100700, 85296, 160623, 70454, -175024, -210427, 20448, 53549, -56667, -75398, 133052, -23539, -79573, 53327, 230751, 334175, 647153, 1068588, 1092833, 826023, 679711, 528927, 549542, 429002, 287296, 157220, 46636, 26308, -41894, -186928, -31853, 196500, 304923, 179337, -22624, -190794, -253477, -17974, 61290, 18991, -136081, -59725, -133383, -320059, -205873, 152873, 327061, 224605, 55484, -188412, -189458, -38370, -8407, -45309, 47999, 7106, -223615, -376055, -199714, -65797, -193993, 166167, 296530, 51640, -196460, -123207]
2010a23207J82380J16504j15158J45241j24451j68678n1889P6587o856J02820
2000C3293R5950j28710j87298j5477M9283j6130J72211J62969l74746o8570J9917
1989b57308k2941p4984K62849J81664j78127j41050p2350J13132P9688m6586M2920
1978a13093O7422J30143k52825k05796J83037K08701j33985R4729L1615k44338
1968b34390N4191P8946J13985m4736O3116K6896j40194k68569O0905J56799J02562
1957c0489O8565Q0500J27904j34470l55001L7824L15206O799j41538K2607o3875
1946f5968j7017p1756r7760K66068K20529j30279n02897J4068L53582L3826k45318
1935b42922k861L07171k4018k03864j90262K85491L14462l6573l04700J67341
$$ y = [-123207, 59173, 175677, 60519, 205760, 81309, -87369, -139258, -62671, -69527, 33293, 129243, 533, -186765, -202242, -152959, -169089, 3122, 166091, -208655, -277225, -257308, -280249, -355233, -92384, 89280, -88847, -229897, -302247, -189115, -109427, -156013, -113093, -45671, 84472, -168353, -374149, -191112, 17589, -116396, -21667, 9948, -234390, -180199, -101253, 12732, -32004, 31112, 58008, -82186, -350755, -289850, -133051, -30489, 38076, 118576, 246480, 112010, -242991, -205167, 110039, 116838, -24700, -2093, -65968, -82985, -154741, -252501, 13567, 234096, 103817, -399080, -385012, -31430, 2396, -242922, -245783, 61388, 37370, -166494, -356756, -71265, 243197, 206624, -98076, 69265]
1925F9265J5530k96408j5466J42706J26843q941j23338j16108K157O5063K172
1914a36525K9874Q3326r0835j35775k5695N1811m7533J75044J02109p9111K405
1903g0905k6682j02321j07281K26728O3547j59425K7948m2070j17819P1842Q4468
1892a51970R7723l8502M1285n8609k3247o404m0514O5540J48256k8103k09160
1881b03705j44419K9865L4340R6958q2545O9154J61467r6244j94759L9772J20669
1870a69447N4140O4412p3089l8382J42461J66115j29871j07874J74827R6836k20725
1859d0597r6695J31372p4700j06973L8038J88358J02493j21962m9987M1950l7865
1848b6568o0214m3648J96549J19802j10686j59254j7022P9019J51480j5169k29658
$$ y = [69265, 84795, -211613, -227079, -84373, 42470, 33529, -89809, -205917, -203760, -138697, -136525, -106651, -23325, -114160, -249935, -275630, -223819, -271352, -96308, 5801, -73310, -70905, -97587, -199908, -307189, -80461, -16914, -176339, -148391, -190461, -308280, -236438, -151970, -54247, -92749, -51464, -110073, -133320, -139724, -180238, -114698, 33558, 5455, -203705, -348124, -318259, -283919, -186961, -269506, -200352, -38885, -135129, -329888, -290116, -169447, -115307, -50895, -123984, -162366, -19905, 146210, 16339, -91535, 83292, 180128, -40597, -137292, -5920, -80620, -187593, -149555, 38803, 141296, 19334, -30653, 11297, -26568, -86782, -130430, 66119, 185921, 75235, -84019, -101041, -22022, 129458, 114289, -115369]
1837a15369j7271K01863k4399k20834J410J12647n8703R3086j15830j15719R5156
1826a63963l2463k6647m0519K65036r3600n4009O9112j26070p4160K61059J68081
1815A51857k95001j3601J19216r0423J11784o972J1029j66859N7015K6935j2397
1804a07417N4130k22480j12932K94211J90074q5011j36266n6935N8392K6743Q6841
1793a0650j765J19889O9279l71288k41708R0488L25797J21096j75535J0728J28991
1782F5322j06166j91432J13225J45515J00178k42950k34820J93586J95607r3963
1772e5898N6413K20553m1462j11690k04112j01280K35794J89237j35259j20272
1762f7976O9926K4641j06118K1211O0382J56458J9628j84107j56008J69034L9843
$$ y = [-115369, -132640, 69223, 44824, -176010, -174600, -61953, -120656, -27570, -143400, -259119, -163963, -196426, -223073, -263592, 1444, -92156, -146165, -77053, -203123, -277283, -16224, 151857, -143144, -156745, -37529, -127952, -16168, -23140, -12111, -178970, -121955, -95020, -107417, -53287, -275767, -388699, -94488, 95586, 10575, -125691, -182626, -124234, -97491, -10650, -12415, 107474, 176753, -194535, -436243, -345755, -19958, 101138, -74397, -63669, 65322, -40844, -232276, -119051, 26464, 126642, -116308, -351128, -157542, 38065, -55898, 515, 221068, 179606, 67916, -136196, -237476, -1682, 187555, 52296, -67976, 1950, 26591, -79527, -58316, 2066, 158524, 178152, -5955, -161963, 7071, 46914]
1751D6914r9373j0481J61263J34787l13479k29614O3958J60706Q0814k8543r3983
1740a27031J17390N3722N4584j00769k4750K1556r4712n882j05713o2416k2533
1729b96554J65030P1734O8945p7805N2554P2894o2675j92506J37069L91123j57499
1718A72310k81316m0432r2193k5677K89425N9701j05222r0451p2566m1814J56268
1707g1967o134j17002P7367O7504m6828k08097j43732R3687J82258P6607r187
1696a05524j10697K1633j61602o6863J13237Q4583K77065j80136j50169J24349
1686a54124J05444m4593j50330J65344L5907j49875R8358j0265p3649J79205L74274
1675C75696j15319l73985m5837K74083p3771j55464K20099K21963k39811j28190
$$ y = [46914, -52459, -62940, 98323, 233110, -80369, -309983, -246025, -85319, -4505, -33048, -127031, -9641, 44081, 98665, -2104, -26854, -5298, -100010, -105892, -211605, -274021, -296554, -131524, -59790, 9155, -68650, -16096, 56798, -5877, -198383, -61314, 329809, 172310, -109006, -149438, -241631, -267308, 22117, 81818, -23404, -113855, -186421, -228235, -71967, -78101, -195103, -117736, -50232, -97060, -305157, -448889, -355202, -172944, -96337, -105524, -216221, -194588, -356190, -423053, -309816, -225233, 51832, -128304, -278473, -154124, -48680, -93273, -243603, -78259, -42352, -192227, -93869, -104134, -177783, 1422, 375696, 260377, -113608, -159445, 114638, 40867, -114597, 105502, 327465, 87654, -40536]
1665d0536j29042l0794K00585N4858Q52l3159Q2530r5323j66725p2268J63548
1654f5474M9502m2013P0971K5410o8376j29367l5611K34899J9378P7947k21510
1643h4244o8833J29328Q2241r2262j07736L21379o2901k77751j71922K08488N1114
1632g3099K2239q0041r9364P7507K52248o4313l18684J47120L32177j73569l50191
1621c27970j44560J90002J46728J81141N7380k54472k04749R1891J5223O1483
1611a87903Q4856j58716J9106K49631j57637j94712Q6633J72193J23989j22388
1601h4948k41866O4378K79707j85495j22718L33852K57199l91652j65376O8516
1591a88403j07927R1845J20398J20921m1370j46847j23538m2064K97396N3040
$$ y = [-40536, -169578, -200372, 213, 55071, 55923, 22764, 105294, 9971, -156754, -229022, -65474, -15972, -57985, 12986, 38396, -29980, -159347, -194958, 39941, 59319, 137266, -84244, -153077, -23749, 58492, -33770, -141506, 179873, 116972, -160779, -332701, -124213, -73099, -50860, -130901, -230265, -152758, 99490, 35177, -283507, -136387, 195790, 22221, -327970, -472530, -282528, -135800, 45341, 102721, -151751, -356500, -264609, -249386, -187903, -103047, -261763, -242657, 6974, -150663, -345375, -258742, -86549, 37440, -84948, -326814, -262436, 17271, -168224, -290942, 42910, 300109, -91543, -256919, -188403, -296330, -204485, -84087, 36834, -4536, -151383, -274921, -316985, -19589, 33451]
1581C3451k09176k9772K10413L5592k45598k35524J35160L41858K86831k81359
1571D1876q2568Q7446k04882l4025K65672J53569o0386k84085o3820J9125q8856
1560b50934K02205k2035J34742l1380k95500P56Q7358O8933l9327J96770l8735
1549A2853l97j43595k6580r2988P3702L45223j29188k65310K6805R7234K082m0957
1537a41116K22926J3940k68111o2929J64621N5607j85224k0696J77145N1780q6804
$$ y = [33451, -175725, -205497, 4916, 40508, -205090, -440614, -305454, 36404, 323235, 41876, -40692, 46754, -158128, -192153, 73519, 227088, 166702, -117383, -181203, -162078, -250934, -48729, -70764, 63978, 32598, -262902, -262146, -174788, -105855, -145182, 51588, 12853, 12456, -131139, -157719, -250707, -177005, 168218, 39030, -226280, -199475, -102241, -100159, -141116, 81810, 95750, -172361, -235290, -70669, -15062, -200286, -220982, -43837, 7943, -78861]
$$ [...]
##END NTUPLES=NMR SPECTRUM
##END=
