##TITLE=1H_DE-80H_X3
 200.13MHz, d2o
 8 sc
 
 19ns.26.2.2025
##JCAMPDX= 6.0         $$ Bruker NMR JCAMP-DX V2.0
##DATA TYPE= NMR SPECTRUM
##DATA CLASS= NTUPLES
##ORIGIN= UXNMR, Bruker Analytische Messtechnik GmbH
##OWNER= pz
$$ XWIN-NMR		Version 3.5
$$ Wed Jan 21 10:33:45 2026 Russian Standard Time (UT+4h)  Yarkov@DPX200
##.OBSERVE FREQUENCY= 200.1313
##.OBSERVE NUCLEUS= ^1H
##.ACQUISITION MODE= SIMULTANEOUS
##.ACQUISITION SCHEME= undefined
##.AVERAGES= 8
##.DIGITISER RES= 18
##SPECTROMETER/DATA SYSTEM= spect
##.PULSE SEQUENCE= zg30
##.SOLVENT NAME= CDCl3
##.SHIFT REFERENCE= (INTERNAL, CDCl3, 0, 15.5254)
##AUDIT TRAIL= $$ (NUMBER, WHEN, WHO, WHERE, WHAT)
$$ ##TITLE= Audit trail, XWIN-NMR		Version 3.5
$$ ##JCAMPDX= 5.01
$$ ##ORIGIN= Bruker BioSpin GmbH
$$ ##OWNER= Yarkov
$$ C:/Bruker/XWIN-NMR/data/yarkov2/nmr/H-C/1/pdata/1/auditp.txt
$$ ##AUDIT TRAIL=  $$ (NUMBER, WHEN, WHO, WHERE, WHAT)
(   1,<2026-01-21 10:32:57.45 +0400>,<Yarkov>,<DPX200>,
      <created by zg, POWCHK disabled, PULCHK disabled
       configuration hash MD5:
       00 E9 B6 7A A2 85 ED C7 34 08 36 98 17 FE 4E 26
       data hash MD5: 16K
       78 D1 8D 04 FB A8 CE 34 7B DF BE 8A DD 29 0E 0D>)
(   2,<2026-01-21 10:33:04.62 +0400>,<Yarkov>,<DPX200>,
      <Start of raw data processing
       efp BC_mod = 2 LB = 0.25 FT_mod = 6 PKNL = 1 PHC0 = -5297.497 PHC1 = 7.62193 SI = 16K 
       data hash MD5: 16K
       7A AD A7 15 A0 09 D0 DF AE 26 77 70 FD 91 EC 1C>)
$$ ##END=
$$ 
$$ hash MD5
$$ 2A C4 7F B3 B8 5E 8D 91 B3 3A 6C EB 85 66 56 3E
##$RELAX= 
##$RELAX= 
##$RELAX= 
##$RELAX= 
##$RELAX= 
##$RELAX= 
$$ Bruker specific parameters
$$ --------------------------
##$DU= <C:/Bruker/XWIN-NMR>
##$EXPNO= 1
##$NAME= <H-C>
##$PROCNO= 1
##$TYPE= <nmr>
##$USER= <yarkov2>
##$AMP= (0..31)
100 100 100 100 100 100 100 100 100 100 100 100 100 100 100 100 100 100 
100 100 100 100 100 100 100 100 100 100 100 100 100 100 
##$AQSEQ= 0
##$AQ_mod= 1
##$AUNM= <au_zg>
##$AUTOPOS= <>
##$BF1= 200.13
##$BF2= 200.13
##$BF3= 200.13
##$BF4= 200.13
##$BF5= 200.13
##$BF6= 200.13
##$BF7= 200.13
##$BF8= 200.13
##$BYTORDA= 1
##$CFDGTYP= 0
##$CFRGTYP= 5
##$CHEMSTR= <none>
##$CNST= (0..31)
1 1 145 1 1 1 1 1 1 1 1 1 1 1 1 1 1 1 1 1 1 1 1 1 1 1 1 1 1 1 1 1 
##$CPDPRG= <>
##$CPDPRG1= <>
##$CPDPRG2= <>
##$CPDPRG3= <>
##$CPDPRG4= <mlev>
##$CPDPRG5= <mlev>
##$CPDPRG6= <mlev>
##$CPDPRG7= <mlev>
##$CPDPRG8= <mlev>
##$CPDPRGB= <>
##$CPDPRGT= <>
##$D= (0..31)
0 0.7 0 0 0 0 0 0 0 0 0 0.03 0 0 0 0 0 0 0 0 0 0 0 0 0 0 0 0 0 0 0 0 
##$DATE= 1768977176
##$DBL= (0..7)
120 120 120 120 120 120 120 120 
##$DBP= (0..7)
150 150 150 150 150 150 150 150 
##$DBP07= 0
##$DBPNAM0= <>
##$DBPNAM1= <>
##$DBPNAM2= <>
##$DBPNAM3= <>
##$DBPNAM4= <>
##$DBPNAM5= <>
##$DBPNAM6= <>
##$DBPNAM7= <>
##$DBPOAL= (0..7)
0.5 0.5 0.5 0.5 0.5 0.5 0.5 0.5 
##$DBPOFFS= (0..7)
0 0 0 0 0 0 0 0 
##$DE= 6
##$DECBNUC= <off>
##$DECIM= 32
##$DECNUC= <off>
##$DECSTAT= 4
##$DIGMOD= 1
##$DIGTYP= 9
##$DL= (0..7)
0 120 120 120 120 120 120 120 
##$DP= (0..7)
$$ [...]
##$SUBNAM2= <"">
##$SUBNAM3= <"">
##$SUBNAM4= <"">
##$SUBNAM5= <"">
##$SUBNAM6= <"">
##$SUBNAM7= <"">
##$SUBNAM8= <"">
##$SUBNAM9= <"">
##$SW= 18.0517328524113
##$SWIBOX= (0..15)
0 0 2 0 0 0 0 0 0 0 0 0 0 0 0 0 
##$SW_h= 3612.71676300578
##$TD= 16384
##$TD0= 1
##$TE= 0
##$TE2= 300
##$TE3= 300
##$TEG= 300
##$TL= (0..7)
0 120 120 120 120 120 120 120 
##$TP= (0..7)
150 150 150 150 150 150 150 150 
##$TP07= 0
##$TPNAME0= <>
##$TPNAME1= <>
##$TPNAME2= <>
##$TPNAME3= <>
##$TPNAME4= <>
##$TPNAME5= <>
##$TPNAME6= <>
##$TPNAME7= <>
##$TPOAL= (0..7)
0.5 0.5 0.5 0.5 0.5 0.5 0.5 0.5 
##$TPOFFS= (0..7)
0 0 0 0 0 0 0 0 
##$TUNHIN= 0
##$TUNHOUT= 0
##$TUNXOUT= 0
##$USERA1= <user>
##$USERA2= <user>
##$USERA3= <user>
##$USERA4= <user>
##$USERA5= <user>
##$V9= 5
##$VALIST= <valist>
##$VCLIST= <CCCCCCCCCCCCCCC>
##$VD= 0
##$VDLIST= <DDDDDDDDDDDDDDD>
##$VPLIST= <PPPPPPPPPPPPPPP>
##$VTLIST= <TTTTTTTTTTTTTTT>
##$WBST= 1024
##$WBSW= 4
##$XGAIN= (0..3)
0 0 0 0 
##$XL= 0
##$YL= 0
##$YMAX_a= 569587
##$YMIN_a= -311811
##$ZGOPTNS= <>
##$ZL1= 120
##$ZL2= 120
##$ZL3= 120
##$ZL4= 120
##$ABSF1= 0
##$ABSF2= 0
##$ABSG= 0
##$ABSL= 0
##$ALPHA= 0
##$AQORDER= 0
##$ASSFAC= 0
##$ASSFACI= 0
##$ASSFACX= 0
##$ASSWID= 0
##$AUNMP= <proc_1d>
##$AZFE= 0.1
##$AZFW= 0.1
##$BCFW= 0
##$BC_mod= 2
##$BYTORDP= 0
##$COROFFS= 0
##$CY= -3
##$DATMOD= 1
##$DC= 0
##$DFILT= <>
##$DTYPP= 0
##$F1P= 0
##$F2P= 0
##$FCOR= 1
##$FTSIZE= 16384
##$FT_mod= 6
##$GAMMA= 0
##$GB= 0
##$INTBC= 1
##$INTSCL= 3.241238e-09
##$ISEN= 128
##$LB= 0.25
##$LEV0= 0
##$LPBIN= 0
##$MAXI= 10000
##$MC2= 0
##$MEAN= 0
##$ME_mod= 0
##$MI= 1.114404
##$NCOEF= 0
##$NC_proc= -4
##$NLEV= 6
##$NOISF1= 3.799351
##$NOISF2= 2.8
##$NSP= 0
##$NTH_PI= 0
##$NZP= 0
##$OFFSET= 15.52543
##$PC= 1
##$PHC0= -5297.497
##$PHC1= 7.62193
##$PH_mod= 1
##$PKNL= yes
##$PPARMOD= 0
##$PSCAL= 0
##$PSIGN= 0
##$REVERSE= no
##$SF= 200.129999254034
##$SI= 16384
##$SIGF1= 3
##$SIGF2= 2
##$SINO= 0.751879
##$SIOLD= 32768
##$SREGLST= <19F.Aceton>
##$SSB= 0
##$STSI= 16384
##$STSR= 0
##$SW_p= 3612.71676300578
##$SYMM= 0
##$S_DEV= 0
##$TDeff= 16384
##$TDoff= 0
##$TI= <>
##$TILT= no
##$TM1= 0
##$TM2= 0
##$TOPLEV= 0
##$USERP1= <user>
##$USERP2= <user>
##$USERP3= <user>
##$USERP4= <user>
##$USERP5= <user>
##$WDW= 1
##$XDIM= 16384
##$YMAX_p= 325161086
##$YMIN_p= -244340
$$ End of Bruker specific parameters
$$ ---------------------------------
##NTUPLES= NMR SPECTRUM
##VAR_NAME=  FREQUENCY,     SPECTRUM/REAL,   SPECTRUM/IMAG
##SYMBOL=    X,             R,               I
##VAR_TYPE=  INDEPENDENT,   DEPENDENT,       DEPENDENT
##VAR_FORM=  AFFN,          ASDF,            ASDF
##VAR_DIM=   16384,         16384,           16384
##UNITS=     HZ,            ARBITRARY UNITS, ARBITRARY UNITS
##FACTOR=    0.220516191357247, 1,           1
##FIRST=     3107.10423941229, 0,            0
##LAST=      -505.612523593494, 0,           0
##MIN=       -505.612523593494, -244340,     0
##MAX=       3107.10423941229, 325161086,    0
$$ Real data points
##PAGE= N=1
##DATA TABLE= (X++(R..R)), XYDATA
$$ [...]
8290C800058o255P4109J35593K03638J52679J04173N0869q3104o8701j09027l0768
8279D223264k0702m9265l5897j27376j61599k49930k01888j81910j18520m2671
8269C033506m6327n4473j56381j62928j79426j53115j31207j05059j05417j31930
8259A807243o6226k4499k7009J3971J6700P257j5168j4420K698m563K4677L4807
8247A755468J3394L057j3131r006j3186j5478P6061O6544J40885J58538J24461
8236B287607N5482l9758j31160j53986j58531r7906Q603K0759Q8602P9658l942
8225A955428o3261j20610j38870j61610j43723j25311j21226p4246p8741n0670
8215H77160m6842m5571m2375n5630j6621j8482j3422k927k4054L0774k0351L978
$$ y = [3800058, 3793803, 3867912, 4003505, 4207143, 4359822, 4463995, 4514864, 4431760, 4363059, 4254032, 4223264, 4202562, 4153297, 4117400, 3990024, 3828425, 3578495, 3376607, 3194697, 3076177, 3033506, 2987179, 2932706, 2776325, 2613397, 2433971, 2280856, 2149649, 2044590, 1939173, 1807243, 1741017, 1716518, 1689509, 1703480, 1720180, 1727437, 1712269, 1697849, 1700547, 1695984, 1720661, 1755468, 1768862, 1771919, 1758788, 1749782, 1736596, 1721118, 1797179, 1863723, 2004608, 2163146, 2287607, 2343089, 2303331, 2172171, 2018185, 1859654, 1761748, 1770351, 1791110, 1879712, 1959370, 1955428, 1892167, 1771557, 1632687, 1471077, 1327354, 1202043, 1080817, 1006571, 927830, 877160, 830318, 784747, 742372, 686742, 670121, 651639, 638217, 635290, 611236, 642010, 621659, 625637]
8203F25637l8649O902m9892k2201j9799l1170k3919L1076n6865N310l24871p9595
8191B1964M78797L1875J6236m3652j5646m7822O09l6702R366k2565j4067j3460
8179C64933L226M183m3154J0346k454j9765J88j5726j5635R473k8382J0025l2225
8166B45033L7923j1779K029J6920k0176m583K0237K6181q528J1734n66Q554k1964
8153C01015j4659J8943l0103l1620J9188j7623n365J5851L3451J5770J0440L4707
8141C49995r305k7534O776N976k3985l7363K1826q929j4402R759N079J9227k0969
8128B76151K2500J174K4399L746o677J4928l8372K4346k5367M007l8869P484j120
8115B68330m8417L0003m6067J5408p257r796o981l0982K1513j0198J3106o520
$$ y = [625637, 586988, 593890, 543998, 521797, 501998, 470828, 446909, 477985, 421120, 426430, 101559, 21964, 500761, 532636, 548872, 505220, 489574, 441752, 442361, 405659, 415025, 392460, 378393, 364933, 368159, 372342, 329188, 339534, 337080, 317315, 317503, 301777, 286142, 295615, 267233, 277258, 245033, 282956, 271177, 273206, 290126, 269950, 265367, 285604, 311785, 303257, 314991, 314425, 322979, 301015, 286356, 305299, 275196, 243576, 262764, 245141, 239776, 255627, 289078, 304848, 315288, 349995, 340690, 313156, 319932, 325908, 301923, 264560, 286386, 277457, 263055, 272814, 277893, 297120, 276151, 298651, 299825, 324224, 327970, 321293, 336221, 297849, 322195, 296828, 300835, 261966, 269450, 268330, 219913, 249916, 203849, 219257, 212000, 202204, 195223, 164241, 185754, 175556, 188662, 182142]
8103A82142k831J7391j6205o002o016j7854J3400j618J182J4271k8762K8496o361
8090A71233r669J5053j5586o074J4154Q764j2126J3234l0570J5407j7013k8384
8078A18423K7879k1569K3935r820j6517J0599L509K082J3208l2884N683n150K0875
8065A40253P02k8176J592J6909l1724J1353k4894j2266j773o950P606M109m177
8052G2564J0298P342j2116J5428K755j124q130R417o191r741N662j6433r109J7378
8038G8000l2l003J9806j1052K7468N79J3839J1737j6971J3766q767Q703j2536
8025A21537J5679j8532K8188L642M853k8329L9103K3685j8680J5628j6601J5683
8013A85856M8696l6654L6044k1927P996L7766j1940J2944M65L1649r299K8469
$$ y = [182142, 179311, 196702, 180497, 174495, 168479, 150625, 164025, 162407, 163589, 177860, 149098, 177594, 171233, 161564, 176617, 161031, 154957, 169111, 177875, 165749, 178983, 148413, 163820, 146807, 118423, 146302, 124733, 148668, 138848, 122331, 132930, 136439, 138521, 151729, 118845, 124528, 119378, 140253, 140955, 112779, 114371, 131280, 99556, 110909, 86015, 73749, 71976, 65026, 72632, 76741, 72564, 82862, 90204, 78088, 93516, 96271, 95147, 87017, 96434, 90243, 80502, 86164, 69731, 60622, 78000, 77968, 74965, 94771, 83719, 111187, 111766, 125605, 137342, 120371, 134137, 125370, 134073, 121537, 137216, 118684, 146872, 150514, 155367, 127038, 166141, 189826, 171146, 186774, 170173, 185856, 234552, 197898, 233942, 212015, 220011, 257777, 245837, 258781, 259246, 290895, 281596, 310065]
8001C10065O859J3293Q111o657J9055k1931Q200M5262P726M4094J2277L1709L7533
7988E15596M4327Q5169N6164R1506J54090J71646K76826L00287L21860J90615
7978B208086J14054k1715r2231j42281j25895J4736M9661J84799J76761J22306
7968B488281J7133j16297j82244k75054k84669k33889j72929j08085r7553k4442
7958A010252o8271l2805n9890m5932n7343m0091k8129n016p786J4246K2372J6500
7946G18107K4286P889N6523O8409J03178J63801K50683K88417K85545K49396J58883
7935B375117M4414j03934j41075j57147r4273J8530Q2167J70592J25866Q7633
7925B407890o0238j72415k98318k46456k43412k29059j32182j00326q4867n5437
$$ y = [310065, 316924, 330217, 338328, 331671, 350726, 328795, 336995, 382257, 389983, 434077, 446354, 478063, 515596, 559923, 645092, 701256, 792762, 946852, 1118498, 1395324, 1695611, 2017471, 2208086, 2322140, 2300425, 2208194, 2065913, 1940018, 1954754, 2004415, 2189214, 2365975, 2488281, 2505414, 2389117, 2206873, 1931819, 1647150, 1413261, 1240332, 1132247, 1034694, 1010252, 941981, 909176, 849286, 803354, 746011, 705920, 677791, 672775, 664989, 679235, 701607, 718107, 742393, 750282, 806805, 875214, 978392, 1142193, 1392876, 1681293, 1966838, 2216234, 2375117, 2419531, 2315597, 2174522, 2017375, 1923102, 1941632, 2023799, 2194391, 2320257, 2407890, 2347652, 2175237, 1876919, 1630463, 1387051, 1157992, 1025810, 925484, 840617, 785180]
7915G85180p0461l3029q4410l6726o0656l4969m6863k3313j1682l9210r453j0256
7903C24152m5503R766j3302j5566j242k8944J2992l1893K3530j5876O378k1889
7891B02603O264j2192l1261K2930M307k0210Q775J5745K6978j3970M1639l8138
7879B13470J9362P498k6271j0607Q538O95J6335o949Q36m749r396k6298J7698
7866B00162k7119j9866n272k2085K4195k9081j7505J3854j7858J6624j3902p050
7854I5097k786k029r561j3680J9909j1997J9278j5172K7137J6985N974l457J0465
7841A36163K4325J9125l124o313o46q99P246j2201K6663J4582k109J7919j5018
7828B05713k172j1454j2788j9529j1238j0747j6755R336j9394J2217r189o750
$$ y = [785180, 714719, 681690, 597280, 560554, 499898, 464929, 418066, 394753, 383071, 343861, 334408, 324152, 278649, 288415, 275113, 259547, 258305, 229361, 242353, 210460, 233990, 218114, 224492, 202603, 208867, 196675, 165414, 188344, 192651, 172441, 181216, 196961, 223939, 209969, 251608, 213470, 232832, 240330, 214059, 203452, 211990, 212685, 229020, 222071, 222907, 218158, 208762, 182464, 200162, 173043, 153177, 147905, 125820, 150015, 120934, 103429, 117283, 99425, 116049, 102147, 95097, 92311, 90282, 80721, 67041, 86950, 74953, 94231, 79059, 106196, 123181, 129155, 125698, 136163, 160488, 179613, 176489, 170176, 169530, 168631, 175877, 163676, 190339, 204921, 202812, 220731, 205713, 203541, 192087, 179299, 159770, 148532, 137785, 121030, 130366, 110972, 123189, 114000, 107250]
7816A07250l494m257j0521o927J3894l7473J0947j5954N271k493m762j8965n1207
7803a8691M7104R61K3469q387J0990L4194k9652K000q959J5128j0942M2268k8173
7790G1310j5904l987N67J8999R893m554K5376M273q922K3808M230n8876L4167
7777A00380j4784n696j3614O772R131l013j7028j104m80j6261J8559J0948j8431
7764E5379J8057k7689J2236k0176L2395m576r291O164J6807l0284n588J4111J4108
7751G1653K6897l6689K4041j9370Q753j4004J2876j2920K4683k290j2098N672
7739G7204p029J253P70k7000N0512j9481q457M425k665m739J4474j6201K0986
7726H4052j2283K5879r855K147j0631k6142J23J0329j7501j1399m67M4681L337
$$ y = [107250, 103756, 99499, 88978, 82051, 95945, 58472, 69419, 53465, 58736, 56243, 51481, 32516, -18691, 28413, 29374, 52843, 44456, 55446, 89640, 59988, 61988, 53029, 68157, 57215, 99483, 71310, 55406, 51419, 51986, 70985, 80878, 76324, 101700, 105973, 97051, 120859, 125089, 66213, 100380, 85596, 79900, 66286, 73058, 82189, 79176, 62148, 61044, 60564, 44303, 62862, 73810, 55379, 73436, 45747, 57983, 37807, 70202, 65626, 56335, 62499, 79306, 49022, 43434, 57545, 71653, 98550, 61861, 85902, 66532, 75285, 61281, 74157, 61237, 85920, 83630, 71532, 77204, 70175, 71428, 72198, 45198, 95710, 76229, 67772, 72197, 69532, 64793, 79267, 63066, 84052, 71769, 97648, 87793, 89940, 79309, 53167, 53290, 63619, 46118, 34719, 34252, 78933, 82270]
7713H2270J730p733K2844j6945K66q145q587K7716j3699n015k5544O355J1761
7700F7274j1249j0376L3316k3848k567j5294L7640R782M349L0561j5664M914J4054
7687A22892j0882O821j4733p230R580j2123M223K6659j230J691j4315J518n003
7674A07868j2599O3k326O917j1047P424j1049J5737n948n078M634j757J1325k4265
7660G9899J8905j272r661K1432K168O363k564Q341k3413O821J806q304m078K2743
7646A19186p921O077j9867K295R011k8121K9341j0166m728Q402P006J1841o784
7633A15572r113J2588k45j3059J9148J9229j5644K7998l513j3761N485j9338J0621
7620A35968q939K6858Q741l0602K6848j0838K3212j784m357L5978r932O202K9920
$$ y = [82270, 84000, 76267, 99111, 82166, 82432, 74287, 65700, 93416, 79717, 74702, 49158, 55513, 67274, 56025, 45649, 78965, 55117, 52550, 37256, 74896, 84678, 89027, 119588, 103924, 108838, 122892, 112010, 118831, 104098, 96868, 106448, 94325, 98548, 125207, 123977, 125668, 111353, 112871, 107868, 95269, 95332, 93006, 99923, 88876, 96300, 85251, 100988, 95040, 89962, 94596, 92839, 104164, 79899, 98804, 97532, 87871, 109303, 111471, 117834, 115270, 123611, 100198, 107019, 108825, 100521, 96443, 119186, 111265, 117342, 97475, 99770, 108781, 80660, 110001, 99835, 95107, 103509, 110515, 122356, 115572, 106459, 119047, 118802, 105743, 124891, 144120, 128476, 156474, 152961, 139200, 144685, 125347, 135968, 127029, 153887, 162628, 132026, 158874, 148036, 171248, 169464, 165107, 201085, 191153, 197355, 227275]
7607B27275k841R705N479N2357K372M0062o513Q569j361m133O729m5517L558P480
7593C03221L163m7347j5603Q696k4882J384j7357J1905P236j646L2390j0098J1434
7580B62496O80K407p668K9187J4604p631J7148o775R240j7393P702K3824m848
7567C22973M920O640K1049J9884j8674J2350J8838Q984L6627J1612L0999K7631
7555E03833M4085O5524K7531L0892M5893K7819J6089M0225L6937N3905N3646O7204
7543A013583Q9981J39322J86858K98806M03503M14537K42290Q0314p9555n8701
7533B730938L5002R8874J08585k1227k05336l21975l56137l10859k82499k04294
7523A271072j57201j18806m5977q1855n7936k2941o5480n344L784k320p26l2647
$$ y = [227275, 224434, 234139, 239618, 291975, 294347, 334409, 327896, 336465, 335104, 330971, 337700, 292183, 295741, 303221, 306384, 259037, 243434, 252130, 227248, 228632, 211275, 223180, 230416, 228770, 261160, 251062, 262496, 263176, 265583, 257915, 287102, 301706, 294075, 311223, 304448, 313688, 296295, 303997, 327821, 322973, 327893, 334533, 355582, 375466, 356792, 369142, 387980, 396964, 433591, 445203, 476202, 503833, 547918, 613442, 640973, 671865, 717758, 745577, 761666, 801891, 838828, 892733, 946379, 1013583, 1103564, 1242886, 1429744, 1728550, 2132053, 2546590, 2788880, 2869194, 2789639, 2730938, 2765940, 2864814, 2973399, 2952172, 2746836, 2424861, 2068724, 1757865, 1475366, 1271072, 1113871, 995065, 949088, 867233, 809297, 786356, 720876, 715532, 719316, 716996, 716270, 683623]
7511F83623k7858P50l5957j0861R38m2960J9409o693K1705l209J8605p513K8985
7498F38964M5984L0931K3005K7350N2106N6102O1619Q7537J11409J98049K51149
7487A584205L52898L58305K59575P3976l5603p5704K5297J25251J49855L9520
7477B857575j52018k70878l38830k86900k52907k00799j41307j20687m3190q3339
7467I66720j8703o4438k7794k2953k4911J2897J4080M968O048K6591j6978Q67
7455H56394p860k4268J1323J5897o341J602j6800l442l7100j5719J6526j7808
7443G72404q060M425J7707J7482J1872L5756J2267q93J4331M2056J2489k048k382
7430I27406j4213J4326n2808N5j5284l8926J1334j2632m1408l320j5399M868L46
$$ y = [683623, 655765, 656515, 620558, 609697, 610635, 567675, 587084, 580391, 602096, 598887, 617492, 609979, 638964, 684948, 715879, 738884, 766234, 818340, 874442, 936061, 1023598, 1135007, 1333056, 1584205, 1937103, 2295408, 2554983, 2628959, 2593356, 2517652, 2542949, 2668200, 2818055, 2857575, 2705557, 2434679, 2095849, 1808949, 1556042, 1355243, 1213936, 1093249, 1050059, 966720, 948017, 883579, 855785, 832832, 807921, 820818, 834898, 839866, 845914, 872505, 855527, 856394, 848534, 824266, 835589, 851486, 845145, 846747, 829947, 826505, 789405, 773686, 790212, 772404, 764344, 768769, 786476, 803958, 815830, 851586, 863853, 862960, 877291, 919347, 931836, 929788, 927406, 913193, 927519, 874711, 874766, 859482, 820556, 831890, 819258, 777850, 774530, 759131, 763999, 764345]
7417G64345j4104N907O323K2143N662O611j507J3105J8251j5230O0981M3095J2134
7404I27716J9197j614l916J726K3807N654K9669k9258k4924m0875j9064j1311
7392H76807n265k6427J4577J7366M4256k7574L9753j3573J802M520l750Q859K6923
7379I58274o12J3488Q576O577o909J9223j0374N6489L5265L0964O6606K7300N9774
7366A264641N4729N7885P7291P4569Q2056J01720J21595J38041J68748J94433
7356B335708L02991M23561M76206M72247L43764J92591Q6862J09330K23633L27136
7346E294029L34523L03955K14291J78041K33136L54314N16998P07417Q10173Q72713
7336I819590Q06274O49744L34537m4090m17253o89181r51424j018165r95328r30330
$$ y = [764345, 750241, 756148, 762471, 784614, 790276, 796887, 795380, 808485, 826736, 811506, 872487, 915582, 927716, 946913, 945299, 941383, 943109, 966916, 972570, 1002239, 972981, 948057, 907182, 888118, 876807, 871542, 845115, 859692, 877058, 921314, 893740, 933493, 919920, 921722, 926242, 922492, 931351, 958274, 957662, 971150, 979726, 986303, 979394, 998617, 988243, 1044732, 1079997, 1110961, 1177567, 1204867, 1264641, 1319370, 1377255, 1454546, 1529115, 1611171, 1712891, 1834486, 1972527, 2141275, 2335708, 2638699, 3062260, 3538466, 4010713, 4354477, 4547068, 4633930, 4743260, 4966893, 5294029, 5628552, 5932507, 6146798, 6324839, 6557975, 6912289, 7429287, 8136704, 8946877, 9819590, 10625864, 11275608, 11610145, 11566055, 11148802, 10459621, 9508197, 8490032, 7494704, 6564374]
7326F564374p84032o85784m94041m27344l06146k18236j71819j06451q8866j9640
7316C262015n4418l4249p9784j04675j60671j79269j61763j84007j65387j19342
7306B018450j20136j05821r9918o4277o7896m1213k6789j6656n4331k6540l9488
7295A355385m8608l3062l2162j4011m7147K1066K151M322k4733J5629P984Q41
7283A207655O3964J8743L0785M0932P7997R4170J28920J92726K89263L22611K95584
7272B763350K22717N5796r3018o4742n507K4535L8063n3466j60721k60307l11728
7261B154972l03407k63350j95449j59428j12582j13691o5807n7725l9945n3713
7251G89875n3917m804n3331k8710m5581k0838J0994j9474O516n5848j958m807
$$ y = [6564374, 5780342, 5094558, 4600517, 4173173, 3867027, 3648791, 3476972, 3370521, 3281655, 3262015, 3207597, 3173348, 3093564, 2988889, 2828218, 2648949, 2487186, 2303179, 2137792, 2018450, 1898314, 1792493, 1692575, 1628298, 1560402, 1519189, 1492400, 1475744, 1421413, 1394873, 1355385, 1306777, 1273715, 1241553, 1227542, 1180395, 1201461, 1203612, 1207934, 1183201, 1198830, 1206814, 1207655, 1271619, 1290362, 1321147, 1362079, 1440076, 1534246, 1663166, 1855892, 2145155, 2467766, 2763350, 2986067, 3041863, 2948845, 2884103, 2878596, 2903131, 2941194, 2887728, 2727007, 2466700, 2154972, 1851565, 1588215, 1392766, 1233338, 1120756, 1007065, 941258, 883533, 843588, 789875, 735958, 731154, 677823, 649113, 603532, 582694, 593688, 574214, 580730, 524882, 522924, 518117]
7239E18117k0552j321k0636r847l5914L0369k9166l882J0394n1922J5878k767
7227C98751n540j4963J264P364j0459m211j2746J0448j1297j0903Q318l2838N256
7214C28444L0636j9230o931k9168K8757j5381r466K5928k966l377J4147O752r741
7201C38404j154N1293R358N901M8469M6713K986M990j1798l5143J8440j1507j2166
7188D54786J7129n0532Q967m5691o1298p732m5875j9120l5667M9483n1908l5972
7176A76570J6359n933J7597j6251L1588j0975K360M102N981l338m1397N4445l3147
7163A97961j8423R057R011j5645j1227K9906l9833j47j3139J690K0000k3129J7566
7150A63648k803r921M940K1093N372O216L2791k5611J6827m731k9698n532j8235
$$ y = [518117, 497565, 496244, 475608, 465761, 429847, 460216, 431050, 427168, 437562, 385640, 401518, 398751, 393211, 378248, 379512, 386876, 376417, 372206, 359460, 369908, 358611, 347708, 356026, 323188, 328444, 359080, 339850, 332919, 303751, 332508, 317127, 307661, 333589, 330623, 327246, 341393, 348145, 338404, 337250, 388543, 397901, 403802, 452271, 498984, 501970, 506960, 495162, 460019, 478459, 466952, 454786, 471915, 421383, 430350, 384659, 323361, 315629, 269754, 250634, 214967, 264450, 212542, 176570, 192929, 186996, 204593, 188342, 219930, 208955, 211315, 215417, 221398, 218060, 176663, 231108, 197961, 179538, 188595, 197606, 181961, 170734, 200640, 160807, 160660, 147521, 149211, 169211, 146082, 163648, 160845, 150924, 155864, 176957, 182329, 188545, 221336, 195725, 212552, 207821, 178123, 172591, 154356]
7137A54356P326N834l3001J6483o893o687R342J2741j4079O154L167L349l935
7124A54157J9717q795j200J1117J2953K7944M4622K6331R9425K30522K31541J04389
7112I52723k9727j65196j75312j42887r9976n1178p0024k8619j520k9864n303
7101A53117M734j7295L7j8089j1805J3159k6942Q100J6570j7143J4661j0213l1294
7088G7597k4667J6409l986Q973l371P07M578j7816J3244k094p714J2893p991l174
7074F3588j8254M4933q682n1j1241M329n739j2584L388m787N623P705j108J8018
7060H5138j1501P982j2073l3247k4650K8282J1055j881J1313M17k340J5391J719
7047G5605r032J3504k325J9880q006j9063J3994l741j0055K0942o298J0798q390
$$ y = [154356, 161682, 167516, 134515, 150998, 144105, 137418, 146760, 159501, 145422, 151576, 154743, 158092, 154157, 173874, 165079, 163879, 174996, 187949, 215893, 260515, 286846, 386271, 616793, 848334, 952723, 922996, 757800, 582488, 439601, 339625, 288447, 218423, 189804, 188284, 158420, 153117, 157851, 140556, 140593, 122504, 110699, 123858, 96916, 105016, 121586, 104443, 119104, 108891, 77597, 52930, 69339, 65353, 74326, 70955, 71662, 76240, 58424, 71668, 69574, 61860, 74753, 66762, 63588, 45334, 90267, 81585, 81534, 70293, 74622, 68883, 56299, 59687, 54900, 60523, 68228, 67120, 85138, 73637, 81619, 69546, 36299, 11649, 39931, 50986, 49105, 60418, 60835, 58495, 73886, 75605, 66573, 80077, 77752, 97632, 89626, 70563, 84557, 80816, 70761, 91703, 85405, 96203, 87813]
7034H7813O347J5895J830K0090k6122j0014j2382m988J0107l971p459J1245K75
7021H8666k5831J1776k0620K4940J5693j3010L3362k5735K457K5233k4930Q922
7009A00923l261q241K165j5288q027Q975k8968M1073j2079p706Q236l3164J4767
6996E9405k155L1903J105K469q941M1617K261j7924M2197k7407Q718m0450k27
6983I2571R666j3769M3285k3215L563j0894J3225P274l1780M0711k0919J5212
6971A24930l520J3828J1853J3352K2399O682L2259J394O3613M3013r505M0660
6959C60958r907J214j4679j6914q163m3109K4412j7805k2611Q154J3043K8K4976
6946B99597J1783J3153L6558L659q27J2026m2131J1426l1800j6368m2651j4741
$$ y = [87813, 94160, 110055, 111885, 131975, 105853, 95839, 83457, 78469, 88576, 84605, 77146, 88391, 88666, 62835, 74611, 53991, 78931, 94624, 81614, 114976, 89241, 91698, 116931, 92001, 100923, 97662, 89421, 91586, 76298, 68271, 77246, 48278, 89351, 77272, 69566, 77802, 44638, 59405, 57250, 89153, 90258, 92727, 83786, 125403, 127664, 109740, 151937, 124530, 133248, 92798, 92571, 102237, 88468, 131753, 108538, 112101, 101207, 114432, 121706, 89926, 130637, 109718, 124930, 121410, 135238, 147091, 160443, 182842, 189524, 221783, 223177, 286790, 329803, 320298, 360958, 351051, 352265, 337586, 320672, 312509, 269400, 293812, 276007, 253396, 261550, 274593, 274621, 299597, 311380, 324533, 361091, 364750, 363923, 375949, 333818, 345244, 313444, 297076, 254425, 239684]
6934B39684k6733j9320k6827j0981j1451j1520K4103k3472J0925q413k130Q837
6922A42702m289P216q706k1553J430j394k2758R059J1969k8122K4795k0833q836
6909H0680N891p19K668J0047k3044J0520J899n174J3695l149j4689K3342j3628
6896H8339M233K671N380k0578M661o804o727J3669L320p514l787Q111J1364j260
6882I5078M380j1378J6992k0874K5548J6499o304l789k2545J7550J6677K178P234
6869A37246K3214J0581J6396J0750j8521P397K0071k6593p882O431n791l6358
6857A36941Q373k232r841J0057r924K747p764j198J6517Q117k1438n836R330k4293
6843A09556K5373j2846j5633K1152O297j23p252J1233k0341Q697N916L910o03
$$ y = [239684, 212951, 193631, 166804, 155823, 144372, 132852, 156955, 133483, 144408, 135995, 133865, 142702, 138413, 145629, 136923, 115370, 116800, 115406, 92648, 101707, 113676, 85554, 110349, 89516, 80680, 86571, 85852, 88520, 98567, 75523, 86043, 87942, 82768, 96463, 93314, 78625, 101967, 88339, 92572, 95243, 100623, 80045, 84706, 77902, 71175, 84844, 88164, 80650, 76863, 84974, 96338, 95078, 99458, 88080, 105072, 84198, 109746, 126245, 119941, 116152, 93607, 111157, 127834, 130012, 137246, 160460, 171041, 187437, 198187, 179666, 187063, 207134, 180541, 172659, 179090, 173299, 136941, 145314, 143082, 133241, 143298, 133374, 136121, 128357, 127159, 143676, 151793, 130355, 124519, 133849, 109556, 134929, 122083, 106450, 127602, 133899, 133776, 126524, 137757, 117416, 126113, 132029, 135939, 135336]
6830A35336O256R706j8149R405j2576J5815o511j3158L1844j2666J0804j130J1539
6817A66515K2917k260J491J2652J2156m0563M9883l8352K7786J3855N924Q402
6805B40406j1117p878O574J1844k022k9836K8891J1034j1291J5013J6570l867
6793B64321J9131n8420M6989K0999M061J4764p935j8861J5842M09k8105K5564
6781B98759j2043j6390J8962K313K2987j629K269K7780r610K771R641L8787L5823
6768D20420J9036Q6195M5583N5807J26099Q6607J32913Q9578J39040O1873M2083
6757A305234L3845M6484k1671m2787n7388j27454j00432r1438r6773q9550j04768
6746F53302J564p8963l6556J1075m6574j6651j5013n705J9254o1520J5696j6933
$$ y = [135336, 141592, 151298, 133149, 142554, 129978, 145793, 139282, 126124, 157968, 145302, 156106, 154976, 166515, 189432, 187172, 188663, 201315, 213471, 172908, 222791, 184439, 212225, 226080, 232004, 240406, 229289, 221411, 227985, 239829, 237807, 207971, 236862, 247896, 236605, 251618, 268188, 264321, 283452, 225032, 272021, 293020, 297081, 311845, 303910, 285049, 300891, 301300, 273195, 298759, 286716, 270326, 289288, 291601, 314588, 312959, 315228, 343008, 333398, 336169, 345810, 384597, 420420, 439456, 525651, 571234, 627041, 753140, 839747, 972660, 1062238, 1201278, 1263151, 1305234, 1339079, 1385563, 1363892, 1321105, 1263717, 1136263, 1035831, 944393, 847620, 758070, 653302, 654866, 575903, 539347, 550422, 503848, 487197, 472184, 466479, 485733, 424213, 439909, 422976]
6734D22976l2009J3065l708j3637q042L811j6852l634m1044J8225J649j2650j1837
6721C16313j0543j8183J1443k1247k6938j3421j068R003m2762K4290j9264n893
6709B01730K4975k1524K0847j7441r191O33o810O528k2014p527k2502M4981n5274
6696A37411K6479J8660k5558J299k8915K8796k1125L3824P969j2907K0619j9688
6684A66864J0001k8069K0862j8381J3425j2750j0426J9184k6033K2817l078j1152
6672A43264m505n744J3668r366M142K2560k4258K531M630n640k3304K847K1683
6659A42508j129j8917K8315K279j3344j2884J1106q948J1376J5981O876j7927
6647A45292J8014P425p574o227K6894j904j5906O276J6456m798j8605J8780L180
$$ y = [422976, 390967, 404032, 400324, 386687, 378645, 382456, 365604, 361970, 320926, 339151, 340800, 328150, 316313, 305770, 287587, 299030, 277783, 250845, 237424, 236356, 245359, 202597, 226887, 207623, 201730, 226705, 205181, 226028, 208587, 199396, 200029, 193219, 199747, 177733, 170206, 147704, 192685, 137411, 163890, 182550, 156992, 158291, 129376, 158172, 137047, 170871, 178840, 165933, 186552, 166864, 176865, 148796, 169658, 151277, 164702, 151952, 141526, 160710, 134677, 157494, 154416, 143264, 138759, 133015, 146683, 137317, 141459, 164019, 139761, 142292, 146922, 141282, 117978, 120825, 142508, 141379, 122462, 150777, 153056, 139712, 126828, 137934, 128986, 140362, 156343, 163219, 145292, 163306, 170731, 163157, 156930, 183824, 181920, 166014, 172290, 188746, 183948, 165343, 184123, 187303]
6634A87303N973J1001K0984k576o542k847J8404J2341K7458L5892J4603N8885
6622C80879M9718J3043J286k6700k3497l8915k6634j8713j1011J7187K2842N2567
6610C92052Q738j595O277k1210K1613J935M4265K4158K3365M9827m3302k2325
6598D83798l2471j4801j5416q001L9761j6088K9585j5795k9037q670m1349J1910
6586C83426j4177M1163L0426L9949M8137m711p794k1723n8002l6726m2181j5059
6574C42728k5833k9886j0210r684k1848J2788k624J837j9319M574K4599K2943
6562B90065k4185K2420J2025l1028K7721n112N085J8110Q954L3742l723K9623
6550C83697L6847j6015M04j0837l45l3616j5886K2017j6658j5318J5270j5849
$$ y = [187303, 193276, 204277, 225261, 222685, 216143, 213296, 231700, 244041, 271499, 307391, 321994, 380879, 430597, 443640, 444926, 418226, 394729, 355814, 329180, 310467, 299456, 316643, 339485, 392052, 400790, 399195, 405472, 384262, 405875, 407810, 452075, 476233, 499598, 549425, 506123, 483798, 451327, 436526, 421110, 413109, 452870, 436782, 466367, 450572, 421535, 412865, 371516, 383426, 369249, 410412, 440838, 480787, 528924, 524213, 516419, 494696, 436694, 399968, 357787, 342728, 316895, 287009, 276799, 267115, 245267, 258055, 255431, 257268, 237949, 242523, 267122, 290065, 265880, 288300, 300325, 269297, 297018, 291906, 296991, 315101, 324055, 357797, 354074, 383697, 420544, 404529, 404933, 394096, 393751, 360135, 344249, 366266, 349608, 334290, 349560, 333711]
6538C33711j1554K309L375J0744J064j7909M0402k7796J6104K3749L707K694r574
6525C71026l489j8491K2894k76R148k8031P549J4800k5787J6662j3526J0960j04
6512C63335J0569K5847o360L6610j4834o42R507J7680n562J2039k641l2K4344
6499D69860m0656K5972j0492K304L85j7497J3535q561O035Q151j290r589p234
6486D30923K1341j2113j981p385L1993j9643K1143Ln1091J3858J0256J6079M4669
6473D98052k3805O424k86j4023k7501K6792j5875K3511q295n672P718J225J6528
6460D84793R248J9227p758k4478J2898j9001L8999q168P91K1271j5289N030J3436
6447E30999L1297j563N3413M721L9974K2561O129O388J126k2614M5274j728J3704
$$ y = [333711, 322157, 324466, 327841, 338585, 339649, 321740, 362142, 334346, 350450, 374199, 377906, 380600, 371026, 367537, 349046, 371940, 371664, 380812, 352781, 360330, 375130, 349343, 366005, 352479, 363439, 363335, 373904, 399751, 393391, 430001, 415167, 414525, 424032, 441712, 436150, 448189, 445548, 445516, 469860, 429204, 455176, 444684, 446988, 447373, 429876, 443411, 434850, 440885, 449036, 447746, 438157, 430923, 452264, 440151, 438170, 430785, 462778, 443135, 464278, 464281, 413190, 427048, 437304, 453383, 498052, 474247, 480671, 480385, 466362, 438861, 465653, 449778, 473289, 464994, 459322, 467040, 468265, 484793, 494041, 513268, 505510, 481032, 493930, 474929, 513928, 505760, 506551, 527822, 512533, 517563, 530999, 562296, 560733, 614146, 618867, 658841, 681402, 687531, 693919, 695045, 672431, 717705, 715977, 729681]
6434G29681j681M01J7564J784J1115j2505j45J8302j0580J1781j4725J0017J9028
6421G80037L5928L688J3324Q683K7164J4035j6687K730k6721k2439K2096k4326
6409H17512J6314J4349J8397R743J2050J4734L0917J3869J6933k604K8990J6679
6397A007883l0374J2763K0302O416K3323J8306K680N9743k0721J2829K6061J832
6385A141043L1300J0243K4883O927R76N3464n348K8309M5212L2066K0540L9408
6373A429023N4426L4302K3466M5591K8022K710m669L2122O847O6514L1530P8354
6361A828238N1262K8699O9648L6463P5025Q9448R4809P1689Q0046O1972M1241
6350B528540L9022M1151M3213M0226N5737R7369R5897J10948J24318J53108J14449
$$ y = [729681, 728000, 728401, 745965, 747749, 758864, 746359, 746214, 764516, 753936, 765717, 750992, 761009, 780037, 815965, 819653, 832977, 841660, 868824, 882859, 866172, 868902, 842181, 819742, 841838, 817512, 833826, 848175, 866572, 876315, 888365, 903099, 934016, 947885, 964818, 962214, 991204, 1007883, 977509, 990272, 1010574, 1016990, 1040313, 1058619, 1061299, 1121042, 1100321, 1113150, 1139211, 1141043, 1172343, 1182586, 1207469, 1214396, 1215372, 1268836, 1263488, 1291797, 1337009, 1369075, 1389615, 1429023, 1483449, 1517751, 1541217, 1586808, 1614830, 1617540, 1612871, 1644993, 1651840, 1718354, 1749884, 1828238, 1879500, 1908199, 1977847, 2014310, 2089335, 2178783, 2273592, 2345281, 2425327, 2487299, 2528540, 2567562, 2608713, 2651926, 2692152, 2747889, 2845258, 2941155, 3052103, 3176421, 3329529, 3443978]
6339C443978J70011J90019K27944K43667K54631K73812K33459K31656J67772J19811
6329E556760P9500L9683R159m4274k9433l6502m0693l2738k1879L2072Q8829J30719
6317E731203J60652K21057L06926L29392L94264M41985M59681M98883M51289M66109
6307I461441M03890L33940L27042K22507J92320J69583J76830L31515N93381Q63857
6297A3076306P90385N55119K97146J42303K59327N42342R81971J436569K264667
6288B0346135L635832O054487Q962943R980435P275124K041895k882258n776984
6280D9637609o092149m821279l345258j831958l14544J759857M136232N024105
6272D4152615L304456N66262j227348j283638O80987L525926N719812N565704
$$ y = [3443978, 3613989, 3804008, 4031952, 4275619, 4530250, 4804062, 5037521, 5269177, 5436949, 5556760, 5636260, 5675943, 5685102, 5640828, 5611395, 5574893, 5534200, 5501462, 5479583, 5511655, 5600484, 5731203, 5891855, 6112912, 6419838, 6749230, 7143494, 7585479, 8045160, 8544043, 8995332, 9461441, 9865331, 10199271, 10526313, 10748820, 10941140, 11110723, 11287553, 11619068, 12212449, 13076306, 13866691, 14421810, 14718956, 14861259, 15120586, 15662928, 16644899, 18081468, 20346135, 23981967, 30036454, 38999397, 48979832, 56254956, 58296851, 55414593, 49637609, 43545460, 38724181, 35378923, 33546965, 33232421, 34992278, 39128510, 44152615, 47457071, 48023333, 46795985, 45512347, 46193334, 49719260, 55439072, 61004776]
6264F1004776K790125j208478m689934o259957n663208l501323k78168K890116
6256D5083949M003446J939695j463218m104453n044524m230732k626999o50697
6248C2906467J832692N196001Q552163R165234N414464o46889n870768q732523
6240D7816841q690741p317993n786392m430981l365336k408999j715829j240933
6232A2859637q66778o53422m58447k95984j09651o8417j17616k96086m13971n21181
6222I058084n55424m74538m94613l98139l38185k78597k18986j61860n2714L5430
6212F120458N8363O1353P2677J8727N3599P7844Q1734O2791J6730M9537m1163
6201F632650q9467j60297k39747k53798k51944k30955j75309j69677j58636r0480
$$ y = [61004776, 63794901, 62586423, 57896489, 51636532, 45973324, 42472001, 42193833, 45083949, 49087395, 51027090, 49563872, 45459419, 40414895, 36184163, 33557164, 32906467, 34739159, 39935160, 48487323, 57652557, 63067021, 62420132, 56549364, 47816841, 39126100, 31808107, 26021715, 21590734, 18225398, 15816399, 14100570, 12859637, 11992859, 11339437, 10880990, 10585006, 10475355, 10406938, 10289322, 9993236, 9579265, 9058084, 8502660, 8028122, 7533509, 7135370, 6797185, 6518588, 6299602, 6137742, 6085028, 6120458, 6178821, 6240174, 6312851, 6331578, 6385177, 6463021, 6544755, 6607546, 6624276, 6673813, 6632650, 6543183, 6382886, 6143139, 5889341, 5637397, 5406442, 5231133, 5061456, 4902820, 4812340]
6191D812340j22129p1823q3471k0607P856K8756R3352J15550J04909J10693J73537
6180E148963J68630Q3810L2842m9287o3565r4662m1203p610J9188J45527K23778
6169E566411L86799N34573O84936O27464K85245j3117l01229n15205m70402m09091
6159F376384k34558j63248l9930J48700K83294L49133L60071J55725l5470o2479
6149G137622P8318K46898L95986L96693J74976j26495l37436m21801m16526k85653
6139F842582p518J10260J25121j03484k32771m14281m21928l02560j87165n9542
6129E348714J56737M07336N98222N82405M59799N6230l45208n89880p04915o56916
6119E312524o32920m67948l53839l14628k20920j56370j36739j41577j14829j02773
$$ y = [4812340, 4690211, 4618388, 4534917, 4514310, 4522166, 4550922, 4644274, 4759824, 4864733, 4975426, 5148963, 5317593, 5401403, 5434245, 5384958, 5321393, 5226731, 5185528, 5177918, 5197106, 5342633, 5566411, 5953210, 6487783, 7172719, 7800183, 8085428, 8072311, 7771082, 7255877, 6785475, 6376384, 6141826, 5978578, 5938648, 6087348, 6370642, 6719775, 7079846, 7235571, 7200101, 7137622, 7215940, 7462838, 7858824, 8255517, 8430493, 8303998, 7966562, 7544761, 7128235, 6842582, 6835064, 6945324, 7070445, 6966961, 6734190, 6319909, 5897981, 5595421, 5408256, 5348714, 5505451, 5912787, 6511009, 7093414, 7553213, 7609443, 7264235, 6674355, 5969440, 5312524, 4679604, 4211656, 3857817, 3543189, 3322269, 3165899, 3029160, 2887583, 2772754, 2669981]
6109B669981j30675q4060j26141m8240n6965j9679k0233n0129j6145q702k4534
6098B084478q850j6575L3962J8719N0586R3038J02645R9165O2560L4169J3277
6087B567174o1578m2869j16592j05910j17709q0623r1257r6107o2728p6856m8528
6076A666417n1913j1350J7015L7141M5490Q017k7286m3863m8489j3707j1415P813
6064A573870J3399Q7427P9567P1949Q8336M5098K4363K2967Q713k5283l3687m5177
6052A911542o9533r4946p4733q8930q8455o0017k6043l3819l7172r660O088n5543
6040A278779k4066M848k2671j2908L5568M8187r012K0270m397O093k2577j0840
6028A287274K3442l2882J0649M1908J7631k3170J7965k5493o9253m9112k6703
$$ y = [2669981, 2539306, 2455246, 2329105, 2280865, 2223900, 2204221, 2183988, 2133859, 2117714, 2109012, 2084478, 2075628, 2059053, 2093015, 2111734, 2162320, 2255358, 2358003, 2457168, 2519728, 2553897, 2567174, 2505596, 2462727, 2346135, 2240225, 2122516, 2041893, 1950636, 1854529, 1791801, 1714945, 1666417, 1614504, 1603154, 1620169, 1657310, 1702800, 1710817, 1683531, 1639668, 1591179, 1577472, 1566057, 1573870, 1587269, 1674696, 1754263, 1826212, 1914548, 1959646, 1984009, 2006976, 2015689, 1990406, 1956719, 1911542, 1842009, 1747063, 1672330, 1583400, 1494945, 1434928, 1408885, 1375066, 1337894, 1328234, 1334322, 1278779, 1254713, 1259561, 1236890, 1223982, 1259550, 1307737, 1298725, 1318995, 1314598, 1320691, 1298114, 1287274, 1310716, 1277834, 1288483, 1330391, 1348022, 1324852, 1342817, 1317324, 1248071, 1198959, 1172256]
6017A172256l0259l8151P199r488k2451k0953J745J8297j6265K7205N2722j1325
6005A130532L14K2351J3585j3390k00r754l4366k4194J990K2983q975J8883M6532
5992A166291M810K869M122N720k2676n687K8842m2875j5181l0669J5839k0896
5980A090509k7136J51k496l1922K8591J6873k265J7435J8035J3272l80J0635L2554
5967A163856j2812L453Q635J4088K4985J5338j7641K4709p89Q917L0314k4583
5955A238470O106k6232p868j6253o335K8536M9817l1795N4827K8214q22J8798
5943A335463p850J5503Q364k6634K3126n1673N077k6422Q054k1010M2275M4180
5931A348453N7759N0611O9943L9485J990L8466J1905J8112K4669J7130L3586j3704
$$ y = [1172256, 1141997, 1103846, 1111045, 1101557, 1079106, 1058153, 1059898, 1078195, 1061930, 1089135, 1141857, 1130532, 1130846, 1153197, 1166782, 1153392, 1153192, 1143438, 1109072, 1084878, 1086868, 1109851, 1100876, 1119759, 1166291, 1171101, 1173970, 1178092, 1183812, 1161136, 1155449, 1184291, 1141416, 1126235, 1095566, 1111405, 1090509, 1063373, 1063524, 1061028, 1029106, 1057697, 1074570, 1072305, 1089740, 1107775, 1121047, 1120667, 1131302, 1163856, 1151044, 1154497, 1163132, 1177220, 1202205, 1217543, 1199902, 1224611, 1223822, 1232739, 1263053, 1238470, 1244576, 1218344, 1210476, 1194223, 1187888, 1216424, 1266241, 1234446, 1289273, 1317487, 1316665, 1335463, 1327613, 1343116, 1351480, 1324846, 1347972, 1296299, 1301376, 1274954, 1283008, 1261998, 1304273, 1348453, 1406212, 1456823, 1526766, 1566251, 1568241, 1606707, 1618612, 1636724, 1661393, 1678523, 1712109, 1698405]
5919A698405M450M2396l2995l4015j0848L827J8878j1191J0832R95j526L2636
5907A721844K0591N5509M5199N1785K1123K6396k7269l7762o4101m6339o102k3794
5895A737080r634L9498j3493M9034j9040Q0724N2840p43P5427Q060k4196j5765
5883A959792R382j7735n856J9455J7464j3665k1452m0117o6422n8953j6695l9168
5871A726030l4809l8383M1785j2720R122K8288J7821j7808l028k9260j0117j6343
5859A660578j8517K3000n493J0831N6837J1048M4204M1027M9350L7289N2359M9831
5847B012344L7067K3746K0598K9705K5864O0856L1644N1144K1924N9763M047L796
5835B382498n6364l8177l8395l9366k9960Q759k1981j0816J4431L5198o30N2801
$$ y = [1698405, 1702855, 1745251, 1712256, 1678241, 1667393, 1671220, 1690098, 1678907, 1689739, 1690734, 1689208, 1721844, 1742435, 1797944, 1843143, 1894928, 1916051, 1942447, 1915178, 1877416, 1813315, 1766976, 1760874, 1737080, 1727446, 1766944, 1753451, 1802485, 1783445, 1864169, 1917009, 1916266, 1991693, 1999753, 1975557, 1959792, 1969174, 1951439, 1945583, 1965038, 1982502, 1968837, 1947385, 1907268, 1840846, 1781893, 1765198, 1726030, 1691221, 1652838, 1694623, 1681903, 1691025, 1719313, 1737134, 1719326, 1716298, 1687038, 1676921, 1660578, 1642061, 1665061, 1659568, 1670399, 1727236, 1738284, 1782488, 1823515, 1872865, 1910154, 1962513, 2012344, 2049411, 2073157, 2093755, 2123460, 2149324, 2210180, 2241824, 2292968, 2314892, 2374655, 2378702, 2382498, 2326134, 2287957, 2249562, 2210196, 2180236, 2188995, 2167014, 2156198, 2170629, 2205827, 2205197, 2257998]
5823B257998n048M4191m024O0109O3480K5966N4661L9692L3135N7656K4190P2801
5811B724807L9429M1569O6506P4359O5640L8349J04623P0120Q2841Q1680Q7570
5800C477493R9865N9785J05041M8780N1153R2621O4994P6427N0138J18470J00959
5789D345726J16363R8071J30129J27163J31840J66737J78872J69825K24920K25545
5779E915191K45190K33082K76559K40429K46363K77742L36516L08611L09388M00747
5769H789818M14362M12192N01050N46624N62154O37020P90835R38776J097708
5760A4690539J312948J526393J787380K137442K861358M209129O681311R858270
5752D5064770J1638977R412190L770342k159575o341086p655081o871152n161458
$$ y = [2257998, 2252950, 2297141, 2293117, 2353226, 2416706, 2442672, 2497333, 2537025, 2570160, 2627816, 2652006, 2724807, 2764236, 2805805, 2872311, 2946670, 3012310, 3050659, 3155282, 3225402, 3308243, 3389923, 3477493, 3577358, 3637143, 3742184, 3790964, 3842117, 3934738, 3999732, 4076159, 4126297, 4244767, 4345726, 4462089, 4560160, 4690289, 4817452, 4949292, 5116029, 5294901, 5464726, 5689646, 5915191, 6160381, 6393463, 6670022, 6910451, 7156814, 7434556, 7771072, 8079683, 8389071, 8789818, 9204180, 9616372, 10117422, 10664046, 11226200, 11863220, 12654055, 13592831, 14690539, 16003487, 17529880, 19317260, 21454702, 24316060, 28525189, 35206500, 45064770, 56703747, 66115937, 69886279, 67726704, 61385618, 53730537, 46859385, 41697927]
5744D1697927l083825m39740K761454N201670N043732K404266m87570k469756
5736E0628158k433165o26975K253300N548683P790992P371462L954595o31200
5728G3855850m182598n407381m406815j902613M42464O70367j172349l328442
5720E4568483m756773m779502l620609k042887l66511J607346M235415P083211
5712E1928173Q186592N818874R34621l830013o946025p524109o576746n270992
5704C6720375m021589l205558k639548k254761j781591j272359j065609j126945
5696A9352415j252761j318891j171067r35942o70314n41055m14150l13931j38039
5687A2596265j4585L7699p1792l79059o31757p47893p48045o50792n83780m50215
$$ y = [41697927, 38614102, 38174362, 40935816, 46137486, 51181218, 53585484, 53097914, 50628158, 48194993, 47568018, 49821318, 55370001, 63160993, 70532455, 74487050, 73855850, 69673252, 64265871, 59859056, 57956443, 58398907, 59069274, 57896925, 54568483, 49811710, 45032208, 41411599, 39368712, 39002201, 40609547, 44844962, 51928173, 60114765, 65933639, 66868260, 63038247, 56092222, 48568113, 41991367, 36720375, 32698786, 29493228, 26853680, 24598919, 22817328, 21544969, 20479360, 19352415, 18099654, 16780763, 15609696, 14673754, 14003440, 13462385, 13048235, 12734304, 12596265, 12581680, 12619379, 12547587, 12168528, 11536771, 10788878, 10040833, 9390041, 8806261, 8356046]
5677H356046l68591l09480k34856j70584j46747j84717j91328j21580k14645j52631
5667F260887j10283j30466j03775j37032p5072o6827l5955M488Q996l7355l9548
5656E538058K9471q677m6951k5999k0288J10506K13920K65283L6803j37910k30395
5645E723821k19540j42774j01843j7431J6431k8519P1687P3319P6366J70752L32886
5634E955155N47050N99055M30823K27904R1702J67751L05592J64856j08870k61843
5624H119175m12485m56052l79729l00850j79532j23239p186Q7421J71762K42448
5614F761733L55811M44163M68629M12540K79535k8594j27042J3443K99223L95582
5604I275023K22547O1513r981l4221m1695j14261j64255q9672J20527J92654J11489
$$ y = [8356046, 7987455, 7677975, 7443119, 7272535, 7125788, 6941071, 6749743, 6628163, 6413518, 6260887, 6150604, 6020138, 5916363, 5779331, 5704259, 5637432, 5601477, 5605965, 5614961, 5577606, 5538058, 5567529, 5558852, 5511901, 5485902, 5465614, 5576120, 5790040, 6055323, 6092126, 5954216, 5723821, 5504281, 5361507, 5259664, 5242233, 5258664, 5230145, 5301832, 5375151, 5451517, 5622269, 5955155, 6502205, 7101260, 7532083, 7759987, 7851689, 8019440, 8325032, 8489888, 8381018, 8119175, 7706690, 7250638, 6870909, 6570059, 6390527, 6267288, 6260102, 6347523, 6519285, 6761733, 7117544, 7561707, 8030336, 8442876, 8722411, 8693817, 8566775, 8580218, 8879441, 9275023, 9497570, 9559083, 9549102, 9514881, 9473186, 9358925, 9194670, 9104998, 9225525, 9418179, 9529668]
5593I529668q8293k59969m01469m03592k87077j90602j367K46057N43098P51982
5583I438436P36280O05163M57372L03840K65606J95055O8062p3793j32572k49636
5573A1613813l35102m15879m68653m06917k40333m2431Q0166Q552j35458k79650
5563I378108l51889m04406k44336r0038R791J49715K31868L09408K98724J85276
5553I472221j6603j73137l26298l17139l01596l46859l24167k72100k62243j76716
5543F955363q3377m5057J4149N7876J24594J67965N8779N6535K1320j4350J9991
5532G333788J19909J60017K14982L10162L75534L66563L98183L65007L89444M01855
5522A0435444M29161N27497M76817M50310M29605M16898M39059M70916N39543
$$ y = [9529668, 9441375, 9181406, 8779937, 8376345, 8089268, 7898666, 7897299, 8143356, 8686454, 9438436, 10174716, 10779879, 11237251, 11541091, 11806697, 12001752, 12069814, 11996021, 11863449, 11613813, 11278711, 10862832, 10394179, 9987262, 9746929, 9704498, 9784664, 9793216, 9657758, 9378108, 9026219, 8621813, 8377477, 8287439, 8297230, 8446945, 8678813, 8988221, 9286945, 9472221, 9455618, 9282481, 8956183, 8639044, 8337448, 7990589, 7666422, 7394322, 7132079, 6955363, 6871986, 6826929, 6841078, 6898954, 7023548, 7191513, 7250292, 7306827, 7328147, 7313797, 7333788, 7453697, 7613714, 7828696, 8138858, 8514392, 8880955, 9279138, 9644145, 10033589, 10435444, 10864605, 11392102, 11868919, 12319229, 12748834, 13165732, 13604791, 14075707, 14615250]
5513A4615250M13792K55134K3189j68929l48901m62201m56903n19292n16809n79342
5503A2254988n98347p07451p55273p12871p54630p51228o71886o12117m84337
5494F206848m47998l60530l05732k59178k15645j43648j55476j06364q8438q2761
5484D041078j00981o0451q4338j35151j63889j63471j56464j30439j10565q4763
5474B850566p3929o8342j0033L02m4296j7901J8136m1600l5300k3423k3989m0220
5462B489971j8720q158l9555k3262m9405k9083j7548l3268K1648k3452l22J9655
5450B288501L4274J6698J9963Q865j8759k5336l9772k7432p4053p5667n5168p8352
5438A973762n1157n7122m5660p5720m7858j8689o746j7529J8943L6201J3943M8887
$$ y = [14615250, 15029042, 15284176, 15307365, 15138436, 14789535, 14327334, 13870431, 13351139, 12834330, 12254988, 11656641, 10949190, 10193917, 9481046, 8726416, 7975188, 7303302, 6691185, 6206848, 5758850, 5398320, 5092588, 4833410, 4617765, 4474117, 4318641, 4212277, 4123839, 4041078, 3940097, 3879646, 3795308, 3660157, 3496268, 3332797, 3176333, 3045894, 2935329, 2850566, 2776637, 2708295, 2698262, 2698564, 2654268, 2636367, 2654503, 2612903, 2577603, 2554180, 2530191, 2489971, 2471251, 2463093, 2423538, 2400276, 2350871, 2321788, 2304240, 2270972, 2292620, 2269168, 2268846, 2288501, 2322775, 2339473, 2359436, 2368301, 2349542, 2324206, 2284434, 2257002, 2182949, 2107282, 2052114, 1973762, 1922605, 1865483, 1819823, 1744103, 1696245, 1677556, 1670810, 1653281, 1672224, 1708425, 1722368, 1771255]
5426A771255L9347L3614j0200j4761j9526m4561k3453n1367l278j2207j8191K2441
5414A669113K6087K2387j8088q397K113L1054P1477O3549M8356J4067L6014Q921
5402A966653k0677K567P361L3991L4816P5548J44872K66558L55300K49579L0598
5391C147166j72078l01218k74561k53146j66861n6195q8118m8888o5544j03269
5381A617288o7008n1564l1837q5729m8063k6494n095k5391j4136L2952J321j1720
5369A284524J1297M2407m649j2244M0094m1118j978k6374P368j5864l4565q591
5357A240307k7190n1739l6986L675m1204r923J4350p653k9007j0961L132j7122
5345A029679N441R578K2264j9472l0617J8965k9689o224J6371P462k3896K0495
$$ y = [1771255, 1810602, 1844216, 1834016, 1819255, 1799729, 1755168, 1731715, 1680348, 1677070, 1664863, 1646672, 1669113, 1695200, 1717587, 1699499, 1691102, 1693215, 1724269, 1795746, 1859295, 1907651, 1921718, 1957732, 1966653, 1945976, 1948543, 1955904, 1989895, 2024711, 2100259, 2245131, 2511689, 2866989, 3116568, 3147166, 2975088, 2673870, 2399309, 2146163, 1979302, 1923107, 1834989, 1786101, 1720557, 1617288, 1550280, 1498716, 1466879, 1381150, 1333087, 1306593, 1301498, 1276107, 1261971, 1294923, 1296244, 1284524, 1295821, 1338228, 1333579, 1321335, 1361429, 1320311, 1318333, 1291959, 1299327, 1283463, 1248898, 1240307, 1213117, 1161378, 1124392, 1128067, 1086863, 1076940, 1091290, 1083637, 1054630, 1043669, 1046801, 1029679, 1035120, 1044698, 1066962, 1047490, 1016873, 1035838, 1006149, 999925, 1016296, 1023758, 999862, 1020357]
5333A020357J8604k2237l4716K1289k5840k3340n723J8098n075j2503k3158K2308
5321I48064n203j7253M1695p763j4747L9806J1639J3071N1887J7233L6954j1693
5309A103690J0453K3629m6065j4475m072k5000n5544j1895k9404k9838n746j4130
5297I01603o701R954J5008J1883J0209m4618J7359L8354J2425L1259L2140O598
5285A035473Q864J5316M033L2362K0048N1427J09746P7725M1690L9194q621l7282
5273A389975l028k8240n2354m303m8973J9328l878M5225L3695J7273k4507N0245
5261A390458K7923L5630R8145N6347N1259K7862O218l156m8381k7555n2962l4730
5249A527058n0328q900P382R31J9482l568l7181m1224j2552l0917l0680m2152
$$ y = [1020357, 1038961, 1016724, 982008, 1003297, 977457, 954117, 948394, 966492, 961417, 948914, 925756, 948064, 942861, 925608, 967303, 959540, 944793, 984599, 996238, 1009309, 1061196, 1078429, 1115383, 1103690, 1114143, 1137772, 1091707, 1077232, 1073160, 1048160, 992616, 980721, 951317, 921479, 915733, 901603, 894902, 904856, 919864, 931747, 941956, 897338, 914697, 953051, 965476, 996735, 1028875, 1035473, 1044337, 1059653, 1063686, 1096048, 1116096, 1167523, 1277269, 1354994, 1396684, 1435878, 1427257, 1389975, 1386947, 1358707, 1306353, 1302050, 1253077, 1272405, 1268527, 1313752, 1347447, 1364720, 1340213, 1390458, 1418381, 1454011, 1552156, 1608503, 1659762, 1687624, 1693842, 1690686, 1642305, 1614750, 1561788, 1527058, 1476730, 1467830, 1475212, 1476143, 1495625, 1492057, 1454876, 1413652, 1401100, 1370183, 1339503, 1297351]
5237A297351k3684k2770j3448k4535K7359j2207J1641L1655P20j9308K59j8105
5225A234928j8823p573L2455l3495M3616j7802K4237l3218J2223M9398L7532K2346
5213A345824M4273M2538L906j0488K850j4050k960J6543K2556k4772k0391j4722
5201A391107K1582p62L5161M1187j1933J1801N7221k3541l7967k2517l7244m9545
5189A374550L196m331L6682L5104N0120P2471j7268P754J4139J3795K2579O0888
5177A669679P5630L6114J08439P9725R6279J24134J03550J18105O4763L250mj2412
5165B467252l9535k9790M875p246O0872M7970P8868Q4818R2487M8742Q6518M5530
5153B941361P2321Q6098P2022K8643L6050J6531K2241R6660M8253O7625P3065
$$ y = [1297351, 1273667, 1250897, 1237449, 1212914, 1240273, 1228066, 1239707, 1271362, 1272082, 1252774, 1253033, 1234928, 1216105, 1208532, 1240987, 1207492, 1251108, 1233306, 1257543, 1224325, 1236548, 1285946, 1323478, 1345824, 1390097, 1432635, 1436541, 1426053, 1428903, 1414853, 1411893, 1428436, 1450992, 1426220, 1405829, 1391107, 1412689, 1411927, 1447088, 1488275, 1476342, 1488143, 1545364, 1521823, 1483856, 1461339, 1424095, 1374550, 1377746, 1373415, 1410097, 1445201, 1495321, 1567792, 1550524, 1558278, 1572417, 1586212, 1608791, 1669679, 1745309, 1781423, 1889862, 1969587, 2065866, 2190000, 2293550, 2411655, 2476418, 2479668, 2479664, 2467252, 2427717, 2397927, 2402802, 2395556, 2456428, 2504398, 2583266, 2668084, 2760571, 2809313, 2895831, 2941361, 3013682, 3099780, 3171802, 3200445, 3236495, 3253026, 3275267, 3371927, 3420180, 3487805, 3560870]
5142C560870N7715R6864J04710J47894J62093J76861J63208J38461J42582O4473
5132D815731P0807O8297J77000J48385K23097K06720K12120K13872K41537K06834
5122F584400K58935K11538K86101J29506R0909j6108L7943j4153P4152J08393
5112G751616K50736K76587L99624M31263M78789M94985O47950O40438P36319P58774
5102A2867081R95172J009589J234733J460047K012047K952330N099224P404848
5094C5035071P600177M355247R12325j502202j824115l83860J427845L049422
5086D8669910N031701P069262J1110134J9586849L9148066O7419778P7670419
5079B75706119M7628533J826434l5463519n8000357n5010997m3892367l3246678
$$ y = [3560870, 3618585, 3715449, 3820159, 3968053, 4130146, 4307007, 4470215, 4608676, 4751258, 4815731, 4886538, 4954835, 5131835, 5280220, 5503317, 5710037, 5922157, 6136029, 6377566, 6584400, 6843335, 7054873, 7340974, 7470480, 7561389, 7545281, 7583224, 7569071, 7643223, 7751616, 8002352, 8278939, 8678563, 9109826, 9588615, 10083600, 10731550, 11371988, 12108307, 12867081, 13862253, 14871842, 16106575, 17566622, 19578669, 22530999, 27630223, 35035071, 42635248, 46990495, 47902820, 46400618, 44576503, 44192643, 45620488, 48669910, 53701611, 60770873, 71881007, 91467856, 130615922, 198035700, 275706119, 323334652, 325161086, 289697567, 231697210, 176686213, 132793846, 99547168]
5072I9547168k4413396j6967328j1599060p756347n481010m203900l545612k915855
5064B2664660k296845j676430j168451q26009o34781o03971n95508n54507o08247
5055A3699911n79048m31150l38572j41311m6500K6093m8917j44083j62913q6400
5045A1747110L883J35189J41095K76171M47095J134651K221660L107903K261009
5036B1475766J88327j665769k821983k787630k175607j541911r91986m81930j10518
5027I086759N8816R0348k53835n51875p10771p07776n15578l89983k86053j63933
5017E656119j30302j06590r4336o5297q404L3945J02897J69668K04819J74500
5007E937019J26855N0144l972m4458n1274j8200n7974N366rl2459p4100q5975
$$ y = [99547168, 75133772, 58166444, 46567384, 38811037, 33330027, 29126127, 25580515, 22664660, 20367815, 18691385, 17522934, 16696925, 16062144, 15458173, 14862665, 14308158, 13699911, 13120863, 12689713, 12351141, 12209830, 12163330, 12189423, 12140506, 11996423, 11833510, 11747110, 11750993, 11886182, 12027277, 12303448, 12750543, 13885194, 16106854, 19214757, 21475766, 21664093, 19998324, 17176341, 14388711, 12213104, 10671193, 9679207, 9197277, 9086759, 9145575, 9235923, 8982088, 8430213, 7719442, 7011666, 6496088, 6106105, 5820052, 5656119, 5525817, 5419227, 5324891, 5259594, 5251190, 5285135, 5388032, 5557700, 5762519, 5937019, 6063874, 6114018, 6110046, 6065588, 6014314, 5996114, 5938140, 5943506, 5943497, 5911038, 5836938, 5750963]
4995E750963j11705j17183j57582j46066k32605k18172j91642j35342q7073P205
4985D360798J35910L49732O02004P74800N66305K52849j43854l25210m21826m18354
4975E733154m12421l72863l74997l24993k21659j80667j12675n5215o2128l8698
4965C576838p805L412k152N0715Q2199J76855K26406L28446M74368M58815K92767
4954E660864J43065O6072J5588J15200J52113J23707Q6737J47215K45681M21011
4944G177253N76753Q61088J424272K565144M815128O708235N542710J676188k040350
4935B9306421m560360m934088m020151l101140k234988j592489j011748n87624
4927G263833l54140k65003j96151j62421n2463P1669J88847L79813Q37760J512309
$$ y = [5750963, 5639258, 5522075, 5364493, 5218427, 4985822, 4767650, 4576008, 4440666, 4353593, 4360798, 4496708, 4846440, 5448444, 6223244, 6789549, 7042398, 6898544, 6573334, 6151508, 5733154, 5320733, 4947870, 4572873, 4247880, 4026221, 3845554, 3732879, 3677664, 3615536, 3576838, 3569033, 3572445, 3570293, 3621008, 3703207, 3880062, 4106468, 4434914, 4909282, 5368097, 5660864, 5803929, 5870001, 5885589, 6000789, 6152902, 6276609, 6363346, 6510561, 6756242, 7177253, 7754006, 8615094, 10039366, 12604510, 17419638, 24127873, 29670583, 31346771, 29306421, 24746061, 19811973, 15791822, 12690682, 10455694, 8863205, 7851457, 7263833, 6909693, 6644690, 6448539, 6286118, 6233655, 6305324, 6494171, 6873984, 7711744, 9224053]
4917I224053J964152J488145L60632n24720j095585j184471j031556q92329p93006
4908G515315o12885m59984l48786k22982j37007j36381j70039k08908j93764j50270
4898D874309j28994j25464q5470j29741q7450m2580n5944j8310K1184K0644K5083
4887D267267K9475J6867J7586K0948M7915Q2945J41071J58464L12621L26336K42194
4876E663689J20211O1592m0339P5179J06692J89834K31241K60102K30806K09112
4866G108119J25087K2240r3309k52886l06785k49644k26199j43398j89739j99001
4856E594485k04078k00524k03445j57731j94288k36448k30637k70236k43680k05956
4846C447462j90013j57269j05169j12161q9552m4393m4555k9284k6227l3100J0840
$$ y = [9224053, 11188205, 12676350, 13036982, 12512262, 11416677, 10232206, 9200650, 8308321, 7515315, 6902430, 6442446, 6093660, 5870678, 5733671, 5597290, 5427251, 5218343, 5024579, 4874309, 4745315, 4619851, 4534381, 4404640, 4317190, 4274610, 4218666, 4200356, 4221540, 4242184, 4267267, 4296742, 4313609, 4331195, 4352143, 4400058, 4483003, 4624074, 4782538, 5095159, 5421495, 5663689, 5783900, 5845492, 5805153, 5880332, 5987024, 6176858, 6408099, 6668201, 6899007, 7108119, 7233206, 7255446, 7162137, 6909251, 6602466, 6352822, 6126623, 5983225, 5793486, 5594485, 5390407, 5189883, 4986438, 4828707, 4634419, 4397971, 4167334, 3897098, 3653418, 3447462, 3257449, 3100180, 2995011, 2882850, 2793298, 2748905, 2704350, 2675066, 2648839, 2615739, 2626579]
4835B626579k081l5716l2543J4754p0423l2370l8743n1816l6926m6401o9588q0564
4823B144162m0072l6324K3771j2599J1883k917m8539k3998l2189j9063n6193j354
4811A906568k7247k2636O631m765R852j0013n324m113N934j2714K2353K9938n93
4798A893871P4181M3988L9091L5642M4488L8989M8030K7430N7918K4717L1101
4787B359446J00979M1734P0671N0526J01440O2305Q8943J56189J05830K15725
4777C353788K20366K48887K76528K51663K74788K79084K62245K32093K00279Q3255
4767E682976K6018K7909j4219R2321J76304J36583n5887k65292l56320l29689
4757E120704k27866j29091n6022J6221P3369J52482K35589K55047L63258M05929
$$ y = [2626579, 2624498, 2588782, 2556239, 2570993, 2500570, 2468200, 2429457, 2377641, 2340715, 2294314, 2224726, 2144162, 2104090, 2067766, 2091537, 2078938, 2090821, 2087904, 2039365, 2015367, 1983178, 1964115, 1907922, 1906568, 1879321, 1856685, 1863316, 1858551, 1868403, 1858390, 1853066, 1848953, 1854887, 1842173, 1864526, 1894464, 1893871, 1968052, 2012040, 2051131, 2086773, 2131261, 2170250, 2218280, 2245710, 2303628, 2328345, 2359446, 2460425, 2502159, 2572830, 2623356, 2724796, 2787101, 2876044, 3032233, 3138063, 3353788, 3574154, 3823041, 4099569, 4351232, 4626020, 4905104, 5167349, 5399442, 5599721, 5682976, 5708994, 5736903, 5722684, 5815005, 5991309, 6127892, 6072005, 5806713, 5450393, 5120704, 4892838, 4763747, 4707725, 4723946, 4797315, 4949797, 5185386, 5440433, 5803691, 6209620]
4747F209620N40866O80577R78925J324438J354065P60727r3751p74763j226200
4738I754504j276469j112130r06740o92292n34827l52191k70808k06130j18603
4729D284314q2556l1325l9955L6137O8087O8344J66269J93460J33612J33725O0228
4718D990340j40q6930j72215j81018k29537k48195j82683j89423j61165j34831
4708C404203q4712j50737r5012q7921o8334j06803r2188q8164r7363j06214o8358
4697B358397l7342m9230p6607m069o3849l9759l6349k0895k0769m2692K4697l2338
4685A959195j253j4525J558k4555J839L033j4982j1526p838k4102m4777k9641
4673A792426n914q324k7817j4408J4599j6240J8644R074K5063P342M2741N6667
$$ y = [6209620, 6750486, 7431063, 8409988, 9734426, 11088491, 11849218, 11755467, 10980704, 9754504, 8478035, 7365905, 6459165, 5766873, 5232046, 4879855, 4609047, 4402917, 4284314, 4201758, 4170433, 4130478, 4166615, 4234702, 4303046, 4469315, 4662775, 4796387, 4930112, 4990340, 4990200, 4903270, 4731055, 4550037, 4320500, 4072305, 3889622, 3700199, 3539034, 3404203, 3319491, 3168754, 3073742, 2985821, 2917487, 2810684, 2718496, 2630332, 2532969, 2426755, 2358397, 2321055, 2271825, 2195218, 2191149, 2127300, 2087541, 2051192, 2030297, 2009528, 1966836, 1991533, 1959195, 1957942, 1943417, 1944975, 1920420, 1922259, 1925292, 1910310, 1898784, 1890946, 1866844, 1822067, 1792426, 1786512, 1778188, 1750371, 1735963, 1750562, 1734322, 1752966, 1762040, 1787103, 1794445, 1837186, 1893853]
4661A893853L2158L5246L3163K1229O460l654j0531n3991J268l310K0153k2398
4649A949646k120j0712K0397M2784L7488L9422N5168P2652O5097R0410Q8677J30312
4637B579221J33238J69694K57713K87785L51232L61171K35301O6282r4241k06116
4627D141280k49732j52360j09351n6276K3111P7536Q9720J11035J37438J15560
4617D127961J82479J91747K41097L13016L28627M49542N49711P01983R23291R51052
4607H960506P00392L54323M4787j69235j48180J5273J82312L49705M80832M33434
4597A1204149M15950L98486N21480O04175M58759J16557k76773n68284o45633
4588A2228866m76040l27500k05583j54023j94460k93923m07233m30292m08453
$$ y = [1893853, 1926011, 1961257, 1994420, 2015649, 2022109, 2018455, 2007924, 1953933, 1955201, 1951891, 1972044, 1949646, 1947526, 1936814, 1957211, 1999995, 2037483, 2076905, 2132073, 2204725, 2269822, 2360232, 2448909, 2579221, 2712459, 2882153, 3139866, 3427651, 3778883, 4140054, 4375355, 4441637, 4347396, 4141280, 3891548, 3739188, 3629837, 3573561, 3596672, 3674208, 3763928, 3874963, 4012401, 4127961, 4310440, 4502187, 4743284, 5056300, 5384927, 5834469, 6384180, 7086163, 8009454, 8960506, 9660898, 10015221, 10060008, 9890773, 9742593, 9757866, 9940178, 10289883, 10770715, 11204149, 11620099, 12018585, 12540065, 13144240, 13602999, 13719556, 13442783, 12874499, 12228866, 11752826, 11425326, 11219743, 11065720, 10871260, 10577337, 10170104, 9739812, 9331359]
4579I331359m18381l92200l00153k80545k96992k06507j81545j95115j61423j05118
4569F793380j11258m6295k05O4533Q7048J25838K31722K51923J98164K25248K43011
4558H063109J98059K75962L46621M00061N53202P23915R58019J223509J669836
4549A4412293K100510K437043K334177J717088O97364m26965j232672j635934
4541B0402904j776921j778380j599461j448535j299379j071674q50826o21633
4533I956095m66172m26280l57694l72044m27613m28789m26169m01601l82360l53017
4523E914356l42082l26091k83583k54842j89908j95245j60753j28398j31564j30063
4513C771827q2999o7194r8738m8802l5364q839L1926M8422J17271J11326J00168
$$ y = [9331359, 8912978, 8520778, 8220625, 7940080, 7643088, 7436581, 7255036, 7059921, 6898498, 6793380, 6682122, 6635827, 6635622, 6700155, 6787203, 6913041, 7144763, 7396686, 7594850, 7820098, 8063109, 8261168, 8537130, 8883751, 9283812, 9837014, 10560929, 11518948, 12742457, 14412293, 16512803, 18949846, 21284023, 23001111, 23698475, 23271510, 22038838, 20402904, 18625983, 16847603, 15248142, 13799607, 12500228, 11428554, 10577728, 9956095, 9489923, 9063643, 8705949, 8333905, 7906292, 7477503, 7051334, 6649733, 6267373, 5914356, 5572274, 5246183, 4962600, 4707758, 4517850, 4322605, 4161852, 4033454, 3901890, 3771827, 3688828, 3621634, 3522896, 3474094, 3438730, 3429891, 3461817, 3510239, 3627510, 3738836, 3839004]
4502C839004J10725J06625P6765J07122R5892Q0619N6920K6998n9258j47527j97579
4491D096306k39320k26557k61596k12932j44582j86838j34169q3837j12984p7509
4481B415982j6239n2439j4390r865l9743o273J2888K3095L0471K337P780N1984
4469B405588K8677N1785J37775J32659J54730K05828J47294R3110L5911J3027
4459C406384j1312l6169o8153r2984p1642o0555P164O5106P9476J84909K25552
4448C627776K70157L66585N03615O43254Q91203J252345J623638J707719J220212
4439A2106504L26560n60277j226494j409089j350221j169564r56474o95598n50940
4430D514407l82136k71515k33570j59186j21553q8076m7678j13858r7280r2877
$$ y = [3839004, 3949729, 4056354, 4133119, 4240241, 4336133, 4416752, 4473672, 4500670, 4441412, 4293885, 4096306, 3856986, 3630429, 3368833, 3155901, 3011319, 2824481, 2690312, 2606475, 2493491, 2415982, 2399743, 2347304, 2332914, 2323049, 2283306, 2277033, 2289921, 2313016, 2343487, 2345824, 2353604, 2405588, 2434265, 2486050, 2623825, 2756484, 2911214, 3117042, 3264336, 3357446, 3393357, 3406384, 3395072, 3358903, 3290750, 3197766, 3126124, 3065569, 3072733, 3137839, 3217315, 3402224, 3627776, 3897933, 4264518, 4768133, 5411387, 6302590, 7554935, 9178573, 10886292, 12106504, 12433064, 11872787, 10646293, 9237204, 7886983, 6717419, 5760945, 5065347, 4514407, 4132271, 3860756, 3627186, 3468000, 3346447, 3258371, 3210693, 3096835, 2999555, 2906678]
4420B906678j19749j03474p8489o1136q5355m0279n3310o3545n6027n2372k2003
4409B170939l4931l0547j3488l0540l8890m0771m806p0948l5083k2714m5803k4672
4397A777746k6983j6331j292O649L1109R886J37p641N2942j5571k5858l6368k8012
4384A720413l0561o0555p0889l5491m7578j9438l2633j3870n2590j8451j3470
4373A324887k5922j8484k1136l4091p988L942J4070j0648l9272R751o016p173
4361A181920O24K9595K555Q096M5590P17k0825k562O151l7798l9776m92j2668
4348A161127j9854k7492M458p555j0854O6161M6350l0444j4264j9501j6967m0986
4336A090179J5353p429Q823K5597P1610P0138N5144R3785Q8186K6399M2962J3144
$$ y = [2906678, 2786929, 2683455, 2604966, 2543830, 2458475, 2418196, 2364886, 2301341, 2245314, 2192942, 2170939, 2136008, 2105461, 2091973, 2061433, 2022543, 1981772, 1976966, 1906018, 1870935, 1848221, 1802418, 1777746, 1750763, 1734432, 1733140, 1739789, 1770898, 1780784, 1780921, 1773280, 1826222, 1810651, 1784793, 1748425, 1720413, 1689852, 1629297, 1558408, 1522917, 1475339, 1455901, 1423268, 1409398, 1356808, 1338357, 1324887, 1298965, 1280481, 1259345, 1225254, 1217266, 1221208, 1235278, 1224630, 1185358, 1195109, 1189093, 1181920, 1182544, 1212139, 1214694, 1222790, 1268380, 1269097, 1248272, 1245710, 1251861, 1214063, 1174287, 1173795, 1161127, 1141273, 1113781, 1118239, 1110684, 1099830, 1165991, 1212341, 1181897, 1167633, 1148132, 1131165, 1090179, 1105532, 1098103, 1106926, 1132523, 1204133, 1274271, 1329415, 1423200, 1511386, 1537785, 1580747, 1593891]
4324A593891j7706o5282l0641l0625k6636l6857J9117M0916L4446R5301J16609
4313A692533Q7432P1766N7218o7617j04333q9858j11703p3478p1528n1024k0380
4302A319028q177L227N6058M9592P2915J26925R6247J13694Q1897J17998Q0868
4291B110272Q8356O8870Q8900N4006j5160o7592j12215j31989j16014j26278r9066
4280A742090q9782l1097k364O6336M1982P0461N3492j6516k8578m7142p9409o9992
4268A609481m2545j4822L6687J15853L06140N81665O67733L42080j4816l35603
4258C251853m08133l28796k21952j77425j27043p0817n8209l2180l458j5006l1452
4247A777382q6319p4705j18572j05553o8824o1760m8935M636k3262L7901L4452
$$ y = [1593891, 1576185, 1510903, 1480262, 1449637, 1423001, 1386144, 1405261, 1446177, 1480623, 1575924, 1692533, 1779965, 1851731, 1908949, 1841332, 1736999, 1647141, 1535438, 1461960, 1390432, 1339408, 1319028, 1310851, 1314078, 1370136, 1419728, 1492643, 1619568, 1715815, 1829509, 1911406, 2029404, 2110272, 2198628, 2267498, 2356398, 2410404, 2395244, 2327652, 2215437, 2083448, 1967434, 1841156, 1742090, 1652308, 1621211, 1618847, 1685183, 1727165, 1797626, 1851118, 1834602, 1806024, 1758882, 1679473, 1609481, 1566936, 1552114, 1588801, 1704654, 2010794, 2592459, 3260192, 3602272, 3587456, 3251853, 2843720, 2514924, 2292972, 2115547, 1988504, 1917687, 1859478, 1827298, 1823840, 1808834, 1777382, 1691063, 1616358, 1497786, 1392233, 1323409, 1261649, 1212714, 1217350, 1194088, 1231989, 1266441]
4236A266441M9594N5910L1828j1382n6379m4349o9333j4694n2281j9278n0946
4225A085131n4658o5265n3880k9971l2170M29J24m7234L2052J7939K6865L1288
4213I10650K7999L738N2348n887J4658K3435m0398l3412n3923k8205p9685m1046
4201G50272l1332m1626l7263k7737j3162l0668k6224K8026K1982m1703K4467M2889
4189F17921j6899L4115k4043N736l2171k1614P216l549l0502J7852r800l3689
4177E10573J4570L4690j6518J0531O928N455k9066k2611q979j6017j9722j1665
4165D58169o782j1194l3967J8553k6392m8973K5222k0894Q458m60K6601p611l3080
4152C47650J7120O874L4326m7288K5736O266n1111L7449j5697K3494j9486R132
$$ y = [1266441, 1316035, 1371945, 1403773, 1392391, 1336012, 1291663, 1222330, 1207636, 1155355, 1136077, 1085131, 1030473, 965208, 911328, 881357, 849187, 849616, 849740, 802506, 834558, 852497, 879362, 910650, 938649, 942387, 994735, 988848, 1003506, 1026941, 986543, 953131, 899208, 871003, 791318, 750272, 718940, 677314, 640051, 612314, 599152, 568484, 542260, 570286, 592268, 550565, 575032, 617921, 601022, 635137, 611094, 616830, 584659, 563045, 570261, 566712, 536210, 554062, 544262, 510573, 525143, 559833, 543315, 553846, 560774, 566229, 537163, 514552, 505573, 489556, 469834, 458169, 451387, 440193, 406226, 424779, 398387, 349414, 374636, 353742, 362200, 361740, 388341, 380730, 347650, 364770, 371644, 405970, 358682, 384418, 390684, 339573, 377022, 361325, 384819, 365333, 374465]
4140C74465j2212R471J7292Q728O048k3606p576J8223l0247P459k7115J8117m2275
4127C16772M948r844Q329K8136j3777J6546J144r348R673M189m1368K5715J207
4114C42322l638J6610m133p729R459l8553K972L5399l2816J1818M108k973j5664
4101C17182J6199r98k4494J4852j4012K7295P458k2717N1548j9666q869J6265
4089C60043J2696l0939J5827J8102l1667J4743m958P477J0851o477J3402k4231
4077C54869R800K5310K963j3138l202J2265l4857j7769L8553j6329J9601J6306
4065C94372j3042Q899r241K1749q942J5000R375J1985k7440L5683J3452o875K805
4052D47780K2189M519j6312n682K8933m8447j451j2044K0917l0958P883J8649
$$ y = [374465, 362253, 371724, 389016, 397744, 403792, 380186, 372610, 390833, 360586, 368045, 340930, 359047, 316772, 321720, 311876, 320205, 348341, 334564, 351110, 352254, 342906, 352579, 356768, 315400, 341115, 342322, 338684, 355294, 351161, 343432, 352891, 314338, 317310, 352709, 319893, 331711, 335819, 332846, 317182, 333381, 332383, 307889, 322741, 308729, 336024, 343482, 320765, 372313, 352647, 343778, 360043, 372739, 341800, 357627, 375729, 344062, 358805, 353847, 361324, 372175, 365698, 379100, 354869, 364669, 389979, 392942, 379804, 376602, 388867, 354010, 336241, 374794, 358465, 378066, 394372, 381330, 390229, 380988, 402737, 393795, 408795, 418170, 430155, 402715, 438398, 451850, 444975, 447780, 469969, 474488, 458176, 452494, 481427, 432980, 431529, 419485, 440402, 409444, 417327, 435976]
4040D35976m969j83K7740K083o254M2030p719j4242J4287j4387L341k4527L494
4027D56670j929N452K7125R378O342k8914K1727K7560q215K1364L3705L411J0550
4014E84226K7713K5099K7727K1524Q675M1825j2980K5150L5672Q1922J16886J49370
4002A132809N6452L9056m2111m5370r0782n2782m0328l5836O890R800P6568J18589
3990A132955Q9307J17773N6323L5731m124k3099J720m0589j0438k2490J9752l3186
3978A319635K1943M0376J08822K40321L69286L76861J66906m6431k24149l27508
3968B046062k99352k20020j02237j18299m3910j3139m513j8967M0605P2566N5283
3957A394079J0576J2248j986p3770r1696q6193j31249q9954m0955k5223j914L9875
$$ y = [435976, 431007, 430824, 458564, 460647, 454393, 496423, 488704, 474462, 488749, 474362, 477703, 453176, 456670, 454741, 460193, 487318, 496696, 503038, 474124, 495851, 523411, 515196, 536560, 570265, 573676, 584226, 611939, 637038, 664765, 686289, 694964, 736789, 723809, 748959, 784631, 866553, 983439, 1132809, 1189261, 1228317, 1186206, 1140836, 1050054, 997272, 956944, 921108, 927998, 937798, 1014366, 1132955, 1222262, 1340035, 1396358, 1432089, 1427965, 1404866, 1406586, 1365997, 1355559, 1333069, 1352821, 1319635, 1341578, 1381954, 1490776, 1731097, 2100383, 2477244, 2644150, 2597719, 2373570, 2046062, 1746710, 1526690, 1424453, 1306154, 1262244, 1249105, 1244592, 1225625, 1266230, 1338796, 1394079, 1404655, 1416903, 1414917, 1341147, 1249451, 1163258, 1032009, 942055, 901100, 875877, 873963, 913838]
3945I13838R9627M7648Q7278M2357j9875j28314r3614p8853p9077l4686m8441
3934G07888j7898n1047m8579J0123m3344O243j2977N226k0036m6105K1653O231
3922E17378o28p983J2147k7812o822J1323J3771L1922k8425N9364k6359m2p548
3909E40286l4510J1315k7542P304k0021p671J5886O878Q319R587q685k5541L6041
3896E11646O337K8837j1955j5376K078l0042K4711k2425K3113j6856J4429L5985
3884E50482j0770L2569m239L416M51N336n47L2787P790l6778L4733N324P86P440
3870F28780j5588J6096J1306r427K4166j1299k1140K9894J0760R923P812j2119
3858F69164L436j8432J9693J560r786j8096L0911M224n70J5958P51q464r790L3419
$$ y = [913838, 1013465, 1061113, 1148391, 1190748, 1170873, 1042559, 948945, 870092, 791015, 756329, 707888, 689990, 638943, 590364, 600487, 557143, 563386, 550409, 555635, 535599, 489494, 511147, 517378, 516750, 508767, 520914, 493102, 486280, 497603, 511374, 543296, 514871, 574235, 547876, 547834, 540286, 505776, 517091, 489549, 496853, 476832, 469161, 485047, 491925, 500244, 509831, 501146, 475605, 511646, 517983, 546820, 534865, 519489, 521567, 491525, 516236, 493811, 516924, 500068, 514497, 550482, 539712, 572281, 568042, 571458, 571909, 577245, 576698, 609485, 617275, 580497, 615230, 620554, 621340, 628780, 613192, 629288, 640594, 631167, 655333, 644034, 622894, 652788, 663548, 673471, 681283, 669164, 672600, 654168, 673861, 675421, 665635, 647539, 678450, 682674, 682104, 698062, 698813, 690349, 680559, 713978]
3844G13978q465j1814L4156O71k827J4701k0341J5472k2778j0175J2828n272L0685
3831G40819j2385L880K47L2705o461j2974j4039l67K6212k5350J2816Q834K4730
3818G78667j2159J4983J388r904n973L718j1161J293K1939k278j5755P147J6005
3805G87910Q735k0904L8085J3908n093j1113q91R596j8964K7192m1641N657P236
3792G99713n17k2106K8397k2029J826P894Q393J3942L957j0409Q744k7911l203
3779G86691K2509j9897l4112J6502j6493k907P750K184N831J3968k2237R359j0794
3766G58354r643M701p951Q222O661L531k6147k331m702J9736M158j0826k2400
3753G21363J9343o110K3003J1964k607m323M2095m6782J8982l597J735M718M842
$$ y = [713978, 705513, 693699, 727855, 728526, 725699, 740400, 720059, 735531, 712753, 702578, 715406, 710134, 740819, 728434, 732314, 732561, 765266, 758805, 745831, 731792, 731425, 757637, 732287, 745103, 753937, 778667, 766508, 781491, 782879, 772975, 767002, 770720, 759559, 760852, 782791, 780513, 764758, 771905, 787910, 796645, 775741, 813826, 827734, 822641, 811528, 810637, 820233, 801269, 828461, 786820, 792477, 799713, 799196, 777090, 805487, 783458, 785284, 793178, 801571, 815513, 819470, 809061, 817805, 789894, 786691, 809200, 789303, 755191, 771693, 755200, 752293, 760043, 762227, 768058, 782026, 759789, 769148, 758354, 748711, 753412, 745461, 753683, 760344, 763875, 737728, 735397, 730695, 750431, 754589, 743763, 721363, 740706, 734596, 757599, 769563, 766956, 762633, 804728, 757946, 776928, 773331, 775066, 779784, 784626]
3740G84626k3065j75Q935n217K193m211J5214J1321J9251m601j976J5570J8444
3727H36309K6147l3108M24N072p115j7954J0493k285j0102J0318O117p980k109
3714H14227J9872J9440j0282J5110J4714j0137J1844J5668K7715n4915K7105M481
3702H94842j2826P487j9637O958Q655o807J1492j121J987K232J7461j6684K9014
3689I23053K683j2596K8167k0441J2515k5741J1325J4356j0491K3923r321K8765
3677I66197k1124J4805R150l6742K0544L5533K5371k1230J4815p845k1003Q840
3665I87311j7506N603k9547p567j351k2823o062J5857k013m182J4835p76P241
3652I39020J6118K1116n051j4108r126J908J9265l1973L2348k9891J6112J7848
$$ y = [784626, 761561, 761386, 770321, 765104, 767297, 763086, 778300, 789621, 808872, 804271, 802295, 817865, 836309, 862456, 829348, 829772, 834844, 827729, 809775, 820268, 817983, 807881, 818199, 824316, 816336, 814227, 834099, 853539, 843257, 858367, 873081, 862944, 874788, 890456, 918171, 863256, 890361, 894842, 882016, 889503, 869866, 876824, 885479, 878672, 890164, 889043, 891030, 893262, 910723, 894039, 923053, 925736, 913140, 941307, 920866, 933381, 907640, 918965, 933321, 922830, 946753, 937432, 966197, 945073, 959878, 969028, 932286, 952830, 988363, 1013734, 992504, 1007319, 999474, 978471, 987311, 969805, 975408, 945861, 938294, 936943, 914120, 908058, 923915, 921902, 917720, 932555, 931779, 939020, 955138, 976254, 971203, 957095, 947969, 949877, 969142, 937169, 969517, 939626, 955738, 973586]
3640I73586O621J2502O232J0717j5904K0061n143J2183j470k0146K4483j7341
3628A006381J557l356m422r763J68L3001o032J9237p088J6927l337K9272l05M7592
3614A119832N4121Q3193R3596Q7767O3761j0449o0993p4211r4102n5537l4142
3603A172836l5549p675j3770J4805Q2l0574K7296k0093J6767J2187K8748J446
3591A166506J947J4695K5905Q718J7112M4218O350K2094M6605O7327J22145K18395
3579A762017K72521J58509P369p9039j83759j46707j07292r3544q4817m9033k8421
3568A427804L5054k3986M701J4592n77J4879J629J8209J312K566K5694J8697P653
3555A548227K0703R162J3341L9761m118K0312O5026J27892J38623J11620K6521
$$ y = [973586, 980207, 992709, 998941, 1009658, 993754, 1013815, 1008672, 1020855, 1019385, 999239, 1023722, 1006381, 1007938, 1004582, 1000160, 990397, 990565, 1023566, 1017534, 1036771, 1029683, 1046610, 1043273, 1072545, 1072240, 1119832, 1173953, 1257146, 1350742, 1438509, 1502270, 1491821, 1430828, 1356617, 1262515, 1206978, 1172836, 1137287, 1129612, 1115842, 1130647, 1130729, 1100155, 1127451, 1107358, 1124125, 1136312, 1165060, 1166506, 1168453, 1183148, 1209053, 1217771, 1234883, 1279101, 1285451, 1307545, 1354150, 1421477, 1543622, 1762017, 2034538, 2193047, 2200416, 2121377, 1937618, 1790911, 1683619, 1590075, 1505258, 1456225, 1427804, 1462858, 1438872, 1443573, 1458165, 1457588, 1472467, 1474096, 1492305, 1493617, 1496183, 1521877, 1540574, 1548227, 1568930, 1578092, 1591433, 1631194, 1627076, 1647388, 1712414, 1840306, 1978929, 2090549, 2117070]
3544B117070j5836o3682n1874j0344k2775j6554R512J6348q585p907J3990Q189
3532A967552K3988K9938K3L8019L4023N1754K3850K656L3688P1959R2863P1407
3520B441720J52913J33085J16844J21181M6483O2825k2498m7029o1452p9106m3652
3509B821314n6207n857k6003N1733K185L4306M1265K5364Q6875M3346P6260L6175
3497C130756N2212M0271K7266Q7671M4384R0336J02469J51943J76417K32702L02160
3486D438587K87439K48988J81459J43135N89q8984j20109j66532j41709j15907
3476D666956o5735n5906r411J3435L4180N7647N4498R8340O3953J03706Q7143
3465E048806J41508P4325J46354J67681J01990J28094J38427K01739J94505K02223
$$ y = [2117070, 2101234, 2037552, 1985678, 1975334, 1952559, 1936005, 1945517, 1961865, 1953280, 1945373, 1959363, 1967552, 1991540, 2021478, 2021501, 2059520, 2093543, 2145297, 2169147, 2171803, 2205491, 2277450, 2370313, 2441720, 2594633, 2727718, 2844562, 2965743, 3012226, 3075051, 3052553, 3005524, 2944072, 2864966, 2821314, 2765107, 2759250, 2733247, 2784980, 2787165, 2821471, 2862736, 2888100, 2974975, 3018321, 3094581, 3130756, 3182968, 3223239, 3250505, 3338176, 3382560, 3472896, 3575365, 3727308, 3903725, 4136427, 4438587, 4726026, 4975014, 5156473, 5299608, 5300197, 5211213, 5091104, 4924572, 4782863, 4666956, 4601221, 4545315, 4535904, 4549339, 4583519, 4641166, 4695664, 4794004, 4857957, 4961663, 5048806, 5190314, 5264639, 5410993, 5578674, 5680664, 5808758, 5947185, 6148924, 6343429, 6545652]
3455F545652K90500K74727K98570L25627L36761K92975L13588L14643L29099L74486
3445I696628M54918N39455O03825O90460P85490Q43782R34270R88060J015476
3436A6552364R53285Q26111O45423K98304o6650m04649p36131r28761r78498r91711
3426A5169087r34723q18122p43625n90083n65561m93103m21054m14631l59239
3417I828946l55857k91496l39530k37096k23146k27570j81402j61664j11623j46217
3407G553345p2594p9529o5771k4451L3874J87699J28591N4184j39993k37669k77612
3396G060074l09160k59165k06392j70596j11119m9441m4954o3705j09943j32054
3386E603545j16953j29095j37956k10015j55722j70286j01009j03711q5031o1785
$$ y = [6545652, 6836152, 7110879, 7409449, 7735076, 8071837, 8364812, 8678400, 8993043, 9322142, 9696628, 10151546, 10691001, 11294826, 11985286, 12770776, 13614558, 14548828, 15536888, 16552364, 17505649, 18331760, 18977183, 19275487, 19208837, 18804188, 18068057, 17139296, 16160798, 15169087, 14234364, 13416242, 12672617, 12082534, 11516973, 11023870, 10602816, 10188185, 9828946, 9473089, 9181593, 8842063, 8604967, 8381821, 8154251, 7972849, 7811185, 7699562, 7553345, 7480751, 7401222, 7335451, 7311000, 7344874, 7532573, 7661164, 7715348, 7575355, 7337686, 7060074, 6750914, 6491749, 6285357, 6114761, 6003642, 5954201, 5909247, 5845542, 5735599, 5603545, 5486592, 5357497, 5219541, 5009526, 4853804, 4683518, 4582509, 4478798, 4393767, 4331982]
3376D331982j7473k302m051N2902J12086L12101M88824M20229J32076j54024l62837
3365E309513l98057l84304l05849k34309j81693j24850l5632j4892m5290p824
3355C576813l20o6809n2256o8771o5429r1836o7605m8027n4261o7310k2562L28
3343B971955j8227J3843M0518M4291J56048K57245J78857K4216q4199j78661k08104
3332C197782j99128j41030j03822j02234o3804k9020l9363p6936m59m5571l8635
3321B357780m2356j4976q487m9606Q09j9785m1456k6487k6966k7878m2678l157
3309B054757l5751j6691k331P130l3830k2599k382j3685J546j6352l1699j6071
3297A872042k18r947n531j9941j9710J457L331j1886j9042o843J0197l2778j1735
$$ y = [4331982, 4314509, 4312207, 4308156, 4361058, 4473144, 4785245, 5274069, 5694298, 5826374, 5672350, 5309513, 4911456, 4527152, 4221303, 3986994, 3805301, 3680451, 3644819, 3629927, 3584637, 3576813, 3576493, 3509684, 3457428, 3388657, 3323228, 3231392, 3163787, 3115760, 3061499, 2994189, 2971627, 2971955, 2953728, 2967571, 3008089, 3052380, 3208428, 3465673, 3644530, 3668746, 3584547, 3405886, 3197782, 2998654, 2857624, 2753802, 2651568, 2587764, 2558744, 2519381, 2442445, 2441986, 2396415, 2357780, 2315424, 2300448, 2291961, 2242355, 2243164, 2223379, 2181923, 2155436, 2128470, 2100592, 2057914, 2054757, 2019006, 2002315, 1999984, 2007114, 1973284, 1950685, 1948303, 1934618, 1936164, 1919812, 1888113, 1872042, 1871824, 1861877, 1856346, 1836405, 1816695, 1818152, 1821483, 1809597, 1790555, 1783712, 1793909, 1761131, 1749396]
3284A749396k3400j969j1909p066j498j3825M871j7422L588o782k0438J0509j3765
3271A650290J0712J510m531k6443o932k0106k6723K1402j6803Q874p989j6878
3259A566383j1664k7317p736m780j4462k7330l949q262j4387n818k0327P175j6623
3246A410903N564L703k2509p513N90P480k6961k4568K3539P715j2434k9100P94
3233A337203j3631q415M08j9435k9755m9313J0424j9691J685n969j5659k331j7362
3220A168159j3849k007j4229P285r391j6400m056j502J4147K7116O191J6978j3947
3207A164495k0041j2777J054p612J4061m09J1787J0391p703k0616L55O902R402
3194A149289k0798K5517j1546J1569K7908n085J9125j1144L6702P202L15J7121
$$ y = [1749396, 1725996, 1724027, 1712118, 1705052, 1703554, 1689729, 1694600, 1677178, 1680766, 1673984, 1653546, 1664055, 1650290, 1661002, 1662512, 1657981, 1631538, 1624606, 1604500, 1577777, 1599179, 1582376, 1591250, 1583261, 1566383, 1554719, 1527402, 1519666, 1514886, 1500424, 1473094, 1469145, 1460883, 1446496, 1440678, 1420351, 1427526, 1410903, 1416467, 1420170, 1397661, 1390148, 1390738, 1398218, 1371257, 1346689, 1370228, 1377943, 1365509, 1336409, 1337203, 1323572, 1315157, 1315565, 1296130, 1266375, 1217062, 1227486, 1207795, 1209480, 1203511, 1187852, 1185521, 1168159, 1154310, 1152303, 1138074, 1145359, 1135968, 1119568, 1115512, 1114010, 1128157, 1155273, 1161464, 1178442, 1164495, 1144454, 1131677, 1132731, 1125119, 1139180, 1138771, 1150558, 1160949, 1153246, 1132630, 1132985, 1139887, 1149289, 1128491, 1154008, 1142462, 1154031, 1181939, 1176854, 1195979, 1184835, 1221537, 1228739, 1229054, 1246175]
3182A246175J6923J2225q059K1442k310K4242K2062L633L3410k6211M0016q733
3170A374815Q6036N9567M4449Q0918O1655M6782j1241j733o5714m9324k6470o584
3158A593156K1393l0816K2941J0454M3280m222O958K391k550M1430Q924J8706
3146A732045J7607K2614K3226L6019L3145K5959N5154P2851J05801O6163J04596
3135B295180J18645K8137L5616L3601m906K5194L5497N6014P8347N1369J25289
3124B877983J01890Q8782J23577R4214Q2518M7163Q2002N2647K7024J7849K0798
3113C616447l922K9349M4038L9829M7324M4157P9706O3169Q0900J22283J77122
3102D340402J77199J85797K21116K27090K64111K86766L28276L52210L78021L52996
$$ y = [1246175, 1263098, 1275323, 1267264, 1288706, 1286396, 1310638, 1332700, 1336333, 1369743, 1343532, 1383548, 1374815, 1460851, 1520418, 1564867, 1645785, 1707440, 1754222, 1742981, 1741248, 1675534, 1626210, 1599740, 1593156, 1614549, 1583733, 1606674, 1617128, 1660408, 1656186, 1663144, 1665535, 1662985, 1704415, 1713339, 1732045, 1749652, 1772266, 1795492, 1831511, 1864656, 1890615, 1945769, 2018620, 2124421, 2190584, 2295180, 2413825, 2441962, 2477578, 2511179, 2506273, 2531467, 2566964, 2622978, 2701325, 2752694, 2877983, 2979873, 3068655, 3192232, 3286446, 3368964, 3416127, 3498129, 3550776, 3577800, 3595649, 3616447, 3612525, 3641874, 3685912, 3725741, 3773065, 3817222, 3896928, 3960097, 4040997, 4163280, 4340402, 4517601, 4703398, 4924514, 5151604, 5415715, 5702481, 6030757, 6382967, 6760988, 7113984]
3092G113984L19093K23976M8426j03178k50710l56347l52395l49712k89313k06663
3082E797161j49364q6551j9252j6289O4705Q9060J27464J69800J47175K02633
3072F326542J73563J99597K00493K04431K33084J97815J50275J31317P666o5797
3062G758986r5243j68905j90771k41735l37387k95045l62231k85293k82435k15690
3052E284251j70500j41841n6871p170j1440L1000P4287P1186M8684M3860k0990
3041E144456r913o6392l9418j28607j65677j46710k23833k21680k52264k38717
3031C651245k09101k24682j45688j47224j37864j27869j22530q2949p6531o3194
3021B313613q3997m4541q5914m4992m8125k1606m6346m5878k2627l9061j8413
$$ y = [7113984, 7433077, 7657053, 7705479, 7602301, 7351591, 6995244, 6642849, 6293137, 6003824, 5797161, 5647797, 5561246, 5541994, 5525705, 5590410, 5679470, 5806934, 5976734, 6123909, 6326542, 6500105, 6699702, 6900195, 7104626, 7337710, 7535525, 7685800, 7817117, 7824783, 7758986, 7663743, 7494838, 7304067, 7062332, 6724945, 6429900, 6067669, 5782376, 5499941, 5284251, 5113751, 4971910, 4915039, 4907869, 4896429, 4927429, 5001716, 5072902, 5121586, 5165446, 5144456, 5134543, 5068151, 5028733, 4900126, 4734449, 4587739, 4363906, 4142226, 3889962, 3651245, 3442144, 3217462, 3071774, 2924550, 2786686, 2658817, 2536287, 2453338, 2376807, 2313613, 2229616, 2185075, 2099161, 2054169, 2006044, 1984438, 1938092, 1892214, 1869587, 1830526, 1812113]
3010A812113p5283n2026m0613p7650n6102n7650m6418m2645k4264n8615r649m8215
2998A222983k7583l0852m7424k1951m6390j3538m2086l4539Q659n4153j6999j6182
2986H79945k938l5529J3628k9241j7267J8120l2125J4548j9016J0887j458q169
2974G91385j9764l2158j6313k0412M210K127j5898j6434l2843k0768J0982o6383
2962E67731k0553l701j2040m010k0974j2197N779l04J2791m125j9432k015J6673
2949E03623k1485q480J721j8141j500N24m261j5801j0345m101k0395j5963j2923
2936C72473k1897L342r288J066L344m6700J6780j0694Q755l1789J4299l602j0000
2923B86089l167N778K839k1448J4337j9349j4850M880R521j0480N953P137K940
$$ y = [1812113, 1736830, 1684804, 1644191, 1566541, 1510439, 1452789, 1406371, 1363726, 1339462, 1280847, 1271198, 1222983, 1195400, 1164548, 1117124, 1095173, 1048783, 1035245, 993159, 958620, 967279, 913126, 896127, 879945, 877007, 841478, 855106, 825865, 808598, 826718, 794593, 809141, 790125, 801012, 799554, 791385, 771621, 739463, 723150, 702738, 706948, 709075, 693177, 676743, 643900, 623132, 634114, 567731, 547178, 543477, 531437, 527427, 506453, 494256, 500035, 499731, 512522, 508397, 488965, 486950, 503623, 482138, 473658, 475379, 457238, 455738, 456262, 452001, 436200, 425855, 421754, 401359, 385396, 372473, 350576, 353918, 344630, 345696, 349040, 302340, 319120, 308426, 317181, 285392, 299691, 296089, 286089, 282922, 288700, 291539, 270091, 284428, 265079, 250229, 255109, 264630, 254150, 260103, 267240, 270180]
2910B70180k2953L595p183j92m2884J7411k4343L530J2079m004n579j6385K1295
2897B04567M6l3930K9763j214k381k2102K0329o559K891J783J334m059k4239J9247
2883A85476K954j85K131l1393J2609l5575K0527L540p801J4719j4973K1451j4478
2870A59002n570R932J2239j9034J55J937K379j9700j2010J8654p071p38k576m203
2856A33396k4083K5322J9078k0164K538j0866L4030m3297K1001K553k9119j4683
2844I5706L275L9688l0224L734J0185j5561Q234P948J821k4112l748j581K8416
2831A23781k8169k041J8236k7943J6188J883j4689j694K2436J8565k3551j0114
2819I2888K8556o164L244L631N700j8793K1288j1009r847j9644j1823M0355j0403
$$ y = [270180, 247227, 250822, 243639, 243447, 200563, 217974, 193631, 197161, 209240, 205236, 199657, 183272, 204567, 204613, 170683, 200446, 199232, 196851, 174749, 195078, 188519, 191410, 193193, 194527, 190468, 166229, 185476, 188430, 188245, 190376, 158983, 171592, 136017, 156544, 160084, 152283, 167002, 152029, 173480, 159002, 153432, 163364, 175603, 156569, 156724, 158661, 161040, 141340, 129330, 147984, 140913, 140175, 137599, 133396, 109313, 134635, 153713, 133549, 136087, 125221, 159251, 115954, 136955, 139508, 110389, 95706, 98981, 138669, 108445, 112179, 122364, 106803, 115037, 122985, 124806, 100694, 96946, 95365, 123781, 95612, 93571, 111807, 83864, 100052, 101935, 87246, 85552, 107988, 126553, 103002, 92888, 121444, 115280, 118524, 122155, 127855, 109062, 130350, 119341, 109494, 89850, 78027, 118382, 107979]
2806A07979J5353q755J2694k6484j5142J6053k2164j0279L290J995P858O292J8300
2793A06990j8074J413n61n315m465J1253N41l162J3390j5124J583m0932Q318J9093
2779G4948o724J083J4421R191J1841j3551l1211J2283n938O443m93j5530J5316
2766G2079k320j5738l919J0188j3179N859J4993p085K0026P290j924j4529J4351
2753H6092j2872m481m471r390M334j3723r460P435P160o30n042k0580K7082K0726
2739G2180m2938Q49J173L189k0218J1050o375l866n82Q635O153k2798J0443K6914
2725D3809p741j8095K7726j7922M249J6518p453j7192k7178L1781n33j689k714
2712B3566K1251j1898j6741J8053k6857J5042O755L0956k2303k8710M9985m1963
$$ y = [107979, 123332, 114577, 127271, 100787, 85645, 101698, 79534, 69255, 72545, 74540, 82398, 88690, 106990, 88916, 90329, 89768, 84453, 79988, 91241, 91782, 88620, 102010, 86886, 88469, 47537, 55855, 74948, 68224, 69307, 83728, 92919, 104760, 91209, 59998, 72281, 66343, 72786, 72293, 56763, 72079, 69759, 54021, 50102, 60290, 47111, 52970, 67963, 60878, 80904, 88194, 86270, 71741, 86092, 73220, 68739, 64268, 54878, 59212, 45489, 36029, 43464, 50624, 49994, 44952, 24372, 51454, 72180, 29242, 30091, 31264, 34453, 14235, 25285, 18910, 15044, 14462, 23097, 29250, 6452, 16895, 43809, 36068, 17973, 45699, 27777, 32026, 48544, 41091, 23899, -3279, 28502, 27969, 26280, 23566, 44817, 32919, 16178, 34231, 7374, 22416, 29171, 60127, 37824, 9114, 59099, 17136]
2700A7136K5966p633q538l716o422K5371k6648j8752j3982M5291n2798Q702J8017
2687A994J807K330j299J0207k2881N775J6916R455r111j2956J5694j9406r957
2674a1432P114K2478l8960J2483O68k515M059O87p253N034k780J298J6214J0206
2660A7301Q21J934j004M298j1399k730k8553M275m216L4286l580l9683L1837K2206
2646B5793k897j8815K048L530j7217L363R232p130k7349M2696k9704j4199P913
2633b2736q865k18o263j361j2900J108K0172K3321k5376j139J6293l962j0454
2620c2380K3521m296k3303q046L6472l85m170N995J2887k2294J3650J065J3378
2607A2094n2887L1384J0633j4829j6173P468J4355k977j0493k443j7992L3590
$$ y = [17136, 43102, 35469, 26931, 23215, 16793, 42164, 15516, -3236, -17218, 28073, -24725, -16023, 1994, 3801, 6131, 4832, 15039, -7842, -2067, 14849, 24304, 15193, 2237, 17931, -1475, -11432, -4318, 18160, -20800, -8317, -7649, -10164, -6105, -5418, -12671, -7637, -10417, -9119, 7095, 17301, 18122, 20056, 19052, 23350, 11951, 9221, -19332, -15057, -19273, 15013, 11433, -28250, 3587, 25793, 22896, 4081, 6129, 9659, -7558, -4195, 5037, -2093, -29442, 13254, -16450, -30649, -22736, -31601, -31819, -38082, -39443, -52343, -51235, -31063, -7742, -33118, -34257, -17964, -21926, -32380, -8859, -13155, -36458, -44504, -8032, -8417, -12587, -6592, 6295, -15999, -2349, -1284, 12094, -40793, -9409, 1224, -13605, -29778, -22310, -7955, -10932, -21425, -23868, -41860, -8270]
2595h270J155j3743Q672L194N009j161r842J0690n910j3750J7834p007j8259Q027
2581b3361L180p136k9219J6859J65p355J4121Q779J4704J8539N03l0269O75p157
2567b6972J7976L996r620K9093R355K8107K1927J4712n11l9492j1902k2117K453
2554A7005N74R292k9140j989q361j2340J8785j4184J7302k7983K971J1039j3745
2541c0774Kr820J5725k9602K3061K64j3623O763N064J9191l9057K9537k002l83
2527b5654K199p23j442l7736Q8J2457r425Q149J2702K490N38J985J8806Q412m567
2512a1721j5516O304o565K634l852M842l529j755k6385J3089Q688K387k5153L2551
2498b3981k3649R350N104m103J5152L285K191O748j7486o072q180J717j4880R461
$$ y = [-8270, -7115, -20858, -12186, -8992, -3983, -5144, -14986, -4296, -10206, -23956, -6122, -13129, -31388, -23361, -20181, -27317, -56536, -39677, -39512, -46867, -32746, -23967, -9263, 9276, 9779, -20490, -19815, -26972, -8996, -5000, -14620, 14473, 23828, 51935, 73862, 88574, 88063, 48571, 36669, 14552, 17005, 17579, 26871, -2269, -4258, -12619, -24959, -6174, -20358, -3056, -31039, -28068, -17029, -30774, -30772, -40592, -24867, -54469, -31408, -31144, -44767, -38004, -32940, -13749, -52806, -23269, -25271, -25654, -23455, -24178, -25620, -63356, -63268, -50811, -60236, -52087, -39385, -36895, -36357, -34372, -15566, -7154, -11721, -27237, -20933, -27498, -24864, -28716, -23874, -27403, -29158, -55543, -42454, -33766, -31379, -56532, -23981, -47630, -38280, -33176, -37279, -22127, -18842, -16651, -9903, -27389, -33461, -41641, -39924, -54804, -45343]
2484d5343k0551J7055k618q415k051Q522L5979k4646J6000O22O851j6939Q673
2471b6861n383J5114l550j8546O193k6063J9316p788m34R371K8644j635k3184
2458c4806J4553j4797J1874l5721J5784J4927M431O262K8601K763m6258K6922
2446e465r850j4648J6686J675M312o652K3633R527j5331k045L495J4069n0757
2433c1351J0077N456p180j237o435P445j7571m73J3566J2679L490J3072P240k7136
2419a8358J20J8506j883o311O757J9795j4024J6186j1012o586j58k1436K2192
2406C788p406o51J4501Q194k6334p369K3615n778J2170o546K9824k3525N497k5405
2392e425J7634P339J3514J300l3126J6890L9816N80o165n455R116k3077K8672
$$ y = [-45343, -65894, -48839, -51457, -59872, -61923, -53401, -17422, -42068, -26068, -25446, -18595, -35534, -26861, -32244, -17130, -20680, -39226, -33033, -59096, -39780, -47568, -48002, -38631, -9987, -11622, -34806, -20253, -35050, -23176, -58897, -43113, -28186, -23755, -17493, 11108, 13871, -32387, -5465, -15315, -29963, -13277, -11602, -7290, -13942, 9691, 19218, 3887, 1842, 5337, 19406, -31351, -21274, -15818, -22998, -24235, -30670, -23225, -40796, -41269, -27703, -15024, -11534, 1538, 8778, -18358, -18238, 268, -1615, -7926, -1169, 18626, 4602, 20788, 9776, 3190, 3032, -18404, 3788, -3618, -4269, 10232, 18426, -7908, -15277, 8338, 2560, 14730, 8184, 38008, 14483, 19980, -5425, 12209, 19548, 33062, 34362, 1236, 18126, 57942, 58522, 52357, 46902, 56018, 32941, 61613]
2379F1613k9653J8605k6864l4M915o5J7402P282K3326l1491J1495k956K2329P073
2365H2977m750J1196l017J773j5370L0845k5410J9406K6504k0984J4608j8498
2353I9280J9935J0023J7646O455J2534K896N394J6851j3827K0341R893O625K0954
2340B35000r68K2194j1323J4730j4929o316J4073j6533M5435j899o136L6212p191
2327C02349J8411L3464L7846R694K6414K9194N4817K4735L9167N8830K7471L9446
2315G01838O6676K9670Q3365J43167K43282K55862K22213J25680M8660j77Q2476
2304B002712J48265K74068L16378M90715N52076P56209J216286K704485N228696
2295A3689890O591434L930719k49343l362872m926221m079284l088298k270102
$$ y = [61613, 31960, 50565, 23701, 23667, 28582, 28517, 45919, 53201, 76527, 45036, 56531, 53575, 75904, 82977, 78227, 89423, 86406, 88179, 72809, 103654, 78244, 97650, 124154, 103170, 117778, 99280, 119215, 129238, 146884, 153339, 165873, 168769, 174163, 191014, 177187, 197528, 207421, 214046, 235000, 234032, 256226, 244903, 259633, 244704, 238388, 252461, 235928, 281363, 279464, 273328, 309540, 302349, 320760, 354224, 392070, 401764, 428178, 457372, 512189, 536924, 576091, 634921, 662392, 701838, 768514, 798184, 881549, 1024716, 1267998, 1523860, 1746073, 1871753, 1920413, 1920236, 2002712, 2150977, 2425045, 2741423, 3232138, 3784214, 4540423, 5756709, 8461194, 13689890, 20281324, 24212043, 23962700, 20599828, 15673607, 11594323, 8506025, 6235923]
2287F235923j618758j119279p44374m75468l05595j85440j11751J907n5792j22448
2277A498925j40641j70571j28489j08549j01173p6430n8318q3254k9197l5451
2267E66852m0631j4120k5307m0291j9169k4188k2118j6232p376j7798l1179J201
2255C09644j2371k8878j6849k3875O030j0885o101P668l7467m998j5738m607k935
2242A58638j434l0742K0894j2026l6167J8321m0028K7066j455K4769J4311l3509
2230A08638O962k3052K3684l0855L3238p81n0801o022j6201K4768k5671N950o154
2217D3703j9665J9262r943L8514k0630J6789R893j4933p137Q775j6823k1528j2435
2204A3842k6309J5827o056K1286j984k8792J2963L2159o081k5810M4415K19j6512
$$ y = [6235923, 4617165, 3497886, 2753512, 2278044, 1972449, 1787009, 1675258, 1677165, 1621373, 1498925, 1358284, 1187713, 1059224, 950675, 849502, 773072, 714754, 631500, 602303, 566852, 526221, 512101, 486794, 446503, 427334, 403146, 381028, 364796, 357420, 339622, 308443, 309644, 297273, 268395, 251546, 227671, 233701, 222816, 216715, 224383, 186916, 181918, 166180, 161573, 158638, 157204, 126462, 147356, 135330, 99163, 117484, 77456, 104522, 103067, 127836, 142147, 108638, 115600, 92548, 116232, 85377, 118615, 117834, 67033, 61011, 44810, 69578, 43907, 49857, 43703, 24038, 43300, 33357, 71871, 51241, 68030, 77923, 62990, 55853, 64628, 47805, 26277, 13842, -12467, 3360, -2696, 18590, 16606, -12186, 777, 32936, 26855, 1045, 45460, 45679, 29167]
2191B9167l814n600L303q700M267q918j4548m364J3971j1768j3362J3427J0748
2178C809k8794Q622Q799m405J0134K318L675o492n965r030j3694j9489N397J3686
2164c1429k0830n789K0124J3065j0281q352J2057j0462L6302p456j0011k289q718
2151c4069J0616J589l8485Q598L610Q449K18o408J068k445J912J9864m921j9189
2137d9593j543L3254Q061o21r115j5251M299m328J6064R02j1793k3417J6352p846
2123d4575q191J5652K0403k4334K4229j1928k0860K0598J267k1071K28j0984L8900
2110b0666O588m4042o465K2596k4039j6636j947K6633P748L1084j5258J1046j4010
2097c7368K4128j4129l0663K3852P419k980n2355L2750n820j3506K1551p993P854
$$ y = [29167, 25353, 19753, 23056, 14356, 18623, 9705, -4843, -9207, 4764, -7004, -20366, -6939, 3809, -24985, -16363, -7564, -11969, -1835, 483, 4158, -2334, -8299, -17329, -31023, -50512, -45115, -31429, -52259, -58048, -37924, -24859, -35140, -43492, -31435, -41897, -5595, -13051, -23062, -25351, -34069, -23453, -21864, -60349, -51751, -48141, -39692, -39474, -45882, -44814, -47259, -45347, -25483, -30404, -49593, -51136, -17882, -9821, -10442, -19557, -34808, -30509, -34837, -18773, -17871, -29664, -53081, -36729, -44575, -52766, -37114, -16711, -41045, -16816, -28744, -49604, -29006, -27739, -48810, -48582, -59566, -20666, -14078, -58120, -64585, -41989, -66028, -82664, -84611, -57978, -50230, -19146, -34404, -23358, -37368, -13240, -27369, -58032, -34180, -26761, -29741, -82096, -49346, -55166, -68672, -47121, -55114, -47260]
2084d7260m365K0540Q149q340P406l05k703k4267K8527q733L827m805q162k1110
2070f1601R096j076q957J5302o669L373M869o568Q714p910J7938o66J505j8081
2056e0731r252K3289j4598J0440p599k0869M045J8015j9061J1079J865M677L3946
2043a4754j4683N03J979k1674K785J021J3431k0040J9281k0809J7166j7117J3984
2030c8927j07n409L4768J6253J9216J1655L1297k513k4566j5434k9230l4361j8251
2017e5609n71n12k9101J3506R986J3601k4592K0520J911n792P888n522r42K1252
2003c3977k4777J0106M134K123l3614P392L985K1148r43j8729L501l683J7199
1990d6135R263j176j1717J2378K3675l9113J38j0253l292R540m211J6216k4217
$$ y = [-47260, -51625, -31085, -22936, -31276, -23870, -24175, -26878, -51145, -22618, -31351, -27524, -32329, -40491, -61601, -52505, -53581, -62538, -47236, -53905, -50532, -45663, -52231, -43517, -51427, -33489, -34155, -32650, -50731, -59983, -36694, -51292, -40852, -48451, -69320, -65275, -47260, -66321, -55242, -53377, -48700, -14754, -29437, -28934, -26955, -48629, -45844, -44823, -31392, -51432, -32151, -52960, -35794, -52911, -38927, -39034, -44443, -9675, 6578, 25794, 37449, 68746, 66233, 41667, 26233, -2997, -37358, -55609, -56180, -56692, -85793, -72287, -62301, -48700, -73292, -52772, -50861, -56653, -48765, -54287, -55229, -33977, -58754, -48648, -44514, -42391, -76005, -68613, -64628, -43480, -44423, -63152, -59651, -63334, -46135, -36872, -38048, -49765, -37387, -13712, -52825, -52687, -62940, -66232, -56692, -60903, -44687, -68904]
1977f8904J1568j1501J0266j2360J1157J0338k224P71m39J0104j4032K2142k6105
1964e9219p612J1356R87n28r654k2690o660L2244k1854K6405k0498J3100J5705
1951d8918q896J5274l558J0526j721m200N74r857o038L297J1339k5959j8393K0537
1937f5993K8648j6728P616J3658m0026J6938J8733o427J423J6481j0706m17k9184
1924f5984J5572P903k3679K847M132j6437J5994j5083J1219l10j9222K1841j7328
1911g8535K2257J3747j7054k594k981J0779r09L546K210k2924J1010o513n568
1898g3529k8261K7264J8244m21J0068M979p747j3791r686K6295r564l503J5593
1885d4059N39m524l4886J3266p463K401J8975q058J4533k1141K0172O184p909
$$ y = [-68904, -57336, -68837, -58571, -70931, -59774, -49436, -51660, -50889, -51328, -41224, -55256, -33114, -59219, -66831, -55475, -54488, -55016, -64670, -87360, -94020, -61776, -83630, -57225, -77723, -64623, -48918, -57814, -42540, -46098, -35572, -37293, -41493, -40919, -50776, -56814, -53517, -42178, -68137, -86530, -65993, -37345, -54073, -46457, -32799, -72825, -55887, -37154, -43581, -42158, -25677, -36383, -36800, -65984, -50412, -42509, -66188, -63341, -59209, -75646, -59652, -74735, -63516, -63826, -83048, -61207, -78535, -56278, -42531, -59585, -62179, -65160, -54381, -55290, -51744, -49534, -72458, -61448, -67961, -73529, -101790, -74526, -56282, -56703, -46635, -41656, -49403, -63194, -72880, -46585, -56149, -59652, -44059, -43520, -48044, -82930, -69664, -77127, -74726, -55751, -63809, -49276, -70417, -50245, -44061, -51970]
1872e1970K3484j1611n223pK497k9291n997K2752j8899m896l839j822J6228p451
1858g6045P062l29J8351Q85M486L74k0881L6044j9892q342J0072j1692k6443Q474
1844g7876J5783j1423J441N470K5889l11l3970K5536k0283K5842n590l111L369
1831d9234n369K788j1693o627k1854K7947j0374l40N440O878Q405O984r227l1563
1817h7839L2409J0631j7950J3602J3852j2141k4768J894j667k368k0336O183j1910
1804a00408J8887J1953J2636k4157J4922L5695k2452q076P884j4805q087M034
1792g1974J2686j5164N381K3765K772l7232K1585K0264k9739O726K2685N699m5142
$$ y = [-51970, -28486, -40097, -45320, -45327, -42830, -72121, -78118, -55366, -74265, -79161, -83000, -84822, -68594, -76045, -68983, -69312, -50961, -50076, -45590, -45216, -66097, -30053, -49945, -58287, -48215, -59907, -86350, -77876, -62093, -73516, -72075, -66605, -40716, -41027, -74997, -49461, -69744, -43902, -49492, -52603, -49234, -54603, -51815, -63508, -70135, -91989, -64042, -74416, -74756, -69316, -62438, -54033, -47049, -56276, -87839, -55430, -44799, -62749, -49147, -35295, -47436, -72204, -70310, -71977, -74345, -94681, -88498, -100408, -81521, -69568, -56932, -81089, -66167, -30472, -52924, -61000, -53116, -67921, -76008, -71974, -59288, -74452, -69071, -45306, -42534, -79766, -58181, -37917, -67656, -60930, -38245, -32546, -77688]
$$ [...]
##END NTUPLES=NMR SPECTRUM
##END=
