##TITLE=1H_DE-80H_X3
 200.13MHz, d2o
 8 sc
 
 19ns.26.2.2025
##JCAMPDX= 6.0         $$ Bruker NMR JCAMP-DX V2.0
##DATA TYPE= NMR SPECTRUM
##DATA CLASS= NTUPLES
##ORIGIN= UXNMR, Bruker Analytische Messtechnik GmbH
##OWNER= pz
$$ XWIN-NMR		Version 3.5
$$ Tue Jan 13 10:47:06 2026 Russian Standard Time (UT+4h)  Yarkov@DPX200
##.OBSERVE FREQUENCY= 200.1313
##.OBSERVE NUCLEUS= ^1H
##.ACQUISITION MODE= SIMULTANEOUS
##.ACQUISITION SCHEME= undefined
##.AVERAGES= 8
##.DIGITISER RES= 18
##SPECTROMETER/DATA SYSTEM= spect
##.PULSE SEQUENCE= zg30
##.SOLVENT NAME= DMSO
##.SHIFT REFERENCE= (INTERNAL, DMSO, 0, 15.4968)
##AUDIT TRAIL= $$ (NUMBER, WHEN, WHO, WHERE, WHAT)
$$ ##TITLE= Audit trail, XWIN-NMR		Version 3.5
$$ ##JCAMPDX= 5.01
$$ ##ORIGIN= Bruker BioSpin GmbH
$$ ##OWNER= Yarkov
$$ C:/Bruker/XWIN-NMR/data/yarkov2/nmr/H-C/1/pdata/1/auditp.txt
$$ ##AUDIT TRAIL=  $$ (NUMBER, WHEN, WHO, WHERE, WHAT)
(   1,<2026-01-13 10:45:34.35 +0400>,<Yarkov>,<DPX200>,
      <created by zg, POWCHK disabled, PULCHK disabled
       configuration hash MD5:
       00 E9 B6 7A A2 85 ED C7 34 08 36 98 17 FE 4E 26
       data hash MD5: 16K
       B0 DE E8 A0 E1 E2 CD ED 94 B6 4F 6F 09 39 B0 5C>)
(   2,<2026-01-13 10:45:50.95 +0400>,<Yarkov>,<DPX200>,
      <Start of raw data processing
       efp BC_mod = 2 LB = 0.25 FT_mod = 6 PKNL = 1 PHC0 = -5301.897 PHC1 = 7.62193 SI = 16K 
       data hash MD5: 16K
       B2 79 58 A9 25 24 E2 A0 55 DC FA B6 40 A7 26 D6>)
$$ ##END=
$$ 
$$ hash MD5
$$ 59 7E 4F 8F FA 92 89 CF FD C5 0B DF 49 8E 6D 5C
##$RELAX= 
##$RELAX= 
##$RELAX= 
##$RELAX= 
##$RELAX= 
##$RELAX= 
$$ Bruker specific parameters
$$ --------------------------
##$DU= <C:/Bruker/XWIN-NMR>
##$EXPNO= 1
##$NAME= <H-C>
##$PROCNO= 1
##$TYPE= <nmr>
##$USER= <yarkov2>
##$AMP= (0..31)
100 100 100 100 100 100 100 100 100 100 100 100 100 100 100 100 100 100 
100 100 100 100 100 100 100 100 100 100 100 100 100 100 
##$AQSEQ= 0
##$AQ_mod= 1
##$AUNM= <au_zg>
##$AUTOPOS= <>
##$BF1= 200.13
##$BF2= 200.13
##$BF3= 200.13
##$BF4= 200.13
##$BF5= 200.13
##$BF6= 200.13
##$BF7= 200.13
##$BF8= 200.13
##$BYTORDA= 1
##$CFDGTYP= 0
##$CFRGTYP= 5
##$CHEMSTR= <none>
##$CNST= (0..31)
1 1 145 1 1 1 1 1 1 1 1 1 1 1 1 1 1 1 1 1 1 1 1 1 1 1 1 1 1 1 1 1 
##$CPDPRG= <>
##$CPDPRG1= <>
##$CPDPRG2= <>
##$CPDPRG3= <>
##$CPDPRG4= <mlev>
##$CPDPRG5= <mlev>
##$CPDPRG6= <mlev>
##$CPDPRG7= <mlev>
##$CPDPRG8= <mlev>
##$CPDPRGB= <>
##$CPDPRGT= <>
##$D= (0..31)
0 0.7 0 0 0 0 0 0 0 0 0 0.03 0 0 0 0 0 0 0 0 0 0 0 0 0 0 0 0 0 0 0 0 
##$DATE= 1768286733
##$DBL= (0..7)
120 120 120 120 120 120 120 120 
##$DBP= (0..7)
150 150 150 150 150 150 150 150 
##$DBP07= 0
##$DBPNAM0= <>
##$DBPNAM1= <>
##$DBPNAM2= <>
##$DBPNAM3= <>
##$DBPNAM4= <>
##$DBPNAM5= <>
##$DBPNAM6= <>
##$DBPNAM7= <>
##$DBPOAL= (0..7)
0.5 0.5 0.5 0.5 0.5 0.5 0.5 0.5 
##$DBPOFFS= (0..7)
0 0 0 0 0 0 0 0 
##$DE= 6
##$DECBNUC= <off>
##$DECIM= 32
##$DECNUC= <off>
##$DECSTAT= 4
##$DIGMOD= 1
##$DIGTYP= 9
##$DL= (0..7)
0 120 120 120 120 120 120 120 
##$DP= (0..7)
$$ [...]
##$SUBNAM2= <"">
##$SUBNAM3= <"">
##$SUBNAM4= <"">
##$SUBNAM5= <"">
##$SUBNAM6= <"">
##$SUBNAM7= <"">
##$SUBNAM8= <"">
##$SUBNAM9= <"">
##$SW= 18.0517328524113
##$SWIBOX= (0..15)
0 0 2 0 0 0 0 0 0 0 0 0 0 0 0 0 
##$SW_h= 3612.71676300578
##$TD= 16384
##$TD0= 1
##$TE= 0
##$TE2= 300
##$TE3= 300
##$TEG= 300
##$TL= (0..7)
0 120 120 120 120 120 120 120 
##$TP= (0..7)
150 150 150 150 150 150 150 150 
##$TP07= 0
##$TPNAME0= <>
##$TPNAME1= <>
##$TPNAME2= <>
##$TPNAME3= <>
##$TPNAME4= <>
##$TPNAME5= <>
##$TPNAME6= <>
##$TPNAME7= <>
##$TPOAL= (0..7)
0.5 0.5 0.5 0.5 0.5 0.5 0.5 0.5 
##$TPOFFS= (0..7)
0 0 0 0 0 0 0 0 
##$TUNHIN= 0
##$TUNHOUT= 0
##$TUNXOUT= 0
##$USERA1= <user>
##$USERA2= <user>
##$USERA3= <user>
##$USERA4= <user>
##$USERA5= <user>
##$V9= 5
##$VALIST= <valist>
##$VCLIST= <CCCCCCCCCCCCCCC>
##$VD= 0
##$VDLIST= <DDDDDDDDDDDDDDD>
##$VPLIST= <PPPPPPPPPPPPPPP>
##$VTLIST= <TTTTTTTTTTTTTTT>
##$WBST= 1024
##$WBSW= 4
##$XGAIN= (0..3)
0 0 0 0 
##$XL= 0
##$YL= 0
##$YMAX_a= 100720
##$YMIN_a= -63878
##$ZGOPTNS= <>
##$ZL1= 120
##$ZL2= 120
##$ZL3= 120
##$ZL4= 120
##$ABSF1= 0
##$ABSF2= 0
##$ABSG= 0
##$ABSL= 0
##$ALPHA= 0
##$AQORDER= 0
##$ASSFAC= 0
##$ASSFACI= 0
##$ASSFACX= 0
##$ASSWID= 0
##$AUNMP= <proc_1d>
##$AZFE= 0.1
##$AZFW= 0.1
##$BCFW= 0
##$BC_mod= 2
##$BYTORDP= 0
##$COROFFS= 0
##$CY= -3
##$DATMOD= 1
##$DC= 0
##$DFILT= <>
##$DTYPP= 0
##$F1P= 0
##$F2P= 0
##$FCOR= 1
##$FTSIZE= 16384
##$FT_mod= 6
##$GAMMA= 0
##$GB= 0
##$INTBC= 1
##$INTSCL= 3.241238e-09
##$ISEN= 128
##$LB= 0.25
##$LEV0= 0
##$LPBIN= 0
##$MAXI= 10000
##$MC2= 0
##$MEAN= 0
##$ME_mod= 0
##$MI= 1.114404
##$NCOEF= 0
##$NC_proc= -9
##$NLEV= 6
##$NOISF1= 3.799351
##$NOISF2= 2.8
##$NSP= 0
##$NTH_PI= 0
##$NZP= 0
##$OFFSET= 15.49681
##$PC= 1
##$PHC0= -5301.897
##$PHC1= 7.62193
##$PH_mod= 1
##$PKNL= yes
##$PPARMOD= 0
##$PSCAL= 0
##$PSIGN= 0
##$REVERSE= no
##$SF= 200.130004982727
##$SI= 16384
##$SIGF1= 3
##$SIGF2= 2
##$SINO= 0.751879
##$SIOLD= 32768
##$SREGLST= <19F.Aceton>
##$SSB= 0
##$STSI= 16384
##$STSR= 0
##$SW_p= 3612.71676300578
##$SYMM= 0
##$S_DEV= 0
##$TDeff= 16384
##$TDoff= 0
##$TI= <>
##$TILT= no
##$TM1= 0
##$TM2= 0
##$TOPLEV= 0
##$USERP1= <user>
##$USERP2= <user>
##$USERP3= <user>
##$USERP4= <user>
##$USERP5= <user>
##$WDW= 1
##$XDIM= 16384
##$YMAX_p= 473885243
##$YMIN_p= -2981365
$$ End of Bruker specific parameters
$$ ---------------------------------
##NTUPLES= NMR SPECTRUM
##VAR_NAME=  FREQUENCY,     SPECTRUM/REAL,   SPECTRUM/IMAG
##SYMBOL=    X,             R,               I
##VAR_TYPE=  INDEPENDENT,   DEPENDENT,       DEPENDENT
##VAR_FORM=  AFFN,          ASDF,            ASDF
##VAR_DIM=   16384,         16384,           16384
##UNITS=     HZ,            ARBITRARY UNITS, ARBITRARY UNITS
##FACTOR=    0.220516191357247, 1,           1
##FIRST=     3101.37665439342, 0,            0
##LAST=      -511.340108612359, 0,           0
##MIN=       -511.340108612359, -2981365,    0
##MAX=       3101.37665439342, 473885243,    0
$$ Real data points
##PAGE= N=1
##DATA TABLE= (X++(R..R)), XYDATA
$$ [...]
7108B620543J53873r1687j94500l18280L15712l81845j79474M01788Q05739l20099
7098B811770l26396J96277m9725l39718Q21528J130908m07430n95208l42124L03855
7088C203737k85000L36299k46289K62383n75307m1044Q55473k68507m67427m20419
7078B353899K51869o83500j21287N76439L80752L89536N10150k88013j59049j00189
7068C110607K49810k17106j64676L62541k19843K88392j81136K56495n4563k36051
7058C194470K0891k55998j18926L74266l72594j83853M1312K45419K19562q48061
7048B316488L37192P33438M98524K98024l89287M65498p39527n08328J56599P8107
7038C246728j5249j09271M42289l23759p162L09257Q49606o2322o08051k02218
$$ plain form
7108 2620543 2774416 2682729 2488229 2169949 2485661 2103816 1924342 2326130 3131869 2811770
7098 2811770 2485374 2681651 2631926 2292208 3113736 4244644 3837214 3242006 2899882 3203737
7088 3203737 2918737 3255036 3008747 3271130 2695823 2654779 3510252 3241745 2774318 2353899
7078 2353899 2605768 1922268 1800981 2377420 2758172 3147708 3657858 3369845 3210796 3110607
7068 3110607 3360417 3143311 2978635 3341176 3121333 3409725 3228589 3485084 3430521 3194470
7058 3194470 3215361 2959363 2840437 3214703 2842109 2658256 2699568 2944987 3164549 2316488
7048 2316488 2653680 3387118 3885642 4183666 3794379 4259877 3520350 3012022 3168621 3246728
7038 3246728 3231479 3122208 3564497 3240738 3233576 3542833 4392439 4330117 3722066 3519848
7028C519848M9599l93124l06062K43515k86349J24128N31445O97640q01814m8334
7018C330492P35237l22792j40569K31052L89158m1774J26766J39874p63209j53669
7008C530566R0698M35858k63445p67784L91160O6103j04390K33253k39414l27305
6998C045300J02863M58293o2620o30858M18145M86578l64828j29428P7736L2492
6988C433673q6291N9255M26212l05120k61340L75468M86823m37208m42393M62198
6978C711277l72837n95272J03865J41711k07815L17278O81748N71141r87570J20907
6968C484433Q79361m70321l90564l59788L51125p86183L31754J020650K02550
6959D263017M4951J51093N78228r37534p86377L30681r4463J89438K98765K08568
$$ plain form
7028 3519848 3569447 3176323 2870261 3113776 2827427 2951555 3483000 4180640 3378826 3330492
7018 3330492 4065729 3742937 3602368 3833420 4222578 4180804 4307570 4447444 3684235 3530566
7008 3530566 3621264 4057122 3793677 3025893 3417053 3483156 3378766 3612019 3372605 3045300
6998 3045300 3148163 3606456 3543836 2912978 3331123 3817701 3452873 3323445 3401181 3433673
6988 3433673 3347382 3406637 3832849 3527729 3266389 3641857 4128680 3691472 3249079 3711277
6978 3711277 3338440 2743168 2847033 2988744 2780929 3098207 3779955 4351096 3363526 3484433
6968 3484433 4363794 3893473 3502909 3143121 3494246 2708063 3039817 4060467 4263017
6959 4263017 4307968 4459061 5037289 4099755 3313378 3644059 3549596 3739034 4037799 4246367
6949D246367k6170m2861P7165K3016n45504J08269O0691j86488L68760n3317M13731
6938D443659K65579l52118k3438l20911k64373L9303Q84214j54133k09215K70994
6928D579561k83538J00890J21750k78388r1889m21143j29717M05563O3828Q55432
6918D922349Q7099l81047l34083m4108o1632l28471M45628P49976m19586o8326
6908D567799p47581K85260k64919N28036R03494o9213m90672L63870P06817l62977
6898E419914q56948J31859M62473r84397k50743J63929O79922k80957M15813O03700
6888E504565j91987k36912m62396n16922n9337K17140J96736J58163M95929O27691
6878E732670j34892j63761M76694n39094k31462l21522l90391k77139j57431P7613
$$ plain form
6949 4246367 4220197 4177336 4254501 4277517 3732013 3840282 3900973 3714485 4083245 4029928 4443659
6938 4443659 4709238 4357120 4333682 4012771 3748398 3787701 4671915 4517782 4308567 4579561
6928 4579561 4296023 4396913 4518663 4240275 4148386 3727243 3597526 4003089 4066917 4922349
6918 4922349 5009448 4628401 4294318 4250210 4188578 3860107 4305735 5055711 4636125 4567799
6908 4567799 3820218 4105478 3840559 4368595 5272089 5202876 4712204 5076074 5782891 5419914
6898 5419914 4562966 4694825 5157298 4172901 3922158 4086087 4766009 4485052 4900865 5504565
6888 5504565 5312578 5075666 4613270 4096348 4037011 4254151 4450887 4609050 5104979 5732670
6878 5732670 5597778 5434017 5910711 5371617 5140155 4818633 4428242 4151103 3993672 4071285
6868D071285N16614J31943K05355P66434n21980n08900K86946q5864j36008j03044
6858D622781k47056Q22473n61299L00304M28059j90997J06011m09121Q96770n39
6848E767386m73766K36982q0327l97169K35312m980N71940K24628M28841l32921
6838F175926o861K85657m02434m09910L06310K76494k0637M11617n2864L56299
6828F919597m43983j48286j20296n77363L1028J24148j2038L57055L62001J10800
6818F602663N20796J38228m29858l11432Q6047r4105M38656M06402m83513K20311
6808G094195K20891n83801k91212K64762K47923O7755m89193P89978M2742J5969
6798G380009J21414O46751k03301o59752L27382K16867K11409k89777Q74468K93797
$$ plain form
6868 4071285 4587899 4719842 4925197 5691631 5169651 4660751 4947697 4861833 4725825 4622781
6858 4622781 4375725 5198198 4636899 4937203 5365262 5174265 5280276 4871155 5767925 5767386
6848 5767386 5293620 5530602 5450275 5053106 5288418 5283438 5855378 6080006 6508847 6175926
6838 6175926 6169065 6454722 6052288 5642378 5948688 6225182 6204545 6616162 6563298 6919597
6828 6919597 6475614 6327328 6207032 5629669 5660697 5784845 5772807 6129862 6491863 6602663
6818 6602663 7123459 7261687 6831829 6520397 6606444 6512339 6950995 7357397 6873884 7094195
6808 7094195 7315086 6731285 6440073 6704835 6952758 7020513 6531320 7321298 7364040 7380009
6798 7380009 7501423 8148174 7944873 7285121 7612503 7829370 8040779 7751002 8625470 8919267
6788H919267M4615Q18624p32986k2132L2537L5528R02170M95308q6311K55863
6778A0662483N44382n35691l54578J30264l78085J87799P60200Q58601O65983
6769A2541358N04556L44349n38183J6050J31888J77790N60281M92636M55254R2421
6759A4778400J023367N29343m89425j62891k6935k03087l38827Q0833j6931l84401
6749A4789446Q5469m03409l26849q2519m69702o2750m18882j23259o44748k30769
6739A2112028J01259k49017M39189Q686l23190Q0683K99189n43966j26437M53408
6729A2251832j20781l24388k2133N8139J68592N09164p63758M26301J42069m6792
6719A2278245k21316M72257Q88764l33572P60769L99341j07131Q39617p0451J34217
$$ plain form
6788 8919267 8963882 9782506 9049520 9027388 9059925 9095453 9997623 10492931 10406620 10662483
6778 10662483 11206865 10671174 10316596 10446860 10068775 10256574 11016774 11875375 12541358
6769 12541358 13045914 13390263 12852080 12868130 13000018 13177808 13738089 14230725 14685979 14778400
6759 14778400 15801767 16331110 15841685 15678794 15651859 15448772 15109945 15190778 15173847 14789446
6749 14789446 14874915 14471506 14144657 14062138 13592436 13529686 13110804 12987545 12342797 12112028
6739 12112028 12213287 11964270 12403459 12412145 12088955 12169638 12468827 11924861 11798424 12251832
6729 12251832 12131051 11806663 11784530 11842669 12011261 12520425 11756667 12182968 12325037 12278245
6719 12278245 12056929 12529186 13417950 13084378 13845147 14244488 14137357 14976974 14906523 15040740
6709A5040740M14836m43210O64788M23656j95025O89076M10952O80490L11923
6700A7998226o09977L64332L22436N20078O83029K74742k05897M33074O48081
6691B0428124J75620M82966O10732l12206k5682J44721m31823r18474n39496j57008
6681A9457474p19190q47499K69583K46638M1637j22122o54226k34462m24286k09012
6671A6804535L05787l87185l65942R5010r990k17653J16221K91840m59763o4546
6661A6108314J9129L96373r2134j49487P79546j5952M03055J33696j096242N81200
6651A7067498K94383N28666m05753m7401Q5907o56766J8882N63922O02911J35961
6641A8188210k89127O16914L58656Q1071N5207M95161J74233m94940J23690M12231
$$ plain form
6709 15040740 15455576 15012366 15677154 16100810 15905785 16594861 17005813 17686303 17998226
6700 17998226 17388249 17752581 18075017 18595095 19278124 19552866 19346969 19780043 20428124
6691 20428124 20603744 21086710 21697442 21385236 21359554 21504275 21072452 20153978 19614482 19457474
6681 19457474 18738284 17890785 18160368 18407006 18448643 18326521 17672295 17437833 17013547 16804535
6671 16804535 17110322 16723137 16357195 16452205 16442215 16224562 16340783 16632623 16172860 16108314
6661 16108314 16127443 16523816 16431682 16282195 17061741 17045789 17448844 17582540 16486298 17067498
6651 17067498 17361881 17890547 17484794 17437393 17523300 16866534 16885416 17449338 18052249 18188210
6641 18188210 17899083 18515997 18874653 18955724 19010931 19506092 19680325 19185385 19309075 19721306
6631A9721306l43063J70208M49280q7798Q27422L60123N19387k85916K28932k75898
6621B1283983M488L36349m07727k73745Q40687k0950N76911M71700l38799P47047
6611B3219944N84914M3704n8003K71995Q69000K82158J14567j87377K75421L15956
6601B5732279M25804Q67889N87777O79064L25691L68723K00862M1205Q04506j24820
6591B9908980j4134Q02582K57089O98867R27822R76657L87868q2518P45283O06193
6581C5214689k15276Q25545J431015R1454Q69568Q92691R18638q948j16726P75167
6571D0677817J39231Q1726K65355J007047P427M47501R11800L13971M31661j34643
6561D4148893M1277L55209k81883K30074M63508M78842L43872j7759m08522k87397
$$ plain form
6631 19721306 19378243 19548451 19997731 19909933 20737355 21097478 21616865 21330949 21559881 21283983
6621 21283983 21288471 21624820 21217093 20943348 21784035 21763085 22339996 22811696 22472897 23219944
6611 23219944 23804858 23848562 23790559 24062554 24931554 25213712 25328279 25140902 25416323 25732279
6601 25732279 26158083 27025972 27613749 28292813 28618504 28987227 29188089 29229294 30033800 29908980
6591 29908980 29894846 30697428 30954517 31653384 32581206 33557863 33945731 33863213 34608496 35214689
6581 35214689 34999413 35824958 37255973 37347427 38216995 39109686 40028324 40019376 39902650 40677817
6571 40677817 40817048 40898774 41164129 42171176 42178603 42626104 43537904 43851875 44283536 44148893
6561 44148893 44190170 44545379 44263496 44493570 44957078 45435920 45779792 45762033 45353511 45066114
6551D5066114J7013J31256k76513J15535n25409m73810m29838j07318q98137o59916
6541D1958977r62071k68051k16036p77439j89225J67823q0190q26010J02279k73803
6531C8636254j004572l90357J41724j044734n57315O25576m86766q75321j91815
6522C4852674L86346m76785n90414K60611p72318k53684j99450l35927p76970
6513C2094083m61175n2802M03887N26822n88942l26237P0129j51808k66056L10718
6503C1558619j16328k64298L64851q1713K38887k80245P57278Q0267o10118J69945
6493C1817145r32899k97759k83625j7992L5997j001383L32544k8368J11731P6425
6483B9811816n58817J51168k65880q1885l32699o18384o91827N20446N06907j97643
$$ plain form
6551 45066114 45083127 45214383 44937870 45053405 44527996 44054186 43624348 43517030 42618893 41958977
6541 41958977 40996906 40728855 40512819 39735380 39546155 39713978 39633788 38807778 38910057 38636254
6531 38636254 37631682 37241325 37383049 36338315 35781000 36406576 35919810 35044489 34852674
6522 34852674 35239020 34762235 34171821 34432432 33660114 33406430 33206980 32871053 32094083
6513 32094083 31632908 31580106 31983993 32510815 31921873 31595636 31665765 31513957 31247901 31558619
6503 31558619 31442291 31177993 31542844 31461131 31700018 31419773 32177051 32257318 31647200 31817145
6493 31817145 30884246 30586487 30302862 30284870 30320867 29319484 29652028 29623660 29735391 29811816
6483 29811816 29252999 29404167 29138287 29056402 28723703 28105319 27413492 27933938 28440845 28243202
6473B8243202j41620K56454k1761j130160L14246m5916m86046m77518L92402n61156
6463B6342127p92948N35216R942m18435o22407k4110J07897k0968k41833j23324
6453B4751157n57629L55905L69965k19979o24709M85101J84589p16017p1858j24865
6443B3831660J094566l88679o11449N22898j06791m10193o12687j92497K96857
6434B3423685O38508k42642o858K16745O09097M10856n03472K69586L85594M93568
6424B5694667J16081J36148O84312j16125O8129K30206Q43704j72663J88893P4191
6414B7747543m27889K08949R12597p08060m83006N24530O98411J086702m07470
6405B9152307K67153O84200j64672N66220J075721N75270k05546L13460J049027
$$ plain form
6473 28243202 28101582 28358036 28336275 27206115 27520361 27474445 26988399 26510881 26903283 26342127
6463 26342127 25549179 26084395 26094337 25675902 25053495 25029385 25137282 25116314 24874481 24751157
6453 24751157 24193528 24549433 24919398 24699419 24074710 24559811 24744400 24028383 23956525 23831660
6443 23831660 24926226 24537547 23926098 24448996 24342205 23932012 23319325 23126828 23423685
6434 23423685 24062193 23819551 23812693 24029438 24638535 25049391 24545919 24815505 25201099 25694667
6424 25694667 25810748 25946896 26631208 26515083 26583212 26813418 27657122 27484459 27673352 27747543
6414 27747543 27319654 27528603 28441200 27733140 27250134 27774664 28473075 29559777 29152307
6405 29152307 29419460 30103660 29938988 30505208 31580929 32156199 31950653 32264113 33313140
6396C3313140Q20008K38830l03136N19271P256J28359M32778n94491j005896L25915
6386C3882034m07826k60065j084355j22863l97277j116785m87479p2399J84547
6377C0117532n03021o04785j69736q24539J93020q9573p21241l36636k64833o3177
6367B6733011m94J19001Q25536j94913m74798r5670o48783j56022O42783N23512
6357B7273163o11465M78879J159070M76182n29653j26747P26127P95988N02565
6348C0144109K58067O46021R03168N89442O27445J85998m528O64886J387855K65030
6338C5667493R77843Q56002K61646L8493j96013M58882K42799L01720J142208
6329C9751073J018293J043299Q45549R08011J009900J17949L2003M09411Q30661
$$ plain form
6396 33313140 34133148 34371978 34068842 34588113 34595369 34723728 35156506 34562015 33556119 33882034
6386 33882034 33474208 33214143 32129788 32006925 31609648 30492863 30005384 29932985 30117532
6377 30117532 29614511 29009726 28839990 28015451 28208471 28118898 27397657 27061021 26796188 26733011
6367 26733011 26732517 26851518 27677054 27482141 27007343 26911673 26262890 26106868 26749651 27273163
6357 27273163 26661698 27140577 28299647 28775829 28246176 28119429 28845556 29641544 30144109
6348 30144109 30402176 31048197 31951365 32540807 33168252 33354250 33349722 34014608 35402463 35667493
6338 35667493 36645336 37501338 37762984 37801477 37605464 38064346 38307145 38608865 39751073
6329 39751073 40769366 41812665 42658214 43566225 44576125 44694074 44726077 45135488 45966149
6320D5966149Q75235M15279Q23082J082756j72437O49596L44508q10020q10750
6311D8363398k65239n5408p46813L98383m61652Q77922O7033m41971J012849j15039
6301D8633463J30453N32752l08593M36694R92462M79829N8710K7216K42011K25706
6291E1450703J069864L45366j001865j58035n02257L569n18346N954Q0212o69171
6281E0105994K37566O48459l96709k83813r430r5912n45001m26085K40436q89635
6271D8585870j75615m87728j30505K43739l03756n47674r0522o52591l95881q19851
6261D5225486n484m17618n74272J72538m46235m48782l88770j25687l04866q09938
6251D1876372l39726q83658n07789J9835r72783l05273o8439j99245j86925n99934
$$ plain form
6320 45966149 46841384 47256663 48079745 49162501 48990064 49639660 49984168 49174148 48363398
6311 48363398 48098159 48042751 47295938 47694321 47232669 48110591 48177624 47735653 48748502 48633463
6301 48633463 48763916 49296668 48988075 49424769 50417231 50897060 50955770 50982986 51224997 51450703
6291 51450703 52520567 52865933 51864068 51706033 51203776 51207345 50688999 50694953 50775165 50105994
6281 50105994 50343560 50992019 50595310 50311497 50302067 50206155 49661154 49235069 49475505 48585870
6271 48585870 48410255 47922527 47792022 48035761 47732005 47184331 47093809 46441218 46045337 45225486
6261 45225486 45220002 44802384 44228112 44400650 43954415 43505633 43116863 42991176 42686310 41876372
6251 41876372 41536646 40652988 40145199 40165034 39192251 38886978 38818539 38619294 38432369 37832435
6241C7832435p75742j292183n07488m12721l30462n08314k03119j96965p69574
6232C2835867m91113n71241m72502n16800o36426o33409J96994O83173m76210
6223B9918333k46017p69153q4207n53751n87526j98486m30290o49481o74177j74207
6213B5551038K85041M03335j06365m39155n32846j52349p83186m70545M75552
6204B4230520J49086j12836n84610j64333O53741o24280Q2518j47254M39397l33196
6194B3588753k80782J06285n31590k34477K37946J60584k6125k89729L83729l8706
6184B3075888j41742K13742L246q22841n37644o41635Q79747k60995n69J073156
6174B2840353j40475K70095j20367O13678k49630k09182l35760k70930k25015
$$ plain form
6241 37832435 37056693 35764510 35257022 34844301 34513839 34005525 33802406 33605441 32835867
6232 32835867 32344754 31773513 31301011 30784211 30147785 29514376 29711370 30394543 29918333
6223 29918333 29672316 28903163 28818956 28265205 27677679 27479193 27048903 26399422 25725245 25551038
6213 25551038 25836079 26239414 26133049 25693894 25161048 25008699 24225513 23754968 24230520
6204 24230520 24379606 24266770 23682160 23517827 24171568 23547288 23629806 23482552 23921949 23588753
6194 23588753 23307971 23414256 22882666 22648189 22886135 23046719 23020594 22730865 23114594 23075888
6184 23075888 22934146 23147888 23151134 22328293 21790649 21149014 22028761 21767766 21767197 22840353
6174 22840353 22699878 22969973 22849606 23463284 23213654 23004472 22668712 22397782 22172767
6165B2172767N13821M84436J87260K68224M7564J58119J47300l16479m68932k95512
6155B2898568K43914M02429p255o70796R07009J319390l23717J04689M17806P2941
6145B5364978n62851J45947Q92264r36732K7699K45495K15898k11285m84361k59556
6135B4437496l4298m8681k62409o23814m25955j22561j27389o9698j26333O43928
6125B3240286M5649j94016J11591J26148Q2469l74397k17729j5411q17317k24826
6115B1762447P6577L721p9606J20625J85917m52330M06919p1577j234800m87498
6105B0230395r78777m29304o3275K12544O60252Q303o63790M77475m63999n0921
6095A8938903m61433m51158L02432K98656K44247O98344m5304r7984j46692J0680
$$ plain form
6165 22172767 22686588 23171024 23358284 23626508 23674072 23832191 23979491 23663012 23194080 22898568
6155 22898568 23142482 23544911 23537656 22866860 23773869 25093259 24769542 24874231 25292037 25364978
6145 25364978 24802127 24948074 25840338 24903606 24931305 25176800 25392698 25181413 24697052 24437496
6135 24437496 24403198 24354517 24092108 23468294 23042339 22919778 22792389 22722691 22596358 23240286
6125 23240286 23285935 23091919 23203510 23329658 23412127 23037730 22820001 22804590 21987273 21762447
6115 21762447 21839024 21842745 21763139 21883764 22069681 21617351 22024270 21952693 20717893 20230395
6105 20230395 19251618 18822314 18759039 18971583 19631835 19640138 18976348 19453823 18989824 18938903
6095 18938903 18477470 18026312 18328744 18627400 18871647 19569991 19524687 19426703 19280011 19290691
6085A9290691k37814j74908L25355L4984l17095P68212N45432m7505m36953l28135
6075A9422264r55k01454m02385K54156K81012n18834R5367R24821k12793m20157
6065A9221042K50039m26177L55687O41431L40344N6109l8563m5401m89808n62827
6055A9301876L52169K17480J6052j74025L12656j26410j8389o82914N25661p80019
6045A8944137j51023L90828J53623n21846J087400N43857j52139k11664j29386
6036A9953787n89452m16292O3534L78762K02526P557O51044j86359k28985K64224
6026B0100346m88856k93205k95708l1975N31812j91623l34945M79072O81394N78268
6016B0734580k32126M00502l14538j016150L47933K80792j78859L68249J420944
$$ plain form
6085 19290691 19052877 18877969 19203324 19238308 18921213 19689425 20234857 20187352 19750399 19422264
6075 19422264 19421309 19219855 18817470 19071626 19352638 18833804 18929171 19853992 19641199 19221042
6065 19221042 19471081 19044904 19400591 20042022 20382366 20438475 20399912 20354511 19864703 19301876
6055 19301876 19654045 19871525 19887577 19713552 20026208 19899798 19881409 19198495 19724156 18944137
6045 18944137 18793114 19183942 19337565 18815719 19903119 20446976 20294837 20083173 19953787
6036 19953787 19364335 18948043 19011577 19390339 19592865 19600422 20251466 20065107 19836122 20100346
6026 20100346 19611490 19318285 19022577 18990602 19522414 19330791 18995846 19474918 20156312 20734580
6016 20734580 20502454 20902956 20588418 19572268 19920201 20200993 20022134 20390383 21811327
6007B1811327o0321r9048k04410p379J7423n13539O78699M67296M38692P56427
5997B3285167J12646k04778J53711J46726o21316R3547M99496J352901k05308
5988B4612792L61185Q79358O72646l78029j42749J31353m22269O3125J464714
5979B7242126L37144O44155Q63187O75573P5469q94652J59123J039689M67434
5970C0609248L1362R77749J290941K75310L09345Q93766n93448p3683R85626J167404
5960C5873620j80754k83745J510570l26610j3290R31688M04434l40988M18350
5951C7993275P28627K2264l86384P46876O29658l84175O90033O54260K81931M12172
5941D1388537P45248L78679K88974L61131J015381N09529k49945N92523P94322
$$ plain form
6007 21811327 21751006 21651958 21447548 21440169 21457592 20944053 21622752 22090048 22528740 23285167
5997 23285167 23397813 23193035 23346746 23493472 22872156 22965703 23465199 24818100 24612792
5988 24612792 24973977 25853335 26525981 26147952 26005203 26136556 25714287 25777412 27242126
5979 27242126 27579270 28223425 29086612 29762185 29837654 28943002 29102125 30141814 30609248
5970 30609248 30640610 31618359 32909300 33184610 33493955 34387721 33794273 33720590 34706216 35873620
5960 35873620 35692866 35409121 36919691 36593081 36579791 37511479 37915913 37574925 37993275
5951 37993275 38721902 38744166 38357782 39104658 39734316 39350141 40040174 40694434 40976365 41388537
5941 41388537 42133785 42512464 42801438 43162569 44177950 44687479 44437534 45030057 45824379
5932D5824379K19743L15545R55421P44798K51864O21286N07067M89259J7677L12742
5922E0259781M18290P17519K30540J758702J810441l00888J111766J116078n31565
5913E6590664P8241N34245M81265K29065J499682J048684k73825Q79022R78430
5904F2045473O70713L1572j37525R63061P60199K09747Q51231Q42835M18394L66510
5894F7022210J504687Q67756k48038P26714J049739J30888L71118R92986P05217
5885G3123277K31065R39762R44147K68656j92897M77161Q03337J04868j20427
5876G6578949Q73679R3084o55969J066841P46054K6506m52193P85478R6617M42009
5866G9601055R51185L55760n1406O3020m5379J56840l86043m7278J519599j98714
$$ plain form
5932 45824379 46044122 46359667 47315088 48059886 48311750 48933036 49440103 49929362 49947039 50259781
5922 50259781 50678071 51395590 51626130 53384832 55195273 54894385 56006151 57122229 56590664
5913 56590664 56668905 57203150 57684415 57913480 59413162 60461846 60188021 61067043 62045473
5904 62045473 62716186 62747758 62610233 63573294 64333493 64543240 65394471 66237306 66655700 67022210
5894 67022210 68526897 69394653 69146615 69873329 70923068 71053956 71425074 72418060 73123277
5885 73123277 73354342 74294104 75238251 75506907 75314010 75791171 76594508 76699376 76578949
5876 76578949 77452628 77545712 76889743 77956584 78702638 78729144 78276951 79062429 79159046 79601055
5866 79601055 80552240 80908000 80856594 80919614 80874235 81031075 80645032 80597754 82117353 81918639
5856H1918639n94841Q22472R59421m02554o15982P90280m45524p0541L01961J54020
5846H2817351N72476J92922K43190L80523l85559L98937n05188j98937n25650
5837H2990065P1753J138154p55042K78048L16092m40728j14361l99943J25170
5828H3209208n00316K17011Q35415j077294N59250N65361L94167m69486p13493
5819H3019823R18445j71844j007816O17781L38784M29307N7740J131520K30518
5810H5564258o96797N42499J17003J50642J81008P85988J098400p61386J5162
5801H6996777K36241j98087j08185k18175K27625n3447k2968J166642m12220N63698
5791H8177901L26970N0539j27571q92676Q99538J76775n2819Q9731K36617k97404
$$ plain form
5856 81918639 81323798 82146270 83105691 82703137 82087155 82877435 82431911 82361370 82663331 82817351
5846 82817351 83389827 83582749 83825939 84206462 83820903 84219840 83714652 83515715 82990065
5837 82990065 83061818 84199972 83444930 83722978 84039070 83598342 83483981 83084038 83209208
5828 83209208 82708892 82925903 83761318 82684024 83243274 83808635 84202802 83733316 83019823
5819 83019823 83938268 83766424 82758608 83376389 83715173 84144480 84202220 85333740 85564258
5810 85564258 84867461 85409960 85526963 85677605 85858613 86644601 87743001 86981615 86996777
5801 86996777 87233018 87034931 86926746 86708571 86936196 86882749 86859781 88026423 87614203 88177901
5791 88177901 88504871 88555410 88427839 87535163 88434701 88611476 88558657 88648388 88885005 88587601
5781H8587601o86632Q7049K07327n43762k29352J99669k75740k02640l67993o01319
5771H6174208l36579o01582L95542l73201l67072q33963m76463k19840q69556
5762H2491494L62987m48657p55651m26567m46454o69207j356041k44482P0087
5753G8577509o00370k34513O48559q41548j327209j047823J62307j657444j023428
5744G2656040K63651n79886k82733n52809q4293p85127j089340m38966m57036
5735F8649501j150254q02415o20940k49515l24780k25801q4677j009833o62916
5726F3518370k96438q90633r48324q46735L84756m07904n58499l88649r90700
5717E8575244l45894k11474K94709p96531p66685j44946L36374j72313m97106
$$ plain form
5781 88587601 87900969 87988018 88195345 87651583 87422231 87621900 87346160 87143520 86775527 86174208
5771 86174208 85837629 85236047 85631589 85258388 84891316 84057353 83580890 83361050 82491494
5762 82491494 82854481 82405824 81650173 81223606 80777152 80107945 78751904 78507422 78577509
5753 78577509 77977139 77742626 78391185 77549637 76222428 75174605 75336912 73679468 72656040
5744 72656040 72919691 72339805 72057072 71504263 71419970 70634843 69545503 69106537 68649501
5735 68649501 67499247 66696832 66075892 65826377 65501597 65275796 65191119 64181286 63518370
5726 63518370 63221932 62331299 61382975 60536240 60920996 60513092 59954593 59565944 58575244
5717 58575244 58229350 58017876 58312585 57516054 56749369 56604423 56940797 56768484 56271378
5708E6271378l5884n62346o48363n539n4960m82819o4994L06366l74410n69432
5698E3778997J62270k393j065301o25524K71483n82448o2011R6779P39384k51755
5688E2459481j69679K81940n6716J07420j04550N34129P58059n50441O5460L31741
5678E3656844k66332K88554N02891N2330l60012m9805M86802L71638N50441j50091
5668E5083260K04811N69101j86739N35393K36039L14672J047422O76929O50689
5659E9131577J018381N62879k41778o007o1320P64750P10476J39833Q17331J11307
5649F2947429Q4250N97525N45526l938k81536j57970P30218J91069N08912R34604
5639F6096089o2659J42185L93371K16776K32412J18451M84928M94605p74514q4031
$$ plain form
5708 56271378 56235494 55673148 55024785 55019246 54964286 54481467 54416473 54722839 54348429 53778997
5698 53778997 53941267 53938874 52873573 52248049 52519532 51937084 51875073 51971852 52711236 52459481
5688 52459481 52289802 52571742 52515026 52622446 52517896 53052025 53810084 53259643 53325103 53656844
5678 53656844 53390512 53679066 54181957 54234287 53874275 53824470 54311272 54682910 55233351 55083260
5668 55083260 55288071 55857172 55670433 56205826 56441865 56756537 57803959 58480888 59131577
5659 59131577 60149958 60712837 60471059 60465052 60403732 61168482 61878958 62018791 62836122 62947429
5649 62947429 63031679 63629204 64174730 64170792 63889256 63731286 64461504 64652573 65161485 66096089
5639 66096089 66033430 66175615 66568986 66785762 67018174 67136625 67621553 68116158 67341644 67257613
5629F7257613M61314J31864k69612M27101k34897K34074L69354J1493p6600j117068
5619F7194636L23596K18777k15024O4912L20310o55331l70871K93959O27745n79641
5609F7223068R0467o9797p65937p54740P350n82311k99380J96135J47129o32380
5599F4559604q62256j42309j78746n66843k52351J96811p17212j91217r6676k5486
5589F1723319o68422p04488J73180o42531m09657P62093l12630o25415q79925
5580E8415524M7019M95036n07241M5831K47540o62276J60562O4797j80330j147714
5570E6978748m76363k78846q59244K4559N73631r7231q18594m65141M04307q89807
5560E4096019r50407R6190k16516m59785p07104Q3071P52498j044193l15739n4190
$$ plain form
5629 67257613 67718927 67850791 67581179 68008280 67773383 68007457 68376811 68388304 68311704 67194636
5619 67194636 67518232 67737009 67521985 67586897 67907207 67251876 66881005 67174964 67802709 67223068
5609 67223068 67313535 67243738 66477801 65723061 65730411 65148100 64848720 65044855 65191984 64559604
5599 64559604 63697348 63555039 63376293 62809450 62557099 62753910 62036698 61845481 61748805 61723319
5589 61723319 61054897 60350409 60523589 59881058 59471401 60233494 59920864 59295449 58415524
5580 58415524 58462543 58957579 58450338 58496169 58743709 58081433 58241995 58306792 58126462 56978748
5570 56978748 56502385 56223539 55364295 55388854 55962485 55865254 55046660 54581519 54985826 54096019
5560 54096019 53145612 53241802 53025286 52565501 51858397 51941468 52693966 51649773 51334034 51279844
5550E1279844j316032n84022r21225P9556q20232n73199K02230n23943l06868
5541D6516109k68002q43393q9097o36430r7590o69073n4276M09962m80470J08855
5531D3896595j44647L16039o00039p69969N62447j82647j4344l21045J16547N16760
5521D3375697k61847K98627M01884j52451j02182L90198O1901J48772j88110J395064
5511D5367553m32842n59302O02674M58143O37806M26470J372419J002165k05437
5502D8669649R05353J467603J4518J72536Q11944P04460j47446L14123R73117
5493E3885857L39797j93927l79475O7060m49525k42687M8174n30465l61920K70979
5483E2453868O7428N48232j00111L17851k16769r35457Q62146j54113k58154J03286
$$ plain form
5550 51279844 49963812 49379790 48458565 48538121 47717889 47144690 47346920 46822977 46516109
5541 46516109 46248107 45404714 45315617 44679187 44581597 43912524 43858248 44268210 43787740 43896595
5531 43896595 43751948 44067987 43467948 42697979 43260426 43077779 43063435 42742390 42858937 43375697
5521 43375697 43113850 43412477 43814361 43661910 43559728 43949926 44011827 44160599 43972489 45367553
5511 45367553 44934711 44375409 44978083 45436226 46074032 46500502 47872921 48875086 48669649
5502 48669649 49575002 51042605 51057123 51229659 52041603 52746063 52598617 52912740 53885857
5493 53885857 54225654 54031727 53652252 53719312 53269787 53027100 53075274 52544809 52182889 52453868
5483 52453868 52521296 53069528 52969417 53287268 53070499 52135042 52997188 52843075 52584921 52688207
5473E2688207R20675Q4567m25978O08977M7435m09779k32618L50966j30739m22398
5463E3079315M00084J29738j051164r85022m92448l55613n14268m37479Q59648
5454E0632791j027070j004478N51982N00638o42435m12233L37953J50290k79004
5445D8808434J077820J760627j51784Q56538R89851N14481j195536M4043K2925
5436E2727399L30776N66000M69686J529274L63659Q3401J317964j80462m17704
5427E6789993N44494J41961Q85741Q74711J436384Q21615J293520Q18671J483655
5418F5090745J264317J355499K341992J916798K015021L307185K661212K154963
5410H2107732J968593L109953L135595K164450K687637L933258L611036M432045
$$ plain form
5473 52688207 53608882 53693449 53267471 53876448 53923883 53514104 53281486 53632452 53501713 53079315
5463 53079315 53479399 53609137 52557973 51572951 51080503 50724890 50210622 49773143 50632791
5454 50632791 49605721 48601243 49153225 49653863 49011428 48599195 48937148 49087438 48808434
5445 48808434 49886254 51646881 51495097 52351635 53341486 53855967 52660431 52704474 52727399
5436 52727399 53058175 53624175 54093861 55623135 55986794 56070195 57388159 57207697 56789993
5427 56789993 57334487 57476448 58362189 59236900 60673284 61494899 62788419 63607090 65090745
5418 65090745 66355062 67710561 70052553 71969351 73984372 77291557 79952769 82107732
5410 82107732 84076325 87186278 90321873 92486323 95173960 99107218 102718254 107150299
5402A07150299M714513M799763N247750O292395P127902P110015P914056R209391
5394A59566084J0528736R374336R844810J0032338Q248064M342034K631638m67957
5386B14100083l683574o172558p224509q897009j0578626j1061481j1099743j0863291
5378A44519292j0084202r129114q883156p614151o584913o168505n848474m750835
5370H5455942m261492l983744l921208k907862k150802l162487k778936j801910
5362F0487501j239986j733778k270328r93815j760040k117252n36162r86468j000797
5353D7848875j095418k60633j275445j395888l61731n6416j044147j824668k19824
5344D0314705j61757p48263R1152K72774k99774q71821J0191k05608r55181m76921
$$ plain form
5402 107150299 111864812 116664575 121912325 128204720 135332622 142442637 150356693 159566084
5394 159566084 170094820 179469156 189313966 199346304 207594368 211936402 214568040 214100083
5386 214100083 210416509 204243951 197019442 188122433 177543807 166482326 155382583 144519292
5378 144519292 134435090 125305976 116422820 108808669 102223756 96055251 90206777 85455942
5370 85455942 81194450 77210706 73289498 70381636 68230834 65068347 62289411 60487501
5362 60487501 59247515 57513737 55243409 54249594 52489554 50372302 49836140 48849672 47848875
5353 47848875 46753457 46492824 45217379 43821491 43459760 43403344 42359197 40534529 40314705
5344 40314705 40152948 39404685 39495837 39768611 39468837 38597016 38607207 38401599 37446418 36969497
5334C6969497K85n481k01956k01050K68163k0539r43042l474l74454j87859L73714
5323C5673804r4296m62425K64551k04486N8544r5631m05317R4936M3931j0759
5313C4862852K04011M29798n71160r2524J440755m61357N9355k45672o9288o08773
5303C4947997l01174O66160j4577k47364k06489l15492J30612k60199Q94964J30306
5293C5424744m19498N45718L48063k64547l45134N8788p1067J63665j26240M26299
5283C5740791n0271R6210j42100P18435N88509k53649N4990K13360K09199r6796
5273C7078678j42570J263258K14751J99051N09684M8349O75104P87706n5971J87821
5263D0765861J2516P92083K09894P32598M71563M3751O59165M24426M58039Q17116
$$ plain form
5334 36969497 36969782 36964301 36762345 36561295 36829458 36808919 35865877 35862403 35487949 35300090 35673804
5323 35673804 35579508 35117083 35381634 35177148 35235692 35140061 34734744 34829680 34873611 34862852
5313 34862852 35066863 35496661 34925501 34832977 36273732 35812375 35871730 35626058 35556770 34947997
5303 34947997 34646823 35312983 35298406 35051042 34844553 34529061 34659673 34399474 35294438 35424744
5293 35424744 35005246 35550964 35899027 35634480 35289346 35348134 35277067 35440732 35314492 35740791
5283 35740791 35690520 35786730 35644630 36363065 36951574 36697925 36752915 36966275 37175474 37078678
5273 37078678 36936108 38199366 38414117 38613168 39122852 39171201 39846305 40634011 40578040 40765861
5263 40765861 40778377 41570460 41780354 42512952 42984515 43028266 43687431 44111857 44569896 45387012
5253D5387012Q58240Q17927M82893N75676M07630M79464L00817K82401J039427
5244E0631487P95941m7913Q54435R88984J58696L98643M44099O77214k92119O2265
5234E4671732K41200K79689J30897m01654L50825M24877N34210N70826M20698
5225E7223300K32962K5199L85577l3522l26669J29702O792L08654O9809N45313
5215E8567117J130940M5553K62181M75461m48723p92173j63985k57158J189992
5206F0009205K29733Q51944R7264M04355Q55690L17894O50776K32758p2199N051
5196F3582471J2090R28944Q48789N97404J466440J140400N46961N50198R81392
5187G0655089R79605L10766J847980J774919Q04723J231995J172722J884637J807135
$$ plain form
5253 45387012 46245252 47063179 47546072 48121748 48529378 49008842 49309659 49592060 50631487
5244 50631487 51427428 51379515 52233950 53222934 53381630 53780273 54224372 54901586 54609467 54671732
5234 54671732 54912932 55192621 55323518 54921864 55272689 55697566 56231776 56802602 57223300
5225 57223300 57456262 57481461 57867038 57833516 57506847 57636549 57643341 57951995 58021804 58567117
5215 58567117 59698057 59743610 60005791 60481252 60032529 59240356 59076371 58819213 60009205
5206 60009205 60238938 61090882 61188146 61592501 62448191 62766085 63416861 63649619 63577420 63582471
5196 63582471 63594561 64523505 65372294 65969698 67436138 68576538 69123499 69673697 70655089
5187 70655089 71634694 71945460 73793440 75568359 76373082 77605077 78777799 80662436 82469571
5178H2469571J761645J494220J339148J430359Q83613L45318R55157o55627J82702
5169I0206106m27251j597041j186960j713912j447422k324668k538430j917404
5161G7053018k456480k559634k450143j827647k546208k152353j688642j123865
5153F0248046n96666j943436j230073m18534j025249j106614m85762p42271j106974
5144E1592467j017517J20922j13013o89502J19696j087176m77097n7592l38047
5135D8053141l40499k17810K19814L04429L7246O37208K0980m98782L67697R48025
5125D9531449R40136n37538L15919Q48949J101214O75775N14829N52564J03434
5116E4046731p07189J20838J24133J285414M51207n37640O9059J8486L89581O49726
$$ plain form
5178 82469571 84231216 85725436 87064584 88494943 89378556 89723874 90679031 90023404 90206106
5169 90206106 89778855 88181814 86994854 85280942 83833520 81508852 78970422 77053018
5161 77053018 74596538 72036904 69586761 67759114 65212906 63060553 61371911 60248046
5153 60248046 59651380 57707944 56477871 56059337 55034088 53927474 53441712 52699441 51592467
5144 51592467 50574950 50695872 50582859 49893357 50013053 48925877 48448780 48391188 48053141
5135 48053141 47712642 47494832 47714646 48019075 48056321 48693529 48714509 48215727 48583424 49531449
5125 49531449 50471585 49934047 50249966 51098915 52200129 52875904 53390733 53943297 54046731
5116 54046731 53339542 53460380 53584513 54869927 55321134 54783494 54852553 54871039 55260620 55910346
5106E5910346M40968J127336J73127O69313O47990Q33283J252711n6597J639066
5097F2637543J331949J414838J685053O10418J087146J121325O66126K262376
5089G2816774J059476J208391J484648J663883K001778J376099J426019Q25499
5081H3862567J152667J494118P82380Q84790N67776P95190J032765L41676N49899
5072I1463828O57744r0758J82524r44834j84280k39885q52910j119554j081590
5063H7790285l85294j427897j618445j549407j437347j264657j042299o66442
5055G8398497j823639k088819k079934j670822j406128j430678j499101j052728
5047F5346648j085104j018143j376154j839791j319530j216299n95677j215316
$$ plain form
5106 55910346 56351314 57478650 57651777 58321090 58969080 59802363 61055074 60998477 62637543
5097 62637543 63969492 65384330 67069383 67679801 68766947 69888272 70554398 72816774
5089 72816774 73876250 75084641 76569289 78233172 80234950 81611049 83037068 83862567
5081 83862567 85015234 86509352 87291732 88176522 88744298 89539488 90572253 90913929 91463828
5072 91463828 92121572 92030814 92213338 91268504 91084224 90844339 89991429 88871875 87790285
5063 87790285 87404991 85977094 84358649 82809242 81371895 80107238 79064939 78398497
5055 78398497 76574858 74486039 72406105 70735283 69329155 67898477 66399376 65346648
5047 65346648 64261544 63243401 61867247 60027456 58707926 57491627 56895950 55680634
5039E5680634j479058j030993q03577o73466r91991r21049k52968n89472j267896
5030D7670164j107294q90181q3500q91907o96570m41603n55667P7739j114107
5021D1967074l31238j138434p53117k34466p12112m50321j89246J50512j01044
5012C8207608j185987k45418R117j094311l63464k34447l79717l45733n91032
5003C3776616P968n25991q49964k58745O16153r28391r78180M75540O50059j025139
4993C0959926L24561K67649m90359q32902j07664m29643n77021m233k7250K74239
4983B9357303n5320j04861k93695l61535k38986k34905m89519j18448l04677o50836
4973B6504521l86292l82430j98879j69511n42130q378q9255J39833K88312N03945
$$ plain form
5039 55680634 54201576 53170583 52367006 51693540 50701549 49780500 49527532 48938060 47670164
5030 47670164 46562870 45672689 45589189 44697282 44000712 43559109 43003442 43081181 41967074
5021 41967074 41635836 40497402 39744285 39509819 38797707 38347386 38158140 38308652 38207608
5012 38207608 37021621 36776203 36785320 35691009 35327545 35093098 34713381 34367648 33776616
5003 33776616 33784584 33258593 32408629 32149884 32766037 31837646 30859466 31335006 31985065 30959926
4993 30959926 31284487 31552136 31061777 30228875 30121211 29691568 29114547 29110314 29083064 29357303
4983 29357303 29301983 29197122 28903427 28541892 28302906 28068001 27578482 27460034 27155357 26504521
4973 26504521 26118229 25735799 25536920 25367409 24825279 24816901 24727646 24867479 25155791 25659736
4963B5659736l28625l9435j24190n63914n78244k49045l44380N49137J19058P13461
4953B4813559N40541j87527n63772p21156m21103m13586m47143M1676O7245K27684
4943B2936418J58322K97982j8514k14057K05255K0852m97446l14959J28070m54475
4933B2247448R3227L24480M0669P9529K55115L39524l88104k95969n66904k05043
4923B1923972l5367M18957j72808j13038k21900n44910j56010o6804o7975j43544
4913B0820573j84997n40085j55042J44909m47973m28725J38832p9290m6737O86810
4903A9908275l86717k98300n15843o1919n50595m15896J26885k118J7943j040139
4893A6781576k03024J63987N20839n4230j44215j136416o20967N9158O08976o81217
$$ plain form
4963 25659736 25331111 25291676 25167486 24603572 24025328 23776283 23431903 23981040 24100098 24813559
4953 24813559 25354100 25166573 24602801 23881645 23460542 23046956 22599813 22641489 22708734 22936418
4943 22936418 23094740 23392722 23374208 23160151 23365406 23386258 22888812 22573853 22701923 22247448
4933 22247448 22340675 22665155 22705824 22785353 23040468 23379992 22991888 22695919 22129015 21923972
4923 21923972 21888605 22307562 22134754 22021716 21799816 21254906 21098896 21032092 20964117 20820573
4913 20820573 20635576 20095491 19940449 20085358 19637385 19208660 19347492 19268202 19221465 19908275
4903 19908275 19521558 19223258 18707415 18645496 18094901 17679005 17805890 17803772 17821715 16781576
4893 16781576 16578552 16742539 17263378 17209148 17064933 15928517 15307550 15366708 15975684 15294467
4883A5294467J6146J51041l17885k73412n45034J83694j72023r64355O05653q4164
4873A3894128l40287l79915L19628n9183n71830J17082k88910k58475J42151j8370
4863A2556019L17446j55536J37766R1445p75902M30805M19669K51313l22903q26076
4853A2124046J9170M79416l7909L43574j94162j70452j48985O60790k40880m61039
4843A2373569N27923k74260K0306r4945m90722J42986j36484L78374j13813m14873
4833A1918061J25365J92597N75934L02676l04367Q1037k91810o92500O44652L36420
4823A2888065L43479N00719R4201O2628m36164o7792K84068l58647o98745P30526
4813A3342338M71133r10539J20709J404809m9370K96447j11436P29420M05244
$$ plain form
4883 15294467 15310613 15461654 15143769 14870357 14325323 14509017 14336994 13372639 13978292 13894128
4873 13894128 13553841 13173926 13493554 13434371 12862541 12979623 12690713 12432238 12574389 12556019
4863 12556019 12873465 12717929 12855695 12947140 12171238 12602043 13021712 13273025 12950122 12124046
4853 12124046 12143216 12622632 12584723 12928297 12734135 12563683 12414698 13075488 12834608 12373569
4843 12373569 12901492 12627232 12647538 12552593 12061871 12204857 12068373 12446747 12332934 11918061
4833 11918061 12043426 12236023 12811957 13114633 12810266 12891303 12599493 11906993 12551645 12888065
4823 12888065 13231544 13732263 13826464 13889092 13452928 13385136 13669204 13310557 12611812 13342338
4813 13342338 13813471 12902932 13023641 14428450 14379080 14675527 14564091 15293511 15698755
4804A5698755o58164O04944N017M860J69791r4176j5874N14112R41026M78098
4794A7648389J84555J66778P5254L52036L21838P81300K54190J60703j86469K22619
4784A9981193K95480N62823R05705O62469k4409N87956J84494l30507k59837L9726
4774B2605093Q46165O12346J04179J225031K84152M0289N08422N7088P6845o4212
4764B6295398n7804J64918J66670L70635O29511K03565J63777j6504M05922l99214
4754B7926874L51184M59934R2887l30606j1824K88135N3266o07950n4323j36453
4744B8031124n05779k34181k79620L68987m24694L576m85988j072160K38523M31871
4734B6071659p33043r88802j74830k22441p1355j46028n2368k82834j71618k55975
$$ plain form
4804 15698755 15040591 15645535 15650552 15655412 15825203 15731027 15715153 16229265 17170291 17648389
4794 17648389 17832944 17999722 18074976 18427012 18748850 19530150 19784340 19945043 19758574 19981193
4784 19981193 20276673 20839496 21745201 22407670 22383261 22971217 23155711 22825204 22565367 22605093
4774 22605093 23451258 24063604 24167783 25392814 25676966 25717255 26225677 26282765 26359610 26295398
4764 26295398 26237594 26402512 26569182 26939817 27569328 27772893 27936670 27920166 28326088 27926874
4754 27926874 28278058 28737992 28830879 28500273 28488449 28776584 28829850 28221900 28167577 28031124
4744 28031124 27525345 27291164 27011544 27380531 26955837 26959413 26473425 25401265 25639788 26071659
4734 26071659 25338616 24349814 24174984 23952543 23881188 23735160 23682792 23399958 23228340 22972365
4724B2972365m08692j096633o26962M02098K01164j01404L7446m67387o5076J7022
4714B0863941J40850l18324p54235M66556l15958m63945K83475R7164J39026j89599
4704A9948951k60908O0946O3175n32526J86484O3049m65378l84629n44278m00497
4694A7734389p05512k25609j56382j86471M60609L66283R0173n82686M50932K25631
4684A7471357j064028k95893K05135L98409p7945J06994O70699K78110j47129
4675A7545709L8907k20997l7663m31702L92774o2638J4063O4806J16344J78031
4665A7597634N44211J12319K55089k23507O08336Q1726j6681N59560L45309O07073
4655B0471069M79463m7995j85474l021O86818M26694J98923N29588p7517R97867
$$ plain form
4724 22972365 22563673 21467040 20840078 21242176 21443340 21341936 21379382 20911995 20846919 20863941
4714 20863941 21004791 20686467 19932232 20398788 20082830 19618885 19902360 19999524 20138550 19948951
4704 19948951 19688043 19748989 19812164 19279638 19466122 19529171 19063793 18679164 18134886 17734389
4694 17734389 17028877 16803268 16646886 16460415 16921024 17287307 17377480 16794794 17245726 17471357
4684 17471357 16407329 16111436 16316571 16714980 16637035 16744029 17414728 17692838 17545709
4675 17545709 17584616 17363619 17325956 16894254 17287028 17224390 17238453 17303259 17419603 17597634
4665 17597634 18141845 18254164 18509253 18285746 18894082 18975808 18959127 19518687 19863996 20471069
4655 20471069 20950532 20902537 20717063 20714042 21400860 21827554 22026477 22556065 22478548 23476415
4645B3476415J7858K31799M07839L51957N57685N1302R62564J430256J37472J797976
4635B9423123O01071J42600O38432M79888N05084O26711R30316J660210N22101
4626C5529536J006006J690820K114241R38253J006428J650232J496813K364022
4618D7796351K311518K239803K282687K910827K998044L020068L243482N023461
4610G1826241N438531O223059O119083O326692N779957N045580M982457N107807
4602A16849407O082749P727653Q161236P315544N609089M089121L606987L061586
4594A62503372L922880M918460M918085M211868J293265l00241k019384k344305
4586A77104000k702139k937382l287207l189031n105500n823438p107285p023614
$$ plain form
4645 23476415 23494273 23726072 24133911 24485868 25043553 25094855 26057419 27487675 27625147 29423123
4635 29423123 30024194 30166794 30805226 31285114 31790198 32416909 33347225 35007435 35529536
4626 35529536 36535542 38226362 40340603 41278856 42285284 43935516 45432329 47796351
4618 47796351 50107869 52347672 54630359 57541186 60539230 63559298 66802780 71826241
4610 71826241 77264772 83487831 89606914 95933606 101713563 106759143 111741600 116849407
4602 116849407 122932156 130659809 138821045 146136589 151745678 155834799 159441786 162503372
4594 162503372 166426252 171344712 176262797 180474665 181767930 181467689 179448305 177104000
4586 177104000 174401861 171464479 168177272 164988241 159882741 154059303 146952018 139928404
4578A39928404o414061p035452o102344o727456p018085p427295o506902o075348
4570H6621461o523579n266900n393583n324829m917329n477734m180480l232102
4562D6304925l746399k303132j876148j221125n97034j317750p20296k124483
4554C2398558j202179j472314k130458l32050p18115j23372p10380j01280P18713
4545B6327123r18541j31582p71919j228213j075479j182330l16632j033109L91592
4536B0060910J099375k07513M57468m91141m06619j534649o29460J77706p66812
4527A7759265n93480k57773J38875M05546j97532K66597M20980p67770k15939
4518A6958769m15169j84879M11402m54056L26627m3013m8830l32985k9103l26315
$$ plain form
4578 139928404 133514343 126478891 120376547 113649091 106631006 99203711 92696809 86621461
4570 86621461 80097882 74830982 69437399 64112570 59195241 53717507 49537027 46304925
4562 46304925 42558526 40255394 38379246 37158121 36561087 35243337 34523041 32398558
4554 32398558 31196379 29724065 27593607 27261557 26543442 26420070 25709690 25608410 26327123
4545 26327123 25408582 25277000 24505081 23276868 22201389 21019059 20702427 19669318 20060910
4536 20060910 21160285 20952772 21410240 20919099 20512480 18977831 18348371 18526077 17759265
4527 17759265 17165785 16908012 17046887 17452433 17254901 17521498 17942478 17174708 16958769
4518 16958769 16543600 16358721 16770123 16316067 16642694 16599681 16550851 16217866 16188763 15862448
4508A5862448L95559M98188K34643j49347n5013j226520n78676N12894L82278
4499A5876454L04759o38946O26715N41759k17799N22599j7526L23532J74089m13100
4489A7082536l36758k46309J29956P13392K66980K97294K83814N20538M69728
4480A9181171m87540N40540l88797O1802L06840P0870M5678l33881K94382L91650
4470A9682715M09963L40918M53985Q44753Q09332N69888m44733Q6294N89791O07686
4460B3950592Q5819J44188J015908J200650L87523P67401R05901N87254M23775
4451B9469011J309412R18366M37729K07720J507698J327912P49515Q54804J880376
4442C8662543J521721R35348R50478J698228R15590Q50595J326371K417793J792971
$$ plain form
4508 15862448 16258007 16756195 16990838 16841491 16786478 15559958 14981282 15494176 15876454
4499 15876454 16181213 15542267 16168982 16710741 16492942 17015541 16998015 17321547 17495636 17082536
4489 17082536 16745778 16499469 16629425 17342817 17609797 17907091 18190905 18711443 19181171
4480 19181171 18693631 19234171 18845374 18907176 19214016 19284886 19330564 18996683 19291065 19682715
4470 19682715 20092678 20433596 20887581 21732334 22541666 23111554 22666821 22753115 23342906 23950592
4460 23950592 24036411 24180599 25196507 26397157 26784680 27552081 28457982 29045236 29469011
4451 29469011 30778423 31696789 32134518 32342238 33849936 35177848 35927363 36782167 38662543
4442 38662543 40184264 41119612 42070090 43768318 44683908 45534503 46860874 49278667 51071638
4433E1071638J904915K338656K462736L118575K485410L136211L414535L760076
4425G3692752L940506L419132M033697M263498N267621N406780N736945P074204
4417A12835135P370122Q422438R612305J0727384J1813842J4605854J7638752
4410A93025832K2411268L0322233M1749688N7514319O8382947M6649707J3829249
4403D73885243o407415j6503131k1660568l1133735m4433393n0754180m8544035
4396B54448786m2110850l4278099k6023240j9829949j6563702j2859914r695576
4389I3087456q327676p598771o470005n001154m963867m906777k793112k710695
4381E0315399k893341k636430k233300k032512k237492j694092j196905j740045
$$ plain form
4433 51071638 52976553 55315209 57777945 60896520 63381930 66518141 69932676 73692752
4425 73692752 77633258 81052390 85086087 89349585 94617206 100023986 105760931 112835135
4417 112835135 120205257 128627695 138240000 148967384 160781226 175387080 193025832
4410 193025832 215437100 245759333 287509021 345023340 413406287 460055994 473885243
4403 473885243 467477828 450974697 429314129 398180394 353747001 302992821 254448786
4396 254448786 212337936 178059837 152036597 132206648 115642946 102783032 93087456
4389 93087456 84759780 77161009 70691004 65689850 60725983 55819206 53026094 50315399
4381 50315399 47422058 44785628 42552328 40519816 38282324 36588232 35391327 33651282
4373C3651282k266330j458963p61649k016027j044495o62314o38962n06406j421910
4364B2874226m33741r75067p90004l59570j011566p12347n47221o75943n96174
4355A6772593p26627J54168k23228p88668l09345p99457p17996o30450Q8477j049314
4345A1770153n85193K05121k6235j48650l80346p11024j18829p37537m51959M74088
4335I289589n61933o5560m00199n57004N6033q4213P72693l14101o87778m4685
4325G402842l38151r30777k98967L73078J97306p70995P29902J99492l41772n5261
4315F166697q9179N61008o95848j69335O4912m1230l72293N23724K0047m24169
4305E544334j069948R89802K88229n93723n5032M40160J22180n27470J63226J05997
$$ plain form
4373 33651282 31384952 29925989 29164340 27148313 26103818 25441504 24802542 24296136 22874226
4364 22874226 22440485 21465418 20675414 20315844 19304278 18591931 18044710 17368767 16772593
4355 16772593 16045966 16200134 15976906 15188238 14878893 14079436 13361440 12730990 12819467 11770153
4345 11770153 11184960 11390081 11363846 11215196 10834850 10123826 10004997 9267460 8815501 9289589
4335 9289589 8727656 8662096 8261897 7704893 7760926 7676713 8449406 8135305 7447527 7402842
4325 7402842 7064691 6133914 5834947 6208025 6405331 5634336 6364238 6563730 6221958 6166697
4315 6166697 6077518 6638526 5942678 5773343 5838255 5797025 5424732 5948456 5968503 5544334
4305 5544334 4474386 5464188 5752417 5158694 5103662 5543822 5666002 5138532 5301758 5407755
4295E407755r90456K02346n24142K49203L66946k22688J34206l22572K90994Q6184
4285D677776j63576R492n4274J94780n59641k56370Q43883j67786k23650J15317
4275D415951j57642J01720k21238L50301k00383q80444M28083n54552J43433j28479
4265C296750l05621O76893m88407M3602k51088l92915P69970q0618l00391m00709
4255B567466o06301O71922M1658J91433O4479k76744L49346j078995N65617l23950
4245B165931n1398R65741J14492J16154l62743n00486L09032Q0932Q05654j77693
4235C465616n89935j34406O0858M78588L90937K32693K05469L62786L92735n59363
4225D305978k80521j905Q6460L31932J29368Q54731L99533K9343P94578O28442
$$ plain form
4295 5407755 4417299 4619645 4095503 4344706 4711652 4488964 4623170 4300598 4591592 4677776
4285 4677776 4514200 4523692 4469418 4664198 4104557 3848187 4692070 4524284 4300634 4415951
4275 4415951 4258309 4360029 4138791 4489092 4288709 3408265 3836348 3281796 3425229 3296750
4265 3296750 2991129 3668022 3179615 3223217 2972129 2579214 3349184 3268566 2968175 2567466
4255 2567466 1961165 2633087 2674745 2866178 2930657 2653913 3003259 1924264 2489881 2165931
4245 2165931 2114533 3080274 3194766 3310920 2948177 2447691 2756723 2837655 3643309 3465616
4235 3465616 2875681 2741275 2802133 3280721 3671658 3904351 4109820 4472606 4865341 4305978
4225 4305978 4025457 4023552 4110012 4441944 4571312 5426043 5825576 5854919 6649497 7277939
4215G277939J800877J585480K199912L097857J243159J51993q98090j124627j080601
4206A4253899k029483j494123j392243k248937j299902j418247J49712k03251
4198D317425r92109M54034l59568n33084l35596K75168K3527k55888L79010q22523
4188B150396j172880k4868R7851j08728l93648K4536J072123j75848m75311M12198
4178A405821k44141l98978o60785R0554M09779p7023J80139n9305N50217k47372
4168I48906R766L07420n64790k47391j47022L42523k57250J86017J90619p1691
4158F97107n43231K1645L54285M7810J70674J65992k47497k29973K17528l66859
4148B87481j66541J16708p39490J2125N55442J94509M09948J7765J12444M03640
$$ plain form
4215 7277939 9078816 10664296 12864208 15962065 17205224 17357217 16459127 15334500 14253899
4206 14253899 12224416 10730293 9338050 7089113 5789211 4370964 4520676 4317425
4198 4317425 3325316 3779350 3419782 2886698 2551102 2826270 2849797 2593909 2972919 2150396
4188 2150396 977516 952648 1050499 941771 548123 572659 1644782 1468934 993623 1405821
4178 1405821 1161680 762702 101917 192471 602250 525227 705366 646061 1196278 948906
4168 948906 958672 1266092 701302 453911 306889 649412 392162 578179 768798 697107
4158 697107 153876 175521 529806 577616 748290 914282 666785 436812 654340 287481
4148 287481 120940 237648 -501842 -489717 65725 260234 670182 687947 800391 1204031
4138A204031n44687l78736O82225p11998j12303L0929R14261l61311j047856K29300
4128i6145O73061r4659m46004O08582K03351n85302L06103k70411J50842K81044
4118G30462J17556l22977j39135O6784L01472l0629l93354m84r4860l6913p6742
4107A21180K36464P93393P96206J31306N10630J52577j15156p49371l20790M21424
4097A977863m14049J79l85345J7978P5051M17007m2938o30246j26463N1334k85310
4086F55061m22199R512J09681J47409q8249l16741o3816L82663o33966n78075
4076g98720L1514K67836P79589l1311L02878j71276l57436Q8461j7802J12352
4066B06085m34115K56198P0087m58922M5217L47663j8417j18163l11523N12231
$$ plain form
4138 1204031 659344 280608 962833 250835 138532 169461 1083722 722411 -325445 -96145
4128 -96145 576916 482257 36253 644835 848186 262884 568987 298576 449418 730462
4118 730462 848018 525041 385906 452690 754162 723533 330179 329695 234835 197922 121180
4107 121180 357644 1151037 1947243 2078549 2589179 2741756 2626600 1877229 1556439 1977863
4097 1977863 1563814 1563993 1178648 1196626 1271677 1688684 1645746 1015500 889037 940371 655061
4086 655061 232862 242374 352055 499464 411215 94474 30658 413321 -220645 -798720
4076 -798720 -767206 -499370 280219 248908 551786 380510 23074 111535 93733 206085
4066 206085 -228030 28168 98255 -360667 -315450 32213 13796 -104367 -415890 96341
4056I6341l47586n15238M28518M05639J40707j64663L38878P56037p68105J49196
4046E19724J32900l25154k53981l06282N3559j11635J59099M31486j36004n7383
4036A06329m84224k33594M8070k38573L76246k45132j79698J93149q10805M71994
4026i96238R6494K37653n42544j50369P16303j3976m045l3930J33742N62517k97080
4015b91473R2752J91464o23794L61050m00673J68794J76377q0559M4227k39895
4005f01730M03607J06895R2092o62302m79672M87040j77115j76475N46073J02498
3995c59089r9776q31172M04729O66012m86151K57252m56205m07281M13147J93815
3985g04719J63838j8953j26056Q45080k50158J12540n80682l39713l51249N0787
$$ plain form
4056 96341 -251245 -766483 -337965 67674 208381 43718 382596 1138633 370528 519724
4046 519724 652624 327470 73489 -232793 -179234 -290869 -131770 299716 163712 106329
4036 106329 -377895 -611489 -563419 -801992 -425746 -670878 -850576 -657427 -1468232 -996238
4026 -996238 -899744 -662091 -1204635 -1355004 -638701 -652677 -656722 -690652 -556910 5607 -291473
4015 -291473 -198721 -7257 -631051 -270001 -670674 -501880 -325503 -406062 -361835 -601730
4005 -601730 -198123 -91228 864 -661438 -1141110 -654070 -831185 -1007660 -461587 -359089
3995 -359089 -458865 -1290037 -885308 -219296 -705447 -448195 -904400 -1311681 -898534 -704719
3985 -704719 -540881 -559834 -685890 159190 -90968 21572 -559110 -898823 -1250072 -1199285
3975a199285P80172J6175k00039M79847K08229k7035k81791L29942o1394K7909
3965G2730r1528m48680m70701M76059K36306K05173o27497k28674M71819J26121
3955b78872K53675k11549l26983M5014j97955J57031j32460L33187r8697m1006
3945d98615P10330j29115N63155J08505l91182o66397l78181K9891L09207m43362
3935g85764Q657j15058K71541P18833k86446l58418O24813m21096m18367J2174
3925g49131L11261m04166L01845O60486j31697j83646K99203r04749k82088q9688
3915a172370O68905K9030k33957J29926L39552j49482n2015N75854j90684k99860
3905c55101j9470k64178j73149R7309J65173O22699p96230k24228O53136k48284
$$ plain form
3975 -1199285 -419113 -402938 -602977 -123130 85099 58064 -223727 106215 44821 72730
3965 72730 -18798 -467478 -938179 -462120 -225814 -20641 -648138 -876812 -404993 -278872
3955 -278872 -25197 -236746 -563729 -518715 -716670 -559639 -692099 -358912 -457609 -498615
3945 -498615 211715 82600 645755 754260 363078 -303319 -681500 -651609 -342402 -785764
3935 -785764 -777107 -892165 -620624 98209 -188237 -546655 78158 -342938 -761305 -749131
3925 -749131 -437870 -842036 -540191 120295 -11402 -195048 104155 -800594 -1082682 -1172370
3915 -1172370 -503465 -474435 -708392 -578466 -238914 -388396 -440411 135443 -55241 -355101
3905 -355101 -374571 -638749 -811898 -714589 -549416 73283 -722947 -947175 -294039 -542323
3895e42323l53147P29410J9209j02358j66864R64288l53624r09250J90628M53321
3885g0710m4337k15909j10123N29504k41037L23677N09185r95965j52739k34735
3875g03189k03985j03823J5950O36652K88503j75266K42161L38803j13678l71490
3865a49362K16507K07303k69211J20403m40579J39401N25061k18819m43343J95383
3855a17256N78610K3090m78702l25743p8807K0883m23349l25089J39889o3833
3845a050307l59046N29123r0618L28969Q27061P67944l91544n95614L39174j94221
3835A10921r61302M600Q51155j10618p36829l8659Q6750k59460J308408k7516
3825B27450k22774r67242l7834P07766m64979l43856q217j54K94298J79360L14287
$$ plain form
3895 -542323 -895470 -166060 -146851 -249209 -416073 548215 194591 -714659 -524031 -70710
3885 -70710 -115047 -330956 -441079 88425 -152612 171065 680250 -315715 -468454 -703189
3875 -703189 -907174 -1010997 -995047 -358395 -69892 -245158 -2997 335806 222128 -149362
3865 -149362 67145 274448 5237 125640 -314939 -175538 349523 130704 -312639 -117256
3855 -117256 461354 484444 5742 -320001 -398808 -377925 -801274 -1126363 -986474 -1050307
3845 -1050307 -1409353 -880230 -970848 -641879 185182 953126 561582 -34032 305142 110921
3835 110921 -850381 -845781 5374 -105244 -842073 -880732 -793982 -1053442 254966 227450
3825 227450 4676 -962566 -1000400 -292634 -757613 -1101469 -1109686 -1109840 -815542 -636182 -321895
3814c21895L92586J85500K31728k99300p49754j1691J08770k43436n55389P60403
3804e02478L26881l20811M36932P41948J06483l57046j43776l52454n62678J48735
3794d78264L7467L04324R81439q8394K12099p86838l44113M87634n00600r3150
3784b68396N73607J10983o81920k68426M93100K27259N59414k8016J8903j78851
3774E57657n53789N31994l36994k46880L4197l29499J96036j74951J56323j06675
3764b72581k2953K9536P27895L35711j426m08295J51626O3527l82434K55313r00388
3753d24469j77695L04983L25629k23785q27128M96166j28617o59780J178293k62864
3743c99267Q2011l35630L76028L38356n20062O46300L13797n36923Q7072K4712
$$ plain form
3814 -321895 70691 256191 487919 188619 -561135 -572826 -464056 -707492 -1262881 -502478
3804 -502478 -175597 -496408 -59476 682472 788955 431909 288133 -64321 -626999 -478264
3794 -478264 -440797 -136473 844966 756572 968671 181833 -162280 325354 -175246 -268396
3784 -268396 305211 416194 -265726 -534152 -41052 186207 745621 717605 736508 557657
3774 557657 3868 535862 198868 -48012 -13815 -343314 -147278 -322229 -165906 -272581
3764 -272581 -295534 -265998 461897 797608 796182 387887 539513 603040 220606 475919 -424469
3753 -424469 -602164 -297181 28448 -195337 -1022465 -526299 -654916 -1314696 -136403 -399267
3743 -399267 -317256 -652886 -276858 61498 -458564 187736 501533 -35390 51682 76394
3733G6394M87489q4943n19366J07985r95187M72402P98522j90387n20028K65980
3723a01139L13610p74747L09767O80466r50024k96830k00910K44972J37937j0704
3713f47602J109078m12508o38615Q00330O74816p7244l86838j80585j57966r00069
3703h17203O35516k05640o4271L05690n6181O62799p40082O7375l5223k98908
3693e46128L06675p99154M99706J17271p89470R40914j28953Q8417o0455O73764
3683C02587M96982k82497K29970L40458q14887k69932k20750q4896K44096K35575
3673A76706K68642j87989N60957K31512p71528M2437q29810r2598p0291K8066
3663f43896Q76645l6252M74476J07870q68478L60317l83442N30791N1098l86082
$$ plain form
3733 76394 563883 478940 -40426 67559 -927628 -455226 343296 152909 -367119 -101139
3723 -101139 212471 -562276 -252509 427957 -522067 -818897 -1019807 -774835 -636898 -647602
3713 -647602 461476 48968 -589647 210683 885499 808255 421417 240832 82866 -817203
3703 -817203 -181687 -387327 -451598 -145908 -202089 460710 -279372 -211997 -247220 -546128
3693 -546128 -239453 -1038607 -538901 -421630 -1211100 -270186 -399139 -310722 -371177 302587
3683 302587 799569 517072 747042 1087500 272613 2681 -218069 -302965 -58869 176706
3673 176706 445348 257359 818316 1049828 278300 320737 -509073 -601671 -671962 -643896
3663 -643896 232749 196497 670973 778843 -89635 270682 -112760 418031 469129 83047
3653H3047P23661J28125p55880l38668M08070m39419q13483Q05672L72267m02384
3643b28992Q27447m6345J45042j155585j29947J302648o53282p2228K48070l63029
3633a26201N438K79156J394054j9582m86736m23986k67387j70035l47211o525
3623a69015O94453l11458K93783K28261l21233p01293m62779M26585J62881P2328
3613h7487N67435l38474N89948M57788N9419n74195l30306N00821L20840N37232
3603A703021O2417k36418P71376o73688k84648o36118p08619K73101R0869J16836
3593D78129p07479L45852Q51363k04567M04883J37495l04858j54917J30969K53971
3583A230841J2690K56557J74557n61042j10511J74973N3450l52669L17113K78083
$$ plain form
3653 83047 806708 934833 178953 -159715 248355 -191064 -1004547 -198875 173392 -228992
3643 -228992 598455 552110 697152 -458433 -588380 714268 60986 -11242 236828 -126201
3633 -126201 -120763 158393 1552447 1532865 1046129 622143 354756 184721 -162490 -169015
3623 -169015 525438 213980 507763 736024 414791 -286502 -749281 -322696 -159815 -87487
3613 -87487 479948 141474 731422 1189210 1248629 674434 344128 844949 1165789 1703021
3603 1703021 1765438 1529020 2300396 1626708 1342060 705942 -2677 270424 361293 478129
3593 478129 -229350 116502 967865 763298 1168181 1305676 1000818 845901 976870 1230841
3583 1230841 1243531 1500088 1674645 1113603 1003092 1178065 1231515 878846 1195959 1474042
3573A474042J89475K58416m03476M40837j50078l53253m56629O3912k63718J84740
3563I84268K57526M09967J34812q2263k35181j75425r631K66538m57106q8157
3553A005348O0178P46868M20155M20861k3790r2703q7394j89950k86194k24035
3543A749344l54122M26939j27181O27575L20082K76815k45868l49673Q53486m46400
3533B730997r58284K58173N8787K40170M81768M32028j06616K17951K58562L19343
3523C932879R6640k3283r2956Q4097J12935J32955N13172K78284J17484j43910
3513E008297L4425l26417j95406P40535P11798M5239p58707k67376P18909j50985
3503E560312M51364m18399j07640K15378L52045P09870J39512o52028N67011J32747
$$ plain form
3573 1474042 1663517 1921933 1518457 1959294 1809216 1455963 999334 1063246 799528 984268
3563 984268 1241794 1651761 1786573 1704310 1469129 1293704 1284073 1550611 1093505 1005348
3553 1005348 1065526 1812394 2232549 2653410 2629620 2536917 2449523 2259573 1973379 1749344
3543 1749344 1395222 1822161 1694980 2322555 2642637 2919452 2673584 2323911 3177397 2730997
3533 2730997 1772713 2030886 2089673 2329843 2811611 3243639 3137023 3354974 3613536 3932879
3523 3932879 4029519 4006236 3913280 3997377 4110312 4243267 4756439 5034723 5152207 5008297
3513 5008297 5042722 4716305 4520899 5261434 5973232 6018471 5259764 4992388 5711297 5560312
3503 5560312 6011676 5593277 5485637 5701015 6053060 6762930 6902442 6250414 6817425 6950172
3493F950172M17140o8007j5376Q48304N43313K47420j0538K85204M08720r23097
3483H683255M06336M05240P96173m1156L77816J074819J68358j22629N62461q8636
3473A2222037L6746k45042J04495R92650L53101J363041L59045o18155N95250
3464A5163168O01930O44305N61128R90196M44007J98598Q83551j70022J000604
3455B0317465J290810P65689J130900J245722J041793J022860R70947K049321
3447B9835507J018819J447405J271459O89501J127313l912k02753p17229j288468
3438C3177642n18158j610306j504141j601657k012050j185502j562006q22374
3430B2361448l41631q34508q97556j361157m03588p75392j135798j189689j142407
$$ plain form
3493 6950172 7367312 7299305 7283929 8132233 8675546 8922966 8912428 9197632 9606352 8683255
3483 8683255 9089591 9494831 10291004 10249848 10627664 11702483 11870841 11748212 12310673 12222037
3473 12222037 12258783 12013741 12118236 13110886 13463987 14827028 15186073 14567918 15163168
3464 15163168 15765098 16409403 16970531 17960727 18404734 18603332 19486883 19316861 20317465
3455 20317465 21608275 22373964 23504864 24750586 25792379 26815239 27786186 29835507
3447 29835507 30854326 32301731 33573190 34262691 35390004 35386092 35183339 34466110 33177642
3438 33177642 32659484 31049178 29545037 27943380 25931330 24745828 23183822 22361448
3430 22361448 22019817 21185309 20287753 18926596 18523008 17747616 16611818 15422129 14279722
3421A4279722l47358r88926m33698k87182o35217j57548j321199l63036o03950
3412I141608o72393j054631m46320P36292N05109K37248j87823n96749k95532
3403G366809l42869j121318N15325n51004o0453L23973p07766L98561L78263o90919
3393E508602p23059q54849K74633m88115n84826M70099Q6283L37013m4956M63959
3383D444784J04884r24756m61579J1769M24043k82072L6468L96999n8329m1943
3373C650268J69211n90656m88709k84342L33497K22675O1464P52684Q2282l84917
3363C523457m46069L38789J02540j91224M40611l18149J47432P78463l1367k42431
3353D102052l08647j74169J41765k37103L86350J88333J68410O13064q80187J1190
$$ plain form
3421 14279722 13932364 12943438 12509740 12222558 11587341 11429793 10108594 9745558 9141608
3412 9141608 8469215 7414584 6968264 7704556 8209665 8446913 8259090 7662341 7366809
3403 7366809 7023940 5902622 6417947 5866943 5806490 6130463 5422697 5821258 6199521 5508602
3393 5508602 4785543 3930694 4205327 3717212 3132386 3602485 3688768 4025781 3980825 4444784
3383 4444784 4549668 3624912 3163333 3175102 3599145 3317073 3353541 3750540 3692211 3650268
3373 3650268 3819479 3228823 2740114 2455772 2789269 3011944 3073408 3826092 3908374 3523457
3363 3523457 3077388 3416177 3518717 3327493 3768104 3449955 3597387 4375850 4344483 4102052
3353 4102052 3793405 3619236 3761001 3523898 3910248 4098581 4266991 4880055 3999868 4011058
3343D011058j068491o115L76431n74648M034J88170L49936L12345j101728J204672
3333C695664j25913o92249Q9933L36963L90192j96875P99931O20824M2073L27697
3323E288240o1761j36900k20471O0619O21453O0240Q54283N70032J59960K31276
3313G426971L00335L83871j92385Q7687J372926Q44678K778957L636602J662405
3304A8302047J70102l72042m7701m14381j579095j244142j937238j807904p83218
3295A0286428j7395o07262r55970q5303L11003r8401k02228N83146O83090k11045
3285I686063J01136K21928N6893j7764R55926N46651O95406K154373K813805K508751
3275A9723168M968773N743908K681792j267038j671423o31328j233396k458291
$$ plain form
3343 4011058 2942567 2936452 3312883 2738235 2742269 2930439 3280375 3592720 2490992 3695664
3333 3695664 3569751 2877502 2967435 3304398 3694590 3497715 4297646 4918470 4960543 5288240
3323 5288240 5226479 5089579 4869108 4929727 5551180 5611420 6465703 7035735 7195695 7426971
3313 7426971 7727306 8111177 7918792 8006479 9379405 10224083 13003040 16639642 18302047
3304 18302047 18472149 18100107 18052406 17638025 16058930 14814788 12877550 11069646 10286428
3295 10286428 10269033 9661771 8705801 8620498 8931501 8833100 8630872 9214018 9897108 9686063
3285 9686063 9787199 10009127 10066020 10048256 11004182 11550833 12246239 14400612 17214417 19723168
3275 19723168 24691941 30435849 33117641 31850603 30179180 29547852 28314456 25856165
3267B5856165l002262l236183k965589k833278j684507j260298j174306n32810
3259I166932q42619o02107o40010j43709k09137k27455N94945M62831K96657k90491
3249G565837o21971Q50280L92169P11545J455504J190592K054784K455305Q66215
3240A6920260m41420o42990J1281j521283j369912j322810k642269j937082j324489
3231E729286o79364l64076p08624l48640M39265r9254l59879j66528l85403m85824
3221B570959k06636M74414p8246j89154M98209M01446j358593l8114P39834r19892
3211A894227p04850M77798k55115K89408K12720J21962O5541l88356J29773n16722
3201A326386l52640n22602L55859P99993k40578M88481P62272q2543l69683k48308
$$ plain form
3267 25856165 22853903 19617720 16652131 13818853 12134346 10874048 9699742 9166932
3259 9166932 8324313 7722206 7082196 6938487 6729350 6501895 7096840 7559671 7856328 7565837
3249 7565837 6943866 7794146 8186315 8897860 10353364 11543956 13598740 16054045 16920260
3240 16920260 16478840 15835850 15847131 14325848 12955936 11633126 8990857 7053775 5729286
3231 5729286 5049922 4685846 3977222 3628582 4067847 3968593 3608714 3442186 3056783 2570959
3221 2570959 2364323 2838737 2760491 2571337 3069546 3470992 2112399 2074285 2814119 1894227
3211 1894227 1189377 1667175 1412060 1701468 1914188 2036150 2101691 1713335 1843108 1326386
3201 1326386 973746 451144 807003 1606996 1366418 1854899 2617171 2534628 2164945 1916637
3191A916637J53751j338087K24735P16898K97606J57618L64025M67100n56932
3182B403351p73127j67789n55514k39721J109855j96319n4069J05760P36986m46217
3172A923196n57179P52213J25438o08315P32245M94822N36969j28200K76968K68427
3162C816584j523311j23934r6813j36767q3165J105354N76223n84528M91330L12874
3152C753847k05810m26623q22663K59711J55417l7593J884517N32831P66273L47972
3142F207879j31259l95590q52170p401N69071J30805O76829M48170J085029J58536
3132G889899J96173l99248l95036J041214J095102P38505J37949P02622J536346
3123A2543526m47738l13389M47695k68519N83111L9342R39062M91233q8369L8974
$$ plain form
3191 1916637 2070388 732301 957036 1673934 1971540 2129158 2493183 2960283 2403351
3182 2403351 1630224 1462435 906921 667200 1777055 1580736 1526667 1632427 2369413 1923196
3172 1923196 1366017 2118230 2243668 1635353 2367598 2862420 3399389 3271189 3548157 3816584
3162 3816584 2293273 2169339 2072526 1935759 1852594 2957948 3534171 2949643 3440973 3753847
3152 3753847 3548037 3121414 2298751 2558462 2713879 2676286 4560803 5093634 5859907 6207879
3142 6207879 6076620 5681030 4828860 4821459 5390530 5521335 6198164 6646334 7731363 7889899
3132 7889899 8086072 7686824 7291788 8333002 9428104 10166609 10304558 11007180 12543526
3123 12543526 12095788 11782399 12230094 11961575 12544686 12584028 13523090 14014323 13925954 13964928
3113A3964928j33605q32780J65795l47621M11020p07641J265034J166966j08537
3104A4843559N43358j11712K38376M9297K22911J228327N84348J906878J823605
3095B1328947J537677Q49138k86004l15173j114803j737303j343879j883755j197495
3086A5837350j302463m09159l60330j043310q66298j95273n38730o86339q35934
3077I599514k72942J02013j91488J39747n29055N49291L08365m36313q9597O46882
3067I826417P43607l40032l39709N95714q74257k84156n98102j35084o87203k25658
3057G681537j82049n35853p29465l51489p55734r93763o65949o71675j55441o04242
3047B035877K64866L87499L67481K40257l56316M15904l71163k3827o24960n73287
$$ plain form
3113 13964928 13831323 12998543 13164338 12816717 13227737 12520096 13785130 14952096 14843559
3104 14843559 15386917 15275205 15513581 15562878 15785789 17014116 17598464 19505342 21328947
3095 21328947 22866624 23715762 23429758 23114585 21999782 20262479 18918600 17034845 15837350
3086 15837350 14534887 14125728 13765398 12722088 11855790 11660517 11121787 10435448 9599514
3077 9599514 9326572 9428585 9237097 9376844 8847789 9397080 9705445 9269132 9179535 9826417
3067 9826417 10570024 10229992 9890283 10485997 9611740 9327584 8729482 8594398 7907195 7681537
3057 7681537 7499488 6963635 6234170 5882681 5126947 4133184 3467235 2795560 2640119 2035877
3047 2035877 2300743 2688242 3055723 3295980 2939664 3355568 2984405 2960578 2335618 1762331
3037A762331R2586k59763j40241k359m5187J71244J25070q46995q818N55031n90762
3026H12137m16131k41480l51400p8011Q829Q5575N25911K43040J48297j23985
3016F12782k87308o3182P1930L12580P5969p79627L83567M50442n05567j69010
3006A02576q5242K50957K35795m17472k09927M27068l44292m05397k78486m69052
2996a193472R8999K20887R354O88174L76165n4216k22605L30697k87515L85603
2986C52071j0881k30742k35409K69213j63706m75020K280Q0487j53779L8404N29815
2975B733M7370m15248m15668j51706M78592j8593j55000M54223k86555J61839
2965b98013J43705r657P2368k46047L36428m32658n29374M49351l12223m17548
$$ plain form
3037 1762331 1854917 1595154 1454913 1452554 1407367 1578611 1703681 856686 847868 1402899 812137
3026 812137 396006 154526 -196874 -274885 -266056 -180481 345430 588470 736767 612782
3016 612782 325474 262292 334222 646802 722771 -56856 326711 777153 271586 102576
3006 102576 17334 268291 504086 86614 -123313 303755 -40537 -445934 -724420 -1193472
2996 -1193472 -1094473 -873586 -864232 -176058 200107 145891 -76714 253983 -33532 352071
2986 352071 341190 110448 -124961 144252 -19454 -494474 -492194 -411707 -565486 -527082 2733
2975 2733 50103 -365145 -780813 -932519 -453927 -472520 -627520 -173297 -459852 -298013
2965 -298013 -154308 -163965 -91597 -337644 -1216 -433874 -963248 -513897 -826120 -1243668
2955a243668N59175K01076J62483L23872l59491J10551L70954r3449l61325o09388
2945i39210n09013n94912N27711K65059L34356R7324O29626L67064o4426j90165
2935g6586l39023j004m16915j79094p4506q5920M45714R10963l85097L84181j080731
2924h98018J40713j30345k95155J22909k11754M90954P52437L7055k37458k38093
2914d66755n60221j63109O19644J61659J47465l6377K25060j43683k40424l51270
2904h08011n43337l01648M1808O18254Q7446K00335L67954K53018M0493l88789
2894d32477k54292n56389j34148n15206M90576L61728j32103P79243P52757m03296
2884d3607m82572Q4408k15307l49900l44759O94127K33755M02995K01817O5673
$$ plain form
2955 -1243668 -684493 -483417 -320934 2938 -356553 -246002 124952 31503 -329822 -939210
2945 -939210 -1448223 -2043135 -1515424 -1250365 -916009 -818685 -189059 178005 113579 -76586
2935 -76586 -415609 -416613 -833528 -1012622 -1087128 -1173048 -727334 183629 -201468 182713 -898018
2924 -898018 -757305 -887650 -1182805 -1059896 -1271650 -780696 -28259 8796 -228662 -466755
2914 -466755 -1026976 -1190085 -570441 -408782 -261317 -297694 -72634 -216317 -456741 -808011
2904 -808011 -1351348 -1652996 -1611188 -992934 -905488 -705153 -337199 -84181 -43688 -432477
2894 -432477 -686769 -1243158 -1377306 -1892512 -1401936 -1040208 -1172311 -393068 359689 -43607
2884 -43607 -526179 -441771 -657078 -1006978 -1351737 -657610 -423855 -20860 180957 246630
2874B46630J25001n96396n84432k44942m59358K84270J85128O84241J16465J39465
2864a03928k42449j60218j23902j3640q15681Q26180Q51862K02837N0449n19730
2854d8220l79562m80537l22793Q7744o10111K07230M41650R10599K41693K54196
2844C01889L54342r54236n89935j22097p3554l12804K58846N38080L46448N31070
2834B78049K53692m69703m67527q6667K55702k38389p27934J73627J79676k25247
2824a074721N2663m06627O56100l85202J23575o8655k50030P07411J18247n25716
2814a052955M06513O2622j27026n08584o7058L65208K501L89723K13588L2793
2804b82675j11562j115240J66222q6960j79474M66030P93448K19766l9609N94106
$$ plain form
2874 246630 371631 -224765 -809197 -1054139 -1513497 -1229227 -1044099 -359858 -243393 -103928
2864 -103928 -346377 -506595 -630497 -644137 -1459818 -633638 218224 421061 471510 -48220
2854 -48220 -427782 -908319 -1231112 -1143368 -1753479 -1546249 -1104599 -194000 47693 301889
2844 301889 656231 -298005 -887940 -1010037 -1083591 -1396395 -1137549 -599469 -253021 278049
2834 278049 531741 62038 -405489 -492156 -236454 -474843 -1202777 -1029150 -849474 -1074721
2824 -1074721 -1022058 -1428685 -772585 -1157787 -1034212 -1102867 -1352897 -645486 -527239 -1052955
2814 -1052955 -646442 -583820 -710846 -1219430 -1286488 -921280 -918779 -529056 -315468 -282675
2804 -282675 -394237 -1509477 -1343255 -1430215 -1609689 -1143659 -350211 -130445 -170054 424052
2794D24052R9329r36043m32826O2863l52833j38697k99094J126796M91418J25455
2784A70420L1279J00395l1485k75417j09844k32762k27500M54211l67784K10370
2774b78117L97337k63931o71354l98928q9534k10878M708K37344j59558K56755
2764a176156M70842j09713l59482K12542N32339o52705m09407O89990M96387j4784
2754c20147K33555k95938j00242k47988m36126K62311o22571j21020O44697K14964
2744g88505j6899r01020l3630M40770m17177p4787K43762P57099m62284j8560
2734a271231O37160M06768j23667n77633K61444J11152j61699K18315J71122j00030
2724d28299R7913r7244M42013m27432q0545k30932l73718j52058j72264N12620
$$ plain form
2794 424052 523381 -412662 -845488 -782625 -1135458 -1274155 -1573249 -446453 44965 170420
2784 170420 201699 302094 270609 -4808 -114652 -347414 -574914 -120703 -488487 -278117
2774 -278117 119220 -144711 -816065 -1214993 -1304527 -1515405 -1510697 -1273353 -1432911 -1176156
2764 -1176156 -705314 -815027 -1174509 -961967 -429628 -1082333 -1491740 -801750 -305363 -320147
2754 -320147 -86592 -382530 -482772 -730760 -1166886 -904575 -1527146 -1648166 -1003469 -788505
2744 -788505 -805404 -1706424 -1740054 -1299284 -1716461 -1791248 -1547486 -790387 -1252671 -1271231
2734 -1271231 -634071 -227303 -350970 -928603 -667159 -556007 -717706 -499391 -328269 -428299
2724 -428299 -330386 -427630 14383 -413049 -493594 -724526 -1098244 -1250302 -1422566 -909946
2714i09946J94896l77450L72744j18230l89310m97166M8234O30709L83277M6441
2704f15801Q08089R40386j35382q11043J40500l81380m52410k5162p0490k97965
2694i00658p8539J22802K08001n07202K94556j55171J91341j87408r01460M60848
2684a452890M88115M6642N3371m59134Q87970M19744n43639J09009N2451J2552
2674c85809M48812p854k26672R5267n52615o7351k19533K71677k18359N25875
2664c36562l06513j65587O40713n96401p98051N9318r9757N57895q01204K11379
2654a634770R81409J101195k21854J98029M78277r95875j094720j70678m4834
2645a403821j54658L40258M71520K07289l56064N52859K05458o73685o5322m54775
$$ plain form
2714 -909946 -715050 -1092500 -719756 -837986 -1227296 -1724462 -1676228 -1045519 -662242 -615801
2704 -615801 192288 1132674 997292 186249 326749 -54631 -507041 -532203 -602693 -900658
2694 -900658 -979197 -856395 -648394 -1155596 -861040 -1016211 -824870 -1012278 -1913738 -1452890
2684 -1452890 -964775 -918133 -864762 -1323896 -435926 -16182 -559821 -450812 -398361 -385809
2674 -385809 63003 55149 -171523 -76256 -628871 -696222 -915755 -644078 -862437 -336562
2664 -336562 -643075 -808662 -167949 -764350 -1562401 -1503083 -1602840 -1044945 -1846149 -1634770
2654 -1634770 -653361 447834 225980 424009 902286 -93589 -1188309 -1358987 -1403821
2645 -1403821 -1558479 -1218221 -746701 -539412 -895476 -342617 -137159 -810844 -876166 -1330941
2635a330941O06536m42887J19720R48820q0218K44196M16905k60876j54374m65736
2625c98855L23055j11523j70278M86393m01979k62858Q0150Q3518k46901o19839
2615a239117J49923p3882Q02305N98549p39027N41848j17583k90289n32183o43394
2605a542850M76255K88757k07541J095990K13382m9102n08858j87356J17784n1864
2595c55403M2698k85876J29267k78037k63819J3569Q174L4369m3202O6257k59245
2584a191248K71991M51670O51213j046192p1056O9104M83215J09603k27664j27582
2574f26946k23590J87538P15595K91970K65554j044334l12278P49552l70784o0050
2564d27773n94565K5613N14764l2188P078n2469m70733q73694j57752J021936
$$ plain form
2635 -1330941 -724405 -1167292 -1047572 -98752 -178970 65226 482131 221255 66881 -398855
2625 -398855 -75800 -187323 -357601 128792 -273187 -536045 -455895 -372377 -619278 -1239117
2615 -1239117 -1089194 -1163076 -360771 237778 -501249 40599 -76984 -367273 -899456 -1542850
2605 -1542850 -1066595 -777838 -985379 110611 323993 274891 -233967 -421323 -303539 -355403
2595 -355403 -312705 -598581 -469314 -747351 -1011170 -997601 -989427 -955058 -998260 -932003 -1191248
2584 -1191248 -919257 -467587 183626 -862566 -933622 -864518 -381303 -271700 -499364 -626946
2574 -626946 -850536 -662998 52597 344567 610121 -434213 -746491 3061 -367723 -427773
2564 -427773 -1022338 -996725 -481961 -514149 -507071 -559540 -1030273 -1903967 -2061719 -1039783
2554a039783M80126J02724K96785K1469L83126j36730l15968m72457k77051R7878
2544h59881l37361O50636J26025J60464k05738j59122j15394J2832J8131R4279
2534f15129m34644K96243m68777J40237O85954K83857j82357O5618l08511k260
2524e39769n84482j70390L93234l3881N4616M55560J6277l22886N67338L38385
2514A74002k40795q45835K15476l71559o38155L28632O66532m72129L55299N40989
2504b87543P1409J03364j65835k64769L00943P1763M5205j09599m5234J3278j85022
2493d52040j11833N80192O4493K93792k49228Q4286j62232n61294n03420J90130
2483h27154m30164m521L52837p951L64889J85643l19236j51764o31068j94572
$$ plain form
2554 -1039783 -559657 -456933 -160148 -138679 244447 107717 -208251 -680708 -957759 -859881
2544 -859881 -1197242 -546606 -420581 -260117 -465855 -624977 -740371 -727539 -709408 -615129
2534 -615129 -1049773 -753530 -1222307 -1082070 -396116 -112259 -294616 -228998 -537509 -539769
2524 -539769 -1124251 -1294641 -901407 -935288 -880672 -425112 -408835 -731721 -164383 174002
2514 174002 -66793 -912628 -697152 -1068711 -1706866 -1378234 -711702 -1183831 -828532 -287543
2504 -287543 -216134 -112770 -278605 -543374 -242431 -170668 -125463 -235062 -280296 -267018 -452040
2493 -452040 -563873 16319 80812 374604 125376 209662 47430 -513864 -1017284 -827154
2483 -827154 -1257318 -1261839 -909002 -916953 -552064 -366421 -685657 -837421 -1468489 -1663061
2473a663061N36513Q87984M48219j78093n8364m65460l83729Q5983J6865J03350
2463f69793k78723R2610O0782l08508J147896p70639L73345j73182n8684Q7471
2453d97425k13346m48161r0457N54406M38537M35255r0533p35236J02483m39549
2443i84026j29303O98971J63357j86718N82016J04712j1926o64592o26750n96308
2433a650567P50440J80929o1176K31917K8318M73236M43543j05474k72752o67982
2423f49568n99320K02318Q22664L81395m0516Q6972K98335l42392q31122k62157
2413i33391k21600N7106J2821R94351j11200M450j36369l28133m6215l92192m78040
2402a578412N11729j15297O48354K57153J46543j80738k78345j06451p03526n4113
$$ plain form
2473 -1663061 -1126548 -238564 209655 31562 -26802 -492262 -875991 -790008 -773143 -669793
2463 -669793 -948516 -855906 -795124 -1103632 44264 -726375 -353030 -526212 -584896 -497425
2453 -497425 -710771 -1158932 -1249389 -694983 -256446 178809 88276 -646960 -544477 -984026
2443 -984026 -1113329 -414358 -251001 -437719 144297 249009 237083 -427509 -1054259 -1650567
2433 -1650567 -900127 -719198 -780374 -548457 -520139 -46903 396640 291166 18414 -649568
2423 -649568 -1248888 -1046570 -223906 157489 116973 203945 502280 159888 -671234 -933391
2413 -933391 -1154991 -1097885 -1085064 -90713 -201913 -197463 -333832 -661965 -708180 -1100372 -1578412
2402 -1578412 -1066683 -1181980 -533626 -276473 -129930 -310668 -589013 -695464 -1398990 -1453103
2392a453103M15346L26852J044681j38079O5369l73195m31614K83893q45023j82554
2382a287427M04983J76236k26108J71680K35328K85933j93530P1460m37876p40143
2372a539464L77740L04644M96871j04273Q09063k64041p72900k23558j31089r5245
2362a142252k72560M47388K62607o74278O28732R73304l80850l85473k94406J20119
2352g17669J90634m33242M90126l53768O05864N05719n31153q7925o72656K95486
2342g08584k57750J65463M3922L24297O65105k62036n72763R27578j074599k19119
2332i68486L52764R3565n9034o81563M32328l67039j60222O27853m16066J59856
2322i86044k09468j10618Q24168j46886M85618l48053q1554L61340j19022O33786
$$ plain form
2392 -1453103 -1037757 -710905 333776 195697 261066 -112129 -543743 -259850 -1104873 -1287427
2382 -1287427 -882444 -706208 -932316 -760636 -525308 -239375 -432905 -361445 -799321 -1539464
2372 -1539464 -1161724 -857080 -360209 -464482 344581 80540 -692360 -915918 -1047007 -1142252
2362 -1142252 -1414812 -967424 -704817 -1379095 -750363 222941 -157909 -543382 -837788 -717669
2352 -717669 -527035 -960277 -470151 -823919 -218055 287664 -243489 -331414 -1004070 -708584
2342 -708584 -966334 -800871 -756949 -432652 232453 -29583 -602346 325232 -749367 -968486
2332 -968486 -615722 -522157 -581191 -1262754 -830426 -1197465 -1357687 -729834 -1145900 -986044
2322 -986044 -1195512 -1306130 -481962 -628848 -143230 -491283 -572837 -211497 -330519 303267
2312C03267m45277k03205J12033j079616L73159M02023J48791n00487o7829J26193
2302h30948m87404k16082M54355J00608J68457J3555L38883m8491O5431O47382
2292B05746k19038p31241j87815M97221n62797j37794K35817P39714p10845J39939
2282g31093j92226L44937j21638m29722O71448l60605k61976L2542J34441m83542
2272a397434m02086P90270p7854k50159N03758Q85077j02920J51881k69298m42769
2262f11534j03914K18990m09639l07470O53806K78304L83721n02115K91119m80612
2252e89344r03338j36514P14451L75495J9178J50716P04525m65833J285K00960
2242G1581n91781k77886j92138j08928J24486R2052P19611L09107O9246M23425
$$ plain form
2312 303267 -142010 -345215 -233182 -1312798 -939639 -537616 -388825 -889312 -957141 -830948
2302 -830948 -1318352 -1534434 -1080079 -979471 -811014 -797459 -458576 -507067 -441636 205746
2292 205746 -13292 -744533 -932348 -435127 -997924 -1135718 -899901 -160187 -871032 -731093
2282 -731093 -923319 -578382 -700020 -1129742 -458294 -818899 -1080875 -1048333 -913892 -1397434
2272 -1397434 -1799520 -1009250 -1087104 -1337263 -833505 51572 -51348 100533 -168765 -611534
2262 -611534 -715448 -496458 -906097 -1213567 -559761 -281457 102264 -399851 -108732 -589344
2252 -589344 -1492682 -1629196 -914745 -539250 -520072 -369356 335169 -130664 -129379 71581
2242 71581 -520200 -798086 -990224 -1099152 -974666 -882614 -163003 146104 215350 638775
2232F38775j72858r69069p37978M09401L37524q27985O25788M63914k81846l00780
2222h15114k9690M59038j26276K74266M50811j03275l71127K00393J74377P1321
2212A84724o19913P3792j7356m0656M27103J57912l54404j24505Q77718J9980
2202E84395j307981J33383J54528n57937P6710K67000J06617L00639K22395j93912
2192b14163n46924K40657J10917N5673K61719N5848L92287J03150q61641K28004
2182a74473Q21628p35799o21819K01731O77747n49659O00780n85412k76035J74327
2172d66984j08034k80526n31682J55171N60533J64291j290O88609J24220n51953
2162b47645j22299k23706j70005n64185J77087J23610L39561M26211J20286K71999
$$ plain form
2232 638775 465917 -503152 -1241130 -831729 -494205 -1322190 -696402 -232488 -514334 -815114
2222 -815114 -844804 -385766 -512042 -237776 213035 109760 -261367 -60974 113403 184724
2212 184724 -435189 -361397 -378753 -419409 7694 165606 -188798 -313303 564415 584395
2202 584395 -723586 -590203 -435675 -993612 -916902 -649902 -543285 -242646 -20251 -214163
2192 -214163 -761087 -520430 -409513 -353840 -92121 -36273 356014 459164 -402477 -174473
2182 -174473 647155 -88644 -710463 -508732 169015 -380644 220136 -365276 -641311 -466984
2172 -466984 -575018 -855544 -1387226 -1232055 -671522 -507231 -508521 180088 304308 -247645
2162 -247645 -369944 -593650 -763655 -1327840 -1150753 -1027143 -687582 -261371 -141085 130914
2152A30914l54551Q184j46485m69459l33170K32470o41855J48234N1872P97942
2142e75904N6649K39236J23707j97424k46276L362K78965m41729l54765J10599
2132a003580N26572L2999J86225N4910P9601k48120m32990J30700o47505K641
2122a318547j33528J76718M1401M35939J029632l8216m41305L75155l65722K6534
2112b11939K86321K56589j17537j55083L12792K8254m45511o20688J25947J45411
2102c95444n29152j29100O21790M34884J54102m33873k38068l54545p22494M65735
2092a126165N32186N38408K59399n24590N05721p5967r76181j73779O65286J72432
2082b03250m38751M87631R39809n86997m64800m23372O33839n55720m97760K60216
$$ plain form
2152 130914 -223637 -215453 -361938 -831397 -1164567 -932097 -1573952 -1425718 -1373846 -575904
2142 -575904 -519255 -280019 -156312 -353736 -600012 -596650 -317685 -759414 -1114179 -1003580
2132 -1003580 -477008 -444009 -257784 -202874 -123273 -371393 -804383 -673683 -1321188 -1318547
2122 -1318547 -1452075 -1275357 -1233956 -798017 231615 193399 -247906 127249 -238473 -211939
2112 -211939 74382 330971 213434 58351 371143 399397 -46114 -666802 -540855 -395444
2102 -395444 -924596 -1053696 -431906 2978 157080 -276793 -514861 -869406 -1591900 -1126165
2092 -1126165 -593979 -55571 203828 -320762 184959 108992 -867189 -1040968 -375682 -203250
2082 -203250 -642001 -154370 785439 198442 -266358 -689730 -55891 -611611 -1109371 -849155
2072h49155m89118m2810K64364M18247L44362K6994j24310K8988K1297l27636
2062g28777j508K71431K64219j96892K39211l98520K15488k41725M61073J45587
2052B9587l13828n049p63103k03529L17781n2416M89970J10663r0092m52288m52148
2041a384452P36098o96903j2120O91074K35893J10211L0144M36052K66441j98801
2031B13637J98285J62853m50550m89661J77703r4490p82358R1994N60153n58297
2021i70731L59041O76274j23343j55956r94744Q1047Q7020m40942K30095m6339
2011a298578K28582J33031L64679j67988o29610R99954M15507o38015K03607o46740
2001a035571L02288P53808L21857n65989l87114N45722o00641j15630K66766P5897
$$ plain form
2072 -849155 -1338273 -1381083 -1116719 -698472 -354110 -327116 -451426 -422438 -401141 -728777
2062 -728777 -730285 -458854 -194635 -391527 -152316 -550836 -335348 -577073 -116000 29587
2052 29587 -284241 -289290 -1052393 -1255922 -938141 -990557 -500587 -389924 -480016 -932304 -1384452
2041 -1384452 -648354 -1345257 -1357377 -666303 -430410 -320199 -290055 145997 412438 213637
2031 213637 411922 574775 124225 -365436 -187733 -282223 -1064581 -972587 -412434 -970731
2021 -970731 -611690 64584 -58759 -214715 -1209459 -1128412 -1041392 -1482334 -1252239 -1298578
2011 -1298578 -1069996 -936965 -572286 -740274 -1369884 -369930 45577 -592438 -388831 -1035571
2001 -1035571 -733283 20525 342382 -223607 -610721 -64999 -665640 -781270 -514504 -438607
1991d38607K83316p61059J00236j42999J33284N20631J65807k48513J00714M95305
1981B08115O09877k89125m56273J68447R1787j63156p0431J22988K3694r91957
1971g46034o5982J95286l59170J96887l65998M08530l47581J76073J072517k27577
1961f3049m74674l20696J04013M27737N4629M66039n52165O4686k81692m15010
1951i90182J010146l3186j50504l8617m55900K33395k57254R16042j52699m06598
1941c25357l40291p46783N94845M63407k8699J16241L67039j41266n24175n74763
1931a139802P37199l44387k70492L05641j56682k37594j77480J258011p852r03920
1921i37358J03942K83887o21860k49874O55417L77194o15547j18468N76767n48955
$$ plain form
1991 -438607 -155291 -916350 -816114 -959113 -825829 -305198 -139391 -387904 -287190 208115
1981 208115 817992 528867 72594 241041 332828 169672 99241 222229 245923 -746034
1971 -746034 -812016 -616730 -975900 -779013 -1145011 -736481 -1084062 -907989 164528 -63049
1961 -63049 -537723 -858419 -754406 -326669 -272040 193999 -358166 -293480 -575172 -990182
1951 -990182 19964 -13222 -163726 -202343 -658243 -424848 -682102 233940 81241 -325357
1941 -325357 -665648 -1412431 -817586 -354179 -382878 -266637 100402 -40864 -565039 -1139802
1931 -1139802 -402603 -746990 -1017482 -711841 -868523 -1106117 -1283597 -25586 -33438 -937358
1921 -937358 -833416 -549529 -1171389 -1421263 -765846 -388652 -1004199 -1122667 -545900 -1094855
1911a094855j84715j54599M88337J29356M6142Q09375j47623K45741K09064n74249
1901b28026l63331l98674O22637K79329j21974J08258j3657k70873l72901K04819
1891e54393q8774m78816P42849J00914m13038O35239R8821Q5400p46506m75529
1881a093833Q65190q2798l75984q4199k55784J7963P68826J43838k29733l16630
1871f43144N85031k60991o61388J01860L52590O48597o14335O86950p4530r34761
1861h14121j34155l32492M62882l87382O0224R17358k98893M75566J13875n2705
1851A0157r61409j73306O18262k557o81437N61780m0650p0290J02340J67746j42849
1840f12213q07475M19582L00162j21566M12521N06750J65201n31054l03594K21434
$$ plain form
1911 -1094855 -1279570 -1434169 -945832 -816476 -770334 39041 -108582 137159 346223 -228026
1901 -228026 -591357 -990031 -367394 -88065 -210039 -101781 -115438 -386311 -759212 -554393
1891 -554393 -643167 -1121983 -379134 -278220 -691258 -56019 42802 128202 -618304 -1093833
1881 -1093833 -228643 -311441 -687425 -771624 -1027408 -1009445 -240619 -96781 -326514 -643144
1871 -643144 -58113 -319104 -980492 -878632 -526042 122555 -491780 195170 120640 -814121
1861 -814121 -948276 -1280768 -817886 -1205268 -1145044 -227686 -526579 -51013 62862 10157
1851 10157 -951252 -1124558 -506296 -508853 -1190290 -628510 -669160 -739450 -637110 -469364 -612213
1840 -612213 -1419688 -1000106 -699944 -821510 -408989 97761 262962 -268092 -571686 -350252
1830c50252p59127N10392J11689j71142M57581K21643p0002m29945l5254n5108
1820e69525o24770m68324o94581M52344R96960M37020J55309O8703m26843k0947
1810f94654K65242q6222j963N44201q11768o66673N35969K65818N10165k58266
1800c98151K46647K92767r61153k43401N74456P06563J1619q19382J59928k6827
1790d56934j098337M74787J12963k85716J58026J076653N23091q64945k25632
1781e86044M85705k83581m49109k13349N407k22190J15839P47381r6554K1189
1771d75306l1552J97195J86951n37208o58478j39803k00099N79005L60887K94513
1761d23895O00997k6356r55573J09682j26081p8840K42524K03410L69981K61272
$$ plain form
1830 -350252 -1109379 -598987 -487298 -658440 -200859 20784 -49218 -479163 -514417 -569525
1820 -569525 -1194295 -1662619 -2357200 -1904856 -907896 -470876 -315567 -246864 -673707 -694654
1810 -694654 -429412 -515634 -517597 26604 -785164 -1451837 -915868 -650050 -139885 -398151
1800 -398151 -151504 141263 -819890 -1063291 -488835 217728 229347 -590035 -430107 -456934
1790 -456934 -1555271 -1080484 -967521 -1253237 -1095211 -18558 504533 -360412 -586044
1781 -586044 -100339 -383920 -833029 -1046378 -1040971 -1263161 -1147322 -399941 -496495 -475306
1771 -475306 -506858 -309663 -122712 -659920 -1318398 -1458201 -1658300 -1079295 -718408 -423895
1761 -423895 177102 150746 -804827 -695145 -821226 -900066 -657542 -454132 -84151 177121
1751A77121K73703l79639n88756R4609j4183J33242l11596L61255j4024j63123
1741d31391K44242L69708N8569j023405m75130p6502L71150J72013N91695N99135
1731D00084K52032m03240k98914l39558k52710k6512l00447J132768r0538n8234
1721A4731J80583J11473J38490l84387n15163l62755k46810m38460R32486O47596
1711G7784j42856n81688J87614K9438o57660m63479l39788J206038Q83953k87193
1701h7837M2850J2104q5171n2114l49553j15731J57502K31346K70005k62417P1206
1690a67810m36328O30352j30189k08163j16833o5573K17931J10588m15687K31414
1680c50298j90316l82691k35004r0376j18595M72290M30947k2319J08169O50722
$$ plain form
1751 177121 450824 71185 -517571 -422962 -437145 -303903 -615499 -254244 -268268 -431391
1741 -431391 -187149 182559 241128 -782277 -1257407 -1333909 -962759 -790746 -199051 400084
1731 400084 652116 248876 -50038 -389596 -642306 -668818 -969265 163503 72965 14731
1721 14731 195314 306787 445277 60890 -454273 -817028 -1063838 -1502298 -569812 77784
1711 77784 -65072 -646760 -459146 -429708 -1087368 -1550847 -1890635 -684597 199356 -87837
1701 -87837 -44987 -32883 -118054 -170168 -519721 -635452 -477950 -246604 23401 -239016 -167810
1690 -167810 -604138 26214 -103975 -312138 -428971 -494544 -276613 -166025 -581712 -350298
1680 -350298 -540614 -923305 -1158309 -1248685 -1367280 -894990 -464043 -486362 -378193 272529
1670B72529r4417K61700o57617J5001r4286o65506J04642L19983M49012k13014
1660c01973k27391N9833o70829q09942R36058O8515j03904Q4513K57529r866J85750
1649e31707N04376L12494m46432o38533J58569P33592n25648l28219k03500M64114
1639e00894L79254j99353Q11485L20613r67198k1683o41736r8024o55779O1718
1629a511597J003464l2402M8348Q52110k8909L44388j288442n5093Q9417J71901
1619d06815L07867o44221J63721L62735K72740J92839r80324M89768o8726l23616
1609f34032O93047m20794m29397m47376N11594J42156k23189J41794K29538R8159
1599c38500O19155l25888O5994l96887J76799P4516r72233K38248J026551N5648
$$ plain form
1670 272529 178112 439812 -217805 -202804 -297090 -962596 -857954 -537971 -88959 -301973
1660 -301973 -529364 -469531 -1140360 -1950302 -1014244 -945729 -1049633 -965120 -707591 -717457 -531707
1649 -531707 -27331 285163 -161269 -799802 -641233 92359 -433289 -761508 -965008 -500894
1639 -500894 -121640 -320993 490492 811105 -156093 -177776 -819512 -917536 -1573315 -1511597
1629 -1511597 -508133 -540535 -492187 359923 331014 675402 -613040 -668133 -578716 -406815
1619 -406815 -98948 -743169 -579448 -216713 56027 248866 -731458 -241690 -310416 -634032
1609 -634032 59015 -361779 -791176 -1238552 -726958 -584802 -807991 -666197 -436659 -338500
1599 -338500 280655 -45233 20761 -376126 -199327 -124811 -1097044 -858796 167755 223403
1589B23403R3441K80612M85141q39033o52747k54598J41255n99987J62764N05393
1579d54356l85046r341J140946P7676n36124n73148p02502j392n76704P37592
$$ plain form
1589 223403 316844 597456 1082597 243564 -409183 -663781 -522526 -1122513 -959749 -454356
1579 -454356 -839402 -848743 292203 369879 -166245 -739393 -1441895 -1443287 -2019991 -1282399
$$ [...]
##END NTUPLES=NMR SPECTRUM
##END=
