##TITLE=1H_DE-80H_X3
 200.13MHz, d2o
 8 sc
 
 19ns.26.2.2025
##JCAMPDX= 6.0         $$ Bruker NMR JCAMP-DX V2.0
##DATA TYPE= NMR SPECTRUM
##DATA CLASS= NTUPLES
##ORIGIN= UXNMR, Bruker Analytische Messtechnik GmbH
##OWNER= pz
$$ XWIN-NMR		Version 3.5
$$ Wed Dec 17 10:32:22 2025 Russian Standard Time (UT+4h)  Yarkov@DPX200
##.OBSERVE FREQUENCY= 200.1313
##.OBSERVE NUCLEUS= ^1H
##.ACQUISITION MODE= SIMULTANEOUS
##.ACQUISITION SCHEME= undefined
##.AVERAGES= 8
##.DIGITISER RES= 18
##SPECTROMETER/DATA SYSTEM= spect
##.PULSE SEQUENCE= zg30
##.SOLVENT NAME= CDCl3
##.SHIFT REFERENCE= (INTERNAL, CDCl3, 0, 15.4957)
##AUDIT TRAIL= $$ (NUMBER, WHEN, WHO, WHERE, WHAT)
$$ ##TITLE= Audit trail, XWIN-NMR		Version 3.5
$$ ##JCAMPDX= 5.01
$$ ##ORIGIN= Bruker BioSpin GmbH
$$ ##OWNER= Yarkov
$$ C:/Bruker/XWIN-NMR/data/yarkov2/nmr/H-C/1/pdata/1/auditp.txt
$$ ##AUDIT TRAIL=  $$ (NUMBER, WHEN, WHO, WHERE, WHAT)
(   1,<2025-12-17 10:30:51.96 +0400>,<Yarkov>,<DPX200>,
      <created by zg, POWCHK disabled, PULCHK disabled
       configuration hash MD5:
       00 E9 B6 7A A2 85 ED C7 34 08 36 98 17 FE 4E 26
       data hash MD5: 16K
       E8 9F 82 91 40 F3 5E B3 AD 8C D0 70 E7 29 BA 33>)
(   2,<2025-12-17 10:31:01.00 +0400>,<Yarkov>,<DPX200>,
      <Start of raw data processing
       efp BC_mod = 2 LB = 0.25 FT_mod = 6 PKNL = 1 PHC0 = -5301.728 PHC1 = 12.22193 SI = 16K 
       data hash MD5: 16K
       A5 27 7E 1C EF C4 12 87 A6 89 9B E4 12 5B A5 5E>)
$$ ##END=
$$ 
$$ hash MD5
$$ C7 AA 25 C7 28 6E 57 83 A4 DD 58 92 0D EC EF 61
##$RELAX= 
##$RELAX= 
##$RELAX= 
##$RELAX= 
##$RELAX= 
##$RELAX= 
$$ Bruker specific parameters
$$ --------------------------
##$DU= <C:/Bruker/XWIN-NMR>
##$EXPNO= 1
##$NAME= <H-C>
##$PROCNO= 1
##$TYPE= <nmr>
##$USER= <yarkov2>
##$AMP= (0..31)
100 100 100 100 100 100 100 100 100 100 100 100 100 100 100 100 100 100 
100 100 100 100 100 100 100 100 100 100 100 100 100 100 
##$AQSEQ= 0
##$AQ_mod= 1
##$AUNM= <au_zg>
##$AUTOPOS= <>
##$BF1= 200.13
##$BF2= 200.13
##$BF3= 200.13
##$BF4= 200.13
##$BF5= 200.13
##$BF6= 200.13
##$BF7= 200.13
##$BF8= 200.13
##$BYTORDA= 1
##$CFDGTYP= 0
##$CFRGTYP= 5
##$CHEMSTR= <none>
##$CNST= (0..31)
1 1 145 1 1 1 1 1 1 1 1 1 1 1 1 1 1 1 1 1 1 1 1 1 1 1 1 1 1 1 1 1 
##$CPDPRG= <>
##$CPDPRG1= <>
##$CPDPRG2= <>
##$CPDPRG3= <>
##$CPDPRG4= <mlev>
##$CPDPRG5= <mlev>
##$CPDPRG6= <mlev>
##$CPDPRG7= <mlev>
##$CPDPRG8= <mlev>
##$CPDPRGB= <>
##$CPDPRGT= <>
##$D= (0..31)
0 0.7 0 0 0 0 0 0 0 0 0 0.03 0 0 0 0 0 0 0 0 0 0 0 0 0 0 0 0 0 0 0 0 
##$DATE= 1765953051
##$DBL= (0..7)
120 120 120 120 120 120 120 120 
##$DBP= (0..7)
150 150 150 150 150 150 150 150 
##$DBP07= 0
##$DBPNAM0= <>
##$DBPNAM1= <>
##$DBPNAM2= <>
##$DBPNAM3= <>
##$DBPNAM4= <>
##$DBPNAM5= <>
##$DBPNAM6= <>
##$DBPNAM7= <>
##$DBPOAL= (0..7)
0.5 0.5 0.5 0.5 0.5 0.5 0.5 0.5 
##$DBPOFFS= (0..7)
0 0 0 0 0 0 0 0 
##$DE= 6
##$DECBNUC= <off>
##$DECIM= 32
##$DECNUC= <off>
##$DECSTAT= 4
##$DIGMOD= 1
##$DIGTYP= 9
##$DL= (0..7)
0 120 120 120 120 120 120 120 
##$DP= (0..7)
$$ [...]
##$SUBNAM2= <"">
##$SUBNAM3= <"">
##$SUBNAM4= <"">
##$SUBNAM5= <"">
##$SUBNAM6= <"">
##$SUBNAM7= <"">
##$SUBNAM8= <"">
##$SUBNAM9= <"">
##$SW= 18.0517328524113
##$SWIBOX= (0..15)
0 0 2 0 0 0 0 0 0 0 0 0 0 0 0 0 
##$SW_h= 3612.71676300578
##$TD= 16384
##$TD0= 1
##$TE= 0
##$TE2= 300
##$TE3= 300
##$TEG= 300
##$TL= (0..7)
0 120 120 120 120 120 120 120 
##$TP= (0..7)
150 150 150 150 150 150 150 150 
##$TP07= 0
##$TPNAME0= <>
##$TPNAME1= <>
##$TPNAME2= <>
##$TPNAME3= <>
##$TPNAME4= <>
##$TPNAME5= <>
##$TPNAME6= <>
##$TPNAME7= <>
##$TPOAL= (0..7)
0.5 0.5 0.5 0.5 0.5 0.5 0.5 0.5 
##$TPOFFS= (0..7)
0 0 0 0 0 0 0 0 
##$TUNHIN= 0
##$TUNHOUT= 0
##$TUNXOUT= 0
##$USERA1= <user>
##$USERA2= <user>
##$USERA3= <user>
##$USERA4= <user>
##$USERA5= <user>
##$V9= 5
##$VALIST= <valist>
##$VCLIST= <CCCCCCCCCCCCCCC>
##$VD= 0
##$VDLIST= <DDDDDDDDDDDDDDD>
##$VPLIST= <PPPPPPPPPPPPPPP>
##$VTLIST= <TTTTTTTTTTTTTTT>
##$WBST= 1024
##$WBSW= 4
##$XGAIN= (0..3)
0 0 0 0 
##$XL= 0
##$YL= 0
##$YMAX_a= 478889
##$YMIN_a= -320301
##$ZGOPTNS= <>
##$ZL1= 120
##$ZL2= 120
##$ZL3= 120
##$ZL4= 120
##$ABSF1= 0
##$ABSF2= 0
##$ABSG= 0
##$ABSL= 0
##$ALPHA= 0
##$AQORDER= 0
##$ASSFAC= 0
##$ASSFACI= 0
##$ASSFACX= 0
##$ASSWID= 0
##$AUNMP= <proc_1d>
##$AZFE= 0.1
##$AZFW= 0.1
##$BCFW= 0
##$BC_mod= 2
##$BYTORDP= 0
##$COROFFS= 0
##$CY= -3
##$DATMOD= 1
##$DC= 0
##$DFILT= <>
##$DTYPP= 0
##$F1P= 0
##$F2P= 0
##$FCOR= 1
##$FTSIZE= 16384
##$FT_mod= 6
##$GAMMA= 0
##$GB= 0
##$INTBC= 1
##$INTSCL= 3.241238e-09
##$ISEN= 128
##$LB= 0.25
##$LEV0= 0
##$LPBIN= 0
##$MAXI= 10000
##$MC2= 0
##$MEAN= 0
##$ME_mod= 0
##$MI= 1.114404
##$NCOEF= 0
##$NC_proc= -5
##$NLEV= 6
##$NOISF1= 3.799351
##$NOISF2= 2.8
##$NSP= 0
##$NTH_PI= 0
##$NZP= 0
##$OFFSET= 15.4957
##$PC= 1
##$PHC0= -5301.728
##$PHC1= 12.22193
##$PH_mod= 1
##$PKNL= yes
##$PPARMOD= 0
##$PSCAL= 0
##$PSIGN= 0
##$REVERSE= no
##$SF= 200.130005203055
##$SI= 16384
##$SIGF1= 3
##$SIGF2= 2
##$SINO= 0.751879
##$SIOLD= 32768
##$SREGLST= <19F.Aceton>
##$SSB= 0
##$STSI= 16384
##$STSR= 0
##$SW_p= 3612.71676300578
##$SYMM= 0
##$S_DEV= 0
##$TDeff= 16384
##$TDoff= 0
##$TI= <>
##$TILT= no
##$TM1= 0
##$TM2= 0
##$TOPLEV= 0
##$USERP1= <user>
##$USERP2= <user>
##$USERP3= <user>
##$USERP4= <user>
##$USERP5= <user>
##$WDW= 1
##$XDIM= 16384
##$YMAX_p= 332975095
##$YMIN_p= -398731
$$ End of Bruker specific parameters
$$ ---------------------------------
##NTUPLES= NMR SPECTRUM
##VAR_NAME=  FREQUENCY,     SPECTRUM/REAL,   SPECTRUM/IMAG
##SYMBOL=    X,             R,               I
##VAR_TYPE=  INDEPENDENT,   DEPENDENT,       DEPENDENT
##VAR_FORM=  AFFN,          ASDF,            ASDF
##VAR_DIM=   16384,         16384,           16384
##UNITS=     HZ,            ARBITRARY UNITS, ARBITRARY UNITS
##FACTOR=    0.220516191357247, 1,           1
##FIRST=     3101.15449811117, 0,            0
##LAST=      -511.562264894611, 0,           0
##MIN=       -511.562264894611, -398731,     0
##MAX=       3101.15449811117, 332975095,    0
$$ Real data points
##PAGE= N=1
##DATA TABLE= (X++(R..R)), XYDATA
$$ [...]
10597 -94073 -103533 -81324 -95967 -68902 -54079 -91231 -71566 -64065 -89383 -117345 -105782 -38624
10585 -38624 -36684 -73664 -58868 -75093 -49127 -51657 -87351 -83643 -70158 -79419 -102519 -89156
10573 -89156 -89702 -70210 -60437 -67015 -63565 -52941 -55618 -65227 -44728 -60719 -104046 -91095 -106472
10560 -106472 -75315 -39612 -51256 -48096 -63122 -83560 -97939 -107158 -98729 -64873 -45332 -69022
10548 -69022 -58280 -94184 -95156 -39579 -61143 -84222 -25691 -18630 -101420 -62596 -59744 -80499
10536 -80499 -85277 -87329 -102199 -105887 -102915 -76500 -77925 -52974 -70646 -52775 -27985 -114412 -111901
10523 -111901 -103603 -87539 -85439 -52933 -35970 -87755 -72753 -77479 -84868 -54010 -48816 -69578
10511 -69578 -58886 -25221 -72636 -125843 -82468 -92169 -142846 -124588 -94355 -43751 -23370 -95857
10499 -95857 -68026 -54509 -69441 -64225 -68053 -82048 -77114 -109316 -81620 -44281 -62549 -32811
10487 -32811 -51469 -74310 -77839 -49565 -86143 -129330 -71185 -109034 -96403 -38853 -74857 -83104
10475 -83104 -56995 -109754 -131342 -78515 -105414 -70257 -46575 -87427 -114550 -75909 -96073 -119610
10463 -119610 -116320 -117626 -89070 -77918 -82592 -85421 -44696 -92171 -121343 -118632 -99738 -89046
10451 -89046 -118026 -81641 -91970 -84765 -82931 -50643 -85453 -108128 -82400 -100455 -83227 -38011
10439 -38011 -44920 -69493 -38446 -46448 -91676 -64516 -53432 -64230 -106143 -68679 -85322 -86100
10427 -86100 -66479 -66896 -82290 -60806 -78187 -78451 -81675 -112428 -110692 -92070 -50032 -65615 -78382
10414 -78382 -91748 -82754 -65295 -74798 -106664 -100338 -55602 -61908 -67226 -63640 -80527 -58512 -90169
10401 -90169 -70645 -79316 -50459 -76339 -69725 -56073 -64710 -71983 -75340 -89601 -92999 -72249 -35335
10388 -35335 -83610 -120628 -79641 -86089 -73065 -43948 -68596 -91721 -52319 -59544 -79000 -58307
10376 -58307 -73267 -111872 -89843 -97490 -95442 -58401 -53874 -72931 -34643 -80438 -69111 -67060
10364 -67060 -77313 -54068 -68770 -59007 -38196 -34545 -53061 -23101 -73062 -90562 -42826 -53215
10352 -53215 -67625 -39766 -45106 -76003 -40767 -38365 -84415 -75915 -75937 -96678 -108040 -83817 -80195
10339 -80195 -66810 -62896 -66761 -69916 -50472 -97839 -139722 -81745 -84507 -101763 -100605 -97982 -109427
10326 -109427 -81546 -95838 -91084 -80915 -75865 -60663 -115422 -70241 -61738 -71070 -76087 -90237
10314 -90237 -101605 -91426 -54917 -43702 -66131 -78427 -83949 -106554 -86769 -81848 -74897 -42494
10302 -42494 -98557 -114568 -77687 -97520 -119108 -77479 -35648 -88013 -62628 -33586 -51820 -72119
10290 -72119 -55381 -74735 -71916 -52406 -91943 -115051 -79217 -114602 -117528 -69587 -101185 -81897
10278 -81897 -74574 -93344 -94540 -49685 -40135 -54032 -37802 -45115 -67590 -63838 -44099 -71227 -67771
10265 -67771 -38132 -13089 -39313 -85358 -61006 -87205 -78951 -5082 -34374 -51823 -50310 -70452
10253 -70452 -66776 -76366 -94979 -53183 -65363 -71872 -77274 -55192 -62445 -94369 -70508 -78906 -82501
10240 -82501 -80845 -59762 -68141 -86259 -103342 -108481 -109699 -85608 -53555 -92831 -91045 -92188 -95366
10227 -95366 -48554 -67774 -80960 -92730 -67132 -79269 -95704 -30697 -39492 -86077 -65802 -53779
10215 -53779 -68150 -62913 -84409 -99945 -75054 -54846 -73196 -81103 -63446 -68861 -95918 -112919
10203 -112919 -109750 -134499 -112756 -102490 -73592 -62847 -43913 -73901 -71335 -84500 -103997 -49839
10191 -49839 -62417 -66986 -73430 -52903 -60164 -79597 -55669 -79302 -116366 -140821 -118778 -93906
10179 -93906 -39875 -28417 -39705 -35699 -85815 -113054 -104477 -101841 -80728 -82081 -92942 -64019
10167 -64019 -78218 -104873 -95491 -119646 -103991 -76399 -110191 -99122 -76193 -85879 -112745 -102521
10155 -102521 -117664 -78356 -68916 -57597 -64710 -39175 -92175 -112001 -48881 -64320 -92972 -77822
10143 -77822 -121802 -126521 -63201 -66063 -86713 -92320 -70914 -90364 -91394 -69447 -86119 -134308
10131 -134308 -135285 -107105 -104513 -42743 -57644 -96734 -104446 -93662 -73703 -89407 -86014 -80880 -52909
10118 -52909 -45040 -83843 -88863 -110474 -110113 -81113 -96435 -113776 -71064 -97494 -94678 -68130 -89444
10105 -89444 -64340 -106876 -110821 -99657 -72825 -94227 -83944 -98103 -152209 -129581 -71237 -86215
10093 -86215 -98027 -60603 -87074 -90038 -73536 -67388 -59296 -48055 -91494 -95396 -40877 -109813
10081 -109813 -113194 -121705 -137762 -115973 -79998 -67206 -66120 -44132 -42268 -80625 -91124 -48112
10069 -48112 -81204 -63947 -61105 -68575 -59297 -53572 -66681 -101635 -102663 -125555 -126761 -104490 -81656
10056 -81656 -85806 -108941 -94417 -70778 -104252 -114680 -78789 -118232 -103217 -71449 -90949 -93626
10044 -93626 -69112 -50589 -65981 -34054 -49830 -52198 -19345 -66587 -99999 -81873 -79093 -97566
10032 -97566 -83274 -104828 -116286 -49690 -58416 -76513 -74941 -85475 -91984 -64204 -80135 -118240
10020 -118240 -90592 -70141 -58467 -23850 -45584 -61188 -52118 -59528 -41552 -58104 -59529 -51486
10008 -51486 -50894 -50002 -100308 -105318 -66819 -75068 -71470 -69970 -110817 -125401 -157473 -106433 -71626
9995 -71626 -100819 -53057 -84333 -64575 -62143 -69018 -62917 -57668 -49712 -33019 -51829 -97804 -96789
9982 -96789 -123039 -74852 -67013 -88626 -81119 -81001 -89855 -71723 -58261 -98773 -84640 -45722 -38261
9969 -38261 -60240 -56875 -57276 -86439 -74328 -48605 -31118 -29345 -55453 -64163 -55817 -64109 -63793 -71184
9955 -71184 -106305 -94787 -92264 -90174 -81301 -96772 -117652 -101675 -37560 -45071 -53902 -68706 -51188
9942 -51188 -80362 -74236 -91565 -95360 -97606 -104772 -71642 -91992 -66419 -95081 -91510 -90058 -67228
9929 -67228 -61539 -54043 -74469 -79993 -59816 -123275 -100671 -35294 -50823 -38710 -32044 -74121 -45723
9916 -45723 -49546 -96213 -51699 -36275 -6027 10204 494 -14122 -1089 -500 -25349 4055 6462
9903 6462 -17084 -10257 -14033 2489 24694 16064 12984 15932 -1259 11759 33323 41810 3473
9890 3473 -15063 -21726 21119 48422 -9373 7525 22308 10219 -12624 22415 8280 -16435
9878 -16435 -37515 -63837 -66308 -78938 -54567 -45913 -19463 -68666 -71012 -52031 -61733 -60809 -73865
9865 -73865 -77602 -72372 -77422 -69462 -61553 -92979 -58044 -72220 -90929 -51234 -84011 -89096 -38631
9852 -38631 -52484 -71990 -40915 -39949 -69540 -70934 -54671 -66281 -61816 -69567 -117108 -97646 -115428
9839 -115428 -78438 -51028 -85919 -94025 -97093 -96545 -79613 -55412 -58832 -84607 -103550 -88534 -50798
9826 -50798 -69615 -70000 -72342 -70314 -92757 -104540 -70131 -60119 -92117 -100073 -72503 -78916 -48783
9813 -48783 -43107 -72277 -76398 -68137 -65431 -67086 -48690 -62952 -63830 -80691 -90781 -79138 -62335
9800 -62335 -62865 -35126 -30240 -59126 -82107 -82460 -65699 -90053 -65682 -71959 -52720 -78640 -121587
9787 -121587 -69228 -87140 -97489 -53541 -63351 -141418 -78807 -65586 -82572 -108177 -125076 -107826
9775 -107826 -73818 -30281 -90996 -71576 -89836 -106927 -100374 -93721 -77749 -74578 -99179 -103314
9763 -103314 -47339 -78141 -75789 -62846 -103459 -108173 -98482 -118670 -100293 -70862 -70990 -87881 -93086
9750 -93086 -101701 -110082 -109144 -94163 -70277 -59816 -39592 -75429 -81514 -40288 -57258 -72144 -46343
9737 -46343 -61854 -76657 -66521 -84947 -87916 -64882 -115553 -113756 -65256 -69259 -76868 -63153 -102263
9724 -102263 -105327 -54679 -95760 -86201 -47721 -52228 -41605 -76581 -79480 -67603 -58123 -86890 -26444
9711 -26444 -75337 -74966 -41542 -37780 -118781 -123793 -92157 -114884 -51879 -95902 -147315 -108672 -101596
9698 -101596 -108401 -82945 -92762 -79568 -49203 -74038 -93196 -91430 -79398 -65332 -38950 -51243
9686 -51243 -99202 -56558 -60570 -60742 -58780 -66589 -75787 -80911 -102054 -91994 -84669 -77163 -40567 -71534
9672 -71534 -74868 -63830 -50232 -24947 -27144 -50053 -44918 -53608 -53811 -34706 -20869 -27634 -31009
9659 -31009 -9697 -43207 -33986 -47081 -57195 -9182 1258 -17005 -12731 -12634 -48470 -59636 -83404
9646 -83404 -85786 -68380 -97168 -46454 448 -36579 -82552 -28323 -53665 -63754 -18620 -51289
9634 -51289 -57838 -32991 -63161 -48445 -18930 -33177 -36748 -54458 -38108 -20442 -14524 -55806
9622 -55806 -31586 3753 -48737 -44869 -24529 -45492 9256 28018 17702 63115 44379 20856
9610 20856 37432 11530 17943 37134 12255 62093 61926 67354 95252 128513 165666 162856 158026
9597 158026 168014 156163 152303 88924 74700 85039 3897 30222 3264 -5438 45537 19826
9585 19826 8422 -20617 8772 31513 4149 -7284 -29855 -34438 -25971 -18279 -4084 -28548
9573 -28548 -14383 -29770 -18128 23523 2294 5949 64747 27797 17413 40416 24374 -2547
9561 -2547 7842 -14022 -24640 -1681 -18497 -57126 -30696 -29298 -76447 -34006 -103678 -95081
9549 -95081 -37371 -46724 -6810 -12176 -40717 -8046 -16816 11996 32919 23098 33382 40444 1650
9536 1650 5024 14932 25487 40813 68894 89734 99551 157092 136711 146374 223572 183044 207263
9523 207263 245616 216842 229448 189299 104917 58696 31691 38067 27302 28726 11368 8052
9511 8052 -12133 -30708 -45339 -35613 -21799 -33763 -24506 -40912 -37574 -39412 -20732 -18647 -18579 -22990
9497 -22990 -30933 -47210 -10048 15203 -4537 -12715 -1515 -22916 -23612 15048 -13156 -501 18530
9484 18530 -1337 -19131 14755 -534 -869 22618 25238 37694 30987 1274 -14394 -13017 597
9471 597 10551 4897 16512 8196 -4903 -18523 -9888 -36416 -40349 11322 25739 49005 36860
9458 36860 12317 33939 40553 -12784 -23014 -22174 -1772 -16020 -38340 -6916 -43003 13656
9446 13656 17100 -36707 -22232 -21739 -54838 -63281 -42608 -36017 -43297 -2686 -17039 -64792 -4607
9433 -4607 -33729 -32504 28776 -7113 -42109 -61642 -35068 -34859 -20535 -16341 -38381 -14665 10443
9420 10443 -31603 -17263 -3469 -12668 10173 -32959 -32197 -36924 -19842 2840 -44570 -33293 13858
9407 13858 10152 36965 64877 92674 112258 235967 460182 552604 543524 515312 367537 293684
9395 293684 225679 111827 99519 111301 71583 54491 69253 40137 -12159 19565 9580 -12240
9383 -12240 35839 -21684 -70139 -56859 -51701 -77080 -42550 6101 -7070 9839 15490 -14091
9371 -14091 -6451 28250 -2654 -2109 -1429 -46236 -26749 -23977 -63772 -49836 -43363 -21382 -6683
9358 -6683 -11222 -4577 -32274 -17262 -45098 -42018 -22579 -37615 -53960 -44099 -57082 -57160 -77101
9345 -77101 -47299 -24217 -41423 -81561 -39546 -18039 -40823 -40015 -61018 -83717 -8324 14099
9333 14099 -18991 15597 -1791 -53555 -11066 -13829 -18687 -32045 -46415 -37007 -34563 -41268 -28730
9320 -28730 -34668 -61818 -56602 -46909 -38031 -14975 28 -32569 -20593 -41539 -59082 -13447 -37278
9307 -37278 -24837 -21077 -96371 -69275 -31277 -45226 -56803 -43653 -58363 -32327 -15031 -11225
9295 -11225 -29027 1979 -25621 -12755 9038 16537 -11490 -25645 -19752 -27569 -17392 -16767 -15336
9282 -15336 -42312 -18997 -72115 -89221 -36972 -45538 -43179 -67459 -83704 -85899 -113950 -64803
9270 -64803 -30735 -25044 -5895 -8624 -2718 24984 -4041 -21776 -18823 -6527 -51215 -88919 -10688
9257 -10688 -33740 -55532 -4432 -2095 -34485 -22753 -20306 -17322 -33547 -67662 -38704 -26329
9245 -26329 -15492 -30156 -4303 -14932 -69772 -27963 -36497 -36105 10206 -76 -38903 -12012
9233 -12012 -13854 -29301 -49381 -54667 -52684 -69774 -67327 -61651 -41176 -34131 -15597 -16501 -38470
9220 -38470 -849 -5725 -34684 -30859 -31475 -47724 -56455 -71440 -41318 -2653 12713 25167 -3571
9207 -3571 -18802 -9322 -29179 -27756 -44062 -20585 -14094 -4787 -11308 -46061 -61404 -28706 -43323
9194 -43323 -21185 -25026 -9828 23592 -2773 11035 659 -46263 -27056 -19884 -11879 -14901 -3766
9181 -3766 -4274 -33840 -21715 7242 2790 7913 -2146 -16548 4752 -8252 -27278 -23180 -4353
9168 -4353 384 -3769 -3912 -3417 -41431 -45899 826 -14528 -44464 -27321 7421 -22687 -30303 693
9154 693 7147 5168 -16713 -8231 8762 28553 -3954 -33088 -40224 -28343 -25735 43369 34115
9141 34115 29280 7276 4245 23737 4901 -15485 38044 47340 80815 78191 62137 61962 15986
9128 15986 -26497 15798 10909 60657 70075 40496 16679 3567 33488 35112 24043 61709
9116 61709 68190 64199 91704 63185 98638 85288 72228 110277 96853 75399 58257 97103
9104 97103 64737 69057 98966 97771 36868 60729 47807 50648 103155 97056 59782 60600 48234
9091 48234 34851 50636 60047 69633 101263 89987 71040 69227 77442 110232 126361 84344 120006
9078 120006 110654 71572 106804 96421 88444 92845 145063 136234 131251 159231 134100 115360 122341
9065 122341 89615 87204 132175 119197 135088 161712 116730 135883 166204 129698 124186 168794
9053 168794 151289 175557 220394 168991 138612 195228 176079 196357 217480 155220 165467 201846
9041 201846 218988 236441 252454 251724 223015 265279 243215 272017 284925 263339 278824 319174
9029 319174 266290 277565 266152 217831 263811 288865 263325 303162 309105 320054 341088 344570
9017 344570 271589 295236 326894 338200 362051 424405 375232 446955 482996 411750 403136 493712
9005 493712 479542 475225 534141 518422 544403 574783 555343 582273 591664 565714 553608 603277
8993 603277 545755 586511 567628 567372 586489 645370 656697 682290 693324 714471 731803 734174
8981 734174 678453 713629 789505 762322 724806 805158 781859 834709 889347 952529 1022006 1090810
8969 1090810 1098685 1188315 1273082 1253101 1249586 1297537 1283942 1275483 1353299 1362975 1438401 1573009
8957 1573009 1640155 1760904 1887920 1968571 2026478 2147259 2240541 2322624 2406897 2500939 2657283
8946 2657283 2898578 3142082 3354185 3670093 3891913 4206989 4513779 4968287 5475398 6098610
8936 6098610 6613329 7262341 8249233 10057890 12449975 16135234 22489684 36805854 63758283
8927 63758283 92656859 99848815 94555667 82498163 63502038 47318693 35179566
8920 35179566 26712532 20448695 15885006 12282295 9990734 8333032 7215067 6194893
8912 6194893 5428488 4733345 4372982 3896892 3593895 3372742 3285780 3151710 3040572 2823624
8902 2823624 2667924 2513656 2454697 2270629 2161392 2005558 1900845 1863202 1905600 1866850
8892 1866850 1903530 1832601 1799736 1724243 1649439 1526580 1512218 1429922 1375229 1355763 1348383
8881 1348383 1299460 1299170 1277452 1285407 1309783 1317223 1243279 1265228 1188011 1182907 1096421 1038161
8869 1038161 960131 926727 885711 894688 907821 870433 853892 815301 776903 757182 727990 742775
8857 742775 683563 642806 612329 611362 581755 600175 570783 519504 481784 502473 542937 594184
8845 594184 585864 519270 534728 529409 556235 565550 565457 568011 574742 584350 581995 563541 535809 528528
8831 528528 469242 456644 479789 486623 478684 457122 474789 449777 457911 391666 389304 409788
8819 409788 402591 384993 376606 376854 368686 384516 365525 352517 378196 375791 386588 396059 418541
8806 418541 377902 412231 380672 419369 399520 386639 365209 389915 372346 398777 407980 393429
8794 393429 405133 396122 391367 390637 395867 425977 469367 420113 369678 374238 354780 375007 372996
8781 372996 333661 333553 375148 369233 379097 391214 378810 374064 404532 420585 444414 499428 498897
8768 498897 486926 467139 421353 457405 466582 476688 451283 452753 451610 468381 443952 448332
8756 448332 426173 459975 488425 451749 438844 464338 442575 399044 408885 422257 425326 414259
8744 414259 432553 443820 420647 491276 498777 524570 532426 554778 565264 576019 612503 579051
8732 579051 578962 579459 550215 541245 620375 568798 577498 662201 686798 663583 621814 573344 515114
8719 515114 545419 551283 515474 554914 515216 465571 501867 517252 512486 526539 496137 531417
8707 531417 559372 576760 603129 641393 648464 619796 598081 605337 608352 602184 596096 596350 636659
8694 636659 619345 607196 638955 616964 623848 643650 644327 653798 658731 584273 589784 610666 591557
8681 591557 611428 609668 598462 575525 626030 654747 648121 661583 609193 571062 555234 594757
8669 594757 591622 574732 585244 595483 589616 608490 605687 620242 634360 618216 599935 565198
8657 565198 547118 532697 555050 559117 538120 555862 557813 559622 571666 585278 615145 607475
8645 607475 639079 660476 638525 667141 651928 619457 622555 652512 682075 763691 778835 765582
8633 765582 767370 736267 716558 722225 779831 787477 770375 826363 872792 906263 949800 989717
8621 989717 1006508 1012252 1033274 1010933 969943 934709 962233 977255 1007548 1084285 1117502 1192004
8609 1192004 1202902 1140207 1076581 1049678 984078 911278 939351 929463 872382 894766 873829 879324
8597 879324 891145 889038 886149 930534 957562 940099 942989 977473 983081 1011676 1003151 1013215 1064941
8584 1064941 1103099 1218547 1287677 1337938 1338644 1330285 1337251 1357686 1339729 1363466 1465121 1570612
8572 1570612 1730652 1827025 1911026 1914553 1872295 1792402 1701387 1681279 1673675 1687176 1706543 1722636
8560 1722636 1739137 1773429 1774854 1791785 1805764 1830606 1833393 1830418 1881942 1915378 1920149 2010929
8548 2010929 2097859 2180781 2307293 2435145 2531675 2662296 2737273 2820939 2910564 3011993 3084846
8537 3084846 3179430 3368051 3538308 3701048 3951853 4193530 4436364 4678359 4919274 5190126
8527 5190126 5486596 5843947 6330312 7012174 7968143 9365812 11665645 15115748 19308798
8518 19308798 23114692 25556460 26061373 25056682 23276814 21516082 20439013 20615940
8510 20615940 22469286 25843548 29487000 31869506 31990284 30109061 27028381 23416349
8502 23416349 19977752 17122663 14975538 13510303 12561413 11855752 11242197 10705373 10195173
8493 10195173 9616994 9114038 8671300 8323413 8027380 7909133 7893090 8031821 8326989 8832049
8483 8832049 9561938 10681181 12427448 15237380 19176273 23229412 26226385 27464076
8475 27464076 26929010 25322001 23558434 22192964 21750474 22815572 25532661 28985881
8467 28985881 31722618 32556236 31135588 28204065 24602876 20896145 17617120 15036874
8459 15036874 13157894 11867480 10990675 10278055 9544770 8812945 8089098 7363194 6715578
8450 6715578 6267015 5898646 5528625 5179543 4932838 4641769 4439419 4271478 4083090 3892625
8440 3892625 3773108 3605440 3469832 3468246 3406549 3432885 3577684 3631528 3680588 3712614 3651052
8429 3651052 3560548 3497168 3388218 3238141 3174631 3074842 2925775 2871261 2789426 2717698 2692496
8418 2692496 2694965 2690527 2678133 2703535 2689740 2633064 2647901 2627260 2525037 2501207 2520288 2497938
8406 2497938 2493583 2533217 2543420 2562793 2556196 2497278 2440067 2449390 2457839 2444282 2460327 2502606
8394 2502606 2511193 2577464 2630886 2727841 2780710 2837770 2915516 3014285 3146482 3212399 3331574
8383 3331574 3520608 3704221 3913852 4280143 4722948 5373256 6337901 7806263 10004199
8374 10004199 12554612 14465459 15090884 14739118 13785195 12553613 11445926 10800941 10776550
8365 10776550 11584342 13033581 14280926 14550964 14002933 12896167 11427259 9951654 8618364
8356 8618364 7493972 6660445 6046396 5518456 5271913 5243795 5210394 5252866 5389018 5523569
8346 5523569 5734417 5926382 5969332 5915524 5914887 5873681 5907722 6048131 6305966 6775416 7449232
8335 7449232 8239839 9214818 10585129 12617067 15084545 16911417 17441730 16985818 15967374
8326 15967374 14753785 13801402 13301505 13501994 14671773 16592803 18603623 20362288 21887658
8317 21887658 23097774 23333740 22211675 20372074 18297364 16206577 14484822 13491849
8309 13491849 13331990 14063880 15445717 16521153 16677931 16067438 14992520 13531966 11998487
8300 11998487 10591889 9367178 8335774 7580227 7040588 6692597 6634245 6740941 6890918
8291 6890918 7019009 7053239 7026305 6953323 6812411 6514356 6294083 6205832 6134745 6182942 6350924
8280 6350924 6685407 7239047 7949412 8805575 10104294 12030406 14190455 15592338 15794003
8271 15794003 15176055 13981698 12626956 11529610 10935052 10956879 11803216 13129163 14061139
8262 14061139 14127712 13358208 12032750 10478796 8947254 7465027 6367617 5542607 4830259
8253 4830259 4339195 4005652 3734411 3617444 3573280 3526831 3579496 3666477 3725190 3666147 3529591
8242 3529591 3308333 3131403 3019463 2924970 2902042 2961338 3085001 3177855 3164692 3052121
8232 3052121 2839092 2625572 2447662 2253390 2065146 1997091 1887406 1785109 1751147 1687219
8222 1687219 1632009 1562573 1497456 1346588 1288574 1237708 1155723 1098419 1082466 1060300 1060272 1037024
8210 1037024 981842 936390 931710 906831 840128 760123 765797 726726 709672 730146 691678 640732
8198 640732 694924 624900 575112 588795 566814 357930 136016 483251 598385 655698 614638
8187 614638 559395 586925 575758 547882 560047 574292 544457 529314 481508 480380 439873 460743
8175 460743 463600 435833 443412 473179 449167 398839 388764 384632 392674 432988 401698 357321
8163 357321 408222 405615 365067 405123 413414 414567 407060 399085 332869 374575 418904 365068 361130
8150 361130 394948 379607 393139 419865 458991 475406 456793 493201 495492 512110 526007 452749
8138 452749 489258 510710 460964 480469 494876 403568 359641 375688 314328 338018 363001 312569
8126 312569 291522 304438 264094 262347 286848 216305 196026 207007 195283 202651 215375 203133
8114 203133 216781 185150 154978 214943 210562 237681 304543 248070 266842 346136 288014 270765
8102 270765 322949 257904 279400 341460 261758 299872 391444 336383 288564 320271 256248 223488
8090 223488 241097 218937 179389 201260 174907 154323 178686 152368 135121 120347 107854 96248
8078 96248 55670 99286 80917 69433 105285 97014 71292 106565 114568 97776 82184 67237
8066 67237 55884 68129 51875 43329 53426 57637 89425 68627 93915 116581 117204 61242 68180
8053 68180 52778 42843 100813 73695 63654 70043 56810 46529 94445 62069 50074 81734
8041 81734 57687 67155 80225 83799 47545 92159 88871 74481 107215 82898 31530 51079
8029 51079 43096 51251 81144 36804 9540 48683 41179 57190 77314 53988 41284 71955
8017 71955 60088 67950 119802 78328 160746 181868 161051 214288 228957 212292 280830 227080
8005 227080 188210 233768 261439 305348 380269 397531 382237 407082 360852 311697 303190 330221
7993 330221 302137 291564 315815 302584 333462 316150 285352 276376 242699 218429 177067 189342
7981 189342 219034 178325 146923 162111 126856 118346 130722 91814 110296 160423 144064 164219
7969 164219 221865 222701 238058 280763 256365 270551 257220 247860 288062 324687 336812 396405
7957 396405 422817 415909 410836 384449 350236 332772 313468 302800 321730 274145 314248 366374
7945 366374 336757 310968 316939 297522 252339 250749 171942 166961 171560 138471 133315 119784 112766
7932 112766 82126 117869 90955 126875 105110 63804 73424 66600 39005 55412 43899 11954
7920 11954 50870 20574 62808 60562 53173 82048 42212 24644 23879 26492 -2383 34691 11215
7907 11215 14743 34495 -660 21536 49624 73688 47748 63205 58959 76659 43803 29903
7895 29903 76559 54850 27908 69545 73082 61083 93561 57511 3552 1774 -42899 -17032
7883 -17032 40503 26721 -50727 -7477 11781 -7775 14132 -6606 -15165 -19120 -50274 -59105
7871 -59105 -40921 -42315 -34709 18680 6144 -24481 -19170 2705 -6367 38275 26824 1333 -26394
7858 -26394 -88432 -71078 -29480 -63812 -30383 -34784 -74983 -7453 -3179 10913 30138 -7166
7846 -7166 -30011 -8374 -8738 7325 8429 -26475 -72893 -57242 -14032 -46406 -46120 -20278 -40606
7833 -40606 -15682 -70910 -27687 -32584 -5444 10657 -9515 -9623 -5413 176 -3691 -1291 -35432
7820 -35432 -31485 -32567 -80124 -73750 -40844 -27969 -36330 8074 5408 -18685 -72137 -59830 -69679
7807 -69679 -64861 -55251 -25859 -16969 25135 84657 23124 16318 10915 -1640 54636 8998 -27705
7794 -27705 -36412 -20654 -27591 -17220 -10256 -48139 -45681 -3643 -38685 -71541 -59264 -71424 -48254
7781 -48254 -77308 -67652 2013 12104 -60861 -97454 -81412 -47795 -66838 -42058 -48229 -47260 -48885
7768 -48885 -44859 -1883 561 -27160 -10625 -59639 -31365 -23796 -44083 -61942 -75267 -102284
7756 -102284 -52077 -23261 -47218 -55479 -84104 -76256 -53706 -26128 -25415 -26478 -57602 -56687 -23744
7743 -23744 -112070 -109267 -59220 -41280 -30798 -20621 -14614 -8636 3451 -33048 -58248 -65782 -81490
7730 -81490 -59745 -28772 -38729 -28240 -30740 -36799 -5888 -23245 -16399 -6875 5679 1472 -11561
7717 -11561 -42814 -28345 40971 4411 -7385 11959 15093 975 27402 19913 11051 21950
7705 21950 -30195 -27681 -29824 -45614 -55153 -48807 -30218 -16910 -38615 -37141 -15571 -7659 20212
7692 20212 -59690 -80309 -69676 -28892 -15808 12057 22434 -15301 16835 22502 4543 -23673
7680 -23673 18986 -7978 -43700 -22293 -60907 -36090 -59227 -77592 -60692 -41154 -36194 -56471
7668 -56471 -54253 -50571 -64500 -81376 -27281 -31705 -44115 -24957 14490 -23652 -24311 17045 -11410
7655 -11410 -8737 -15729 -17368 8909 35926 9709 29976 37873 -17267 -13353 -14928 -32835 -20237
7642 -20237 -6504 -16728 11133 29114 23739 35807 18194 21143 62734 65173 45644 46462 16742
7629 16742 44097 51831 11079 5681 20911 36866 9701 34824 14355 3358 40023 958
7617 958 41856 73326 12031 -18728 12579 -22841 -23447 -59527 -53152 -25105 -27476 -46892 -32464
7604 -32464 3983 33668 -18540 -35249 -13740 -5797 20270 5798 12400 -3600 -26320 -11724
7592 -11724 -35012 -20269 15453 -2538 26915 17130 -160 -743 31429 -37863 -22681 2468
7580 2468 -16396 -453 637 3143 5759 -11059 -14347 29581 1644 48285 65338 34754 38988
7567 38988 413 29346 32708 49801 36380 90024 96005 104727 170831 181739 222468 293701
7555 293701 292064 264868 316635 297230 235561 269924 242111 172402 234405 213034 208364 223102
7543 223102 208563 198869 204621 204747 196765 215451 194064 165185 156194 109999 122681 107645 84989
7530 84989 89142 84903 80870 89186 75080 48147 59481 31760 65574 92298 67138 56513 57014
7517 57014 49454 18992 59382 77594 57795 70533 105821 93305 97931 125539 111247 121507
7505 121507 114588 83218 107852 130928 133226 150896 192599 173241 155888 183295 197974 188923
7493 188923 207328 201868 197660 225773 209155 221207 231891 218165 179542 215804 186041 153335
7481 153335 169279 148195 135843 168893 125454 90850 115220 136950 156217 136411 147900 169626
7469 169626 227585 259815 300974 326304 256287 276606 320997 291337 270167 305892 276014 237928
7457 237928 230239 164768 181033 177361 101949 116111 149608 105616 78537 166460 127520 136590
7445 136590 137924 101706 105888 116032 74950 85995 117840 82240 122620 169075 150938 131369
7433 131369 120665 90826 128573 172032 164523 170012 168052 175694 207351 221054 259031 234746
7421 234746 254732 283512 293642 322220 365245 360998 369727 328493 330533 359260 324991 331864
7409 331864 362922 348578 299621 317572 273622 243775 279908 248641 200277 235391 206115 160425
7397 160425 227568 208129 193125 248331 172371 155051 219762 203193 193047 240246 230224 192917
7385 192917 213415 218151 193737 263903 273413 196622 276565 254859 251034 280371 249974 248236
7373 248236 272532 194884 207056 262034 228546 281004 311962 309915 367561 439895 430374 468897
7361 468897 499330 449848 498133 529658 522386 531793 568796 569126 646242 666432 652885 696022
7349 696022 735629 818818 895034 998560 1034173 1106759 1198344 1192309 1182547 1228560 1257054 1250002
7337 1250002 1243371 1175692 1095662 1109587 1123813 1112250 1098961 1104573 1093582 1169997 1226359 1234016
7325 1234016 1256405 1243832 1221660 1142979 1051117 950284 911306 868097 786893 738647 692624
7314 692624 654965 640080 637677 642247 651743 599662 618478 642575 607028 609785 647733 598277
7302 598277 581708 609795 552367 525618 545434 521464 507093 545670 497030 476419 514718 468463
7290 468463 508825 581789 563768 603260 671261 653229 657035 679779 675925 733342 723539 706241
7278 706241 714404 706318 627894 591669 549854 552450 526901 462400 485103 448398 415583 388995
7266 388995 383853 353226 356729 339722 296976 322965 318156 302810 313240 306007 275759 276612 287100
7253 287100 246464 270449 241552 220545 220192 226579 198539 208212 227019 224564 194372 175871 238040
7240 238040 228080 196872 160712 183496 196464 190498 160532 131657 135720 117378 147694 202442
7228 202442 215112 179425 215167 165603 178983 233470 211821 223012 199077 174898 155526 193950
7216 193950 188338 181017 171505 160566 177159 191501 209669 250964 241012 243425 268248 261115 286438
7203 286438 334715 255048 248975 316934 310381 318194 326573 299827 261854 230428 185622 179686 166682
7190 166682 191580 177436 177986 142524 131422 133405 94550 110975 114345 147631 145835 116429 120110
7177 120110 149405 102067 126543 122299 74961 108120 125191 96004 66751 73883 45168 89357
7165 89357 107602 113496 109020 105193 116289 113631 154615 101974 144129 143895 103158 100357 76386
7152 76386 78863 78118 44607 58134 65468 19457 30720 16739 5897 19942 38398 9530 18689
7139 18689 43127 23585 50067 96775 35428 36732 53458 49576 79299 104477 30737 10765
7127 10765 21645 18323 39239 57257 59145 26475 719 1908 5243 -2420 48499 72494 137744
7114 137744 201330 199034 161587 161274 161840 126599 139210 111584 59245 36553 43133 20307 23478
7101 23478 33610 2976 24148 10580 14757 -5291 -24960 -8810 -22982 -56270 -46161 -45082
7089 -45082 -6937 19978 -30846 -19842 15529 -18032 -53919 -37847 -15345 -30608 8679 -34847
7077 -34847 -57543 -20950 -22088 -30193 4696 -18606 -78903 -25978 -46484 -53933 -20570 -38579
7065 -38579 -35756 -35895 -45554 -17635 22657 6120 -28493 -52488 -28424 10162 3016 5950 1677
7052 1677 -54348 -32707 5838 -40306 -79425 -32996 -12052 -29252 -56344 -67153 -58709 -23412
7040 -23412 -25725 -21277 -9226 -19123 -23738 -41483 -22724 -45258 -41910 -48558 -17680 -36194 -27705
7027 -27705 19033 8182 -6210 11651 -18102 -27785 25840 -19043 -11500 -11362 -59250 -15607 15441
7014 15441 -9568 -19272 -7631 -32043 -9353 -559 -31632 -31287 1999 -2805 -22970 8641 14066
7001 14066 34445 23875 -2815 18235 -9920 -4631 -20318 -23687 -22938 4549 -16320 29400 49668
6988 49668 65797 58542 38675 29307 10828 8983 -10459 18389 21583 18536 29375 25888 -33565
6975 -33565 -15440 9256 11954 13237 -33788 -2263 16080 -5647 12955 18101 -11416 12516
6963 12516 13895 -5709 1686 -29310 -6461 20056 47528 37062 57448 38506 -3867 27005
6951 27005 -21760 -10204 39985 31283 5574 59112 100123 48413 47608 28236 13332 20263 27186
6938 27186 30734 23789 12234 31296 26471 17625 37315 26176 24025 46533 13039 13733 59182
6925 59182 37485 8294 28280 -1864 -10707 13954 49080 29896 64622 17749 -13174 12533
6913 12533 4924 -27486 -12829 -4608 -36034 -32108 -60634 -607 25054 -1181 -28486 -15353
6901 -15353 -28147 -63763 -22881 -27530 -11956 6894 -52362 -33351 -15546 -10342 19172 -2278
6889 -2278 -30137 -14805 -6330 -38660 -30712 -36565 -49432 -29269 -13752 -64108 -78051 -43907 -66878
6876 -66878 -44367 -5198 -53634 -37264 -30089 -7402 -10283 -4364 660 -44062 5574 21905 -859
6863 -859 42464 -27669 -40696 32321 -6300 -9699 24108 -2738 -9457 27754 -26262 -41810 -16500
6850 -16500 -16058 -49956 -31500 -49594 -37278 7110 -24750 -48900 6135 -40854 -11875 21390
6838 21390 -20848 -18632 -5672 -46136 -64431 -1572 -1089 -1224 49314 -14839 -21624 49525 -20326
6825 -20326 -43646 8190 -13216 -35391 12619 6039 18405 77050 6439 -11101 16048 2867
6813 2867 -18632 -13250 -17781 -41369 -6645 -51882 -77530 -30641 -38852 -42093 -31070 -46661 -48257
6800 -48257 1212 -37059 -42032 -5015 5013 14261 22975 724 -9900 18109 -34463 -11612
6788 -11612 6566 3802 3213 46148 31827 22828 58620 50808 9235 76767 45607 58064 115493
6775 115493 87270 75567 115987 128303 141559 172107 158965 156974 189882 180631 109903 120544
6763 120544 119329 87965 114868 105494 53950 118074 79780 66400 61454 67764 42051 35935 20686
6750 20686 23240 22488 17369 28118 38375 70902 65210 50783 29217 15497 19366 653 -1926
6737 -1926 14829 -9301 31288 25129 31777 42814 34049 2678 -24540 -22046 -14156 -22970 6619
6724 6619 -10357 709 7603 -2900 23097 7463 9194 29599 31100 22113 30833 21624 22216 37987
6710 37987 48030 19492 13851 19960 -30541 -31302 29295 15009 27613 41699 18045 -30132 -6356
6697 -6356 -20064 -58184 -58346 -66321 -41887 -42974 -29466 -9315 -5527 -21599 1893 -2434 -32422
6684 -32422 13060 31663 7562 33298 35898 -8510 -36287 -29409 -13184 -31341 -40425 -25444
6672 -25444 -30205 -23660 -48638 -50551 -42566 -31593 -12544 28241 1486 -29244 43502 67377 5877
6659 5877 -11941 -14985 -1945 24747 15728 5831 -35716 -24109 -15935 -1766 4600 -4096 -1287
6646 -1287 27963 25781 5260 -15294 -38265 -48457 -39792 -61795 -52125 -29031 -9748 -5521 -35536
6633 -35536 -9712 -15474 -5521 17902 42316 23843 39133 72778 62894 36632 24420 6679
6621 6679 19391 50046 10019 23185 35633 10603 46892 53384 17656 12794 27415 12373
6609 12373 30541 48521 58181 34037 49974 54178 48196 34795 17901 66771 59923 47765 43572
6596 43572 59084 51556 105640 111866 52376 53175 72798 111412 97098 84751 62027 76609 89102
6583 89102 28111 49843 90123 77581 71625 47895 55837 95405 75627 55820 72944 105005
6571 105005 57782 69679 96594 101938 136278 160208 146934 158350 174706 186603 164446 158799
6559 158799 132291 136663 175836 156791 191576 228209 240157 252703 256165 251710 283216 309063
6547 309063 299927 279797 329230 312809 311584 357963 372977 350051 409142 401684 443007 502807
6535 502807 510651 580080 623903 611523 655972 723787 741113 800231 832604 850823 873823 850614
6523 850614 845057 814148 780852 777801 752292 726983 692755 680426 660303 635589 655511 640656
6511 640656 591372 601806 552079 548545 546095 556606 569028 596715 579926 580329 602014 628046
6499 628046 619608 618507 653863 597418 602273 641743 646160 675123 643795 631479 652955 643212 616896
6486 616896 567007 590125 602864 594007 568047 584951 600218 594273 675989 719538 731325 788531
6474 788531 841329 866945 954579 999260 1011352 1043659 1033184 1029504 1073736 1086806 1079552 1098683
6462 1098683 1112997 1073271 1104063 1114616 1034886 1025158 1025093 1007965 1036877 1064046 1069035 1060749 1051591
6449 1051591 1039278 1042864 993715 930510 849486 797195 784592 748317 747042 710103 662123 620095
6437 620095 659449 694963 671841 626898 656264 709012 766358 860517 957739 1053824 1182163
6426 1182163 1282863 1316034 1318883 1240870 1148379 1107022 1011724 933614 905081 881959 813829
6415 813829 770494 766822 728454 774588 784396 736552 772870 790091 799469 849620 912242 946538
6403 946538 983070 1042202 1049782 1063954 1062957 1007499 972384 966979 922936 890529 910062 838045
6391 838045 813877 783811 765337 772295 761321 730140 743003 723626 744788 767570 740479 773222
6379 773222 756829 722452 727671 761951 816540 805325 816173 808179 822645 870297 861781 892839
6367 892839 899298 872387 909695 940453 924808 981831 1025065 1067029 1112528 1157909 1217524 1222346
6355 1222346 1262517 1355525 1387882 1440268 1489849 1535755 1537417 1567687 1603532 1538281 1522442 1565788
6343 1565788 1526535 1521655 1570615 1532659 1555415 1558179 1534421 1550080 1563475 1582128 1592499 1633261
6331 1633261 1610667 1652666 1719638 1748020 1772352 1812401 1848762 1825577 1891761 1919617 1959512
6320 1959512 1999860 2045175 2109239 2149135 2236157 2258021 2298299 2375877 2443778 2393882 2446614
6309 2446614 2457874 2449547 2511627 2549000 2552862 2594675 2652258 2675800 2740822 2805244 2868891 2977458
6297 2977458 3118278 3276849 3482664 3796002 4236949 4638066 4870881 5047576 5017135 4957454
6287 4957454 4916569 4764894 4705985 4774739 4844373 4998625 5396424 5708693 5852748 6009977
6277 6009977 6087307 6190048 6443486 6697965 6967762 7338440 7544435 7542092 7509306 7431702
6267 7431702 7304807 7231340 7321698 7495442 7738923 7951725 8034381 8102396 8208512 8300279
6257 8300279 8469700 8741829 9170004 9725366 10479129 11337319 11958849 12470269 12950782 13447876
6247 13447876 14097348 14983245 16269755 17980730 20215714 22799346 25522021 28136980
6239 28136980 30344962 32100459 33459132 34289377 34455098 33818774 32603046 30986495 29130924
6230 29130924 27405680 25877596 24569412 23757171 23318736 23195722 23615486 24527503 25966446
6221 25966446 28150792 31205002 35239907 40336096 46239776 52090696 57250677 61349958
6213 61349958 64234994 66162276 66796355 65529811 62557668 58273017 53077561 47753018
6205 47753018 42657606 38180653 34455145 31492806 29276534 27681598 26695398 26332092
6197 26332092 26542011 27380136 28896534 31078500 33793245 36741515 39435645 41608192
6189 41608192 43373440 44679839 45383511 45359362 44528147 42921666 41032927 39281845 38089939
6180 38089939 37888989 39349990 42947688 48338914 53502280 56004305 55392781 52643119
6172 52643119 48587865 44001812 39876596 36757620 34801434 34283022 35728978 38972696
6164 38972696 42858000 45511904 46215061 46139649 46289696 47371396 50060099 53973510 57325572
6155 57325572 58470007 57236110 54301527 50554697 47063470 44888240 44695561 46216246
6147 46216246 47326732 46471735 44154778 41136004 37983254 35290799 33670413 33559594
6139 33559594 35292720 39405897 45637749 51883271 55262095 54779911 51425106 46318336
6131 46318336 40410104 34596295 29515900 25430764 22143299 19582444 17762682 16356391
6123 16356391 15293810 14484803 13808183 13151194 12528753 11979104 11433071 10970306 10517117
6114 10517117 10043127 9640583 9391755 9122261 8869753 8698847 8572128 8464278 8479790 8587201
6104 8587201 8703331 8991297 9355446 9748782 10159611 10630786 10949525 11209786 11390196 11367621
6094 11367621 11225571 10939118 10498886 9892417 9256165 8598887 7950794 7411516 6912686
6085 6912686 6442567 6114183 5858905 5623045 5450883 5360064 5304473 5309501 5435526 5543792
6075 5543792 5691273 5929708 6089487 6230768 6336635 6363876 6242839 6089167 5885968 5565487
6065 5565487 5231161 4852811 4450270 4094175 3834803 3575389 3312645 3135903 2981755 2848384
6055 2848384 2768477 2687991 2605555 2564216 2533563 2518871 2449683 2423103 2367228 2288646 2249773
6044 2249773 2186501 2097458 2045221 2016425 1976052 1962702 1942783 1863856 1805646 1788166 1714489
6033 1714489 1657721 1640735 1527399 1478861 1474321 1470345 1402717 1382659 1392710 1345638 1363331 1329308
6021 1329308 1312016 1317420 1331310 1279192 1284642 1301746 1246783 1208010 1226160 1183445 1147287 1164060
6009 1164060 1136849 1069217 1077600 1032379 987575 1011238 1018845 1001747 1031658 1001517 979778 984930
5997 984930 976888 947958 928826 931102 864469 868719 857502 883644 827611 805363 833379 805351
5985 805351 785625 796875 791177 761213 823465 773004 774596 811481 774709 741630 755306 774632
5973 774632 741890 793696 817545 767310 770299 801959 756133 779709 788479 744858 779542 798965
5961 798965 766344 729904 748036 723502 701049 749455 772758 748018 773192 783843 787100 801997
5949 801997 758102 734768 750179 768536 794086 817282 829868 819172 804960 812729 852884 859537
5937 859537 821513 853380 860440 892892 907433 893619 897927 931226 928693 889416 921322 942990
5925 942990 930011 971601 1012844 988226 1046019 1049344 1002586 1016879 1042120 1035679 1026942 1073232
5913 1073232 1039685 1068708 1144790 1128011 1105069 1140007 1157922 1229970 1327504 1330661 1393928 1426431
5901 1426431 1469056 1494349 1520070 1536365 1545243 1554172 1545073 1536669 1523433 1542656 1544607 1559073
5889 1559073 1541312 1562312 1558634 1549348 1610532 1608969 1638089 1662974 1712292 1717393 1763162 1790139
5877 1790139 1802114 1869163 1849233 1862855 1902721 1924293 1919527 1960589 1972043 1993855 2093779 2131607
5865 2131607 2138796 2194181 2263807 2209345 2269867 2334714 2312739 2357824 2409366 2462292 2506140 2559602
5853 2559602 2548724 2618061 2699631 2770444 2865412 2943983 3002421 3072880 3124176 3156621 3192248
5842 3192248 3216987 3270026 3316097 3324632 3366879 3400714 3438787 3521872 3625313 3657953 3740430
5831 3740430 3831741 3803834 3805576 3853138 3830529 3848385 3881643 3871986 3906435 3965028 3962455 3996177
5819 3996177 4037204 4036018 4072830 4131562 4161215 4180820 4198564 4244257 4205831 4238446 4319726 4323572
5807 4323572 4388270 4489781 4526389 4556606 4625779 4675076 4722361 4763131 4770537 4775593 4860426 4907674
5795 4907674 4945598 5049675 5052160 5092412 5126619 5143044 5214608 5258159 5339722 5464111 5609346
5784 5609346 5692581 5814731 5827323 5892142 6005961 6077893 6155583 6286871 6395397 6504518
5774 6504518 6685265 6782627 6953953 7230928 7423506 7643908 7975855 8268177 8597463 9034211
5764 9034211 9430297 9927480 10565441 11280410 12115470 13208345 14456527 15978897 17951859
5755 17951859 20222267 22873801 25857512 29115943 32235393 34904533 37011428 38643500
5747 38643500 40067915 41173430 41652779 41202278 39719557 37485370 34992436 32503666
5739 32503666 30354030 28648000 27525780 27020592 26976304 27407660 28280270 29720544 32050936
5730 32050936 35549050 40410322 46378866 52531280 57781614 61581375 64204064 66203568
5722 66203568 67440192 67473445 65894308 62562604 57816205 52561655 47249041 42278235
5714 42278235 37891398 34127430 31031372 28604296 26859276 25721218 25309629 25427584
5706 25427584 26068543 27271205 28909822 30781297 32680912 34142431 35011567 35508081 35606824
5697 35606824 35272593 34478615 33003117 30894547 28411661 25779692 23179774 20838812
5689 20838812 18791267 17087085 15712545 14568561 13614032 12832978 12166633 11559558 10977011
5680 10977011 10400833 9946753 9566904 9171821 8846078 8552781 8274700 8050789 7822408
5671 7822408 7616753 7528990 7466552 7418413 7454307 7448488 7439630 7451094 7422085 7342086 7206696
5660 7206696 7070547 6857915 6662679 6482405 6368853 6174321 6048811 5932917 5826730 5776970
5650 5776970 5688301 5679849 5637284 5572949 5530629 5542077 5547350 5547664 5531529 5574666 5606853 5673351
5638 5673351 5663441 5701533 5838573 5936564 6096580 6206043 6269080 6303378 6388178 6393655 6392451
5627 6392451 6443200 6420309 6433342 6476347 6498225 6524797 6625968 6652169 6778399 6915025 6988574
5616 6988574 7131447 7300604 7455983 7637118 7890405 8021019 8230788 8533511 8772817 9082745
5606 9082745 9448990 9836285 10370916 11044515 11673291 12332679 12896239 13366258 13923708 14486774
5596 14486774 14964854 15575478 16280981 17041512 18031098 19181525 20551673 22258168 24434922
5587 24434922 27367356 31573316 37616189 45390329 53051615 57832252 58826026 57064963
5579 57064963 53534819 49289515 45381216 42449005 40977615 41393312 43923303 48160009
5571 48160009 52255654 54404480 54788620 54207030 53527594 53782147 55713383 59436065 63849787
5562 63849787 67032555 67736555 66096166 63096973 59935684 57775984 57334435 57791092 57353249
5553 57353249 55490802 52933873 50167963 47673997 46043839 45549943 46417526 48998413
5545 48998413 53518370 60062916 67294763 72791328 75514540 76266990 76075661 75871055 76349867
5536 76349867 77870238 80603189 84329021 88811271 94071197 100076890 106390230 112091868
5528 112091868 115945850 117194123 115861997 112543713 107906037 102649197 97049305 91217471
5520 91217471 85222568 79089275 73015180 67249710 61824855 56734762 52117140 47844866
5512 47844866 43923388 40415648 37179771 34277759 31786946 29513071 27437328 25677404
5504 25677404 24101786 22699091 21465807 20350199 19316848 18375003 17523991 16704050 15969577
5495 15969577 15295554 14637838 14032974 13479170 12946620 12450588 11944665 11471536 11014201
5486 11014201 10590613 10217437 9872349 9549600 9273927 8941776 8706119 8498607 8228108
5477 8228108 7974579 7786515 7564240 7425508 7288127 7122466 7003459 6918699 6808405 6664626
5467 6664626 6542245 6384102 6270648 6146068 6042347 5950290 5808197 5651908 5582637 5397833
5457 5397833 5253002 5147792 4990338 4829490 4737930 4577332 4429577 4389144 4292313 4159964
5447 4159964 4118365 4056555 3998761 3998449 3941273 3872655 3858299 3813217 3697394 3699084 3666974 3624819
5435 3624819 3606778 3568765 3549196 3527229 3545670 3475210 3452827 3399743 3378627 3402536 3407994 3434910
5423 3434910 3439397 3445743 3442948 3376663 3364233 3315268 3201075 3191612 3133072 3059745 3040529 2976778
5411 2976778 2949295 2966823 2950517 2939642 2937802 2922634 2934582 2880513 2876533 2863170 2889500 2900383
5399 2900383 2840784 2888730 2861820 2832182 2843364 2792635 2761698 2778624 2712407 2707139 2685844 2595512
5387 2595512 2633731 2597184 2498422 2500921 2486370 2416070 2394780 2382721 2334159 2336156 2363855 2279687
5375 2279687 2255076 2303861 2271857 2257222 2297341 2306573 2318223 2302090 2236843 2226134 2198026 2143603
5363 2143603 2070254 2032397 1983661 1947973 1885704 1917406 1898418 1869210 1875049 1856615 1857506 1894481
5351 1894481 1874272 1813950 1835728 1878561 1873031 1930857 1992153 1985303 2043064 2129940 2243873 2442197
5339 2442197 2588653 2687185 2649363 2611661 2537772 2424528 2234892 2102200 1976418 1871189
5329 1871189 1852441 1763051 1687774 1713452 1700528 1623029 1627857 1602254 1535668 1547561 1538794 1485605
5317 1485605 1515024 1515404 1466029 1522907 1526549 1513231 1526569 1501219 1491255 1460312 1481048 1475951
5305 1475951 1469734 1439227 1452379 1440195 1397703 1386802 1347164 1380117 1395032 1369233 1353416 1368521
5293 1368521 1359718 1372744 1442125 1434229 1455207 1461068 1425805 1396096 1420438 1414706 1378751 1345526
5281 1345526 1316174 1343033 1355901 1328134 1346213 1352647 1360115 1358675 1356312 1369155 1417576 1377785
5269 1377785 1352302 1406720 1413342 1380909 1449198 1411637 1406742 1462465 1422478 1482975 1530994 1552970
5257 1552970 1622034 1623481 1580061 1592089 1661333 1645857 1637015 1669565 1639022 1640939 1731113 1718725
5245 1718725 1765498 1901203 1980394 2204071 2511412 2880358 3236844 3256485 3202318 3074701
5235 3074701 2825316 2596666 2423243 2256780 2167168 2131223 2094115 2092776 2103046 2061390 2111893
5224 2111893 2175841 2171639 2194666 2173697 2219924 2282142 2313358 2306421 2337276 2320039 2306040 2249962
5212 2249962 2196121 2185591 2167112 2109130 2087158 2090320 2038638 2096580 2119061 2047541 2040612 2109255
5200 2109255 2099652 2136171 2189257 2133941 2184197 2189272 2163179 2220130 2281987 2281142 2315440 2411744
5188 2411744 2426581 2512649 2603815 2676709 2808295 2933938 3060473 3223963 3399703 3566397
5178 3566397 3789255 4007878 4336409 4671762 4961165 5281177 5499746 5643482 5725021 5707958
5168 5707958 5535481 5337224 5091106 4863043 4615212 4332027 4081822 3885889 3754297 3581192
5158 3581192 3487082 3369690 3270348 3204900 3132164 3081409 3043736 2954784 2921222 2872197 2803880
5147 2803880 2821221 2812381 2775983 2769024 2698836 2635087 2632762 2621338 2548661 2568690 2497956 2409901
5135 2409901 2427893 2397958 2359021 2390174 2359826 2343307 2389954 2313154 2291252 2294337 2261577 2260762
5123 2260762 2269464 2268018 2283498 2335381 2263361 2254690 2272149 2236677 2268762 2306417 2241724 2276722
5111 2276722 2319497 2325079 2413269 2445474 2436317 2523238 2579041 2642245 2795318 2937986 3008262
5100 3008262 3057780 3050365 3044497 3088453 3145729 3186558 3362728 3557679 3869688 4284069 4718830
5089 4718830 5434649 6765760 9158717 12449055 14508402 14361990 13414358 11916683 10107106
5080 10107106 8460195 7162099 6211640 5555584 5087611 4727392 4513603 4381511 4282542
5071 4282542 4291416 4389677 4467140 4428888 4307349 4174190 4006314 3752756 3558164 3385608
5061 3385608 3245594 3195594 3140875 3130005 3173010 3185486 3243839 3327764 3299164 3286684 3320148
5050 3320148 3260468 3375853 3494168 3626574 3817898 3956195 3913162 3830227 3788598 3646289
5040 3646289 3555941 3549334 3462066 3430339 3403491 3308410 3344289 3417016 3388882 3451440 3487434 3417902
5028 3417902 3415329 3428462 3361101 3405314 3416381 3453996 3593081 3647074 3725124 3885606 3966923
5017 3966923 4132749 4330925 4385124 4444973 4519248 4475437 4480712 4522472 4517794 4513647 4560204 4626475
5005 4626475 4734642 4874030 4963120 5013202 5099294 5130661 5178975 5227183 5250924 5270650 5233312
4994 5233312 5240220 5292747 5295883 5371357 5457688 5558385 5663648 5799865 5884863 6025526 6152578
4983 6152578 6263570 6372514 6490844 6581109 6676642 6785162 6945537 7131306 7394604 7644268
4973 7644268 7959280 8244924 8620966 9073367 9466702 9886811 10356583 10803987 11349982 11966455
4963 11966455 12636570 13515479 14617303 16070249 17728180 18979030 19672724 20239984 20569777
4954 20569777 20761850 21118592 21536810 22031995 22779307 23687999 24877581 26416068 28020466
4945 28020466 29501557 31109974 32759204 34647979 36774274 39393981 42388627 45600364
4937 45600364 48278169 50671633 52874434 55478977 59444438 65904313 75452433 90030605
4929 90030605 113876111 158302004 230465107 304357856 332975095 322915771 297755959
4922 297755959 260024832 218147999 180302037 150972070 128490675 111316409 97892626
4915 97892626 88175689 81386081 76669983 73077565 70360074 68300666 66996455 66220886
4907 66220886 66265639 66860198 68028552 69613753 71341955 72988202 74494751 75506901 76065472
4898 76065472 76093124 75585830 74573101 73456378 72297211 71394432 70899449 70964362 71810222
4889 71810222 73645774 76176995 79146127 82144062 84554877 85913356 85925750 84302541
4881 84302541 81151593 76739491 71507638 66066225 60941111 56401741 52740287 50017543
4873 50017543 48356388 47916946 48911821 51455901 55503297 60261829 64254252 66325002
4865 66325002 65778350 63018225 58771546 53656616 48532967 43769600 39560350 36020683
4857 36020683 33142342 30822956 29005814 27662711 26700138 26068176 25730514 25648045 25792985
4848 25792985 26179682 26678315 27257622 27719010 27857189 27674979 27018888 26024018 24898604
4839 24898604 23589837 22327742 21163113 20066067 19182492 18433248 17864087 17446828 17154758
4830 17154758 16886486 16610511 16365955 15946418 15434792 14806973 14099130 13367976 12704159
4821 12704159 12073279 11568285 11188289 10882124 10643782 10437567 10252682 10102515 9962449
4812 9962449 9830021 9815207 9785088 9745204 9815960 9834745 9941458 10076147 10234637 10468114
4802 10468114 10749160 11047568 11506517 12034284 12632075 13519782 14611611 15991307 17810590
4793 17810590 20025044 22660316 25670084 28903581 32305358 35801849 38904303 40708731
4785 40708731 40468258 38637544 35768092 32324682 28684372 25286014 22291467 19636931
4777 19636931 17364885 15473454 13912259 12628106 11606634 10772094 10108148 9555443 9070430
4768 9070430 8700031 8349588 8024285 7771840 7548750 7306251 7105530 6926966 6702496 6527617
4758 6527617 6336012 6173156 6066147 5934059 5848939 5766142 5600370 5484788 5416705 5256044
4748 5256044 5167764 5099578 4988489 4916868 4881132 4764428 4779862 4775391 4722118 4719818 4715702 4628633
4736 4628633 4608500 4667792 4622228 4627324 4634265 4659719 4601071 4543007 4513680 4475444 4476664 4471466
4724 4471466 4482798 4461918 4409982 4408178 4359037 4336442 4306478 4315209 4284764 4248000 4165503 4118058
4712 4118058 4056441 3981881 3991293 3961310 3994722 4023873 4001557 4002210 4010765 4001935 4042901 4026651
4700 4026651 4028837 4081892 4108502 4157006 4197727 4242702 4229974 4277411 4296686 4259588 4341777 4373402
4688 4373402 4395849 4447444 4441558 4406925 4485665 4467754 4487255 4533959 4494198 4522500 4564740 4563802
4676 4563802 4586903 4676352 4732617 4858930 4933927 5003476 5085949 5149630 5166829 5244225 5315304
4665 5315304 5339451 5418305 5475747 5515544 5623818 5772532 5918282 6100386 6349523 6511392
4655 6511392 6759233 7012963 7233027 7476155 7733117 7913585 8109928 8320667 8508726 8766363
4645 8766363 9000352 9289031 9594130 10055910 10507838 10917972 11386111 11849254 12353875 12905051
4635 12905051 13529885 14168987 14952189 15891380 17008314 18316735 19822724 21522048 23390804
4626 23390804 25462471 27673053 30184893 32983991 36164576 39933561 44447826 50146637
4618 50146637 57631643 67633717 81179678 100059220 126507333 161419616 199577853
4611 199577853 229372134 242119359 238089101 221681731 198221886 173113564 150164601
4604 150164601 131089438 115448242 102024712 90158331 79746072 70555741 62465164
4597 62465164 55494951 49527424 44576472 40606623 37588535 35329130 33537684 31941969
4589 31941969 30354428 28743106 27046350 25364553 23755718 22359372 21061674 19962055
4581 19962055 19071467 18307649 17633743 17078025 16490733 15845410 15267367 14615652 13939777
4572 13939777 13418076 12880057 12408532 12118569 11868410 11655451 11668207 11707746 11690188 11718577
4562 11718577 11667094 11445039 11246524 11006212 10686496 10461224 10166153 9954236 9795795 9712042
4552 9712042 9669696 9684418 9591485 9408635 9236328 8941871 8581444 8238835 7876248 7537052
4542 7537052 7201120 6821046 6499873 6295854 6032364 5794181 5636512 5422572 5283392 5212218
4532 5212218 5049106 4953629 4905248 4786509 4732664 4727425 4663468 4559326 4591911 4564382 4572314
4521 4572314 4640157 4656486 4632007 4691150 4686138 4604390 4585008 4536150 4413359 4401959 4412019
4510 4412019 4326982 4339301 4313111 4214294 4168163 4146556 4132071 4109076 4098413 4063346 4081729
4499 4081729 4075002 4036141 4002497 4025403 3968396 3943667 3913287 3824453 3828850 3779666 3767924 3852152
4487 3852152 3825992 3901797 4073593 4114444 4113922 4098989 4025104 3910007 3873908 3759424 3634214
4476 3634214 3659746 3593052 3474515 3538520 3454638 3287048 3230072 3107165 2944289 2911637 2835318
4465 2835318 2703428 2702114 2645554 2575577 2614322 2669472 2701564 2765859 2820801 2722238 2645283
4454 2645283 2575364 2478849 2376651 2335355 2237937 2188882 2139537 2090013 2049185 1992844 1963468
4443 1963468 1890211 1918451 1896674 1851731 1823177 1822609 1808809 1807049 1820857 1811316 1831546 1834264
4431 1834264 1817470 1798072 1831172 1844845 1841797 1816418 1783386 1734383 1692013 1713009 1700784 1631289
4419 1631289 1618652 1608331 1573234 1584623 1588081 1514472 1504711 1591000 1551560 1556583 1667981 1656801
4407 1656801 1677009 1765796 1727710 1729292 1798500 1763667 1812295 1896341 1942949 1927086 2017809 2086709
4395 2086709 2148603 2288066 2531858 2918331 3754616 4952329 5863119 6134052 5847688 5321641
4385 5321641 4653175 4029063 3561681 3260383 3173908 3180410 3195424 3253063 3272879 3165777 3027704
4374 3027704 2838614 2635573 2447504 2287118 2192205 2053822 2008823 1897498 1771519 1714926
4364 1714926 1708603 1634982 1641082 1733084 1746457 1718940 1728763 1659253 1535799 1505745 1412933 1390631
4352 1390631 1376435 1303915 1264305 1242731 1246693 1215761 1192931 1229415 1185822 1182032 1171733 1129146
4340 1129146 1159634 1113117 1087214 1115893 1111345 1075249 1090786 1107151 1142531 1132366 1130864 1123049
4328 1123049 1139104 1173058 1163183 1136142 1139649 1154048 1173305 1174136 1219000 1251844 1250841 1335813
4316 1335813 1361596 1359352 1450257 1498685 1543112 1684443 1788450 1868908 2063014 2170462 2162805
4305 2162805 2127211 2088881 1953523 1846043 1789867 1675819 1644230 1619071 1575979 1529206 1491096
4294 1491096 1481133 1415938 1353043 1281525 1260517 1216028 1209047 1251463 1219828 1249618 1287410 1270742
4282 1270742 1300675 1322188 1297785 1356426 1368187 1288275 1319340 1373431 1277080 1239054 1259101
4271 1259101 1224781 1213541 1233687 1152655 1133703 1176256 1106101 1072493 1106172 1101726 1097620 1041094
4259 1041094 1025451 1019257 1051447 1021988 1011609 1022745 997559 978526 999661 1020173 1011885 1044918
4247 1044918 1054714 1094043 1109669 1073004 1078182 1104571 1086900 1124879 1095560 1051903 1086352 1067540
4235 1067540 1043521 1062587 1083474 1051748 1082993 1167663 1127401 1155288 1175219 1055727 1058394
4224 1058394 1063822 976239 929086 945869 881172 908317 926703 873245 870183 923605 891713 871176
4212 871176 975526 927479 935009 1010467 990006 949411 961125 913069 866862 862299 843558 867317
4200 867317 817326 807510 843063 868534 854825 839400 808183 748179 760402 769909 758924 817360
4188 817360 826015 815922 852587 843445 857541 899203 917962 894716 921075 927932 854115 867396
4176 867396 878117 838053 848221 805034 786415 823994 800288 756350 790933 799478 803083 807487
4164 807487 757272 760229 785391 780171 772959 782018 774723 769246 798438 771562 748710 708819 688249
4151 688249 708759 739929 731241 743922 738319 718674 742357 737101 737971 714953 738065 727250 735940
4138 735940 746654 688947 684322 694718 670680 665606 690493 667818 668839 665769 669608 682670 695666
4125 695666 653969 586576 608884 587373 551271 562026 566252 553186 571259 581817 586199 610109
4113 610109 590072 579852 574476 591134 582487 599330 569919 562223 610957 584275 584567 603502 567524
4100 567524 557675 599214 610584 602222 614763 591050 609980 613245 594907 621777 633918 586460
4088 586460 597919 624107 551432 573624 576085 496659 506296 524361 522128 524807 488442 489174 494148
4075 494148 486000 499595 473708 499196 484316 461504 485089 470532 473991 469549 464264 446079
4063 446079 462359 447441 474469 436036 439836 449082 439416 449044 443481 459670 431633 431783 451970
4050 451970 425190 421939 435670 425894 415964 398915 384181 404238 430289 480331 464392 442956
4038 442956 422792 399935 379427 383387 364024 355550 401241 404400 411273 402768 425986 444755 431876
4025 431876 412007 406478 429031 416033 426721 449185 457007 457350 486154 488177 470486 430608 372890
4012 372890 422090 430495 420316 429608 431185 450131 490144 520955 486757 490921 485553 470017 495773
3999 495773 504806 492417 487626 492905 457884 489613 500853 554333 580617 629175 652138 655946
3987 655946 614131 586447 572323 499218 488621 490009 483376 501462 505754 475424 482153 506694
3975 506694 462541 451240 448727 438888 403162 409267 414777 384798 397996 390123 364469 360964 403550
3962 403550 406635 421938 442343 420486 422885 422395 394279 418689 432941 356311 335715 390784
3950 390784 364904 354580 322540 314432 334201 321511 305071 326695 331709 303294 317390 360581
3938 360581 312052 304297 333595 304198 330334 332770 281243 288639 283685 258855 275666 272859 275588
3925 275588 309061 286735 301562 328210 300768 298026 314669 286771 260169 272549 268864 274682
3913 274682 274732 289956 292314 298166 274381 286738 314258 258811 279838 303611 263448 278775 327096
3900 327096 274623 236829 243593 231651 267520 272574 248420 263075 296127 268131 306564 323283
3888 323283 291887 248538 247408 293297 285497 311335 275237 250077 284568 283014 241653 254268
3876 254268 264956 270043 262104 243414 294814 278328 300045 310580 284904 306564 272292 263912
3864 263912 225709 224116 259262 296501 299832 274822 265038 272856 268094 242991 297066 294934 277108
3851 277108 295850 259411 267903 268198 237943 228658 289021 321838 275637 290993 280429 239023
3839 239023 262210 275158 248735 303408 293159 293931 285507 270022 273881 260708 270454 277131 287253
3826 287253 299495 253026 263319 287421 278501 316828 261210 242367 276898 253821 278790 288668
3814 288668 249587 266580 298163 263047 273504 299507 269359 289475 303727 268699 264804 306591
3802 306591 274829 260615 299686 259354 256120 280532 279277 274150 272908 303366 321854 308902
3790 308902 279965 303905 337800 293464 315066 365218 345527 355582 339733 317333 301363 320932
3778 320932 323619 307930 325739 323540 338044 307952 315126 317788 314116 309969 331173 338992 283767
3765 283767 303110 343609 330390 323782 340398 291602 309881 337227 296601 294103 349762 316728
3753 316728 316606 380918 362492 367204 402044 320321 360529 395329 356724 325129 385788 367197
3741 367197 366743 399052 360126 360221 354117 322689 371281 403283 366311 398418 357599 360255 375698
3728 375698 368603 349129 387769 373142 344220 374035 370612 345586 412452 408355 376258 420855
3716 420855 402412 358392 429501 436831 406900 434730 429274 391308 396173 406712 408987 396286
3704 396286 422682 400505 389699 418470 389445 383368 402535 376690 355913 387780 387686 375421
3692 375421 379870 412611 412315 370072 368327 360395 400422 439828 411789 436589 410781 426104 416224
3679 416224 344948 355141 368922 363151 380495 372182 374022 377172 357197 384753 384057 367194 373925
3666 373925 356788 358537 309310 339279 343208 294105 345522 391953 353444 334909 363338 326207
3654 326207 350957 355978 359091 370080 390233 376158 355999 381448 342856 323502 324930 352081
3642 352081 327918 331628 329568 306438 330956 348888 323805 306633 352697 348599 336316 349740
3630 349740 295627 306197 328659 318913 329012 340447 316880 298249 317920 325219 328227 345503
3618 345503 362543 338581 317901 328660 333315 332776 339889 346635 343749 303965 332893 318119 285354
3605 285354 332701 330387 328238 385249 365146 275436 323992 335226 323331 377263 368373 351486
3593 351486 421314 392404 352668 394713 384667 332471 334254 367651 349229 350475 344804 328602
3581 328602 393802 412869 389767 409452 379485 357791 359048 368825 365786 399569 403310 458818
3569 458818 464424 463141 488662 460738 442837 475297 483355 452027 478608 512377 454491 508823
3557 508823 534462 491990 467541 487019 474863 454593 511087 533634 524503 522399 505209 508976
3545 508976 579312 613428 616493 625684 610878 564347 615364 658148 651649 689122 736661 754250
3533 754250 809268 843673 847174 830161 854652 791978 803372 811123 747806 752155 757512 759855 762192
3520 762192 765167 775443 760294 785966 810528 823532 801873 806404 864750 836691 870536 912848
3508 912848 893462 982427 1037473 1035030 1070124 1148591 1196223 1287604 1377069 1345872 1353738 1371466
3496 1371466 1308717 1286164 1288119 1246412 1234270 1221849 1211824 1217372 1288779 1310704 1345859 1389300
3484 1389300 1423772 1402067 1411858 1437745 1445318 1504552 1587435 1612593 1654328 1740543 1835005 1888225
3472 1888225 1950976 2040205 2147551 2266754 2369213 2468521 2590324 2731621 2864932 3001873
3462 3001873 3204484 3392141 3595326 3861522 4087402 4332647 4579469 4819445 4982483 5126968
3452 5126968 5221473 5203817 5178012 5115659 5044439 4976332 4855385 4734479 4610350 4530805 4438001
3441 4438001 4344338 4295173 4238281 4167261 4146397 4108186 4038340 4002393 3968091 3883443 3779330
3430 3779330 3685887 3551001 3374848 3190122 2988182 2796478 2590504 2399934 2236908 2116893
3420 2116893 2043677 1916379 1814752 1778812 1670437 1600028 1567013 1462009 1416045 1449075 1408744
3409 1408744 1385500 1394641 1363912 1378635 1433298 1483958 1578584 1749595 2010087 2412885 2754948
3398 2754948 2715666 2584838 2482120 2267826 2025559 1802204 1590949 1430756 1287285 1143679
3388 1143679 1125391 1067842 1038380 1003251 992463 967601 988390 1005737 1001527 1070830 1049993 1025886
3376 1025886 1098319 1155601 1204406 1355242 1451836 1661081 2091250 2711865 3518014 4025473
3366 4025473 3954336 3760769 3585053 3163097 2638297 2187755 1855692 1594797 1365450 1221919
3356 1221919 1114898 1023316 989620 939495 905313 876399 840289 814689 843152 797701 755277
3345 755277 807833 834599 833795 864209 890231 991947 1142279 1333175 1656605 2005523 2200468
3334 2200468 2167285 2089463 1921044 1732326 1523050 1273714 1079145 950958 851656 799710
3324 799710 769908 702860 721950 714730 620229 650683 628381 597463 582092 576084 538195 519617
3312 519617 530253 503734 522218 522247 493363 498596 512071 505030 508819 484511 509366 514493 483344
3299 483344 498616 464416 506631 511659 478258 511746 523715 532103 525597 506509 495294 509433
3287 509433 493712 490124 445284 410105 427827 415269 429127 394398 395608 391073 382653 383746 361937
3274 361937 393360 385197 387642 375107 368436 348801 368229 401553 379370 361271 408976 392396
3262 392396 351350 432330 464907 375608 409152 413948 367422 409648 385122 366858 399945 359215
3250 359215 335690 380023 354350 354146 370450 341841 327853 353099 341958 333787 332722 304093
3238 304093 321557 353333 288054 272854 316989 339190 328085 314382 327994 343217 342720 294223
3226 294223 348219 361656 351350 313895 347279 343104 310560 308389 308293 315086 330009 325886 314085
3213 314085 319473 333095 305823 347257 352650 329883 349948 343529 339272 370629 372718 319349 310298
3200 310298 311762 330071 345338 383430 335030 338710 335950 321917 339744 345099 334015 329808 309242
3187 309242 304270 376219 401540 360311 343587 346262 342248 354097 380048 334878 371095 355618
3175 355618 357847 399820 335921 340763 380715 337232 336586 386458 386729 429603 458987 427329 438903
3162 438903 462225 440148 406467 458322 444130 435585 466345 504075 510743 515383 462313 492642
3150 492642 546845 547582 580185 566591 586242 591435 652396 697549 675924 705929 734759 750095
3138 750095 769634 773714 793720 812628 804440 805769 798381 800290 790047 772562 826659 808919 839898
3125 839898 896073 898887 897692 932442 957797 981476 1031537 1072791 1145459 1198736 1298557 1346306
3113 1346306 1420638 1469887 1477666 1465093 1407825 1365807 1274101 1156890 1125470 1094722 1011281
3102 1011281 1037097 979767 965245 1038114 1015944 1015128 1011736 1007507 1035446 1040782 1041140 1080046 1166028
3089 1166028 1160895 1162858 1175903 1173850 1173547 1219319 1146518 1153585 1193811 1141981 1106319 1053319 1007125
3076 1007125 958487 912851 877007 914968 875879 797191 823196 838059 811051 784304 784583 742696
3064 742696 790961 799006 786079 755735 712532 697756 668108 665892 568276 559636 567580 545506
3052 545506 527318 505923 460094 460152 472008 448605 465218 407930 404953 401407 392887 365282 371659
3039 371659 359901 313000 316355 332460 323564 291741 336391 307700 318887 296680 264433 297567
3027 297567 293905 316084 295129 304458 233072 228265 256993 248928 259469 296752 253682 218744
3015 218744 275284 227277 236193 253059 217173 205401 236236 210891 223848 235716 242331 221573
3003 221573 274854 215429 163155 198906 159034 188397 218914 171220 222318 192660 156015 160231
2991 160231 138824 155903 183542 205874 173708 170382 179998 170415 156726 164897 148502 163482
2979 163482 165510 138630 176297 147122 147713 132151 103349 114293 158975 152882 154787 179399 174482
2966 174482 172051 180637 175606 165105 165130 163750 142463 158842 157194 129676 130982 103625 117560
2953 117560 149729 160366 180891 155106 164442 146168 101887 181110 141891 115267 133773 139978
2941 139978 128517 135291 117743 121453 149685 141332 96346 106110 119899 74161 114225 146858
2929 146858 109866 119007 109308 96050 138911 135462 106218 142557 131501 136606 108069 88298
2917 88298 103321 134095 127876 101366 82573 60344 86482 111309 113806 108803 129414 125058 112390
2904 112390 101265 94207 100132 96308 75431 47890 92562 86042 98103 131677 73907 92695
2892 92695 114723 122673 132956 106869 98217 66771 53182 65588 74766 79019 123325 107266 113906
2879 113906 132728 94536 64806 73861 92582 75440 97694 87962 57108 89371 120353 109528
2867 109528 136304 159874 146808 140562 109087 128920 135326 105220 102751 75744 89962 62746
2855 62746 60576 100067 95202 101707 119062 86117 76326 83452 132372 106147 106732 141013 91368
2842 91368 88494 82136 68220 65097 111432 88499 63113 74312 80090 107483 49919 65601 84765
2829 84765 123075 126110 122204 78402 72497 71930 27294 46909 94303 70519 61414 130131 99683
2816 99683 71921 113402 81434 85316 92972 67505 82742 119164 80551 92149 153108 74110
2804 74110 47916 116520 64406 62625 116460 87571 77863 88236 51485 57689 100855 76659
2792 76659 71099 103859 99822 91855 110779 49895 60482 90267 79029 75453 91782 111468 150736
2779 150736 137386 156673 119905 96572 74517 75946 102829 69097 43291 89646 88176 49107
2767 49107 93561 71711 31277 59558 35719 48290 101102 76773 43212 94794 85627 40827
2755 40827 90634 51746 31833 101888 32392 7567 98795 40036 -3853 75023 89891 68951
2743 68951 76821 69666 26970 85629 86039 37680 93882 100386 59894 89729 71146 46473 92754
2730 92754 75877 99747 94897 53621 85848 72016 56685 55282 84447 74793 42933 92589
2718 92589 83843 40583 102205 49692 29773 59493 17159 58892 99190 100823 71524 110903
2706 110903 132004 87455 104972 121471 57228 69648 79931 35262 18806 52158 17066 52727
2694 52727 88453 70775 78379 89215 74583 101813 92187 66172 79279 84993 51653 85458
2682 85458 70224 32821 86476 97061 81944 84832 108710 65884 57798 89881 35680 54761
2670 54761 57625 35213 55094 65703 80233 65678 40187 63531 79793 62223 65858 79807
2658 79807 90861 42229 70845 108239 63931 87896 88610 38455 88860 90082 45230 67307
2646 67307 60382 42274 33521 24026 8899 29126 49886 33089 44056 53407 13860 54076 67198
2633 67198 48758 54725 75390 82182 77463 70590 64339 77492 86303 74124 12659 60458 55017
2620 55017 50527 68531 51875 63572 110560 118496 125749 87138 59234 59073 71366 46318 41101
2607 41101 62713 39734 45230 87997 26482 2266 70663 60302 54610 51503 34715 40959 49525
2594 49525 25783 55796 83925 70308 93873 120187 58046 119032 164415 119560 140789 189371
2582 189371 156328 151464 182934 111037 142105 147087 80503 82766 48481 37415 62947 89197
2570 89197 87392 41898 48072 46285 72982 63331 16769 31795 43137 53362 95681 70667 31668
2557 31668 35966 33807 46436 39861 28770 8524 -2824 54114 46174 75328 94192 78774 67809
2544 67809 82456 103531 78260 69385 56713 56540 79723 84903 92667 129420 93367 76588 106613
2531 106613 73815 74780 71198 58536 45537 90077 63419 43329 84974 61257 54298 62626 51843
2518 51843 61865 105845 61434 56107 72318 48999 92221 99243 66083 93408 110934 87893
2506 87893 93347 67857 49416 57797 77586 26627 66968 93751 24988 91752 88044 56568
2494 56568 75992 72683 35928 91810 69896 38088 43067 72113 58816 90707 116877 53333
2482 53333 29394 76523 70181 57808 55924 82259 117113 85969 88219 63323 51333 89164
2470 89164 78257 74289 86849 67443 64726 75788 80897 104076 109545 63427 72866 88014 54731
2457 54731 68886 98768 92475 53931 23029 36114 114426 67312 47529 81685 62373 72495
2445 72495 107105 93924 78274 82600 67424 54368 96063 72340 52976 68753 58892 63439
2433 63439 99875 42305 58827 125331 88042 119211 136157 106051 94868 128965 86112 84580
2421 84580 101934 71317 87967 102447 135829 153245 127877 108456 111489 103557 108074 129854
2409 129854 95803 107953 115118 100193 106360 181746 154718 211916 207568 163195 215226 198854
2397 198854 155368 175033 182662 182208 170814 173732 199386 199446 169861 139274 157560 152697 124496
2384 124496 155737 179541 197311 200893 155804 152889 176283 192572 239386 291967 211686 249232
2372 249232 240188 182645 247714 276092 241516 228781 248652 207970 243224 252278 272575 309856
2360 309856 327852 356589 344508 327360 344241 354178 336186 344926 375381 346710 377133 440445
2348 440445 449411 475688 543198 514213 582946 593698 573876 655213 679079 670661 783935 838882
2336 838882 913789 1082277 1225472 1485458 1702530 1760045 1812371 1834989 1867021 1912104 2071129
2325 2071129 2236096 2637931 3217587 4078709 5251623 7522159 12367981 20277422 25285160
2316 25285160 25384645 23565123 19563686 15367191 11739336 9010383 6946904 5485935
2308 5485935 4294701 3444509 2925814 2579518 2366747 2313620 2196610 2017507 1862048 1669825
2298 1669825 1438731 1338917 1188423 1123498 1026144 979547 945154 833770 810005 800721 751335
2287 751335 678114 678173 599723 588697 610507 614687 575592 605487 550984 487506 509164 463804
2275 463804 477861 451361 420394 440165 440513 415200 380205 371356 355509 402948 368780 377519
2263 377519 383128 339966 354308 344320 292896 281376 331632 288522 262325 290582 266214 248355
2251 248355 311631 241651 220729 268158 185702 232925 224719 208850 215847 245510 147184 127143
2239 127143 172825 158832 208877 217068 217435 202178 176494 148694 180551 163009 180164 207231
2227 207231 170445 192436 180318 174217 149381 163653 97545 113915 132120 104137 115683 160131
2215 160131 190705 143972 185186 120385 115395 159775 158707 171564 122516 100026 80747 109208
2203 109208 107378 102136 71699 119875 142092 116765 145895 119567 88411 71063 114738 85881
2191 85881 111725 158302 104458 118958 113655 120481 109748 125741 114979 137588 93264 124846
2179 124846 137416 78709 78956 69441 70152 96837 132168 57351 119001 126246 55971 113012 75417
2166 75417 53425 95758 102328 38142 135828 119858 66172 102461 70711 58399 49995 106234
2154 106234 63302 80067 80672 75589 66583 62707 81703 71911 92908 56477 50514 5837 32850
2141 32850 43963 55159 99478 66036 79711 99049 98837 59530 127325 107087 79677 106702
2129 106702 84380 42818 20122 34830 40520 77455 27219 10948 35810 72125 91593 56177
2117 56177 78648 48186 44674 45048 96302 9082 59911 79467 68944 83428 61963 39452
2105 39452 28258 118844 74749 49102 51604 45436 93824 143499 87634 47505 84985 9339
2093 9339 39441 63652 68981 65942 56921 68855 64649 111441 75497 81106 59179 44649 64817
2080 64817 66983 92211 91191 51703 25899 111869 88199 77729 82709 60196 37145 50513
2068 50513 46097 40648 90531 58769 21603 24158 71571 41949 33350 22932 48734 58088 70659
2055 70659 95879 41959 63561 47831 77348 169982 161959 175614 171017 147358 135164 139196
2043 139196 70876 45905 35517 70246 64463 84279 100927 29042 56579 46314 29321 64155
2031 64155 91726 66040 45029 55889 65803 85943 65395 98236 53721 56932 87436 113161
2019 113161 94768 83222 78048 56841 74088 65012 32620 59620 95087 28517 24545 41380
2007 41380 26555 46183 55668 82407 79107 67181 50453 53358 90915 43399 68104 82674
1995 82674 61852 32232 52673 39468 48038 50447 56814 70930 38478 91279 84532 73547 56611
1982 56611 60429 42835 22193 55922 23575 18917 67895 66723 32911 66255 26333 19227 69836
1969 69836 27769 17978 -21387 16754 26589 1902 19608 29396 25441 52890 29352 60278 84385
1956 84385 33948 41118 35885 76473 78676 79769 80313 51484 25675 34940 1359 17756 58531
1943 58531 55523 26253 9589 27729 25075 39250 57031 26570 95905 74464 27333 63204
1931 63204 76225 13377 33753 21694 14725 87447 48789 27454 30501 64848 20773 22300
1919 22300 30082 19351 51070 33267 47038 47273 60272 20077 19844 7275 28244 11669 18470
1906 18470 65173 95712 113205 63812 104033 44979 29689 90776 40062 19814 43385 -21835
1894 -21835 20424 58208 18055 14303 46585 41090 43317 81687 59729 11014 51728 13796
1882 13796 -1336 65993 37239 1866 44737 97016 62773 95927 77967 16611 33985 22006
1870 22006 15730 48152 65092 53245 69152 48850 56921 57443 40328 66848 88221 71735 32670
1857 32670 62035 23808 40842 59165 56330 16629 49690 63526 43913 99263 44250 88305
1845 88305 86008 59847 78922 106165 76636 43888 50984 71302 66558 92967 72315 -6936
1833 -6936 62827 79951 12028 109585 98713 59429 55615 72339 48521 31998 52920 22107
1821 22107 25227 45048 15717 24572 88779 26434 59080 74636 35722 64007 49702 -21741
1809 -21741 12891 26612 20003 34679 3265 -11207 24102 42458 11829 45475 74285 18939
1797 18939 69150 56984 14414 63767 44696 -2273 36878 7844 21127 88391 52690 21660
1785 21660 75190 74271 32890 65373 52726 -17277 34781 32322 42273 49521 35497 11240 11485
1772 11485 39818 17999 46629 63192 59058 22479 63988 45076 20256 37554 48612 20745
1760 20745 6463 46058 28107 29413 57873 17527 12769 38662 56872 75242 60220 32762
1748 32762 36542 -15698 26606 54101 42477 35649 25934 15153 38009 62635 10316 17472 23141
1735 23141 2204 19125 70129 1628 26066 73123 -8265 45671 83005 33023 40747 35538
1723 35538 13924 36148 53300 27058 11208 57081 37151 -7487 46592 42139 27682 61936
1711 61936 36007 24407 -3819 21120 31337 -7427 24654 74417 2283 13407 63659 28150
1699 28150 1957 -9087 12514 23066 66740 37267 55101 61676 25678 21642 60395 54655
1687 54655 59096 86410 57469 40043 41958 61221 35329 45307 72861 24139 43820 69856
1675 69856 58485 63763 79542 16870 6983 82722 59047 14924 52244 65544 21087 55303
1663 55303 17130 762 69116 42581 32084 48798 37349 33927 -1865 13075 31002 -12257
1651 -12257 12802 33397 44124 24072 53574 23511 3851 68108 34619 8314 74850 74759
1639 74759 4935 71414 56152 7300 55443 24036 -24906 -6206 33921 602 30153 70447
1627 70447 18452 45908 77569 39498 44381 59525 28956 43316 26649 -988 -5983 27119
1615 27119 23403 10633 26532 60010 44778 27559 48771 1082 12409 95326 90034 40194
1603 40194 18567 25561 29566 64571 55056 14500 39722 42281 36930 37723 26690 45671 7229
1590 7229 25516 6529 13410 42054 47241 28881 46981 29263 -39886 -19415 37280 13419
1578 13419 10463 73467 -11549 -4748 9035 -21473 -1117 31795 -12752 -5409 6000 37747
1566 37747 50680 52868 62548 40653 24509 51415 12114 17169 55582 39139 70490 86169
1554 86169 88772 51579 44085 62394 39194 46243 75574 10391 63853 69520 8870 43244 66098
1541 66098 26887 32685 56508 15464 18557 21652 7552 -5012 31235 62351 64627 15433 31790
1528 31790 34154 27928 24922 36112 66842 61615 59729 21445 11581 33948 9625 65650 90781
1515 90781 70960 86716 81387 19850 24584 68671 20182 13122 37854 13266 -8020 18576
1503 18576 -2900 -19592 -3897 43814 9392 33466 26511 -25316 17930 19499 24449 44049
1491 44049 74940 52266 13229 5466 19799 5118 -6960 14698 19875 49534 29140 20246
1479 20246 4644 14967 7434 15505 58225 75458 64336 46629 54174 42495 41185 44688 -21185
1466 -21185 -15970 44954 37516 37461 25074 -22341 3744 22078 -20085 -34931 7027 12265 -24926
1453 -24926 23963 44556 7029 17929 40596 5487 43683 18113 -54809 -8764 10676 -5557
1441 -5557 23011 45795 11541 33206 39624 57338 34599 47412 32853 5831 17925 -22941
1429 -22941 30594 40160 48435 95936 65102 33970 -4343 -28078 20772 37905 22546 36185
1417 36185 16040 3066 18296 18485 50531 43632 67122 21619 17156 33761 21333 24565 19178
1404 19178 24122 23676 48449 41909 -4505 -8702 40814 53219 40564 53599 9493 25886 61535
1391 61535 60874 2172 28632 16792 -10443 18967 -4034 10236 17421 29882 4452 5939 900
1378 900 -27617 -11662 12053 6917 6813 44769 41984 15460 30674 32270 27012 20804 -2090 -23396
1364 -23396 9818 17088 18797 -11564 27593 52645 55580 72235 41422 53590 75163 37826
1352 37826 -6249 13915 -3546 3058 8776 17200 39031 14104 13068 -11567 47928 18741 24967
1339 24967 -4922 16220 71923 57976 36085 20293 -7115 2575 52059 -12996 30650 32484
1327 32484 10072 9305 -2658 10772 25450 32370 28437 53251 73691 61813 47186 31607 -6273
1314 -6273 7837 10953 6384 35768 5599 29382 22445 -2009 -1133 16411 4406 -9688 31719
1301 31719 -18662 -3723 34399 45805 53657 61848 81948 31892 1030 6561 43261 29361
1289 29361 25331 30169 -3590 4661 52508 36541 32964 18478 -2211 41097 44310 26670 41930
1276 41930 27707 13612 57400 53980 22731 43974 55614 46221 40814 53448 33374 48714
1264 48714 44179 19696 41778 61319 38358 23490 34724 40495 67294 39002 -6920 37612
1252 37612 11646 -15668 -20522 16577 31210 53521 30432 10189 3150 -25808 18375 28702
1240 28702 23873 28235 11888 -6459 12588 23040 21558 45639 61372 60924 63746 53015 51163
1227 51163 36876 43410 73774 17436 28438 85565 27144 36291 61324 32052 15558 34763
1215 34763 15243 -21017 5459 37013 56196 45623 16410 -15711 30120 46263 7802 37994
1203 37994 27394 55435 56809 53722 23604 59987 32680 21219 49746 53561 35327 16877
1191 16877 14764 8359 27842 -12174 -15827 13164 -10684 20870 -1414 -18706 -15457 16723 4479
1178 4479 42220 34255 4891 29173 -3073 15037 29887 45165 24063 10787 46814 53466
1166 53466 47842 43083 31896 38584 44823 30560 22205 29573 30339 30671 516 29654 51926 30772
1152 30772 41041 35791 26317 22122 17791 -7806 30973 38929 8812 41931 23926 6888 28107
1139 28107 32443 31778 41600 26808 41349 41603 40113 49882 44396 26522 16165 -11867 11330 32757
1125 32757 16323 1152 47311 37844 6751 -13744 -15940 9581 36234 50391 57670 40120
1113 40120 38732 59634 57679 45091 27156 17407 19315 16269 13126 32590 37413 -5227 -9174
1100 -9174 -10826 -59514 -11403 46411 17471 33229 28092 -21304 2394 44986 17006 50005
1088 50005 10171 -20746 16886 59755 22321 24943 43973 -18327 -21401 1991 -27360 -8937
1076 -8937 37385 -322 13146 11252 16269 36556 28615 24623 62016 42541 13871 81090 72632
1063 72632 31166 58906 50087 24627 28489 21845 30287 104022 75159 -11254 25386 47007 40157
1050 40157 81173 48138 -1247 27014 45438 21313 36330 41333 -26943 9511 30794 -18005
1038 -18005 -3382 -486 1006 51689 45994 19821 67497 62288 20646 24403 76927 53184 31051
1025 31051 49714 25347 4886 30850 22145 43821 50470 30412 11969 55210 34545 25607
1013 25607 46078 11268 72961 78991 5790 44837 50599 15787 46488 39365 -6184 29573
1001 29573 30883 -3429 42502 66682 19871 48173 34260 -48048 -38951 32615 -15160 18799
989 18799 52195 -15238 35717 65516 -1763 17697 59218 -6790 80 51723 37403 18206
977 18206 39260 8366 30296 40753 29826 17449 51924 22409 49477 86931 48685 31332
965 31332 25213 5198 7696 12643 47450 59124 -19426 6637 69448 61340 32311 48106 33958
952 33958 3549 55575 57895 59404 47328 37542 6813 -28000 34434 19296 33608 47037 18991
939 18991 -27492 22788 26461 -23818 19354 15986 19228 19339 -30262 -50888 3193 40416 8895
926 8895 33063 22946 9948 54572 30465 10591 60884 38497 8455 -929 12457 3094 -11499
913 -11499 21698 22110 18389 3827 29793 -15612 168 37748 7278 21907 35736 28252 -4134
900 -4134 -4769 -703 -1217 58030 52399 8602 53265 42920 2731 33462 30268 -1583 4829 24216
886 24216 28274 26377 65927 43297 16248 21662 25802 29460 17271 42985 34476 31456 33806 -8238
872 -8238 -33994 16055 -18191 -5800 33018 14005 -3931 32253 5211 -37288 12735 38768
860 38768 39051 78126 51274 3192 37911 56420 2886 47560 15064 -18381 3298 15572
848 15572 22209 19276 25376 33320 40659 55125 59187 36960 58718 30883 -9914 8083 32975
835 32975 44684 44252 44360 54120 68686 55359 22287 22464 6712 7269 19148 25348 44129 26984
821 26984 290 33395 22474 7048 63194 90718 15659 50601 44016 -12467 -11767 27326 -5610
808 -5610 6273 14739 -37587 -27976 18579 -27036 -5153 51695 -11632 2126 45893 12825 21659
795 21659 25303 -14158 16573 27055 24220 -21544 4234 -8055 2900 43314 23762 61915
783 61915 24395 27658 52252 44744 -10952 10121 8338 31106 73697 55407 55240 69103 52144
770 52144 20636 48224 35249 -7225 35682 31828 20147 24093 31487 18090 9705 11303 14724
757 14724 42747 21040 8282 10195 52772 56797 49296 86062 47404 -15635 3461 15922 -8098
744 -8098 8557 -421 -4661 36520 31244 25393 70098 56979 14995 18418 -37248 -6357 3505
731 3505 26437 48927 48800 55591 60502 59037 12462 26744 48160 31152 13991 54898 6007
718 6007 3675 43350 -9526 36806 10998 -41677 17350 36298 -17194 2193 4483 -27572 17557
705 17557 35105 8416 27181 63165 9343 20439 71732 25934 23710 31099 35490 35011 25545
692 25545 -1963 9642 24085 40890 -1675 2644 69261 55452 45850 50350 6686 5002 23040
679 23040 42830 41204 35495 13670 6305 -7945 -12997 -15692 -3450 37265 38044 -1794 37572
666 37572 76519 5180 16506 19187 37825 45682 50999 10080 6437 55278 -17376 19781 47097
653 47097 13794 18222 49153 3256 -23496 39829 12904 9680 14474 -25607 -23488 -1356 -34780
640 -34780 25792 32707 37691 45616 13085 34178 -10956 -4424 -10210 18908 7266 -32571 27553
627 27553 11761 8424 15093 12021 17240 59276 13957 31324 75069 31536 6189 18647 -11858
614 -11858 22551 66339 11365 -7633 23141 24329 5672 83151 44221 13310 56095 8164
602 8164 1014 13286 30765 22090 8959 44293 52707 29737 8269 35416 23608 16858 -11923
589 -11923 -6571 -4543 14670 34696 18389 44477 35061 39336 4107 -3045 -2353 2592 12011 23333
575 23333 18486 29810 15191 12433 63615 51081 3552 35967 33774 -14943 25326 44833 28678
562 28678 48225 28512 18907 38010 48287 15310 67210 73488 19008 53567 -8795 -38969
550 -38969 9626 28232 40788 66298 26250 -12390 32385 33935 29020 36770 19738 7065 55605
537 55605 58044 28231 5116 -39434 -18311 -14924 -34335 -30355 60225 21023 2124 11782 -20144
524 -20144 -4686 27639 1361 -2383 9903 -1041 41943 46821 37637 15736 6126 9862 15943
511 15943 19066 -9010 -545 -17633 -50488 -33665 28824 39846 6722 31069 -878 -128 -11602
498 -11602 29622 22779 3538 55270 31957 1258 31819 70937 46952 30821 62691 102702
486 102702 35319 42491 55238 21532 21890 47222 6912 21655 37509 -13384 -20387 16211 12080
473 12080 -4550 63787 54576 10014 16438 -15280 -16937 41777 -17877 -29720 19802 15285 -6002
460 -6002 46840 51262 29344 52786 11842 -32493 -27124 7372 26686 31677 -11127 8691 27311
447 27311 8020 31587 -10170 -16951 46154 67954 22717 33346 21305 11581 -10115 -26715
435 -26715 -8027 -4480 25386 24448 53206 26860 -12892 -422 51834 32852 25730 15727 -7225
422 -7225 23106 17304 26129 34938 55151 64261 46211 18674 2858 818 -7866 35836 28545 32808
408 32808 37072 15842 13886 27689 1839 16409 92387 56649 80037 88614 36241 13191 17438
395 17438 2897 29118 50428 11657 25576 58268 19456 46268 68878 4256 -14256 7244
383 7244 1329 47522 32059 -2735 58638 27934 -19747 770 -7464 -28701 15954 14864 10669
370 10669 44644 36846 12614 50187 21239 -2106 16944 12706 33051 12284 7247 7446 69593
357 69593 66763 30254 27340 2079 1653 32801 43985 5445 -3398 -169 15838 -2542 -1786 2773
343 2773 -3887 16689 7222 27572 11359 -10670 23644 26853 -1758 6883 17538 -25639 20194
330 20194 32651 -3449 -22349 -6771 11120 14564 26507 36502 44972 25032 -15949 2460 42458
317 42458 -16872 6792 10640 -22320 17575 6355 -11158 39615 -765 -39367 -26782 3238
305 3238 -7342 31258 40843 10913 35867 13000 7312 38068 28152 24153 42988 4998 -3527
292 -3527 -5398 -23135 14616 70021 37605 38592 26237 -5604 31676 5475 13976 52353 52545
279 52545 45939 80058 83331 16281 17690 1677 4290 2373 -16981 -14157 17416 8371 -2999
266 -2999 -17788 4924 23967 11154 21974 19022 23442 28110 65864 45300 21286 10267 -5037
253 -5037 -10677 3033 6237 -7168 16998 27713 -21462 -8354 5785 -32604 56755 68570 22590
240 22590 11322 7522 -10592 -20656 -16615 -425 5832 32791 27755 8229 5140 18057 10497
227 10497 6645 -25557 -47555 -27642 -13510 10547 16765 39918 -1539 -6918 21216 28130 17360
214 17360 22772 13739 -8664 -6050 -18934 4367 6698 -16172 8605 -12294 -7229 -1880 -34158
201 -34158 -37293 -22602 -23531 -993 8946 -7570 -19540 3639 -14597 -51821 -44475 -33515 -37180
188 -37180 -11706 -58979 -77708 -3518 -36152 -14151 12590 -15910 -27440 -25381 -11258 9767
176 9767 14308 -10205 -36403 -68287 -49295 2204 -7463 -3669 32303 1092 -34106 -30066 -7243
163 -7243 -495 34883 -890 2487 -3665 -40908 -65099 -53658 -58187 -55409 -59156 -55342 -69958 -96145
149 -96145 -67466 -58999 -51611 -68455 -33366 -21282 -26721 -22372 -52116 -48714 -16399 -56057 -31132
136 -31132 -19478 -66361 -40528 -3058 -86252 -94564 -58225 -77404 -68031 -25266 -58444 -69507
124 -69507 -54077 -77143 -64034 -47237 -65042 -69107 -55635 -60858 -33378 -10461 -38084 -27968
112 -27968 -19937 -52646 -48826 -45312 -72052 -71924 -53594 -62370 -60197 -45931 -64830 -80948 -82381 -100036
98 -100036 -87321 -107155 -91517 -65576 -96280 -111079 -99147 -88641 -71595 -59310 -64639 -82123
86 -82123 -90352 -84209 -110278 -98821 -83614 -106696 -115637 -108503 -113231 -123353 -90810 -106890 -136267
73 -136267 -124094 -126439 -132336 -82162 -87835 -130422 -88994 -94816 -103814 -90551 -107678 -125794 -105049
60 -105049 -122395 -143269 -129621 -156348 -162428 -127164 -129944 -118807 -118151 -153994 -144407 -123096 -165677
47 -165677 -143053 -106199 -153239 -141850 -116275 -135886 -130901 -141529 -183903 -157322 -127437 -158566
35 -158566 -154157 -155249 -177598 -138634 -137858 -158644 -121394 -145162 -163816 -168162 -181474 -194300 -184555
22 -184555 -158783 -182333 -172139 -153216 -152325 -197807 -172747 -163984 -162437 -173702 -176243 -194465 -236709
9 -236709 -230559 -215691 -219805 -225284 -191382 -186691 -186656 -211985 -219543
0 -219543
$$ Imaginary data points
##PAGE= N=2
##DATA TABLE= (X++(I..I)), XYDATA
16383 -509549 -501837 -460529 -445706 -446237 -469426 -436319 -426290 -432768 -407232 -376075 -391178 -376907
16371 -376907 -339457 -336700 -306435 -305771 -336764 -334856 -297858 -300909 -273927 -269744 -289288 -243431 -231724
16358 -231724 -263690 -254558 -213698 -228214 -183661 -163833 -181539 -155669 -143752 -136604 -88557 -75476
16346 -75476 -96236 -64903 -80798 -97441 -49721 -55304 -60509 -12587 3903 -18763 22466 1692
16334 1692 10470 53138 38182 29619 72663 51939 44873 100375 102534 95811 131547 127438 131302
16321 131302 155998 149534 179629 181013 178766 199983 215141 204547 222966 271437 250212 258350
16309 258350 304619 273287 291049 342582 332604 318728 339508 343029 347457 318870 333486 366780
16297 366780 395931 405474 362729 388397 414341 380412 427212 419634 405431 435983 475804 476459
16285 476459 463576 488489 525086 525646 503358 503565 503349 500683 497114 526603 536052 554431 591090
16272 591090 566879 553767 584376 591418 598247 609612 585297 608576 635564 633272 639013 653968
16260 653968 616776 641913 692554 689355 693171 719530 703861 697931 744946 724050 714454 747654
16248 747654 749568 744721 762703 749750 733023 743170 774190 772826 790090 808429 799054 807212
16236 807212 802388 801717 807317 803119 798618 793227 834315 847880 858731 865771 883673 872591 903938
16223 903938 920923 857687 874458 946599 946204 913630 916804 899922 878760 886156 913209 948119
16211 948119 943654 954230 935190 953729 977032 969525 987500 1009859 998450 966435 987334 993684
16199 993684 990573 1019917 998618 979387 988335 1020980 1037693 1065667 1036369 1031906 1034670 1019405
16187 1019405 1049401 1066973 1072481 1046952 1030601 1046453 1084375 1041303 1050976 1080718 1071390 1089020
16175 1089020 1105959 1076055 1063835 1091244 1067069 1020422 1100290 1076212 1067176 1116171 1108547 1123236
16163 1123236 1140564 1127882 1113786 1100603 1115192 1120669 1132847 1135420 1144240 1119179 1089675 1103302
16151 1103302 1131548 1151957 1167295 1148314 1152377 1181132 1157779 1138566 1160468 1116222 1117752 1160103
16139 1160103 1148270 1144459 1161711 1133044 1151317 1204765 1162444 1156382 1184145 1182876 1180485 1186610
16127 1186610 1180548 1187116 1208759 1248884 1205714 1211438 1244732 1213470 1173239 1213457 1207768 1199641
16115 1199641 1221728 1181370 1162355 1194429 1185582 1187725 1205897 1200529 1193696 1205323 1196484 1211425
16103 1211425 1189593 1192947 1201395 1207331 1212732 1199538 1176296 1229573 1257856 1247896 1253349 1256515 1203731
16090 1203731 1168170 1200572 1190470 1190036 1241781 1219139 1189711 1252230 1216065 1205773 1244645 1232995
16078 1232995 1208237 1234809 1219764 1218686 1195651 1190595 1189308 1188406 1213006 1189059 1224900 1214634
16066 1214634 1207116 1210418 1208514 1241107 1252731 1247098 1234614 1223005 1222473 1219474 1197732 1201921 1235198
16053 1235198 1250778 1245946 1240820 1240504 1249564 1286272 1259694 1238133 1231947 1195094 1200224 1184397 1222979
16040 1222979 1220815 1218384 1249266 1240606 1225945 1240230 1200004 1221176 1264776 1277064 1257399 1246414
16028 1246414 1259114 1236138 1252825 1257997 1206900 1201804 1197316 1184261 1194673 1209560 1205770 1236603
16016 1236603 1245435 1222236 1206375 1261964 1256491 1223751 1283217 1279440 1244289 1250699 1275470 1273507
16004 1273507 1269076 1254470 1301819 1281219 1260408 1283843 1248714 1271145 1237058 1256117 1268583
15993 1268583 1222577 1246482 1275366 1287190 1250724 1232570 1241882 1234231 1239742 1222707 1232072 1261758
15981 1261758 1265112 1274437 1285612 1307154 1269583 1253137 1268684 1301157 1316600 1300777 1261450 1264079
15969 1264079 1242832 1283405 1275641 1252798 1277918 1282889 1258501 1248178 1263797 1214942 1240453 1256149
15957 1256149 1299753 1281774 1267424 1243556 1233756 1240632 1215262 1244208 1247017 1255871 1230751 1246906
15945 1246906 1261516 1263668 1199165 1200819 1232271 1248468 1275391 1264855 1289942 1266877 1221880 1248073
15933 1248073 1283648 1257229 1225946 1273103 1255354 1237043 1230133 1240640 1252641 1267417 1269466 1234384
15921 1234384 1278384 1242086 1241975 1223496 1224960 1289166 1301639 1274264 1302171 1298405 1264848 1294122
15909 1294122 1265110 1234682 1272577 1298815 1266566 1294897 1290549 1268848 1267425 1279417 1256793 1262361
15897 1262361 1243972 1225678 1250687 1234770 1227837 1257753 1274751 1241917 1242776 1243019 1198400 1195638
15885 1195638 1187761 1211396 1247952 1246492 1242824 1239504 1297050 1277946 1272826 1258982 1259716 1264269 1257766
15872 1257766 1270478 1317608 1294504 1244105 1251793 1235224 1245581 1295594 1297074 1250663 1255595 1266823
15860 1266823 1223152 1265989 1292694 1237563 1255827 1270351 1219113 1241270 1290478 1234029 1258928
15849 1258928 1284199 1208407 1232778 1289986 1233036 1255123 1301680 1249115 1269953 1320387 1283449
15838 1283449 1269100 1284781 1243476 1276948 1271474 1199676 1204963 1244762 1256544 1286247 1277118 1253691
15826 1253691 1263415 1253191 1208692 1254942 1267716 1272528 1310808 1264603 1223449 1266086 1269831 1251905
15814 1251905 1299982 1289645 1238697 1295148 1296512 1236746 1305040 1312248 1267383 1296106 1283441 1214729
15802 1214729 1283594 1305244 1263156 1279752 1274666 1216356 1239789 1304739 1297769 1299715 1304702 1255795
15790 1255795 1283346 1269642 1261985 1252558 1281939 1302337 1269822 1271199 1296343 1288183 1314591 1318837
15778 1318837 1304910 1290753 1265320 1296030 1274770 1252449 1297374 1249079 1201634 1262668 1220839
15767 1220839 1167954 1252463 1280802 1245052 1311135 1270417 1260747 1297898 1297093 1270068 1331080 1315859
15755 1315859 1265895 1318204 1298475 1264218 1304522 1305257 1242813 1293751 1309854 1271046 1265315 1251088
15743 1251088 1257456 1282646 1283182 1284602 1269547 1289959 1272842 1246805 1259812 1290971 1278350 1258059
15731 1258059 1278957 1276860 1273230 1305987 1302002 1219739 1237886 1258572 1216070 1226226 1236121 1222603
15719 1222603 1266343 1307658 1267893 1255417 1266979 1242907 1238353 1291393 1283567 1241173 1295828 1295627
15707 1295627 1256530 1261435 1270153 1244112 1301197 1319045 1255393 1266404 1305578 1281516 1268614 1287661
15695 1287661 1249957 1247788 1306043 1257178 1242869 1267156 1250683 1227482 1249217 1264940 1277868
15684 1277868 1319462 1315609 1282899 1270933 1316589 1289122 1263369 1290780 1262509 1208763 1257025
15673 1257025 1273340 1268724 1300216 1311915 1247815 1262421 1283659 1240077 1269230 1263160 1227588 1260959
15661 1260959 1336736 1281800 1267136 1304638 1303459 1290627 1304949 1253751 1259066 1306955 1337173 1327359
15649 1327359 1289819 1303719 1313028 1282427 1328832 1308259 1314165 1316299 1301826 1304859 1309238 1345015
15637 1345015 1274325 1288436 1305673 1303288 1279907 1287096 1262012 1280444 1314788 1285322 1277805 1312518
15625 1312518 1302598 1294775 1306830 1311961 1280519 1308630 1314934 1293128 1287582 1306198 1269682 1279669
15613 1279669 1290620 1256927 1245284 1293270 1282697 1291907 1319264 1285047 1283483 1317054 1305488 1258864
15601 1258864 1297788 1303179 1290129 1302094 1306091 1290144 1323602 1351217 1316715 1294577 1291186 1293836
15589 1293836 1288027 1309530 1336292 1287598 1286263 1275164 1291686 1313228 1330045 1251710 1265603 1329997
15577 1329997 1299229 1294955 1317199 1328453 1301618 1359582 1345562 1304885 1352211 1325889 1292119
15566 1292119 1344523 1311581 1272699 1271592 1306996 1320661 1278861 1320105 1319804 1236949 1282784 1304200
15554 1304200 1294606 1351517 1354561 1325672 1325676 1335100 1270425 1270851 1305171 1270913 1260396 1315463 1260942
15541 1260942 1260232 1319373 1308059 1310035 1293944 1306345 1313603 1336686 1339466 1322684 1331091 1321984 1278751
15528 1278751 1296524 1322645 1295514 1328316 1328522 1339147 1328497 1336446 1312169 1335400 1350176 1331055
15516 1331055 1327230 1334627 1346977 1321829 1365831 1367349 1344255 1310701 1309163 1344690 1329169 1353141
15504 1353141 1296307 1287138 1338921 1323792 1294645 1333364 1323349 1314696 1363615 1359582 1347670 1331488
15492 1331488 1353761 1334228 1321899 1360205 1317407 1315544 1316559 1302283 1312554 1367341 1343206 1298734
15480 1298734 1334319 1358856 1335567 1307097 1319370 1301136 1316685 1326838 1321730 1294070 1300248 1304058
15468 1304058 1309092 1282699 1283138 1317735 1329091 1332689 1288156 1303225 1319616 1297622 1295660 1299093
15456 1299093 1314973 1345635 1335767 1298430 1279262 1271122 1315823 1294164 1294450 1324397 1317465 1337816
$$ [...]
##END NTUPLES=NMR SPECTRUM
##END=
