##TITLE=1H_DE-80H_X3
 200.13MHz, d2o
 8 sc
 
 19ns.26.2.2025
##JCAMPDX= 6.0         $$ Bruker NMR JCAMP-DX V2.0
##DATA TYPE= NMR SPECTRUM
##DATA CLASS= NTUPLES
##ORIGIN= UXNMR, Bruker Analytische Messtechnik GmbH
##OWNER= pz
$$ XWIN-NMR		Version 3.5
$$ Wed Dec 17 10:52:25 2025 Russian Standard Time (UT+4h)  Yarkov@DPX200
##.OBSERVE FREQUENCY= 200.1313
##.OBSERVE NUCLEUS= ^1H
##.ACQUISITION MODE= SIMULTANEOUS
##.ACQUISITION SCHEME= undefined
##.AVERAGES= 8
##.DIGITISER RES= 18
##SPECTROMETER/DATA SYSTEM= spect
##.PULSE SEQUENCE= zg30
##.SOLVENT NAME= CDCl3
##.SHIFT REFERENCE= (INTERNAL, CDCl3, 0, 15.5298)
##AUDIT TRAIL= $$ (NUMBER, WHEN, WHO, WHERE, WHAT)
$$ ##TITLE= Audit trail, XWIN-NMR		Version 3.5
$$ ##JCAMPDX= 5.01
$$ ##ORIGIN= Bruker BioSpin GmbH
$$ ##OWNER= Yarkov
$$ C:/Bruker/XWIN-NMR/data/yarkov2/nmr/H-C/1/pdata/1/auditp.txt
$$ ##AUDIT TRAIL=  $$ (NUMBER, WHEN, WHO, WHERE, WHAT)
(   1,<2025-12-17 10:51:39.75 +0400>,<Yarkov>,<DPX200>,
      <created by zg, POWCHK disabled, PULCHK disabled
       configuration hash MD5:
       00 E9 B6 7A A2 85 ED C7 34 08 36 98 17 FE 4E 26
       data hash MD5: 16K
       E5 B6 B9 97 F5 98 C3 05 01 37 1C 89 07 82 BB AA>)
(   2,<2025-12-17 10:51:43.54 +0400>,<Yarkov>,<DPX200>,
      <Start of raw data processing
       efp BC_mod = 2 LB = 0.25 FT_mod = 6 PKNL = 1 PHC0 = -5301.728 PHC1 = 12.22193 SI = 16K 
       data hash MD5: 16K
       71 07 73 E7 2C 1F 5C 42 CC F0 01 2B 89 DF 59 E4>)
(   3,<2025-12-17 10:51:48.54 +0400>,<Yarkov>,<DPX200>,
      <abs ABSG = 5 
       data hash MD5: 16K
       56 CF A6 B4 BF A5 62 1D 5F 59 4F 77 EF 41 A6 E6>)
$$ ##END=
$$ 
$$ hash MD5
$$ E3 B3 94 74 B1 D4 C5 D6 04 24 24 2B BA 36 5D 97
##$RELAX= 
##$RELAX= 
##$RELAX= 
##$RELAX= 
##$RELAX= 
##$RELAX= 
$$ Bruker specific parameters
$$ --------------------------
##$DU= <C:/Bruker/XWIN-NMR>
##$EXPNO= 1
##$NAME= <H-C>
##$PROCNO= 1
##$TYPE= <nmr>
##$USER= <yarkov2>
##$AMP= (0..31)
100 100 100 100 100 100 100 100 100 100 100 100 100 100 100 100 100 100 
100 100 100 100 100 100 100 100 100 100 100 100 100 100 
##$AQSEQ= 0
##$AQ_mod= 1
##$AUNM= <au_zg>
##$AUTOPOS= <>
##$BF1= 200.13
##$BF2= 200.13
##$BF3= 200.13
##$BF4= 200.13
##$BF5= 200.13
##$BF6= 200.13
##$BF7= 200.13
##$BF8= 200.13
##$BYTORDA= 1
##$CFDGTYP= 0
##$CFRGTYP= 5
##$CHEMSTR= <none>
##$CNST= (0..31)
1 1 145 1 1 1 1 1 1 1 1 1 1 1 1 1 1 1 1 1 1 1 1 1 1 1 1 1 1 1 1 1 
##$CPDPRG= <>
##$CPDPRG1= <>
##$CPDPRG2= <>
##$CPDPRG3= <>
##$CPDPRG4= <mlev>
##$CPDPRG5= <mlev>
##$CPDPRG6= <mlev>
##$CPDPRG7= <mlev>
##$CPDPRG8= <mlev>
##$CPDPRGB= <>
##$CPDPRGT= <>
##$D= (0..31)
0 0.7 0 0 0 0 0 0 0 0 0 0.03 0 0 0 0 0 0 0 0 0 0 0 0 0 0 0 0 0 0 0 0 
##$DATE= 1765954299
##$DBL= (0..7)
120 120 120 120 120 120 120 120 
##$DBP= (0..7)
150 150 150 150 150 150 150 150 
##$DBP07= 0
##$DBPNAM0= <>
##$DBPNAM1= <>
##$DBPNAM2= <>
##$DBPNAM3= <>
##$DBPNAM4= <>
##$DBPNAM5= <>
##$DBPNAM6= <>
##$DBPNAM7= <>
##$DBPOAL= (0..7)
0.5 0.5 0.5 0.5 0.5 0.5 0.5 0.5 
##$DBPOFFS= (0..7)
0 0 0 0 0 0 0 0 
##$DE= 6
$$ [...]
##$SUBNAM3= <"">
##$SUBNAM4= <"">
##$SUBNAM5= <"">
##$SUBNAM6= <"">
##$SUBNAM7= <"">
##$SUBNAM8= <"">
##$SUBNAM9= <"">
##$SW= 18.0517328524113
##$SWIBOX= (0..15)
0 0 2 0 0 0 0 0 0 0 0 0 0 0 0 0 
##$SW_h= 3612.71676300578
##$TD= 16384
##$TD0= 1
##$TE= 0
##$TE2= 300
##$TE3= 300
##$TEG= 300
##$TL= (0..7)
0 120 120 120 120 120 120 120 
##$TP= (0..7)
150 150 150 150 150 150 150 150 
##$TP07= 0
##$TPNAME0= <>
##$TPNAME1= <>
##$TPNAME2= <>
##$TPNAME3= <>
##$TPNAME4= <>
##$TPNAME5= <>
##$TPNAME6= <>
##$TPNAME7= <>
##$TPOAL= (0..7)
0.5 0.5 0.5 0.5 0.5 0.5 0.5 0.5 
##$TPOFFS= (0..7)
0 0 0 0 0 0 0 0 
##$TUNHIN= 0
##$TUNHOUT= 0
##$TUNXOUT= 0
##$USERA1= <user>
##$USERA2= <user>
##$USERA3= <user>
##$USERA4= <user>
##$USERA5= <user>
##$V9= 5
##$VALIST= <valist>
##$VCLIST= <CCCCCCCCCCCCCCC>
##$VD= 0
##$VDLIST= <DDDDDDDDDDDDDDD>
##$VPLIST= <PPPPPPPPPPPPPPP>
##$VTLIST= <TTTTTTTTTTTTTTT>
##$WBST= 1024
##$WBSW= 4
##$XGAIN= (0..3)
0 0 0 0 
##$XL= 0
##$YL= 0
##$YMAX_a= 598610
##$YMIN_a= -346676
##$ZGOPTNS= <>
##$ZL1= 120
##$ZL2= 120
##$ZL3= 120
##$ZL4= 120
##$ABSF1= 15.46814
##$ABSF2= -2.58371
##$ABSG= 5
##$ABSL= 3
##$ALPHA= 0
##$AQORDER= 0
##$ASSFAC= 0
##$ASSFACI= 0
##$ASSFACX= 0
##$ASSWID= 0
##$AUNMP= <proc_1d>
##$AZFE= 0.1
##$AZFW= 0.1
##$BCFW= 0
##$BC_mod= 2
##$BYTORDP= 0
##$COROFFS= 0
##$CY= -3
##$DATMOD= 1
##$DC= 0
##$DFILT= <>
##$DTYPP= 0
##$F1P= 0
##$F2P= 0
##$FCOR= 1
##$FTSIZE= 16384
##$FT_mod= 6
##$GAMMA= 0
##$GB= 0
##$INTBC= 1
##$INTSCL= 3.241238e-09
##$ISEN= 128
##$LB= 0.25
##$LEV0= 0
##$LPBIN= 0
##$MAXI= 10000
##$MC2= 0
##$MEAN= 0
##$ME_mod= 0
##$MI= 1.114404
##$NCOEF= 0
##$NC_proc= -5
##$NLEV= 6
##$NOISF1= 3.799351
##$NOISF2= 2.8
##$NSP= 0
##$NTH_PI= 0
##$NZP= 0
##$OFFSET= 15.52984
##$PC= 1
##$PHC0= -5301.728
##$PHC1= 12.22193
##$PH_mod= 1
##$PKNL= yes
##$PPARMOD= 0
##$PSCAL= 0
##$PSIGN= 0
##$REVERSE= no
##$SF= 200.129998372662
##$SI= 16384
##$SIGF1= 3
##$SIGF2= 2
##$SINO= 0.751879
##$SIOLD= 32768
##$SREGLST= <19F.Aceton>
##$SSB= 0
##$STSI= 16384
##$STSR= 0
##$SW_p= 3612.71676300578
##$SYMM= 0
##$S_DEV= 0
##$TDeff= 16384
##$TDoff= 0
##$TI= <>
##$TILT= no
##$TM1= 0
##$TM2= 0
##$TOPLEV= 0
##$USERP1= <user>
##$USERP2= <user>
##$USERP3= <user>
##$USERP4= <user>
##$USERP5= <user>
##$WDW= 1
##$XDIM= 16384
##$YMAX_p= 470339738
##$YMIN_p= -300219
$$ End of Bruker specific parameters
$$ ---------------------------------
##NTUPLES= NMR SPECTRUM
##VAR_NAME=  FREQUENCY,     SPECTRUM/REAL,   SPECTRUM/IMAG
##SYMBOL=    X,             R,               I
##VAR_TYPE=  INDEPENDENT,   DEPENDENT,       DEPENDENT
##VAR_FORM=  AFFN,          ASDF,            ASDF
##VAR_DIM=   16384,         16384,           16384
##UNITS=     HZ,            ARBITRARY UNITS, ARBITRARY UNITS
##FACTOR=    0.220516191357247, 1,           1
##FIRST=     3107.98694786079, 0,            0
##LAST=      -504.729815144993, 0,           0
##MIN=       -504.729815144993, -300219,     0
##MAX=       3107.98694786079, 470339738,    0
$$ Real data points
##PAGE= N=1
##DATA TABLE= (X++(R..R)), XYDATA
$$ [...]
8132E08615R3632O6408p5570j07647P907J02233o764O0998K6267K7245N5166M5920
8120H04410K5138L9523R63M0874N9030L2360M7019m7907l5796Q844O4788p3924
8108I65322n3988J9631m5305q9681l8651n743k4076k4640K5448r6326j0636N6185
8096F77540j26817n1276L4025n4277k8718l8477K3583M4330n9667l4485O141J2488
8084D04390m0470l0915J27670L2111p775M2641k8920K6781k1011O5128P0966j7150
8072F23446P9463K5703l4169M4126l5576J8291n574r7759O499R834L8246n4479
8060F18051l0751J7852r2470j9383O5576j11267r9452j417O5795j08746j02729
8049B01059J15147P443n5774J6696L6422K1796p7717L3846K7987r5233j5924j8618
$$ y = [508615, 602247, 668655, 593085, 485438, 493345, 595578, 588814, 649812, 676079, 703324, 758490, 804410, 829548, 869071, 870034, 910908, 969938, 1002298, 1049317, 1001410, 965614, 974458, 1039246, 965322, 911334, 930965, 885660, 795979, 757328, 751585, 727509, 702869, 728317, 631991, 621355, 677540, 550723, 499447, 533472, 479195, 450477, 412000, 435583, 479913, 420246, 385761, 391902, 404390, 363920, 333005, 460675, 492786, 485011, 527652, 498732, 525513, 504502, 569630, 640596, 623446, 702909, 728612, 694443, 738569, 702993, 721284, 715710, 617951, 624450, 634284, 672530, 618051, 587300, 605152, 512682, 493299, 558875, 447608, 348156, 346739, 412534, 303788, 201059, 316206, 323649, 267875, 284571, 320993, 342789, 265072, 298918, 326905, 231672, 215748, 197130]
8037A97130N338p1685n701M4536p0148K167N7355J7180l8415K3592Q7683j6113
8025B32919l4592k285L3155l9146k9720l7530N3322P817k0779K4939l2617L4465
8013A89948q1860L6080J38367n1203O9091P1912j2939L3564r010L5343p601J8422
8001D30114N8070M2107N4847j3133M364O8371j9549J3541J14563N4193l8248l577
7989G65663k555l050M8696M3537K1615M7561J17419R7118J09875J67680J54924
7978A568483J71468K61986L01089K72277K94007K70683K17502K11572J80421K75271
7968D024759K36506J69641Q6083j0554J0150k4342j23563j9468k4115l3430q7657
7957D204010k03582j34024l48481l91323k49663l31906j99440j12778j09782j18881
$$ y = [197130, 202468, 130783, 125082, 169618, 99470, 101637, 158992, 176172, 137757, 161349, 249032, 232919, 198327, 196042, 229197, 190051, 160331, 122801, 176123, 183940, 163161, 188100, 155483, 189948, 108088, 144168, 282535, 231332, 300423, 372335, 359396, 392960, 383950, 419293, 411692, 430114, 488184, 530291, 585138, 572005, 576369, 644740, 625191, 638732, 753295, 807488, 769240, 765663, 763108, 760058, 808754, 852291, 873906, 921467, 1038886, 1136004, 1245879, 1413559, 1568483, 1739951, 2001937, 2303026, 2575303, 2869310, 3139993, 3357495, 3569067, 3749488, 4024759, 4261265, 4430906, 4516989, 4506435, 4516585, 4492243, 4368680, 4349212, 4325097, 4291667, 4204010, 4000428, 3866404, 3517923, 3126600, 2876937, 2545031, 2345591, 2232813, 2123031, 2004150]
7947B004150j93670m7050o6976j36929P8924M1515q1289l6891J07975J32334J2678
7936A814771M9325K74340L10405J46126K38812L80658K30544J46179J99953K15150
7926D006263J49734J37274J62887L2840r5500j18205q1066o8772j06164p2800
7916C946491q0601j33202j83681k76881l39414l21485l32386k52106k34884k30421
7906A561430r0000r6310j68252j56353j21166j7146m3157j68398Q826o9427l6969
7895F03078m9640n0300N1488r5443m9965k1419n789P7193j24532l6153K3142k8626
7883B93034l3377m4296J20259J6148p1797q136j1995k9715Q7027N1542M491n3385
7871C19800k5954Q2056N986P429M863l103m441k9373N2323j7474m0425j8913p9000
$$ y = [2004150, 1810480, 1763430, 1696454, 1559525, 1638449, 1679964, 1598675, 1561784, 1669759, 1802093, 1814771, 1864096, 2138436, 2448841, 2594967, 2833779, 3214437, 3444981, 3591160, 3791113, 4006263, 4155997, 4293271, 4456158, 4488998, 4393498, 4275293, 4194227, 4125455, 4019291, 3946491, 3865890, 3732688, 3549007, 3272126, 2932712, 2611227, 2278841, 2026735, 1791851, 1561430, 1471430, 1375120, 1206868, 1050515, 929349, 912203, 869046, 700648, 709474, 640047, 603078, 553438, 503138, 554626, 459183, 409218, 387799, 382010, 459203, 334671, 298518, 321660, 293034, 259657, 215361, 335620, 351768, 279971, 271835, 259840, 230125, 317152, 368694, 373185, 319800, 293846, 375902, 381888, 389317, 394180, 391077, 386636, 357263, 409586, 392112, 351687, 332774, 253774]
7858B53774j6221k5868O9636J8781j54498L3074N8347J2292o3724O07N9060n6366
7846A88894o5838R3619K4023n9826l362l8952j1887K6997P8447j3622N726K6068
7834B50287m214k6120J8833M5842L852j25435L369R4553K0713K3862J7940m1204
7822B82278r0201j9677O0732J8530o5031l4889J5073R378q5106j7365P5834o9792
7810G9764K7707j9334K0245L0597K46l2568o3477J3122J1406l8208j5127L2405
7798D6778k3244k2585m5704J4119R9764k872p5059L0791J11970K6577j00409J3545
7786G3671P4152m4792o4492R155M7218j4700m73j14108M6494J06297n1412M0859
7774A07869k9432K2238J545m5039O3737m9760l9625K0394k4309O2413k5762o2123
$$ y = [253774, 237553, 211685, 281321, 300102, 145604, 178678, 237025, 249317, 185593, 186200, 245260, 188894, 123056, 216675, 240698, 180872, 177510, 138558, 126671, 153668, 232115, 218493, 224219, 250287, 246073, 219953, 238786, 284628, 288480, 163045, 166414, 260967, 281680, 305542, 323482, 282278, 192077, 172400, 233132, 251662, 186631, 151742, 166815, 176193, 91087, 73722, 149556, 79764, 107471, 88137, 108382, 138979, 139225, 106657, 43180, 56302, 67708, 29500, 14373, 46778, 23534, 949, -44755, -30636, 69128, 66256, -8803, 21988, 133958, 160535, 60126, 73671, 147823, 103031, 38539, 47694, 94912, 80212, 79739, -34369, 12125, 118422, 67010, 107869, 78437, 100675, 102220, 57181, 120918, 71158, 31533, 51927, 27618, 90031, 64269, 2146]
7762B146r301p1517N5923N9473o3722J01936l0271l529P1132k5728Q1186q5181
7750H2547m5772R6989q3437L9438n7201n809K5295j34053L2648M1565K2186Q364
7738B2760j6853O7318P110n4826L8703j006m394L9882p6742o877M3648N351n0838
7725A3236m7341N1221K0995p910K5561l7057J746N0252J2876m1572j210L3476
7713G4273r3483j815M2909m8823J2186J3608M1517k0190m05L4227j7275k1106
7701A5623L1405m3295O6040p4677k8337K1823r2278N0731m3825K0878N3192k926
7689b5646M7610k172K7447N9243p1220O7340Q3034o4702k7301J9994L14J3866
7677A27807n8778K4188j3813j6742N4668n7975O2382j5159j0238P1679l4806l951
$$ y = [2146, -7155, -78672, -22749, 36724, -26998, 74938, 44667, 41138, 112270, 86542, 167728, 82547, 36775, 133764, 50327, 89765, 32564, 26755, 52050, -82003, -49355, -7790, 14396, 22760, 5907, 73225, 80335, 25509, 64212, 63206, 58812, 98694, 21952, 15075, 58723, 64074, 13236, -34105, 17116, 38111, 30201, 55762, 18705, 20451, 70703, 83579, 42007, 40797, 74273, -19210, -21025, 21884, -26939, -14753, -1145, 40372, 20182, 19777, 54004, 36729, 15623, 47028, 3733, 69773, -4904, -33241, -11418, -103696, -52965, -96790, -75912, -22720, -25646, 21964, 19792, 47239, 106482, 35262, 102602, 185636, 120934, 93633, 113627, 113941, 127807, 69029, 93217, 79404, 62662, 117330, 59355, 121737, 106578, 96340, 168019, 133213, 129262]
7665A29262M6591j096p0591m6692J5799N474l1486K6225l1038n7979P3238L0924
7653H8631j2285N405L10O4788j4818j067j2774J624M8363q2698L510Q3420n5995
7640A16414q2763L8110N5407o5626k713p625K7937j5724K1038m3216j124M8107
7628H8222k6856l8320O8307K4387m0869k1088j2477j4452K6902O8175o288q64
7616A14779M3354K4975n3357K0438k47M736J9193k1936N6957l3523o122K0150
7604A89397j8283K1671l1490J17942L8506m8278K8113N6710J5760J4758P2101
7593D56907N8675J0383m574L5606q976j2324m6656l7797r916J0950P700o9354
7581C90624j864j7948K2204Q149j5993R1875j4174J8558K3313j9085M9257J6780
$$ y = [129262, 175853, 174757, 104166, 57474, 73273, 78747, 47261, 73486, 42448, -15531, 57707, 88631, 76346, 81751, 82061, 146849, 132031, 130964, 118190, 119814, 168177, 85479, 88989, 172409, 116414, 33651, 71761, 127168, 61542, 58829, 51204, 79141, 63417, 84455, 41239, 40115, 88222, 61366, 23046, 91353, 115740, 74871, 53783, 41306, 26854, 53756, 121931, 115643, 114779, 158133, 183108, 129751, 150189, 149942, 154678, 173871, 151935, 208892, 175369, 169247, 189397, 171114, 192785, 161295, 279237, 317743, 269465, 297578, 354288, 370048, 384806, 456907, 515582, 525965, 521391, 556997, 548021, 535697, 489041, 451244, 441328, 452278, 459978, 390624, 388760, 370812, 393016, 401165, 385172, 477047, 462873, 481431, 504744, 485659, 534916, 551696]
7569E51696j3253j5431L0979Q0881P123q6276M8284J11123L1033Q4702Q4049J30219
7557A045129J92868P0346J83189J26021Q1926m804r5774J3425j31802n5714N7879
7546A482689q9085l211P8797M4661J29320J09824K15871K37991J88131M76032
7536B871020M76787M55235M96721L26487L95170K68295K05595K65391M8414N700
7526E814815j99387k46083l08091m49620l66905m32060n23334m30993l93493k89051
7516B175798j90060k66233j21571q3432k0296k2155j07595J5979j1596n6529j609
7505A310701q0001m5803n9862O045J377p7229N1114p7760p1J2323J05152P1690
7493A217676j9008M5051J77891J66374M5908J16930K70831K36244K52607M90704
$$ y = [551696, 538443, 523012, 553991, 634872, 641995, 555719, 604003, 715126, 746159, 830861, 914910, 1045129, 1237997, 1308343, 1491532, 1617553, 1699479, 1694675, 1598901, 1612326, 1480524, 1424810, 1482689, 1393604, 1390393, 1469190, 1513851, 1643171, 1752995, 1968866, 2206857, 2394988, 2871020, 3347807, 3803042, 4299763, 4626250, 5021420, 5289715, 5495310, 5760701, 5809115, 5814815, 5615428, 5369345, 5061254, 4611634, 4244729, 3812669, 3289335, 2858342, 2464849, 2175798, 1985738, 1719505, 1597934, 1514502, 1494206, 1472051, 1364456, 1380435, 1368839, 1312310, 1310701, 1230700, 1184897, 1125035, 1131080, 1132457, 1055228, 1106342, 1028582, 1028511, 1040834, 1145986, 1217676, 1198668, 1243719, 1421610, 1587984, 1633892, 1750822, 2021653, 2257897, 2510504, 3001208]
7483C001208M73034M66902L75602K42445L59947L98135L33641J96609J16910L9889
7473F004322k42379k73783l10231n16750m94951m71743m78171m04826l27025k49901
7463B234562k54232j04092r3441p7207m4161L2092o6260M485J851p425n057o173
7451A614942j9951j05026M7198j107j19797P299k0882j22964q1811M3994N5884
7440A297779r8564p8059K6583L2371J2519n5060l527L4553j1115J2106J12200
7429A281786n364m4166J8096K647K5276O7186J50023p1003J6970M4406O7137K9269
7417A582263j4171J00815o1368o1151P5857N3479n2097k3991k7432l6107l5726
7406A500371Q6875N1622p0505O8975M8499M8774K7779P7759N4876j9265l3145
$$ y = [3001208, 3474242, 3941144, 4316746, 4559191, 4919138, 5317273, 5650914, 5847523, 5964433, 6004322, 5761943, 5488160, 5177929, 4661179, 4166228, 3694485, 3216314, 2811488, 2484463, 2234562, 1980330, 1876238, 1782797, 1705590, 1661429, 1693521, 1627261, 1631746, 1633597, 1626172, 1621115, 1614942, 1594991, 1489965, 1537163, 1536056, 1416259, 1423558, 1402676, 1279712, 1197901, 1241895, 1297779, 1199215, 1121156, 1147739, 1180110, 1192629, 1137569, 1134042, 1168595, 1157480, 1169586, 1281786, 1276422, 1232256, 1250352, 1252999, 1278275, 1345461, 1495484, 1424481, 1441451, 1485857, 1552994, 1582263, 1568092, 1668907, 1607539, 1546388, 1622245, 1675724, 1623627, 1599636, 1572204, 1536097, 1500371, 1587246, 1638868, 1568363, 1637338, 1685837, 1734611, 1762390, 1840149, 1895025, 1875760, 1842615]
7395A842615O8735q4264l5170m9634l9251l9244j10726J09885m0867q0194o7531
7384A474354M8892J03799o9265K0091O9167k4243m6365J1019O1024J7894o7605
7373A598762P1065r1721K0289J09790R5326P4990o5498J16824J66447L3096Q7649
7362B217019J49621M9874N3341J12237L04009Q7300J46044L24197L23404L73705
7352D140751M76798O76303O33391N33028N69533N76920M24898M95906N17376M49785
7342I494689L69353K12128L42121L14157M42545N00164N63131P69522R28318J049783
7332A4985911J134386J043407J131681R15856P37651N09277J69463p7175m74214
7323B0076243q47524j140658j179142j340229j364126j317601j105716r48357
$$ y = [1842615, 1911350, 1827086, 1791916, 1742282, 1703031, 1663787, 1553061, 1662946, 1622079, 1541885, 1474354, 1523246, 1627045, 1557780, 1577871, 1647038, 1622795, 1576430, 1587449, 1648473, 1666367, 1598762, 1669827, 1578106, 1598395, 1708185, 1803511, 1878501, 1813003, 1929827, 2096274, 2129370, 2217019, 2366640, 2416514, 2469855, 2582092, 2886101, 2973401, 3119445, 3443642, 3767046, 4140751, 4617549, 5293852, 5927243, 6460271, 7029804, 7606724, 8031622, 8527528, 9044904, 9494689, 9864042, 10076170, 10418291, 10732448, 11174993, 11675157, 12238288, 13007810, 13936128, 14985911, 16120297, 17163704, 18295385, 19211241, 19948892, 20458169, 20627632, 20550457, 20076243, 19228719, 18088061, 16908919, 15568690, 14204564, 12886963, 11781247, 10832890]
7315A0832890p77476m87710m28216m26623k04161j11708j25392n0495j30840j06335
7305G983934k29136k14815k43164l42926k63765l38103l98414m26388l75358l43579
7295D808286l72972m33261k04660k44383k59632k02344j43230j39442j66941n4305
7285B587116o3417l6378l8840M2842k1364P7170O5136l765O3206J11109J62886
7274B945701J86599J75653L94296M15991L64019L92685K74440K70674J51137K60555
7264E831750J78334J6475o0642j62950k71412l14576l30282m17983l61023m32486
7254C675205m49198l73674l08709k56711k19109k30928j30724r9418j01239p1773
7244A433722j74657m7651l5098j05544r3012L9243l0916o9221n4952N3128m010
$$ y = [10832890, 10055414, 9567704, 9139488, 8712865, 8508704, 8396996, 8271604, 8221109, 8090269, 7983934, 7754798, 7539983, 7296819, 6953893, 6690128, 6352025, 5953611, 5527223, 5151865, 4808286, 4435314, 4002053, 3797393, 3553010, 3293378, 3091034, 2947804, 2808362, 2641421, 2587116, 2523699, 2487321, 2448481, 2491323, 2469959, 2547129, 2612265, 2608500, 2671706, 2782815, 2945701, 3132300, 3307953, 3702249, 4118240, 4482259, 4874944, 5149384, 5420058, 5571195, 5831750, 6010084, 6026559, 5965917, 5802967, 5531555, 5216979, 4886697, 4468714, 4107691, 3675205, 3226007, 2852333, 2543624, 2286913, 2067804, 1836876, 1706152, 1606734, 1505495, 1433722, 1259065, 1211414, 1176316, 1070772, 977760, 1017003, 986087, 916866, 861914, 915042, 911032]
7233I11032r0756J6783n3342l9457K419q150j5103n7025k5822j238n3309M1563
7221F27595P9162j6940j06018K7353R5752j10907l7350L2834P2559o4825l9860
7210E59355J01774K061o2142J5163L2473m4069l0336R1242M5034p2368K9327l8631
7198F28883L8901O5819K9404R0091M4087J40946J50357J28319J01813J11080J2615
7187A542315L8753r911J3039J1173j46917j55086j64131p6714j46678j19215j3753
7176G72875j8147j72469p9017L345N8519p3178q6226M6068o9591J6749r321m0161
7164C49446o1614l7474k7633l512K8956Q0515j5807j30036M3508L9741l092k4301
7152B38697J7119n6793m6951Q652N4764j1929j7391j8724l249J08585P0440J52006
$$ y = [911032, 820276, 837059, 783717, 744260, 746679, 738529, 723426, 666401, 640579, 639341, 586032, 627595, 706757, 689817, 583799, 611152, 706904, 595997, 558647, 591481, 664040, 599215, 559355, 661129, 663190, 601048, 616211, 648684, 604615, 574279, 665521, 710555, 638187, 667514, 628883, 667784, 733603, 763007, 853098, 897185, 1038131, 1188488, 1316807, 1418620, 1529700, 1542315, 1581068, 1571157, 1584196, 1595369, 1448452, 1293366, 1129235, 1052521, 905843, 786628, 772875, 754728, 582259, 503242, 506587, 565106, 491928, 405702, 451770, 382179, 398928, 389607, 349446, 287832, 250358, 222725, 219213, 248169, 328684, 312877, 182841, 226349, 266090, 262998, 238697, 255816, 199023, 152072, 160724, 215488, 203559, 186168, 167444, 164195, 272780, 343220, 495226]
7140D95226J30065N5768J8751O6207N8927L9414j1058J1900j04714j13588O700
7129F53598j02979q2950j41004k8979p2740K9424j289L1185k8516n1105K8047
7118B32692J6862J1461r3272J8071N8076j13785k3520J00847j3604j4174r5633
7107H4021K1367M3087P452R5528j07398m0268K4863l3745o352K070k3342j2585
7095E4698j34095L0926R817n4661N2042k8933J1631J3677L7645k2122j6629o890
7083e2894N3657n2648O444L773m339j9461r4334K8463J6804q218j6717N5762L1955
7070e1753Q590L7368M2657r4379l5220O7744J5257m2759k8475L9219j26761J9537
7058a48975K846J3691l0477k926P7173K1189L4211L114K696k5541r3098M9641
$$ y = [495226, 625291, 681059, 699810, 766017, 824944, 864358, 853300, 865200, 760486, 646898, 653598, 550619, 467669, 326665, 297686, 224946, 254370, 253081, 284266, 255750, 204645, 232692, 249554, 261015, 167743, 185814, 243890, 130105, 106585, 207432, 193828, 179654, 84021, 105388, 148475, 155927, 251455, 144057, 103789, 128652, 94907, 88555, 90625, 67283, 54698, -79397, -48471, -38654, -93315, -41273, -70206, -58575, -44898, -7253, -29375, -46004, -52894, 763, -51885, -45441, -41668, -46007, -65468, -159802, -131339, -114535, -122753, -139470, -83708, -51753, -43163, -5795, 36862, -57517, -92737, -24993, -9736, -52495, -80970, -41751, -168512, -148975, -146129, -132438, -162915, -165841, -88668, -67479, -33268, -30154, -27458, -52999, -146097, -96456]
7046i6456J15397q0616j20216j3413L8881K2286J251J7757k9884k4546O3813J45560
7034C9814j8244j0604J2254o4784n6056J23192J09145q8418r6125l6613J9184
7023f7255L921P0256J8080k5627p3590k4326N9412P7660o020j03565n4415J1027
7011a14442R1973k5712j5508l8535p078J8662J1516M0647O4901l9404j08978J4928
6999a07030L7478R8026q0783j5248k2083R842L7766P4346L6814p2346o8250J2256
6987e9212O0104N2426O3740p3599m0601j8883O0163M0133m2585l0953m7952o5064
6975a02283M1036Q6455k9447p5651r6959P2093L000j7645N8903M3389m628n8633
6963h0370Q6347J37587R781k3078M3474J7431J23284J5971J4468o9735p842M4523
$$ y = [-96456, 18941, -61675, -181891, -195304, -156423, -134137, -132886, -115129, -145013, -169559, -105746, 39814, 21570, 10966, 23220, -41564, -97620, 25572, 134717, 46299, -49826, -86439, -67255, -63334, 6922, 25002, -625, -74215, -98541, -39129, 38531, 32511, -71054, -125469, -114442, -22469, -48181, -63689, -102224, -109302, -90640, -79124, -38477, 26424, -12980, -121958, -107030, -69552, 28474, -52309, -67557, -89640, -79798, -42032, 32314, 69128, -3218, -71468, -59212, 892, 53318, 117058, 43459, 2858, -16025, 44138, 84271, 41686, 10733, -37219, -102283, -61247, 25208, -4239, -79890, -176849, -104756, -101756, -119401, -60498, -17109, -21737, -80370, 5977, 143564, 153345, 130267, 173741, 191172, 314456, 330427, 344895, 275160, 267318, 311841]
6951C11841n6885R010L1773K5277o2245k1214J9393O5423n4866J1741M8914O5369
6939C93531Q064l2424K2188n4316o6551l9400O8966m8966K74o4648p6631o8383
6927D1704L4167n6973q593P0204n2248k9717l9142L9915p0713J1032M2590l7067
6915e4841l2311N3020j4041m7760J2406j9813j611K8772P518k0840O9974n4738
6903g4265n7034J8697l1196m1126L0411O0779n5857m2790J5593N5324r4732P4043
6891a42153J8553j2566j5998j3512L4879M8346m4831k2907k2179p574L6809j5473
6879a58606N8490l3918n4955J5733k7047M9869R9856k3704n8544j4791L8148J39065
6867B9596o8644m4307M897n944M6567o106N4572j9433n7437P3265q843n754R2498
$$ y = [311841, 254956, 263966, 295739, 321016, 258771, 237557, 256950, 322373, 267507, 279248, 328162, 393531, 401595, 369171, 391359, 337043, 270492, 231092, 300058, 251092, 251366, 186718, 110087, 41704, 75871, 18898, 10305, 80509, 28261, -1456, -40598, -683, -71396, -60364, -17774, -54841, -87152, -34132, -48173, -95933, -83527, -103340, -104951, -76179, -68661, -89501, -19527, -74265, -131299, -112602, -143798, -184924, -154513, -93734, -149591, -192381, -176788, -121464, -216196, -142153, -123600, -136166, -152164, -165676, -130797, -82451, -127282, -150189, -172368, -179942, -143133, -158606, -100116, -134034, -188989, -173256, -200303, -150434, -50578, -74282, -132826, -147617, -109469, 29596, -39048, -83355, -78458, -84402, -37835, -43941, 10631, -8802, -66239, 7026, -1817, -7571, 84927]
6854H4927o3218O8468q1474J9772L8856o1091J8002m8532l7956L8477J7762n729
6842a1736O169o1815j6128j4624J11453k6017n3260k944l3765J9426m1629k1475
6830a46345L5675K5011m9363L3603n8392N6189n1457J1288N004n3315M8535Q780
6818a34787O7458k4813k7801k1601L4428L7850L7230N186J4290l4923M474N9624
6806A6615K3363P3918J4338k0672J4657O7896R2311o523q1508m7221M9029P862
6794B04065k8641J6509O5409o8829p5144N5931P2939l2825l9827J5600l6740J7129
6782A65576M9328m503o3893Q3364n6654l0163P3085O4344k0572n9273P374K6722
6770B34735M9199N880l1395O7180Q392M0317J28676L2168O7482K030J70553K05749
$$ y = [84927, 21709, 90177, 8703, 28475, 67331, 6240, 24242, -24290, -62246, -23769, -6007, -11736, -5567, -67382, -83510, -98134, 13319, -12698, -65958, -68902, -102667, -83241, -124870, -146345, -110670, -85659, -135022, -101419, -159811, -103622, -155079, -143791, -138787, -192102, -143567, -134787, -67329, -92142, -119943, -141544, -107116, -69266, -32036, -26850, -12560, -47483, -43009, 16615, 39978, 113896, 128234, 107562, 122219, 190115, 282426, 275903, 194395, 147174, 196203, 204065, 175424, 191933, 257342, 188513, 113369, 169300, 242239, 209414, 169587, 185187, 148447, 165576, 214904, 210401, 146508, 229872, 173218, 143055, 216140, 280484, 259912, 200639, 208013, 234735, 283934, 289814, 258419, 325599, 333991, 374308, 502984, 535152, 602634, 604664, 775217, 980966]
6758I80966R1170K70274R4548J42821J25453P3882J55009J00914Q7525k3381j40625
6747A958556N2346k8917r3708j42206k76432k9986j26736j90913q0036o9495j18775
6736H53698j99182o0146M6187l4691m7239j7962Q545l804j13593Q1352L656j11162
6724D05659l5086j510N3788M4129k6519j11079q5402R147N4942q1773P0619n6150
6712B40765n2563j4003N7722M6856q8911k4620m7549N2857J15952l7426q6149
6701A62931j9305p2800l8021l224R5852m851j19377m4514j4023N7173l0848k5551
6689e6558J5425J9171k094O1386j1939k2425j09900o2999j1558L8124J05390q171
6677d6148q4512K9427l8871m3630P6334M5997J703j47301Q0628R7561l3545k895
$$ y = [980966, 1072136, 1342410, 1436958, 1579779, 1705232, 1779114, 1934123, 2035037, 2122562, 2099181, 1958556, 2010902, 1981985, 1888277, 1746071, 1469639, 1439653, 1312917, 1122004, 1041968, 972473, 853698, 654516, 594370, 640557, 605866, 558627, 540665, 549210, 545406, 431813, 513165, 516821, 405659, 370573, 369063, 422851, 466980, 440461, 329382, 243980, 253127, 308069, 226296, 296915, 240765, 188202, 174199, 231921, 278777, 189866, 165246, 117697, 170554, 286506, 249080, 162931, 143626, 70826, 32805, 29581, 125433, 120582, 1205, -43309, -57332, -159, -31007, -56558, -41133, -21962, -24056, 37330, 25391, 2966, -106934, -169933, -181491, -143367, -37977, -46148, -130660, -101233, -140104, -183734, -107400, -61403, -59700, -207001, -126373, -28812, -62357, -65252]
6665f5252q3840j3790j0127K6204Q1187k4269n1988l261p8596N2539M132M586
6653a62475r819q7018O9393m9221k9118L7286l3976j4914k0357P1579J20129p2006
6641a80517l2487J8486o8426N7275N658M0773k4746k0889J6370j5250J4477m0216
6629b29492k189N4117j6411R8994O6375r985J03640N258O3639l5749O4820R8814
6617B61831l3082M1956J5970O9944L5029j07382L1088Q280k6063L8605n6513o363
6605B73300r136j5646O2211J096P2631N5332k4956r73L8382Q871m0635q4435Q4838
6592D20880N4321p9089L2148L0915m8944p5576J6172M9362k0367J941m1516j3027
6580C27220K6966N1059J2880n1779n8231N3035L1641M5447k6662r5358n3235r7761
$$ y = [-65252, -149092, -162882, -173009, -146805, -65618, -89887, -141875, -145136, -223732, -171193, -167061, -162475, -172294, -259312, -189919, -239140, -268258, -230972, -264948, -279862, -300219, -228640, -108511, -180517, -213004, -194518, -262944, -205669, -200011, -159238, -183984, -204873, -188503, -203753, -189276, -229492, -231681, -177564, -193975, -94981, -28606, -38591, 65049, 70307, 133946, 98197, 163017, 261831, 228749, 270705, 286675, 356619, 391648, 284266, 315354, 323634, 297571, 336176, 279663, 273300, 264164, 248518, 310729, 311825, 384456, 439788, 414832, 413859, 452241, 461112, 420477, 336042, 420880, 475201, 396112, 428260, 459175, 410231, 334655, 350827, 400189, 379822, 381763, 340247, 327220, 354186, 405245, 418125, 366346, 308115, 361150, 392791, 438238, 411576, 316218, 262983, 165222]
6568A65222L2072j8535n6159o2954r7074L9631n3546j7187P1826j0801J8152o0229
6556d9582O6591Q4664j01699m3096m4403o244O0702N4387K3995J0142n2898O148
6544H707m1714L6732Q0149l8827L6319o586N1014O8600j51550k3046N7887m9774
6532B7911p881K7455J20789p1307q0618P4006l368N4903L0133j7343r1242K3255
6520H6693P1660o577M1124m1225p1950N7987P698K5298J1135n7999L4038m7110
6508A10772P3407Q777l6468R0409l9853J0116j663J368J52182r1539k2685P0360
6496C25183j4587M7799n0114J4038L1753o1935Q590L4070J4193L7226K98o898
6484C79616j8880L5553M6394j13226K3647O8521q7141O2166k8470l3628k4621
$$ y = [165222, 197294, 178759, 122600, 59646, -37428, 2203, -51343, -68530, 3296, -7505, 10647, -49582, 17009, 101673, -26, -43122, -87525, -93769, -33067, 21320, 45315, 55457, 2559, 8707, -33007, 3725, 83874, 45047, 81366, 74780, 125794, 194394, 42844, 19798, 77685, 27911, 20030, 47485, 168274, 96967, 16349, 90355, 86987, 141890, 172023, 154680, 63438, 86693, 158353, 151776, 192900, 151675, 79725, 137712, 145410, 170708, 181843, 123844, 157882, 110772, 184179, 192956, 156488, 246897, 207044, 217160, 215497, 216865, 369047, 277508, 254823, 325183, 310596, 358395, 308281, 322319, 354072, 292137, 300727, 334797, 348990, 386216, 386514, 379616, 360736, 396289, 442683, 329457, 353104, 421625, 334484, 396650, 368180, 334552, 309931]
6473C09931q3821R5289k1610J7095L0163o1047P8422k393m1328K6175o7250O2762
6461C42388J8431n9213M2725k8338j5646k3115n597P4430j3327L3347j4458l6293
6449C15334N1669K8219q5476P456N3766j6961K9070J45130J6676j04555L9243
6438D79571J21903L1171M30R2402N6989L080M7325O0164P315l5904j5437k3623
6426H25386L4328J5914J1201o2170p3794j4284L9500M3532N26O2862O887l9216
6414H50672P9521L0495O2626J4424m2308J58K5725Q9107j9122n4978M0116q2009
6402I94427j1501N1605M4200j367p8886N357K9945L2046N8410n209L6953l2543
6390A123437Q787J23987L4297J0117j6747M0980J8490Q1227J01549j595o1381
$$ y = [309931, 226110, 321399, 299789, 316884, 347047, 286000, 364422, 362029, 320701, 346876, 279626, 342388, 360819, 301606, 344331, 315993, 300347, 277232, 271635, 346065, 332738, 366085, 351627, 315334, 367003, 395222, 309746, 317202, 370968, 354007, 383077, 528207, 544883, 440328, 479571, 601474, 632645, 633075, 725477, 782466, 785546, 832871, 893035, 900350, 864446, 849009, 825386, 859714, 875628, 886829, 824659, 750865, 736581, 776081, 819613, 820139, 883001, 889888, 850672, 930193, 960688, 1023314, 1037738, 995430, 995588, 1021313, 1110420, 1091298, 1036320, 1076436, 994427, 982926, 1034531, 1078731, 1077364, 998478, 1003835, 1033780, 1065826, 1124236, 1119027, 1155980, 1123437, 1132224, 1256211, 1290508, 1300625, 1283878, 1324858, 1343348, 1424575, 1526124, 1524529, 1463148]
6379A463148M8956J0195R508O1578O7343K3856L5680R6412J0213J3630J00287
6368A940806k7764Q4621Q4970N3927J11301Q6996P466L3412J00910R4883k5319
6357B546209J41891K04551l958J88500K38562J08437J50323K34652J56398R4646
6347D060211J31651J75428Q4230L5897K6842m2993O0983O4182J36158K29999J21833
6336E084421Q9682L13436K99261K62365L31154M89359L86247L28392M74763M27136
6326H486216L12472K93086K67272K17970K17518J11061N0680O0764M3746p801
6316A0052984l8374J21302J76696K22824K39477L59655M51467N61808O01752P49528
6306A3499119P46497P92911Q88094R52314Q68020P88358Q17274P00558P05126
$$ y = [1463148, 1512104, 1522299, 1531807, 1593385, 1660728, 1684584, 1720264, 1816676, 1826889, 1840519, 1940806, 1913042, 1997663, 2082633, 2136560, 2247861, 2334857, 2342323, 2375735, 2476645, 2571528, 2546209, 2688100, 2892651, 2888693, 3077193, 3315755, 3424192, 3574515, 3809167, 3965565, 4060211, 4191862, 4367290, 4451520, 4487417, 4514259, 4471266, 4532249, 4596431, 4732589, 4962588, 5084421, 5174103, 5487539, 5786800, 6049165, 6380319, 6869678, 7255925, 7584317, 8059080, 8486216, 8798688, 9091774, 9359046, 9577016, 9794534, 9905595, 9956275, 10017039, 10060785, 10052984, 10014610, 10135912, 10312608, 10535432, 10774909, 11134564, 11586031, 12147839, 12749591, 13499119, 14245616, 15038527, 15926621, 16878935, 17746955, 18535313, 19352587, 20053145, 20758271]
6297B0758271P65659R33988Q90952J002631R63501Q07105R41516J248860J410575
6288B9723058J561315K010240K758468L716627M992146O366846P715675Q140381
6280F6984756O778664N740978O553189N711628L539729K910842K343234K09296
6272A00772316j971197l100697l006047k023258j411878J18721K891929L601655
6264I5871544L936183N360859N772235M138238J525207J77487L3476N5252J58185
6255A17028666O49462N45608p30037k928563n180417n412955l383079k848737
6247I7739948k524697n71146M78749O44994P43543R66094J083967L22505M88847
6238I9372804K015514J027652r25178j660970k843182n719359q970884j0775636
$$ y = [20758271, 21523930, 22457918, 23348870, 24351501, 25315002, 26122107, 27063623, 28312483, 29723058, 31284373, 33294613, 36053081, 39769708, 44761854, 51128700, 58844375, 66984756, 73763420, 79504398, 86057587, 91769215, 95308944, 98219786, 100563020, 100772316, 98801119, 95700422, 92694375, 90671117, 89259239, 89377960, 92269889, 95871544, 99807727, 105168586, 110940821, 115079059, 116604266, 116781753, 116815229, 116870481, 117028666, 117678128, 118223736, 117493699, 114565136, 109384719, 103971764, 100588685, 97739948, 95215251, 94644105, 95122854, 95767848, 96511391, 97477485, 98561452, 98883957, 99372804, 101388318, 102415970, 101490792, 99829822, 96986640, 91267281, 82296397, 71520761]
6230G1520761j0958591r561165p563532n728029m225184l159279k395729j773031
6222B6156221j508554j236744r87799j011690q80296q37413q08787p80464q55080
6213A7249394p95609o75782o66232m86324l08743j95842k36713j40009K04592
6204A3948732J14937M8119L07620K88340J70062R5481J6858J33567n9579r3428
6194A4970709r4956k54219k25268m46326m38831l68808n91640m86736m61614m39434
6184A1162877k78693k26148j44880j15899l3893K08032J84594J79076K97984K29934
6174A1462984K87489K44655K50585K43461J01704J10291J06806Q2495K00471K14494
6164A3305435L82457M37639L95103M31540L65431K82373J77893J03803L4684j61238
$$ y = [71520761, 60562170, 51001005, 43437473, 37709444, 33484260, 30324981, 27929252, 26156221, 24647667, 23410923, 22423124, 21411434, 20531138, 19693725, 18884938, 18104474, 17249394, 16453785, 15778003, 15111771, 14625447, 14316704, 14120862, 13884149, 13744140, 13948732, 14063669, 14111788, 14419408, 14707748, 14877810, 14973291, 14990149, 15123716, 15064137, 14970709, 14875753, 14621534, 14396266, 13949940, 13511109, 13142301, 12550661, 12063925, 11602311, 11162877, 10884184, 10658036, 10513156, 10397257, 10363364, 10571396, 10755990, 10935066, 11233050, 11462984, 11750473, 11995128, 12245713, 12489174, 12590878, 12701169, 12807975, 12890470, 13090941, 13305435, 13687892, 14125531, 14520634, 14952174, 15317605, 15599978, 15777871, 15881674, 15916358, 15755120]
6154A5755120k34640k66467l37869k40746j55865L967J59474L33896L30856L80963
6144A5728689M78062M58000L57850J98178N5146q9957k5083m5523n6579n8433
6134A7000350k96402m89629n57969n72753m56446m28170k60327j35089k07712
6125A3595853k6592n0799J53815K01553J30251K68418J64593M7312j01735k26423
6115A4156246m60642p31307q40050j080284j005942q48979q33705p07783n31454
6106G116100m43850l79348l43702k57989k19220k47254k01584j60188j10948j59144
6096D592873k12319j0141L0409m8561m5950M2867J27111R3239J91506K32499J44887
6085E138420J50507K04626J34607J00241O4366l4956p5465k07153r0757j34274
$$ y = [15755120, 15520480, 15254013, 14916144, 14675398, 14519533, 14523500, 14682974, 15016870, 15347726, 15728689, 16206751, 16664751, 17022601, 17220779, 17275925, 17185968, 17160885, 17115362, 17058783, 17000350, 16703948, 16214319, 15656350, 15083597, 14627151, 14198981, 13938654, 13803565, 13595853, 13569261, 13518462, 13672277, 13873830, 14004081, 14272499, 14437092, 14484404, 14382669, 14156246, 13695604, 12964297, 12124247, 11043963, 10038021, 9189042, 8355337, 7647554, 7116100, 6672250, 6292902, 5949200, 5691211, 5471991, 5224737, 5023153, 4862965, 4752017, 4592873, 4380554, 4370413, 4400822, 4352261, 4306311, 4349178, 4476289, 4569528, 4761034, 4993533, 5138420, 5288927, 5493553, 5628160, 5728401, 5792767, 5757811, 5682346, 5475193, 5384436, 5250162]
6075E250162k87784l13064k32305k24326k27199j09831n656j24226j61506m5161
6065C519104J7640m8787k5762J7615n2941M6512L3971J53398P8777P0685J25345
6054C935557J29233K13122J48738J74482P0575j1208P4113p3788j59525o1579
6044D439720j85800l09602k65747j27638j78292j80902j44942j53662j34291j08669
6034B650175L9301m6055l9938k9621j11616l6379P9291M8920o859l8353K9526
6023B538392N003L4944M8672k1998P3873m1488o0419L6276K3121k2266r2143n6977
6011B464990o3989r9317k8896j3695j30353p9641k5491L3439j9518Q767m0106
6000B006190O9998n3166m2903J07520J8865K573p279L9447k7002o129R4175l5562
$$ y = [5250162, 4962378, 4649314, 4417009, 4192683, 3965484, 3855653, 3849997, 3725771, 3564265, 3519104, 3536744, 3487957, 3462195, 3479810, 3426869, 3473381, 3507352, 3660750, 3739527, 3810212, 3935557, 4064790, 4277912, 4426650, 4601132, 4671707, 4660499, 4734612, 4660824, 4501299, 4439720, 4253920, 3944318, 3678571, 3550933, 3372641, 3191739, 3046797, 2893135, 2758844, 2650175, 2689476, 2643421, 2603483, 2573862, 2462246, 2425867, 2505158, 2554078, 2547219, 2508866, 2538392, 2543395, 2578339, 2627011, 2605013, 2678886, 2637398, 2576979, 2613255, 2636376, 2614110, 2521967, 2464990, 2401001, 2301684, 2272788, 2259093, 2128740, 2049099, 2023608, 2057047, 2037529, 2046296, 2006190, 2076188, 2023022, 1980119, 2087639, 2106504, 2109077, 2101798, 2141245, 2114243, 2108114, 2202289, 2166727]
5988B166727p5055l812j4789R670O2291J3756k6355l7838k2412K1884M8967M267
5976B147301j4482m2237L4135o4151J0490L3826l2439N7092q3483J784N0651N2488
5964B150975J1325p544J4817j647n3315M6994j6598n0738N6747l2749n6582N563
5952B067248K5313n2069l04L9365M1010J7128O4239M4698n7531N8833Q7778k9576
5940B306132M1979N9934m5495K0143q8687O1834K2172k8966O0649q1422J03309
5929B431582j8281L1311Q6840J823M7888J6484O5793O9552N3431P8590j7491m2873
5917B804649J19331L495P1407L0047l7268K1412L9760l8554l3166j0319p316r4765
5905B868713K1522O6792r3240P6379L5560K8083O7650K7395Q358M6797N181J1785
$$ y = [2166727, 2091672, 2087860, 2073071, 2082741, 2145032, 2158788, 2132433, 2094595, 2072183, 2094067, 2143034, 2147301, 2132819, 2090582, 2124717, 2060566, 2071056, 2104882, 2072443, 2129535, 2046052, 2047836, 2098487, 2150975, 2162300, 2154756, 2169573, 2167926, 2114611, 2161605, 2145007, 2094269, 2151016, 2118267, 2061685, 2067248, 2092561, 2040492, 2040188, 2079553, 2120563, 2137691, 2201930, 2246628, 2189097, 2247930, 2335708, 2306132, 2348111, 2408045, 2362550, 2382693, 2294006, 2355840, 2378012, 2349046, 2409695, 2328273, 2431582, 2413301, 2444612, 2531452, 2533275, 2581163, 2597647, 2663440, 2732992, 2786423, 2865013, 2847522, 2804649, 2923980, 2927475, 2998882, 3028929, 2991661, 3013073, 3052833, 3014279, 2981113, 2970794, 2963478, 2868713, 2890235, 2957027, 2863787, 2940166, 2975726, 3003809, 3071459, 3098854, 3107212, 3154009, 3159190, 3170975]
5893C170975l3160M8354K1527j06776K2240j29355j984K4170n300K0574O0095
5882C091360O0485K7728M3308P0115O0699L8363Q8330p0539M4048K8136j27782
5871C354251n2599k8790j22941o9666k5725m9174q8791o2870M1049j24695J5954
5860B786003O7310p7022N74j4568j9201m6514k1453N5896n9525R585M5163o6419
5848B659829J09832J07230K1324P8431j0597N1590Q3384P8433N1221M6369O4957
5837C342003O7177J3622J83040K5345L9864J57825k2104K1463N0463M1298k9088
5826C890908p8092o113j8935p6340K5023j45710m0294R1263k9289N6788P8525
5815C747734J0293M4366R3522R1545j0824N7984J78595m8293O6221J08019K8828
$$ y = [3170975, 3137815, 3186169, 3207696, 3100920, 3123160, 2993805, 2991821, 3015991, 3010691, 3031265, 3091360, 3151845, 3179573, 3222881, 3292996, 3353695, 3392058, 3480388, 3409849, 3453897, 3482033, 3354251, 3301652, 3272862, 3149921, 3080255, 3054530, 3005356, 2916565, 2853695, 2894744, 2770049, 2786003, 2853313, 2776291, 2776865, 2762297, 2743096, 2696582, 2675129, 2731025, 2671500, 2681085, 2726248, 2659829, 2769661, 2876891, 2898215, 2976646, 2966049, 3017639, 3101023, 3179456, 3230677, 3277046, 3342003, 3409180, 3422802, 3605842, 3631187, 3671051, 3828876, 3806772, 3828235, 3878698, 3919996, 3890908, 3812816, 3806703, 3787768, 3711428, 3736451, 3590741, 3550447, 3641710, 3612421, 3669209, 3747734, 3758027, 3802393, 3895915, 3987460, 3976636, 4034620, 4213215, 4164922, 4231143, 4339162, 4367990]
5804D367990J42415P2811J01680N1849R0785J50958K03912J09376R5915Q0735
5794E468426J90806J65953Q5299K64808J03006J48373K41779J60644J60835K78165
5784G268094K77941K09886K17252L45877K98587K35945L86287L09507L63555M37265
5774A0350196M15927M05691M86947N34615N36607N73316O92236O12617O23855
5765A5232007P62231P43986Q55883Q80350J093803J147913J290568J471653J673704
5756B5152098J992307K319276K886702L564673M621454O203108Q084349R721997
5748F4545964J0596091R979447Q066961P346001P464558N421613L383935K750269
5740A19554839J573180q82714l127051m035644m099244l831216j719042R34616
$$ y = [4367990, 4510405, 4583216, 4684896, 4736745, 4827530, 4978488, 5182400, 5291776, 5387691, 5468426, 5659232, 5825185, 5910484, 6175292, 6278298, 6426671, 6668450, 6829094, 6989929, 7268094, 7546035, 7755921, 7973173, 8319050, 8617637, 8853582, 9239869, 9549376, 9912931, 10350196, 10766123, 11171814, 11658761, 12193376, 12729983, 13303299, 13995535, 14608152, 15232007, 15994238, 16738224, 17594107, 18474457, 19568260, 20716173, 22006741, 23478394, 25152098, 27144405, 29463681, 32350383, 35915056, 40536510, 46739618, 54823967, 64545964, 75142055, 85121502, 93188463, 100534464, 107999022, 113420635, 116804570, 119554839, 121128019, 120245305, 117118254, 113082610, 108983366, 105152150, 103433108, 104367724]
5732A04367724J803327L086701N196701O136343N525145L964892K115694J545187
5724A33741714K403182K832001K858171K609772J896298l56366m286080o376055
5716A35322637o032344o069551n425379l551480k242940j374005n75351L07785
5708A10359372J172842J242893R88376J742760J904439L25615p52041j496717
5700A15487539l430816o272631q766500r882330r455262q454606o996837n545510
5692E6683047m507850l859568l416124k933260k579002k269116j973899j794600
5684C3349628j621847j275701j080402r41609q15395q13152r16759r35309r41444
5675B4008010j007534j115082j204331j075437j067864j022931p12743n63244
$$ y = [104367724, 106171051, 109257752, 114454453, 120590796, 126115941, 130080833, 132196527, 133741714, 136144896, 138976897, 141835068, 144444840, 146341138, 145984772, 141698692, 135322637, 129290293, 123220742, 117795363, 114243883, 112000943, 110626938, 110051587, 110359372, 111532214, 112775107, 113763483, 115506243, 117410682, 117736297, 116984256, 115487539, 112056723, 105784092, 97017592, 87135262, 77680000, 69225394, 62228557, 56683047, 52175197, 48315629, 44899505, 41966245, 39387243, 37118127, 35144228, 33349628, 31727781, 30452080, 29371678, 28430069, 27614674, 26801522, 25884763, 24949454, 24008010, 23000476, 21885394, 20681063, 19605626, 18537762, 17514831, 16802088, 16238844]
5667A6238844n80787n37520l65056l42331m15876m31321k69161l05233k45109
5658A2746450j72851j09120j91840q2030j5037j9565m2297p058R9438J24057K86908
5647A2617055L09877O0100m2096o4891J73644r840j48221P3719q819j43366k45573
5636A2571589l89785k20168r3279N2487L89336N02431P17179P56751O98772Q77005
5626A5862318P54735O52388P18386N27926K68726k44098m42562m43249m39211
5617A7215359m79094o49022o58088n43281k85542j63534J0241K22891L34903M20243
5607A5425076M27812N08992P27980O41012O41994O20393N63421N50544N03420
5598B0610644L46084L26158L29748J07978j28875j65952j56582k68917l22108
$$ y = [16238844, 15658057, 15120537, 14755481, 14413150, 13997274, 13565953, 13296792, 12991559, 12746450, 12573599, 12464479, 12272639, 12190609, 12175572, 12156007, 12113710, 12106652, 12206090, 12330147, 12617055, 12926932, 12987032, 12944936, 12880045, 13053689, 13043849, 12895628, 12969347, 12960528, 12817162, 12571589, 12181804, 11961636, 11868357, 11920844, 12310180, 12812611, 13529790, 14286541, 14985313, 15862318, 16617053, 17269441, 17987827, 18515753, 18784479, 18540381, 18097819, 17654570, 17215359, 16736265, 16087243, 15429155, 14885874, 14600332, 14436798, 14447039, 14669930, 15004833, 15425076, 15852888, 16361880, 17089860, 17730872, 18372866, 18993259, 19556680, 20107224, 20610644, 20956728, 21282886, 21612634, 21720612, 21591737, 21425785, 21269203, 21000286, 20678178]
5589B0678178m03989m47109m22845k61072j82338k66247k3905P0610J76518L39654
5579A9257455M83032O74927O40192Q56923R12578Q42161P16514L85282J61281
5570B4930345K1765r8874j46523k49394l24447l08464l94045l88045l83460l79339
5560B2279519l97439m47419l25143l17836l30317j01150j90440k11299M4057N2813
5550B0055346Q9789J2546J64491m0948k30861j78551l66013n19858m97110m95735
5540A7993096m16131l98344k94226q0331p2465O0843K31882K36303K83370K09212
5530A7753209K83305L37460L12841M18393M24141M23666O14277N73201P29011
5521B1869504Q61509R68787J055978R39187J138981J115653Q59804R30799Q60830
$$ y = [20678178, 20274189, 19827080, 19404235, 19143163, 18960825, 18694578, 18670673, 18741283, 18917801, 19257455, 19740487, 20415414, 21055606, 21912529, 22825107, 23667268, 24383782, 24769064, 24930345, 24952110, 24853236, 24706713, 24457319, 24132872, 23824408, 23430363, 23042318, 22658858, 22279519, 21882080, 21434661, 21109518, 20791682, 20461365, 20360215, 20169775, 19958476, 20002533, 20055346, 20145135, 20157681, 20322172, 20281224, 20050363, 19871812, 19505799, 18985941, 18488831, 17993096, 17576965, 17178621, 16884395, 16804064, 16731599, 16792442, 17024324, 17260627, 17543997, 17753209, 18036514, 18373974, 18686815, 19105208, 19529349, 19953015, 20567292, 21140493, 21869504, 22731013, 23699800, 24755778, 25694965, 26833946, 27949599, 28809403, 29740202, 30601032]
5512C0601032Q74163Q73996P64739P23824N23972M36727L12338P8595N3080k60026
5502C4982440n05650o69692r13156j081220j322250j478512j477509j618232j614864
5493B4301355j650311j623160j529066j546486j427312j269308j111472r81060
5485A3163180q37828p15280n34582m59464m56834l77464l77789k88709l23025
5476H792205l24824k80890l01041k94785k61342l40797l03483k18445l11638k04419
5466E950541r5035j40723j17493q7250L8555j47323j52649P8241r3476o4697k7435
5455E141256p9788K64j12040j21254l9906r9995k680n8729L393k953p2482P9072
5443D634158j09970o4539J03826o3307k8109k6482j7420j47783j37900o9511r1530
$$ y = [30601032, 31475195, 32349191, 33113930, 33837754, 34361726, 34798453, 35110791, 35189386, 35242466, 34982440, 34476790, 33807098, 32893942, 31812722, 30490472, 29011960, 27534451, 25916219, 24301355, 22651044, 21027884, 19498818, 17952332, 16525020, 15255712, 14144240, 13163180, 12325352, 11610072, 11075490, 10616026, 10159192, 9781728, 9403939, 9115230, 8792205, 8467381, 8186491, 7885450, 7590665, 7329323, 6988526, 6685043, 6466598, 6154960, 5950541, 5855506, 5714783, 5597290, 5510040, 5548595, 5401272, 5248623, 5326864, 5233388, 5168691, 5141256, 5061468, 5061732, 4949692, 4828438, 4788532, 4688537, 4685857, 4627128, 4630521, 4627568, 4555086, 4634158, 4524188, 4459649, 4563475, 4500168, 4472059, 4445577, 4428157, 4280374, 4142474, 4072963, 3981433]
5432C981433j05597o0637j18226j5802k0919r5761p6113P1462K2439m6265N7287
5421C593301R2751l0653m5801O5181N858l4814l3953m5148r333m2785j2051j14298
5409C388255k2902Q567p991Q5365N5738K2306R2677r61N1744O7654Q0338J9781
5397C840571O827J53523P8358N9600K37756J94635K85401L10952J64537J80556
5387E512716J84891q114m4130k9543o2105k82433l07094k82431l21489k38540
5377D121728j24377j47229j37550p5744j49634j54766j58555j05733j10140o1649
5367B896351l5236j05275r0457k4106k4730L4532J2941k2454M4530Q470K342r717
5355B687191N4750k6505l0507K9296L3387J1334Q9592L2852j30134P3279L65j30863
$$ y = [3981433, 3875836, 3815199, 3696973, 3681171, 3660252, 3564491, 3488378, 3559840, 3582279, 3536014, 3593301, 3686052, 3655399, 3609598, 3674779, 3680637, 3645823, 3611870, 3566722, 3557389, 3514604, 3502553, 3388255, 3365353, 3373920, 3365929, 3451294, 3507032, 3529338, 3622015, 3621054, 3672798, 3740452, 3820790, 3840571, 3847398, 4000921, 4079279, 4138879, 4376635, 4571270, 4856671, 5167623, 5332160, 5512716, 5697607, 5689493, 5645363, 5615820, 5553715, 5271282, 4964188, 4681757, 4360268, 4121728, 3997351, 3850122, 3712572, 3636828, 3487194, 3332428, 3173873, 3068140, 2958000, 2896351, 2861115, 2755840, 2665383, 2641277, 2616547, 2651079, 2664020, 2641566, 2686096, 2694566, 2696908, 2687191, 2741941, 2715436, 2684929, 2714225, 2747612, 2758946, 2848538, 2881390, 2751256, 2824535, 2824900, 2694037]
5343B694037n6660K5643o0880j53836l6433m4443j45215k2810J643n0252l7777
5332B113017K187M9199n7520k7974L0686j01251k618K8865M7957k7406p1043O146
5320A990245k13m9016L8906j8003J3316j0323k149O4233O239j7460O7053k0881
5308B061947M6733R4336J9073L2822K9914m313l9527j4113N0616l6858K5328J3388
5296B279346o3220m0118m6151m8852l9975m0768l0683n7682M0234m9392n367n5040
5284A842332p663L7750J6559L6240M5519j2938k909j2581N9708J513Q9939Q7302
5272B180771J4696P2004R0052r91J2215O1197Q6685K4862m3272L8710O3478j29325
5260B471082J9684K6998M9294p978J1654J17039k4545K255M8815N761R5424P2439
$$ y = [2694037, 2637377, 2663020, 2602140, 2448304, 2411871, 2367428, 2222213, 2199403, 2201046, 2150794, 2113017, 2115204, 2164403, 2106883, 2078909, 2109595, 2008344, 2005726, 2034591, 2082548, 2055142, 1984099, 1990245, 1990032, 1941016, 1979922, 1961919, 1975235, 1964912, 1962763, 2026996, 2033235, 2015775, 2082828, 2061947, 2108680, 2203016, 2222089, 2254911, 2284825, 2280512, 2240985, 2226872, 2277488, 2240630, 2265958, 2279346, 2216126, 2176008, 2129857, 2081005, 2041030, 2000262, 1969579, 1911897, 1952131, 1902739, 1897372, 1842332, 1834669, 1872419, 1888978, 1925218, 1970737, 1957799, 1954890, 1942309, 2002017, 2003530, 2093469, 2180771, 2195467, 2267471, 2357523, 2356532, 2368747, 2429944, 2516629, 2541491, 2498219, 2536929, 2600407, 2471082, 2490766, 2517764, 2567058, 2559080, 2570734, 2687773, 2663228, 2665483, 2714298, 2720059, 2815483, 2887922]
5248B887922R4955J09746L6532O8309Q0143M0734N1488m5466j3706q005r2671
5237C209981l1945j7783q0802q6647j19608j03705j07678j40464n8111q4949q9909
5226B288380j8504k78n3380n3903m8137P1835p0671p387M1241l3839j0846j2113
5214B092398M6980r477J5179J14123o3319N9991O4393k951l2392L3023L5424N334
5202B358706N9460O2379O995j6066o3108P1260o8789K0422L909P0269j8680j0636
5190B476121Q8190K9049o8513N6069L9551L2249o1387R3528N0970o6523J4519
5179B683823J522o0305o279Q015K9907k3010N8899N3594P5667K9051J19460R2400
5167C062744J37221Q7967J02017O2680Q5927j5754O2253N1898Q1277J51640J54592
$$ y = [2887922, 2982877, 3092623, 3129155, 3197464, 3277607, 3318341, 3369829, 3324363, 3310657, 3302652, 3209981, 3178036, 3160253, 3079451, 2992804, 2873196, 2769491, 2661813, 2521349, 2463238, 2378289, 2288380, 2269876, 2269598, 2216218, 2162315, 2114178, 2186013, 2115342, 2107955, 2149196, 2115357, 2104511, 2092398, 2139378, 2129901, 2145080, 2259203, 2195884, 2255875, 2320268, 2317317, 2284925, 2317948, 2353372, 2358706, 2418166, 2480545, 2487540, 2471474, 2408366, 2479626, 2410837, 2431259, 2435168, 2505437, 2486757, 2476121, 2564311, 2593360, 2524847, 2580916, 2620467, 2652716, 2591329, 2684857, 2735827, 2669304, 2683823, 2685345, 2625040, 2618761, 2626776, 2656683, 2633673, 2692572, 2746166, 2821833, 2850884, 2970344, 3062744, 3199965, 3287932, 3389949, 3452629, 3538556, 3522802, 3585055, 3636953, 3718230, 3869870, 4024462]
5156D024462O7241J50934J54664J71273Q3137J87042J01107J64912J22735J49935
5146E377442j7757R513Q7544M9614J6158J10640J41601J67115K6536J21962J65462
5135F255830J98887J40304K03729L03459J35121J48955K36865J50088Q0813J42051
5125G996102K75712K00931L08963L99513L76344L69239N52463O48008O57655O64683
5115A2449613N60510O67549N94454N26611N26058O33008N02338N47243O21131
5106A7628515O95745O35304Q98410R51846J112288J254886J452727J477623J928017
5097B8035361K088843K583537L095444M438328N885424P203304Q077353P182056
5089F8589650N802085P957377O110940M792360O460069P138789O658984Q500618
$$ y = [4024462, 4091703, 4242637, 4397301, 4568574, 4651711, 4838753, 4939860, 5104772, 5227507, 5377442, 5359685, 5369198, 5456742, 5506356, 5522514, 5633154, 5774755, 5941870, 5968406, 6090368, 6255830, 6454717, 6595021, 6798750, 7102209, 7237330, 7386285, 7623150, 7773238, 7854051, 7996102, 8271814, 8472745, 8781708, 9181221, 9557565, 9926804, 10479267, 11127275, 11784930, 12449613, 13010123, 13677672, 14272126, 14798737, 15324795, 15957803, 16460141, 17007384, 17628515, 18324260, 18959564, 19857974, 20809820, 21922108, 23176994, 24629721, 26107344, 28035361, 30124204, 32707741, 35803185, 40241513, 46126937, 53330241, 61407594, 68589650, 74391735, 82349112, 88460052, 93252412, 99712481, 106851270, 113510254, 122010872]
5081A22010872J2379715K3564320L9130759N2461283O0971470N5766284L4769898
5074D01054601M1543737K6045145k445297M141552l516746k7420914n2010836
5067C87391242o7092893o7672240n4942313m2346579l0504614k1998371j5918771
5060H6915461j2282367r282176p839754o726284n681816m464027l743216k620257
5052C4275564k178028j710516j572255j270683j141578q38187p31994n08595n23460
5043B3800268q6229j22153M3002K60450L96591O62480J167535J533573J880391
5034B9535908J498208R88684R41010Q7794o31560l09384o66750j390029k007703
5025B8046178k066822j806095j231450q68149p19271m66743m61052o81061n18187
$$ y = [122010872, 134390587, 157954907, 197085666, 249546949, 310518419, 366284703, 401054601, 442598338, 468643483, 466198186, 470339738, 466822992, 439402078, 387391242, 320298349, 252626109, 197683796, 155337217, 124832603, 102834232, 86915461, 74633094, 65350918, 57511164, 50784880, 45103064, 40639037, 36895821, 34275564, 32097536, 30387020, 28814765, 27544082, 26402504, 25564317, 24832323, 24323728, 23800268, 23714039, 23591886, 23634888, 23895338, 24291929, 24954409, 26121944, 27655517, 29535908, 31034116, 32022800, 32963810, 33051604, 32420044, 32110660, 31443910, 30053881, 28046178, 25979356, 24173261, 22941811, 22073662, 21354391, 20887648, 20426596, 19745535, 19227348]
5016A9227348p44190j065112j239169j330681j180911q74069o27039k89641k14406
5007A1662130j10231R5043O0535L5325J38937J72835J37102J83470J30040J30472
4997A2635658l9251l5717j15777r1087p7700j08386j04961j29392k37086j95385
4987A1500916k71850l86367k44581j34632j54974j229R8811K98844K44517L19035
4977A1268490L55165L19409J88204J78333J12768m3197l00607m62047m89479l82005
4967A0745034m34177m92050n08209l73418k81896l28569k36147n2918k982K0109
4957H054777R7651L37534K88091L23148L68263L74638M21694M72523M57284M93736
4947A1689339N55185N82217M76979M37543M93915P20766R91556J348080K159964
$$ y = [19227348, 18483158, 17418046, 16178877, 14848196, 13667285, 12793216, 12166177, 11876536, 11662130, 11551899, 11646942, 11707477, 11742802, 11881739, 12054574, 12191676, 12375146, 12505186, 12635658, 12596407, 12560690, 12444913, 12353826, 12276126, 12167740, 12062779, 11933387, 11696301, 11500916, 11229066, 10842699, 10598118, 10463486, 10308512, 10307283, 10406094, 10704938, 10949455, 11268490, 11623655, 11943064, 12131268, 12309601, 12422369, 12379172, 12078565, 11616518, 11127039, 10745034, 10310857, 9818807, 9310598, 8937180, 8655284, 8326715, 8090568, 8037650, 8034668, 8054777, 8152428, 8489962, 8778053, 9101201, 9469464, 9844102, 10265796, 10738319, 11195603, 11689339, 12244524, 12826741, 13303720, 13741263, 14235178, 14955944, 15947500, 17295580, 19455544]
4938A9455544L266516M106478M779011M694176L350513L346498K237322O6362
4930D5302420L13726l60995k367202m064220n123687n092887l922490l054854
4922B1629811k022646j319172q20422l96377p1453M95040J048615J419361J952784
4913B1915541K012054J369279J443646J384586K99833K06448R8447o66543j656370
4904B6406921k236891k419837k107802j585862j361202j081567p48453o33978
4896A4231329m70741m06622m01707l66715l28783k77430k77137j61365j08780
4887A1432049j19343l4114M7428q28O0479L4952J16965J53427J72759K37731K34098
4876A2335603L68159M24151L35143L33009L30206M66929M28410M67430N86032
$$ y = [19455544, 22722060, 26828538, 31607549, 36301725, 39652238, 42998736, 45236058, 45302420, 45616146, 45255151, 42887949, 38823729, 33700042, 28607155, 24684665, 21629811, 19607165, 18287993, 17467571, 17071194, 16999741, 17494781, 18543396, 19962757, 21915541, 23927595, 25296874, 26740520, 28125106, 28424939, 28631387, 28729834, 28063291, 26406921, 24170030, 21750193, 19642391, 18056529, 16695327, 15613760, 14865307, 14231329, 13760588, 13353966, 12952259, 12585544, 12256761, 11979331, 11702194, 11540829, 11432049, 11312706, 11278592, 11326020, 11325192, 11385671, 11420623, 11537588, 11691015, 11863774, 12101505, 12335603, 12703762, 13127913, 13463056, 13796065, 14126271, 14593200, 15021610, 15489040, 16075072]
4867A6075072N78315N10525N41724P03845P00667O57946N44673M35725L21342
4858B1069834J24408m6397k78145l45818o12697p44186p49192q02525p27171p37545
4848A6150566p85438q06844p18577o51665p03886o45347o97213o63330n97098
4839I881168n87978n13046n21579l83443k57032l03816j40038r1197j65279j48379
4829F769381j28466k7111j8635o8982l476j79981p7378j06067q3009n1002k00079
4818E825195r0071m6247p7164p8840p5569m5974j51063r0001j3500J750j10462
4807E048054l4362j07355j40772n1281p0770o4000o0498p3259Q3940P170j6196
4796D520671J9361L1905L4118j735Q1661J21516M1670P5813P7327P6683J05628
$$ y = [16075072, 16653387, 17163912, 17705636, 18409481, 19110148, 19768094, 20312767, 20748492, 21069834, 21194242, 21147845, 20869700, 20523882, 19911185, 19166999, 18417807, 17615282, 16888111, 16150566, 15365128, 14558284, 13839707, 13188042, 12484156, 11838809, 11141596, 10478266, 9881168, 9293190, 8780144, 8258565, 7875122, 7618090, 7314274, 7174236, 7083039, 6917760, 6769381, 6640915, 6613804, 6595169, 6526187, 6522711, 6342730, 6265352, 6159285, 6076276, 6025274, 5825195, 5735124, 5688877, 5611713, 5532873, 5457304, 5411330, 5260267, 5170266, 5156766, 5158516, 5048054, 5013692, 4906337, 4765565, 4714284, 4643514, 4579514, 4519016, 4445757, 4529697, 4536867, 4520671, 4540032, 4571937, 4606055, 4604320, 4685981, 4807497, 4849167, 4924980, 5002307, 5078990, 5184618]
4785E184618J25377P7676J35348J39892J50652J56273K28744K48190J46893K74204
4775F867867L47876L12992L99761M08163M50767M66016M96362N01683N87674N38136
4765A1377297M61781M36436M74282L47162K72623L90540K71580N5413Q5407Q5046
4755A4257567j46211j42952l4576j01869p7326J3961J62930M58507O78235Q97737
4745A5966003Q62738O35267M93360P46305J134244Q21517M21618L54436J62143
4736B1597631k92013q63348j186430j484014j427739j280417j059565r46615p40135
4727A2317355n95678n04982l57914l11313k32321p7684l8956k099J1094J19626
4717A0327128J14485J8737J00767M5620l3566j15880k11048j17865k69305l58907
$$ y = [5184618, 5309995, 5387671, 5523019, 5662911, 5813563, 5969836, 6198580, 6446770, 6593663, 6867867, 7215743, 7528735, 7928496, 8336659, 8787426, 9253442, 9749804, 10251487, 10839161, 11377297, 11839078, 12275514, 12749796, 13096958, 13369581, 13760121, 14031701, 14087114, 14172521, 14257567, 14111356, 13968404, 13933828, 13831959, 13754633, 13768594, 13931524, 14390031, 15068266, 15966003, 16828741, 17464008, 17957368, 18703673, 19837917, 20659434, 21081052, 21435488, 21597631, 21305618, 20442270, 19255840, 17771826, 16344087, 15063670, 14004105, 13057490, 12317355, 11721677, 11216695, 10858781, 10547468, 10315147, 10237463, 10198507, 10196408, 10207502, 10327128, 10441613, 10460350, 10561117, 10606737, 10573171, 10457291, 10246243, 10128378, 9859073, 9500166]
4707I500166l15377l29207l52097l13611k91925k02073k43519k08970k27784j77577
4697F838026j21292j53927j81183k04680j68960o3669q6326j38006j62686m2748
4687E514549l5491j09572l0411Q4462q5311r3183L5093K1705k4385m6868J4992
4676E245580k3697l277k0602p7370L2274m2240r9481l0478j3021P696q2279p0873
4664D822232k935p2607L5751M4813L3577N7254j6414N6527J06369L0897k3011
4653E072453M995J29411L4118l1357K4344n5165r8281r202r8399n9355K8248j810
4641D940000K3400n8887J17864O4598l0279J43750J42672K34724K64055J68781
4631F010678L86637M18010L51933L52676L23037M05656K44017K04986L28294J00725
$$ y = [9500166, 9184789, 8855582, 8503485, 8189874, 7897949, 7695876, 7452357, 7243387, 7015603, 6838026, 6716734, 6562807, 6381624, 6176944, 6007984, 5944315, 5857989, 5719983, 5557297, 5514549, 5479058, 5369486, 5339075, 5423537, 5338226, 5245043, 5280136, 5301841, 5277456, 5230588, 5245580, 5221883, 5218606, 5198004, 5120634, 5152908, 5110668, 5011187, 4980709, 4967688, 4975384, 4893105, 4822232, 4819297, 4746690, 4782441, 4827254, 4860831, 4918085, 4901671, 4958198, 5064567, 5095464, 5072453, 5077448, 5206859, 5240977, 5209620, 5233964, 5178799, 5080518, 5071316, 4972917, 4913562, 4941810, 4940000, 4963400, 4904513, 5022377, 5086975, 5056696, 5200446, 5343118, 5577842, 5841897, 6010678, 6397315, 6815325, 7167258, 7519934, 7842971, 8248627, 8492644, 8697630, 9025924, 9126649]
4621I126649M6487K8460k6212k9762l9883J8267J36685J58657L54626L07165M10697
4610A0491836O34352O69182R50950J065015J277728J562804J428463J297473J291052
4601B0668855J263363J188169R61412J039871R20094O24596N09338K48928L90575
4592B7815201P08721R10165J146844J109290Q34581O66068M55492J40518j83775
4583C3603105k90003n19764r33538j213058j430300j504623j312595j158331j095426
4574B4145467j029016r75250r30249q86887q19364p51273p51367n95104n37525
4565A6869432m29218l44034k46952k15873j36387k174J00582J61279L42756L09454
4555A6408865L61450M96550N50831P61008Q60192J031485J304617J601537K072907
$$ y = [9126649, 9173136, 9201596, 9175384, 9145622, 9105739, 9124006, 9260691, 9419348, 9773974, 10081139, 10491836, 11126188, 11795370, 12746320, 13811335, 15089063, 16651867, 18080330, 19377803, 20668855, 21932218, 23120387, 24081799, 25121670, 26041764, 26666360, 27175698, 27424626, 27815201, 28523922, 29434087, 30580931, 31690221, 32524802, 33190870, 33646362, 33786880, 33603105, 33313102, 32793338, 31859800, 30646742, 29216442, 27711819, 26399224, 25240893, 24145467, 23116451, 22141201, 21210952, 20324065, 19504701, 18753428, 18002061, 17406957, 16869432, 16440214, 16096180, 15849228, 15633355, 15496968, 15494794, 15595376, 15756655, 16099411, 16408865, 16770315, 17266865, 17817696, 18578704, 19438896, 20470381, 21774998, 23376535, 25449442]
4546B5449442K354248K687814K947351K795333K611219K365118J969159J408001
4538D4587685O70031Q0766p38741j554688k184775k732520k913538k728270k572621
4529B9913329k321556j897081j673102j447087j321097j153600j012242r77188
4521A8110376q78287q96112r54776q33201q10813p10567o71434o77019m94067
4512A1184100n27637l76856l28151l14215k23220l21419j59642j72749j50132
4503H610079L8353J5056o4014m313P3168J16962R3260J47882K18777J69217O4849
4492I479276J02046J12340M098j29627j11193j47885k14966j70699k89097l29470
4482H304823l23125l29825l25609k73261j22506j68168j12218j13709r8426n8809
$$ y = [25449442, 27803690, 30491504, 33438855, 36234188, 38845407, 41210525, 43179684, 44587685, 45257716, 45338482, 44599741, 43045053, 40860278, 38127758, 35214220, 32485950, 29913329, 27591773, 25694692, 24021590, 22574503, 21253406, 20099806, 19087564, 18110376, 17232089, 16335977, 15381201, 14548000, 13737187, 13026620, 12355186, 11678167, 11184100, 10656463, 10279607, 9951456, 9637241, 9414021, 9092602, 8932960, 8760211, 8610079, 8648432, 8663488, 8599474, 8595161, 8668329, 8785291, 8878551, 9026433, 9245210, 9414427, 9479276, 9581322, 9693662, 9697760, 9568133, 9456940, 9309055, 9094089, 8923390, 8634293, 8304823, 7981698, 7651873, 7326264, 7053003, 6930497, 6762329, 6650111, 6536402, 6437976, 6379167]
4472F379167j8563r1195k0240m934O473J3025N4113Q8832k6155P2865J53571Q0252
4460F687211K07053K15868J88399J48405J39467J68627K4606k0666R0004n7461
4450G791513n6299k3562J6881p0054J7916K09101K95828L26792O47535R47541
4440A0103192J057114J332622J414588J543179J208437R00994Q07334L65368l6935
4431A8695893l28335p77140j054212j528837j650576j390282j277141r70865q05378
4422H913127o43041n06527m45829l43568l51842l79625j74163k63672k71430j90500
4412E342930k61913j23751k10010j74151m9468j39077j33295q1605o2763o9844
4402D037053j80105o4819K5753j27939k4205p0149l9031m8512j62125m4234k2746
$$ y = [6379167, 6360604, 6269409, 6249169, 6244235, 6250708, 6263733, 6317846, 6406678, 6380523, 6453388, 6606959, 6687211, 6894264, 7110132, 7298531, 7446936, 7586403, 7755030, 7779636, 7758970, 7848974, 7791513, 7735214, 7711652, 7728533, 7658479, 7676395, 7885496, 8181324, 8508116, 9155651, 10103192, 11160306, 12492928, 13907516, 15450695, 16659132, 17560126, 18367460, 18732828, 18695893, 18367558, 17590418, 16536206, 15007369, 13356793, 11966511, 10689370, 9718505, 8913127, 8270086, 7763559, 7317730, 6974162, 6622320, 6242695, 6068532, 5804860, 5533430, 5342930, 5081017, 4957266, 4747256, 4573105, 4523637, 4384560, 4251265, 4169660, 4106897, 4037053, 3856948, 3792129, 3817882, 3689943, 3665738, 3595589, 3556558, 3508046, 3345921, 3301687, 3278941]
4391C278941m3466K9941p4039l3545Q9554m908l4441o4980N5884k9462j53277
4380C016202r104Q6436j46505j00453J0218q0949j06473q1562Q8315o0781r1839
4369B523505K4841q6147n6888j4845J9998r1754m3121P5662K3126l3584M9732
4358B390525L3709Q125m6651J8857O2271O9500m8012M4803P5307r7365o5709J941
4346B447301O3343o1003n9714Q718q770O6899M6420m3306k5118R8376k1081K6493
4334B538558N4760K1474p2419o5730L9472L9364N5509M9193L4719J45486J03888
4323B944274l0699O8640N5843m1401l2015Q6067k0355r2703M241O905l558J4226
4311B959465J22605O2102O9587J01162R7668l8247j7878N840k5213q0807r9837
$$ y = [3278941, 3235475, 3265416, 3191377, 3157832, 3247386, 3242478, 3208037, 3143057, 3198941, 3169479, 3016202, 3007098, 3093534, 2947029, 2846576, 2856794, 2775845, 2669372, 2587810, 2676125, 2615344, 2523505, 2548346, 2462199, 2405311, 2390466, 2410464, 2318710, 2275589, 2351251, 2374377, 2340793, 2390525, 2424234, 2432359, 2385708, 2404565, 2466836, 2536336, 2488324, 2533127, 2608434, 2511069, 2445360, 2447301, 2510644, 2449641, 2389927, 2398645, 2389875, 2456774, 2503194, 2459888, 2434770, 2533146, 2512065, 2538558, 2593318, 2614792, 2542373, 2476643, 2516115, 2555479, 2610988, 2660181, 2694900, 2840386, 2944274, 2913575, 2982215, 3038058, 2996657, 2964642, 3050709, 3030354, 2937651, 2941892, 2948797, 2945239, 2959465, 3082070, 3144172, 3213759, 3314921, 3412589, 3374342, 3356464, 3362304, 3337091, 3256284, 3156447]
4300C156447M1906j40859q7658L8325l0144j453J13999J21183J68865R8452J55236
4289C634299J58993R0005J91750L3010R8080N2514o5704L5210m4307p6693k6830
4278D080327j91059p7504l5091j65624l6117j71790J6206o3046r8682N7029o6347
4267C248302m7771J9144r3691l0154q3789p0960J8557j62068o230k8703l0087
4256B732550N2911K2018L4867N0539p132P3264J03222N6736Q4153Q133Q4120K6017
4244C321398k6398P697K9741j18425k7273m8046j19896j37791j23209J9966j00104
4233B677660j08788M5795N9101J7434L284k1985M0369M326k4634K236j26781R88
4221B569005r0346j31522q0731o1867r0193r5195n1491J03663l8370n8539N5734
$$ y = [3156447, 3198353, 3057494, 2969836, 3008161, 2978017, 2976564, 3090563, 3211746, 3380611, 3479063, 3634299, 3793292, 3883297, 4075047, 4108057, 4206137, 4258651, 4192947, 4228157, 4183850, 4107157, 4080327, 3889268, 3811764, 3776673, 3611049, 3574932, 3403142, 3419348, 3356302, 3257620, 3314649, 3248302, 3200531, 3219675, 3125984, 3095830, 3012041, 2941081, 2959638, 2797570, 2791340, 2762637, 2732550, 2785461, 2807479, 2842346, 2892885, 2885753, 2959017, 3062239, 3118975, 3203128, 3211261, 3295381, 3321398, 3295000, 3302697, 3332438, 3214013, 3186740, 3138694, 3018798, 2881007, 2757798, 2777764, 2677660, 2568872, 2614667, 2673768, 2691202, 2694486, 2672501, 2712870, 2717196, 2692562, 2694798, 2568017, 2569005, 2478659, 2347137, 2266406, 2204539, 2114346, 2019151, 1967660, 2071323, 2032953, 1974414, 2030148]
4210B030148J0661O5010m7162O3728P9700n1891l3149k7615k4475P0970j13715
4199B022210j17893l9494j087J6304j74938l2300J5855o8949l8392k4629l5114
4188A521573m6262n8894j4526R010k1644K9442r3423J1475K5954k6337K0328M6685
4176A403381N8300n0566p5926L9260K7340j4719n723m5165M2712n2728j3634n0118
4164A262414J1901O101p5496k8787N8368M3746r7038j7846K5762j5774m7112R047
4152A135286K0011j6338o5064j0202N7356o241n2919q4800Q1883N8343j2470L213
4140A108058j5710J2711o4761k8177J5416K2158K3433M1572p4291N5875j5894
4129A080390m6882n9238R859P6378m8182l8411R5L0228m3902r7361J7591J15104
$$ y = [2030148, 2040809, 2105819, 2058657, 2122385, 2202085, 2150194, 2117045, 2089430, 2064955, 2135925, 2022210, 1904317, 1864823, 1863736, 1880040, 1705102, 1672802, 1688657, 1619708, 1581316, 1556687, 1521573, 1475311, 1416417, 1401891, 1410901, 1389257, 1418699, 1325276, 1336751, 1362705, 1336368, 1356696, 1403381, 1461681, 1411115, 1335189, 1374449, 1401789, 1387070, 1381347, 1336182, 1378894, 1326166, 1312532, 1262414, 1274315, 1280416, 1204920, 1176133, 1234501, 1278247, 1181209, 1163363, 1189125, 1173351, 1126239, 1135286, 1155297, 1138959, 1073895, 1063693, 1121049, 1114808, 1061889, 977089, 1058972, 1117315, 1104845, 1108058, 1092348, 1105059, 1040298, 1012121, 1027537, 1049695, 1073128, 1114700, 1040409, 1096284, 1080390, 1033508, 974270, 984129, 1060507, 1012325, 973914, 974009, 1004237, 960335, 862974, 880565, 995669]
4117I95669k0229j07711N2962J22773r1499j20951J11114K9671P078K9852j080
4106A007649j3836k761j220J4261k7082N9195k0792p436L8246n1367k0431l0251
4094I44175k106K365k2728l8812L7099m296K9742n7565l9789J61391k8592o209
4082I74675p946P005n888j931J7713N0786j2746q3895k7249N9871N9391j06615
4070I23171J1089L3441j7667Q314L2497O0632K3208o5865J0465O6643L7426k1222
4058A102132j04432M5718k2464k3295K4982K7175M1514N366j6380J7803J3322
4047A111441k3166M7658l3656j3351J8097L7195l9077k6862j1745N3249n4793
4036A064990N3926J02016j9545l6910J8143K7923m0476K1739P8887m6326o0112
$$ y = [995669, 975440, 867729, 920691, 1043464, 951965, 831014, 942128, 971799, 978877, 1008729, 1007649, 993813, 991052, 989832, 1004093, 977011, 1036206, 1015414, 1007978, 1046224, 994857, 974426, 944175, 942069, 944434, 921706, 882894, 919993, 915697, 945439, 887874, 848085, 1009476, 980884, 974675, 966729, 973734, 967846, 965915, 983628, 1034414, 1021668, 937773, 910524, 970395, 1029786, 923171, 934260, 967701, 950034, 958348, 990845, 1051477, 1074685, 1008820, 1019285, 1085928, 1123354, 1102132, 997700, 1043418, 1020954, 997659, 1022641, 1049816, 1091330, 1096696, 1080316, 1098119, 1111441, 1088275, 1135933, 1102277, 1088926, 1107023, 1144218, 1105141, 1078279, 1066534, 1119783, 1064990, 1118916, 1220932, 1201387, 1164477, 1182620, 1210543, 1170067, 1191806, 1270693, 1224367, 1164255]
4025A164255J01744o1244n6979N6830k2829M3934J5897K6843N598K6119N5638
4014A355806m5650K2676N0461o820Q6175J8849L0597J09559J03709j8458N7944
4003A764848K22037J71727J15597J62691J66316N6874J55015J12045j748O7619
3993B993021j6543k8990l2891l3080j6939J7660N0991J01721P7396J46658J52057
3982C411061M0841J41307M9936j0512N9283J0766M0120k3783P4271K35162K77240
3971D305692L55369L03423J54221J88526K38361J93024l4037q8362m0502l14614
3961E261101m25987l48791l52489k36289j75036q3853J3865R492J05503n9929
3951C707587o2624j9074j02840k7015j32688k26497j17385j28178n5743r3358
$$ y = [1164255, 1265999, 1204755, 1147776, 1204606, 1181777, 1225711, 1241608, 1268451, 1274049, 1300168, 1355806, 1310156, 1332832, 1383293, 1376473, 1462648, 1481497, 1512094, 1621653, 1725362, 1706904, 1764848, 1986885, 2158612, 2274209, 2436900, 2603216, 2660090, 2815105, 2927150, 2925402, 2993021, 2976478, 2947488, 2914597, 2881517, 2864578, 2882238, 2933229, 3034950, 3112346, 3259004, 3411061, 3451902, 3593209, 3643145, 3632633, 3691916, 3702682, 3742802, 3719019, 3793290, 4028452, 4305692, 4661061, 4964484, 5118705, 5307231, 5545592, 5738616, 5704579, 5616217, 5575715, 5261101, 4835114, 4486323, 4133834, 3897545, 3722509, 3638656, 3652521, 3662013, 3767516, 3707587, 3644963, 3625889, 3523049, 3496034, 3363346, 3136849, 3019464, 2891286, 2835543, 2742185]
3941B742185L1457N4076q4696K2809M8544n9937k1290n7183r4745j40148j47814
3930B293258j71166j76076j06102j42000j21376m6846l3674q9072k579K594j05918
3919A301043n6084O3089K2170o2864K7298N8823j22200k0324J14500o0083l3029
3908A232339L8662m2052K735O4500L5314m8660j6250j8582m778M5175l4973o0479
3896A192951j2035J4161o4715O160J07m4460k0516M6123M965J6073L1972j0169
3884A160617n4771M5598O350L0473Q2611o6645K1039O062N99J3092j7296J8014
3872A245743l9243L2365K5447j3916L7842M6272p5472L6702L0676J7274N3575
3861A397265K6294j6506O899m2540J5964k4652R976K0106p6284O5885m0660J7900
$$ y = [2742185, 2773642, 2827718, 2743022, 2765831, 2814375, 2754438, 2733148, 2675965, 2581220, 2441072, 2293258, 2122092, 1946016, 1839914, 1697914, 1576538, 1529692, 1496018, 1406946, 1404367, 1406961, 1301043, 1244959, 1308048, 1330218, 1267354, 1294652, 1353475, 1231275, 1210951, 1325451, 1265368, 1232339, 1271001, 1228949, 1231684, 1296184, 1331498, 1282838, 1266588, 1248006, 1243228, 1288403, 1253430, 1192951, 1180916, 1195077, 1130362, 1136522, 1136629, 1092169, 1071653, 1117776, 1122741, 1138814, 1170786, 1160617, 1105846, 1151444, 1157794, 1188267, 1270878, 1204233, 1225272, 1231334, 1231933, 1245025, 1227729, 1245743, 1206500, 1238865, 1264312, 1250396, 1288238, 1334510, 1259038, 1295740, 1326416, 1343690, 1397265, 1423559, 1407053, 1413952, 1371412, 1387376, 1362724, 1372700, 1392806, 1316522, 1382407, 1341747, 1359647]
3849A359647M1484p4797K9795L571k8211J730K5795J42212r1008q9409J22378
3838A443187n5055J7138P346q311J3410o8705M8868l2096m5582P7202Q754l7852
3826A368304J1968J3269J01002q2958l651n367M7268k440r140N4960O368J0337
3814A509920m9497O8139N27M538M6173L5344M4094K2092k1924m0127k1472m0185
3802A557622r673n1177K3197k515k4415o1096j9111O0534J1400l6267Q5275k4177
3790A509597m8028M3352p763O4428p0096J3925j544L6617M9414q8874J7292M0199
3778A558519l8991j647L2321o69P0004q1094K234j1891N7915o8318j03444J18621
3766A533560j0397p2896M0898M5801J8291k7971k3874j8872q5560J50465k8558
$$ y = [1359647, 1401131, 1326334, 1356129, 1359700, 1331489, 1333219, 1359014, 1501226, 1410218, 1320809, 1443187, 1388132, 1405270, 1412616, 1404305, 1417715, 1349010, 1397878, 1365782, 1320200, 1397402, 1406156, 1368304, 1380272, 1393541, 1494543, 1411585, 1407934, 1402567, 1449835, 1447395, 1438255, 1493215, 1499583, 1509920, 1460423, 1528562, 1529089, 1533627, 1579800, 1615144, 1659238, 1681330, 1659406, 1619279, 1597807, 1557622, 1547949, 1496772, 1519969, 1517454, 1493039, 1431943, 1412832, 1473366, 1484766, 1448499, 1533774, 1509597, 1461569, 1504921, 1497158, 1561586, 1491490, 1505415, 1503871, 1540488, 1589902, 1501028, 1518320, 1558519, 1519528, 1517881, 1550202, 1549533, 1619537, 1538443, 1540677, 1528786, 1586701, 1518383, 1414939, 1533560, 1523163, 1450267, 1491165, 1536966, 1555257, 1527286, 1503412, 1484540, 1398980, 1549445, 1520887]
3755A520887o9142P2983p150o0988m5154M5528M6970l1055o1599N9435L7223P6587
3743A584525p9075r353J56103k5032j4164j7864K3758M1402n2409l9795p641l7909
3731A522546M2144r4793L1023N3236m3283L8903k1468K6893j548m3695J4098K2351
3719A546407J5219q066o0094R8517K8623j04705L3476j9588K0440j517M2577N4749
3707A646038k0375O7253p9473Q409J34718k2123j4951j2321N043o165q6154N1072
3695A670971K2307k9678J175m7305P8597k4112q7996K9597M677O689L5320J184
3683A661426K6792n8823N9960j4102n5386J62250Q607m4889L3492P8570l0644
3672A827253o9041M779L8489K440J6756L4965j5288L852j12133k1320P3024P518
$$ y = [1520887, 1451745, 1524728, 1517578, 1456590, 1411436, 1456964, 1503934, 1472879, 1411280, 1470715, 1507938, 1584525, 1505450, 1496097, 1652200, 1627168, 1613004, 1595140, 1618898, 1660300, 1607891, 1568096, 1560455, 1522546, 1564690, 1469897, 1500920, 1554156, 1510873, 1549776, 1528308, 1555201, 1553653, 1509958, 1524056, 1546407, 1561626, 1553560, 1493466, 1591983, 1620606, 1515901, 1549377, 1529789, 1550229, 1548712, 1591289, 1646038, 1625663, 1692916, 1613443, 1621852, 1756570, 1734447, 1719496, 1707175, 1712218, 1706053, 1619899, 1670971, 1693278, 1663600, 1664775, 1617470, 1696067, 1671955, 1583959, 1613556, 1618233, 1624922, 1660242, 1661426, 1688218, 1629395, 1689355, 1675253, 1619867, 1782117, 1790724, 1745835, 1779327, 1857897, 1827253, 1758212, 1762991, 1801480, 1803920, 1820676, 1855641, 1840353, 1844205, 1732072, 1710752, 1783776, 1791294]
3660A791294k1055K5110l440L4108m2768L9839p353k8338M1006o9832q835r459
3648A740277K3998j6501k3547K951P2331k7046o004N8877q03l0807j5651J09418
3636A887493m3822o3608M5806p429O552K9872o1013M153k8001L1317K8898l4125
3624A796093R2533j1973M2810J644k1834N3050K0121m1213P7269k6373o1279J22872
3612B043720L6522M8342Q7803K41173J39759J17508J94889J20267R1452J22045
3602C243480M0967n2375L8281m8897j88085k26536j14299j31056j70209o9506
3592B321765l0462j27981P6977j0982j6145N6122k0408J02288Q437P2236J1290
3581B443137O0070K27417J17547J32448L44270L00842K75742J46736R7750L34984
$$ y = [1791294, 1770239, 1795349, 1791909, 1826017, 1783249, 1823088, 1815735, 1787397, 1828403, 1758571, 1749736, 1740277, 1764275, 1747774, 1724227, 1727178, 1799509, 1772463, 1766459, 1825336, 1824533, 1793726, 1778075, 1887493, 1843671, 1780063, 1825869, 1818440, 1824992, 1854864, 1793851, 1798004, 1770003, 1801320, 1830218, 1796093, 1888626, 1876653, 1919463, 1921107, 1899273, 1952323, 1972444, 1931231, 2008500, 1982127, 1920848, 2043720, 2080242, 2128584, 2216387, 2457560, 2597319, 2714827, 2909716, 3029983, 3121435, 3243480, 3284447, 3232072, 3270353, 3221456, 3033371, 2806835, 2692536, 2561480, 2391271, 2321765, 2291303, 2163322, 2240299, 2229317, 2213172, 2269294, 2248886, 2351174, 2359611, 2431847, 2443137, 2503207, 2730624, 2848171, 2980619, 3324889, 3625731, 3901473, 4048209, 4145959, 4480943]
3571D480943J55780M3559P8908Q2396r8566k83466k97645l11009l13857j96884
3561C340159j29624j36459n9508n6915n0975J449L2362n1819l9291Q0249N1287
3550B980915n7243N3343J06696N9939P0226J34278K59314J15359J19155P1064
3540C913046J07710R6789O3849J14342L9456Q538L5909j17166k26081q8292L250
3529C951350j6719o9208J00439L3727r3755N5375L8383J6005Q4596J38881J25819
3518D364893J69683J98714J97792K33949K43287K41317J73320K42241J44886L0070
3508F240152R1256j7188q7393j31913j19057r7701j57759j18653o9672j3801k5563
3497E492708m4549L3906P4268Q9076J54440R3639P9357J14310J73199J66268J69777
$$ y = [4480943, 4636723, 4680282, 4759190, 4841586, 4743020, 4459554, 4161909, 3850900, 3537043, 3340159, 3210535, 3074076, 3014568, 2957653, 2906678, 2908127, 2940489, 2888670, 2849379, 2929628, 2980915, 2923672, 2977015, 3083711, 3143650, 3213876, 3348154, 3607468, 3722827, 3841982, 3913046, 4020756, 4117545, 4181394, 4295736, 4335192, 4343730, 4379639, 4262473, 4036392, 3948100, 3951350, 3934631, 3865423, 3965862, 3999589, 3905834, 3961209, 3999592, 4015597, 4100193, 4239074, 4364893, 4534576, 4733290, 4931082, 5165031, 5408318, 5649635, 5822955, 6065196, 6210082, 6240152, 6331408, 6314220, 6226827, 6094914, 5975857, 5878156, 5720397, 5601744, 5532072, 5518271, 5492708, 5448159, 5482065, 5556333, 5645409, 5799849, 5893488, 5972845, 6087155, 6260354, 6426622, 6596399]
3486F596399L22588L47028M02017N32320N06988N43438M69345L88641K99524K30873
3476A0639161K07138n2699j54321j05880l66123m44268l36785l11932k89300k96738
3466H488253m0086j2633j0941o055L3233R6484O7386J33312K70335K00569R0394
3455I310251L17433L11851K35737L71510N35965M31187M47052O49824N26925M58579
3445A3596314N93380N44632N20464N48089N59805O44499P04900P81999Q18840
3436A9312922J026774J194781J017792J134463J221445J049385P50317N85758
3428B7293637L17706m8608l63719n63628q21145r65469j072413j229253j107359
3419B1439749j024135j011184r36883p77553o88602o63900n94597n64262m95673
$$ y = [6596399, 6918987, 7266015, 7668032, 8200352, 8707340, 9250778, 9720123, 10108764, 10408288, 10639161, 10846299, 10793600, 10639279, 10533399, 10167276, 9723008, 9386223, 9074291, 8784991, 8488253, 8448167, 8435534, 8424593, 8418538, 8451771, 8548255, 8615641, 8748953, 9019288, 9219857, 9310251, 9627684, 9939535, 10175272, 10546782, 11082747, 11513934, 11960986, 12610810, 13137735, 13596314, 14189694, 14734326, 15254790, 15802879, 16362684, 17007183, 17712083, 18494082, 19312922, 20339696, 21534477, 22552269, 23686732, 24908177, 25957562, 26707879, 27293637, 27611343, 27562735, 27199016, 26635388, 25814243, 24848774, 23776361, 22547108, 21439749, 20415614, 19404430, 18467547, 17689994, 17001392, 16337492, 15742895, 15178633, 14682960]
3410A4682960l99351m85118m67252k68785k86806m05152k84407k15486k50710
3401A1619893k21606j64305j10893j06966k1605j14558j64159l1168j06520k05826
3391A0372287j59933Q7655L7361j38516j521N1206q756r2836j99451j69881j76654
3380I600961k74431l16209k40622k18878m02001k99970j81855k43264j85804j49892
3370G088035j39218r0370l183l6868L3552Q7756J41269M3434J905j05621q744
3359G011947O7272L0584J38935J83486J9168Q819J43189O0255j84782l21741k11248
3348F945884k52662k60222k27708k12968j14709j83620k08173j33345j53602j08303
3338E090572r5231m9768J5062J1891M1311l5410N8600N1450p6357n4433k6653
$$ y = [14682960, 14283609, 13798491, 13331239, 13062454, 12775648, 12370496, 12086089, 11870603, 11619893, 11398287, 11233982, 11123089, 11016123, 10994518, 10879960, 10715801, 10684633, 10578113, 10372287, 10212354, 10300009, 10337370, 10198854, 10197333, 10248539, 10239783, 10146947, 9947496, 9777615, 9600961, 9326530, 9010321, 8769699, 8550821, 8148820, 7848850, 7666995, 7423731, 7237927, 7088035, 6948817, 6858447, 6855264, 6818396, 6851948, 6939704, 7080973, 7124407, 7126312, 7020691, 7011947, 7079219, 7109803, 7248738, 7432224, 7451392, 7460211, 7603400, 7663655, 7478873, 7157132, 6945884, 6693222, 6433000, 6205292, 5992324, 5877615, 5693995, 5485822, 5352477, 5198875, 5090572, 4995341, 4945573, 4960635, 4972526, 5013837, 4978427, 5037027, 5088477, 5012120, 4957687, 4931034]
3327D931034k7067k4104L5305J7696J4792m334l7985r8898p1860p7210j58848
3316D498521j95794j01699o2175r1674o8646l7129m8980j04879n6741l385m5840
3305C681579k0823q6206m3773k0023j7695r504n0741m876k9816q3919M139o771
3293C311571j0278k7161r520l9585j2109P7961k0518j04312j036O6777l9418m5833
3281C146539l567k4534q3884q5576K1873L9823l4424k9751P963Q775o537J8601
3269B975301J6058n3678o5517L9792J1203M173k6314n8368r992j5197P666M278
3257B829405l7146k3811K6007L1316n4636k1000j8965l4096n7882m6341O3983
3246B656834j4773j9909j08556j2976L7259m8727K8313j0611N7885q2126l3148
$$ y = [4931034, 4903967, 4879863, 4915168, 4932864, 4947656, 4943322, 4905337, 4806439, 4734579, 4657369, 4498521, 4302727, 4201028, 4138853, 4047179, 3978533, 3941404, 3892424, 3787545, 3730804, 3727419, 3681579, 3660756, 3574550, 3530777, 3510754, 3493059, 3483555, 3432814, 3427938, 3398122, 3314203, 3318342, 3311571, 3301293, 3274132, 3264612, 3225027, 3212918, 3290879, 3270361, 3166049, 3165013, 3231790, 3192372, 3146539, 3142972, 3118438, 3034554, 2948978, 2970851, 3010674, 2976250, 2946499, 2954462, 2963237, 2956700, 2975301, 2991359, 2937681, 2872164, 2911956, 2923159, 2927332, 2901018, 2842650, 2832658, 2817461, 2825127, 2829405, 2792259, 2768448, 2794455, 2825771, 2771135, 2750135, 2731170, 2697074, 2639192, 2592851, 2656834, 2642061, 2622152, 2513596, 2500620, 2537879, 2489152, 2517465, 2506854, 2564739, 2482613, 2449465]
3235B449465L6984l3348J7276m4772n2078O3232q025j1949m0141r096P3357n8703
3223B382202m7181L9586K7992j30771M625K4683k2226q5636j02128j2720j5431
3212B062995Q0461J612l8435k8892K3304n4333L4662P0292K6403r947m4286P428
3200B131264J8008K4026n6271m1744R0147l1713p2023M8483L9606k0546l0059
3189B099178L9405N4912L9648l3927n2347M2697N9111n3145j7066J11078o7126
3178B222418o3125L8604J8881N0948q297O6895O180J25088J8020J5876P1060L377
3166B565925K6604Q3944N5391R8791J25789L91m3613O1914J10397m5876j0520
3155C029137N8932o663k1914m176n6687j0637k4856j8863K1058P816P2905n2152
$$ y = [2449465, 2486449, 2453101, 2470377, 2425605, 2373527, 2436759, 2428734, 2416785, 2376644, 2367548, 2440905, 2382202, 2335021, 2374607, 2402599, 2271828, 2276453, 2301136, 2278910, 2193274, 2091146, 2078426, 2062995, 2143456, 2145068, 2106633, 2077741, 2101045, 2046712, 2081374, 2151666, 2178069, 2168122, 2123836, 2131264, 2149272, 2173298, 2117027, 2075283, 2165430, 2133717, 2061694, 2110177, 2149783, 2129237, 2099178, 2138583, 2193495, 2233143, 2199216, 2146869, 2189566, 2248677, 2195532, 2178466, 2289544, 2222418, 2159293, 2197897, 2216778, 2267726, 2259429, 2326324, 2332504, 2457592, 2475612, 2491488, 2562548, 2565925, 2592529, 2676473, 2731864, 2830655, 2956444, 2956835, 2913222, 2975136, 3085533, 3039657, 3029137, 3088069, 3081406, 3059492, 3055316, 2998629, 2987992, 2963136, 2944273, 2965331, 2973147, 3046052, 2993900]
3143B993900o827K7710l9343N9950R1873N5240Q5060J02684R6177J40741J10297
3132C717462P6053Q0957J68076J68904Q929R5926J46837K2203J14608M6433P1239
3121D717627R1683J29641J12801K7886K09183R2609O9735J33787Q1881P0689P8088
3110E815610P0189K3413M9693O0930M8052O6499J80072N0719L1395K04548J18218
3099F719338K05899K56489K89497K91372L14407M43322L80297M21924N34838M30225
3089A0287608M06694L52285K50990J83259K3941j00908k48516k00392k38444l13570
3079A0402947l79288k62739k58744j64748j42250k9541J80716O9534P3494J69316
3069I658697K65903K38061J93379L12420K92254K73949K47205K16846J50743J35262
$$ y = [2993900, 2987073, 3014783, 2975440, 3035390, 3127263, 3182503, 3267563, 3370247, 3466424, 3607165, 3717462, 3793515, 3874472, 4042548, 4211452, 4220381, 4316307, 4463144, 4485347, 4599955, 4646388, 4717627, 4809310, 4938951, 5051752, 5079638, 5288821, 5381430, 5451165, 5584952, 5666833, 5737522, 5815610, 5885799, 5909212, 5958905, 6019835, 6067887, 6134386, 6314458, 6365177, 6396572, 6601120, 6719338, 6925237, 7181726, 7471223, 7762595, 8077002, 8520324, 8900621, 9322545, 9857383, 10287608, 10694302, 11046587, 11297577, 11480836, 11504777, 11403869, 11155353, 10954961, 10716517, 10402947, 10023659, 9760920, 9502176, 9337428, 9195178, 9165637, 9346353, 9415887, 9489381, 9658697, 9924600, 10162661, 10356040, 10668460, 10960714, 11234663, 11481868, 11698714, 11849457, 11984719]
3059A1984719O426n8747q5077k38417k32237l06153m65956l62101l71634l83149
3049I487674l79338k43678j87783k88213j09736r9931k2595m4990M4558J5044
3039H171012j8195q031q3459j7319r8210j92018k19398j41233j65226k65799l02963
3028F659161l25064k44440l63555k77883k21779j60435k01917k74041j76897j26585
3018D286565j43123j46186j69764N53o7169j08266l4430q5998m7764m4854o9325
3007C370239j09278l0717r4530q5892j24082p2352j08362j30733o0767l9068l2490
2996B481968r3719k1431L6845j2982j14603p3900J7647p5132p7449j3229k4532
2985B029483q5128j00789r348m5050m5210K3358o0335J4574o7025M7107J3504
$$ y = [11984719, 11991145, 11932398, 11847321, 11608904, 11376667, 11070514, 10604558, 10242457, 9870823, 9487674, 9108336, 8864658, 8676875, 8388662, 8278926, 8178995, 8156400, 8111410, 8155968, 8171012, 8152817, 8144786, 8061327, 8044008, 7945798, 7753780, 7534382, 7393149, 7227923, 6962124, 6659161, 6334097, 6089657, 5726102, 5448219, 5226440, 5066005, 4864088, 4590047, 4413150, 4286565, 4143442, 3997256, 3827492, 3828045, 3760876, 3652610, 3618180, 3532182, 3484418, 3439564, 3370239, 3260961, 3230244, 3135714, 3049822, 2925740, 2853388, 2745026, 2614293, 2553526, 2514458, 2481968, 2388249, 2366818, 2403663, 2390681, 2276078, 2202178, 2219825, 2144693, 2067244, 2054015, 2029483, 1944355, 1843566, 1834218, 1789168, 1743958, 1767316, 1706981, 1721555, 1654530, 1701637, 1715141]
2974A715141j5211K8513n1160J1905m2622J5269j7924o5747l7254K539l3673m0545
2962A469231m9782n945p4975p0096P992K655j5366l041o4156L082K1689o4649
2950A156639J7781N091k2368o5644M9688O291m5124M0438n6868j6058J9322p032
2938A082156k7007O3912n9355n9631L4950K6433m958j04045l235M4778o9150j1445
2926I13403j1098j7183N18n6828j442R394Q218m3074n5187M4214P2634n1930N246
2913H16885q4637p5883J02285l552r0963n557N649P208o2653P0457L7965n1088
2901F66116L5118l2419R0661l839m9665L3238n2285n2360M687L7041m6959o9507
2889E59827K0099K6206k9686k3852L7963J2709j5822r028N3374J6111o1384q683
$$ y = [1715141, 1699930, 1728443, 1677283, 1689188, 1646566, 1661835, 1643911, 1578164, 1540910, 1543449, 1509776, 1469231, 1419449, 1413504, 1338529, 1268433, 1276425, 1279080, 1263714, 1260673, 1196517, 1199599, 1221288, 1156639, 1174420, 1179511, 1157143, 1091499, 1141187, 1147478, 1102354, 1142792, 1085924, 1069866, 1089188, 1082156, 1055149, 1119061, 1059706, 1000075, 1035025, 1061458, 1056500, 952455, 949220, 993998, 924848, 913403, 902305, 885122, 885640, 828812, 827370, 836764, 844982, 801908, 746721, 790935, 863569, 811639, 816885, 732248, 656365, 758650, 755098, 664135, 658578, 664227, 671435, 608782, 679239, 717204, 666116, 701234, 668815, 759476, 755637, 705972, 739210, 686925, 634565, 639252, 676293, 629334, 559827, 579926, 606132, 576446, 552594, 590557, 603266, 587444, 578416, 631790, 647901, 586517, 577834]
2877E77834M1422k8125l6006N5585n1291j0837K9625l9333j797n029O1902r97
2865E92953l6879n4516K1250R2431k6490l7716k2448K7352J1792l6573o383j3153
2853E11620l642k7714n254N6812J4350o921n7173K6770j0536m2824K6325l8334
2841D43479m6648L9283L3980k0744j2877L4189J3335j5094j5265N6338O0305j0669
2829E59612j5219L530J228p7670n4361l1791O220r63k8302k0695j9433L197R129
2816C34482L2793L5350L4244K9495K3894l7694n6793L8060l3113j8335j8990k882
2804C60511K2320j8441J0229j0486N9655K9549J0659l1381q642O9479l5907k7377
2792D30168L4876k5146l7612m3892j1949j906K6200P2587q2291j8679P1811J8882
$$ y = [577834, 619256, 591131, 555125, 610710, 559419, 548582, 578207, 538874, 537077, 532048, 593950, 592953, 556074, 501558, 522808, 615239, 588749, 551033, 528585, 555937, 567729, 531156, 524773, 511620, 507978, 480264, 475010, 531822, 546172, 539251, 482078, 508848, 498312, 455488, 481813, 443479, 396831, 436114, 470094, 449350, 436473, 470662, 483997, 468903, 453638, 509976, 570281, 559612, 544393, 547923, 549151, 471481, 417120, 385329, 391549, 390586, 362284, 341589, 322156, 325353, 334482, 367275, 402625, 436869, 466364, 490258, 452564, 395771, 433831, 400718, 382383, 363393, 360511, 382831, 364390, 374619, 364133, 423788, 453337, 463996, 432615, 423973, 493452, 457545, 430168, 465044, 439898, 402286, 358394, 346445, 344539, 370739, 443326, 361035, 342356, 414167, 433049]
2780D33049j847K8536j8278m0845j8544L2765K9778j0335n7092j17894J2892K5277
2768B97462N5747K5912r514k8546M8921K73j4409M3846j8479l4393j5957M1330
2756C92193n5225J7393k1729p3408r086L9766K2875K7810n7728L4997M8556j7068
2744C49346L3144k6584l465q0702j1933J2310l8323M620J9381r681K5003K3633
2732B96749N282l4771L0408M827m6107N7366K4055k4210l2645k226m4825j5661
2720B18242O3136k9183j8700P6733r214o0265O3101J3979j3909o0603l129O53
2708B40841m1383M4374j9993l201L0940n6705l1788L7484K2816R7363o6236J7409
2696B71921N5423p6565k5253m512M9452J5620n2560O5433m7794p0721L6627q4367
$$ y = [433049, 431202, 459738, 441460, 400615, 382071, 414836, 444614, 434279, 377187, 259293, 272185, 297462, 353209, 379121, 369607, 341061, 389982, 390255, 375846, 419692, 401213, 366820, 350863, 392193, 336968, 354361, 332632, 259224, 250138, 289904, 312779, 340589, 282861, 317858, 366414, 349346, 382490, 355906, 352441, 271739, 259806, 272116, 233793, 238413, 257794, 248113, 273116, 296749, 302031, 267260, 297668, 302495, 256388, 313754, 337809, 313599, 280954, 278728, 233903, 218242, 281378, 252195, 233495, 310228, 301014, 240749, 303850, 317829, 303920, 243317, 240188, 240841, 199458, 243832, 223839, 220638, 251578, 194873, 163085, 200569, 223385, 320748, 254512, 271921, 327344, 250779, 225526, 221014, 270466, 286086, 233526, 298959, 251165, 180444, 217071, 132704]
2684A32704P0875j1885l9857O6764J4288L7557J0768q6372l9275N4271L3781p193
2672B36426l9072L6186m7314r255K5746n1943K7427K0850n0110m263M8601k3410
2660A69869r0972J6692R2183J658Q510M330K1233o419m5971R7377k566n4553P671
2647B19042K886q240k9750L8833o243p6978K1762O0124m9191K5451O833l969k5192
2634A75368K3238O8322p6035K8632Q659o3784k9403l3486l389L0465j6494p72
2622A11321l6713P8282M7077n6767r478M732N34K5531l7003k3948Q7571p0093
2610A21046r474k859O3144l2074n7007Q1652j5036J8156N9J2657M5054m8886J9389
2597A95821K6064n3369k7902l6015Q648J4649n2328J3513P778l5950j7846R0764
$$ y = [132704, 203579, 191694, 151837, 218601, 232889, 270446, 281214, 194842, 155567, 209838, 243619, 236426, 197354, 233540, 186226, 176971, 202717, 150774, 178201, 199051, 148941, 144678, 193279, 169869, 78897, 95589, 187772, 189430, 197940, 202270, 223503, 217084, 171113, 268490, 265924, 211371, 219042, 221928, 213688, 183938, 222771, 216528, 139550, 161312, 221436, 172245, 197696, 204529, 200560, 175368, 198606, 266928, 190893, 219525, 228184, 164400, 134997, 101511, 98122, 128587, 112093, 111321, 74608, 152890, 199967, 143200, 133722, 138454, 138988, 164519, 127516, 103568, 191139, 121046, 111572, 108713, 171857, 139783, 82776, 164428, 149392, 167548, 167607, 180264, 225318, 176432, 195821, 221885, 168516, 140614, 104599, 113247, 127896, 75568, 89081, 96859, 60909, 43063, 133827]
2585A33827M6093j7162R539R4633j18408j6799P0316j06539n2118L2149M2578
2574A18109p5642J5409M1096o421j1650P6458j2490J0361M1897l8655M4803n1091
2562A52184l7919O5837o270j820k1097m5426J8102j6356K5189l999J4196M5717
2550A88338J2916j7520o43K0735o3571n357r4758M5902J6141O526J6696q7933
2538C7472O0918n317J6139L7250J1680N8486j1120k5819L9420q8983n4560J1075
2526H6641n964K316p9263L6096N0214k5366l1591M1298O52J12923p2900N4208
2514A69264J0346m0739j6386q5665O4556o8918o402Q3101m2641k5195J7041j5871
2502D2491J5887J9614R1580j8722j7242J17588o2576r0601L2863J130k9875j14009
$$ y = [133827, 179920, 162758, 172297, 266930, 148522, 131723, 202039, 95500, 43382, 75531, 118109, 42467, 57876, 98972, 92551, 80901, 157359, 144869, 155230, 197127, 158472, 203275, 152184, 114265, 180102, 173832, 172012, 150915, 105489, 123591, 107235, 132424, 128425, 142621, 188338, 201254, 183734, 183091, 203826, 140255, 134898, 40140, 86042, 102183, 108709, 125405, 37472, 98390, 93073, 109212, 146462, 158142, 216628, 205508, 179689, 219109, 130126, 75566, 86641, 80677, 82993, 3730, 39826, 90040, 64674, 33083, 74381, 75033, 187956, 115056, 169264, 179610, 138871, 122485, 36820, 101376, 32458, 26056, 109157, 66516, 41321, 58362, 42491, 58378, 77992, 169572, 150850, 133608, 251196, 188620, 98019, 130882, 132012, 102137, -11872]
2490a1872N7542J15929r2188M53k7442K6102O0632j45584R7486K8651p08k5939
2478H3062k4497o662k5183K714P452l1289O9798M7458j09495R5123L0457q0569
2466E8369K128j5946Q8725j7356m4679k3639r190P2286m4729j11337P6479j548
2454B9563Q059J0916l7945N5037N692p4041l5455P4522L2293j9725j6689M0687
2442G2914o7693Q0997m585l0575N5005j9704N178J6999J5896j4788l7079Q518
2430H1083k3643j6643N6713L255n3869K7802M7955l0971k771Q2624N925n7967
2418A19493M06j5246q2161J3443L1302n3253m2971L8457L9401l380M0685j03929
2406a7753Q5968P2254n967n04J0035N5886k6699l8384j9850m3150N2425k9179
$$ y = [-11872, 45670, 161599, 69411, 69864, 42422, 68524, 129156, -16428, 81058, 109709, 109001, 83062, 58565, 51903, 26720, 29434, 36886, 5597, 75395, 122853, 13358, 108481, 138938, 58369, 60497, 44551, 133276, 115920, 71241, 47602, 38412, 110698, 65969, -45368, 31111, 29563, 37622, 48538, 10593, 65630, 71322, -2719, -38174, 36348, 68641, 48916, 32227, 72914, 5221, 86218, 81633, 51058, 106063, 86359, 91537, 108536, 124432, 109644, 72565, 81083, 57440, 40797, 97510, 100765, 46896, 74698, 122653, 91682, 88911, 171535, 177460, 119493, 119899, 104653, 22492, 35935, 67237, 13984, -28987, 9470, 48871, 45491, 86176, -17753, 68215, 140469, 134502, 133998, 144033, 199919, 173220, 134836, 114986, 71836, 124261, 95082]
2394I5082q2658Q9445M2717j2990o8223M1960M8672r055j6519J6108o047Q308
2382A46800N715n6914L6841k5966k7528k5474Q395N5671k3139M5018k1279M6643
2370A64783j2240p7256p932R3999R944p9779m452J2177j3902k8401M4528K3460
2358A24929j8428K1354K6749K4344K4080n598j6869K0614m9487K9836r27k4829
2346A55768J5612l0319q4596O8967M2439j77k9992O6266N8076o2992R837J0642
2334B19531N8264K214k1232K4719k3719K9452j2454m1464K5337L2090J8574L1335
2322C42647P7758P1016N2657k5812k0663R2699O2103r693O045P7569L5059N174
2310G66559J03051J34059J12248J57004J91423J09689J90638J43880Q7516K03691
$$ y = [95082, 12424, 101869, 144586, 131596, 63373, 105333, 154005, 144950, 128431, 144539, 138492, 146800, 152515, 95601, 132442, 106476, 78948, 53474, 61869, 117540, 94401, 139419, 118140, 164783, 152543, 75287, 67355, 161354, 171298, 91519, 87067, 99244, 85342, 56941, 101469, 124929, 106501, 127855, 154604, 178948, 203028, 197430, 180561, 201175, 151688, 181524, 180597, 155768, 171380, 141061, 56465, 125432, 167871, 167694, 137702, 203968, 262044, 199052, 208889, 219531, 277795, 280009, 258777, 283496, 259777, 289229, 276775, 235311, 260648, 292738, 311312, 342647, 420405, 491421, 544078, 518266, 497603, 590302, 652405, 642712, 648757, 726326, 761385, 766559, 869610, 1003669, 1115917, 1272921, 1464344, 1574033, 1764671, 1908551, 1996067, 2199758]
2300B199758K35630K52564L89234O38764J051477J610538K217455K723385K555240
2291A3874045J627892J424077j47622l14934J8363p43744j709430k527747k511774
2282H989126k088517j485442j094676p23708m46235m02400l36430j60277k23688
2273B027753j80004j39016j00715j42393k09669j07266k4068j15134q6767j22319
2263H00402o4487l5799p087m4302p7788k7372N058j8236k4795j3021K067m760
2251D89880p8301l3207L2401l29P635l5841K3752P527K9772l0049J6416M2573
2239D72229p5968k3901k7405j2991P1382o4347k9378L2296l2221n4390p2835L9251
2227B21722M2213o2481K7130M343K456m9338K7588L1692o3109l1624J12609j16400
$$ y = [2199758, 2435388, 2687952, 3077186, 3715950, 4767427, 6377965, 8595420, 11318805, 13874045, 15501937, 16926014, 16778392, 16463458, 16481821, 15738077, 14028647, 11500900, 8989126, 6900609, 5415167, 4320491, 3596783, 3150548, 2748148, 2411718, 2251441, 2027753, 1847749, 1708733, 1608018, 1465625, 1255956, 1148690, 1124622, 1009488, 922721, 800402, 735915, 700116, 693029, 648727, 570939, 543567, 548625, 530389, 505594, 492573, 494640, 489880, 411579, 378372, 410773, 410444, 418079, 382238, 405990, 413517, 443289, 413240, 429656, 472229, 396261, 372360, 344955, 331964, 403346, 338999, 309621, 341917, 309696, 255306, 182471, 221722, 263935, 201454, 228584, 232927, 235383, 186045, 213633, 245325, 182216, 150592, 263201, 146801]
2215A46801j2913Q0429q021n199k0143J0746k1488J8606M2998n721k5159j3575
2203A87361o4484O2639L8116m4191N5667n5397j8545L5469q391o282j0124M698
2191A76536N3175o6937K4803j5899p6503J3094J9561j6739m01O6570m9516m9775
2179G7969M2669R1776o2624J6023r965n7173L5306J459j5359m8392p2223J5949
2167A5415M8832J8602J0908K3653M0469r2467o2890J25637J4678p8615l8046L4139
2155F0315q528j1515K0329K0710o8263K4172m8207O2657Q4084j1410M4777k7670
2143A41451k448J2908K010R883J740j7538r370q2978K1548M7092q6277k4121K1995
2130C5895N5338M2131L7017k6046k9056L4120l5756o0320R2379o8375k6653O054
$$ y = [146801, 133888, 214317, 206296, 201097, 180954, 191700, 170212, 188818, 231816, 226095, 200936, 187361, 122877, 185516, 223632, 179441, 235108, 179711, 161166, 196635, 188244, 181962, 171838, 176536, 229711, 162774, 187577, 171678, 95175, 108269, 127830, 111091, 110690, 177260, 127744, 77969, 120638, 212414, 149790, 165813, 155848, 98675, 133981, 135440, 120081, 71689, -534, 15415, 64247, 82849, 93757, 117410, 157879, 65412, 2522, 128159, 142837, 64222, 26176, 60315, 51787, 40272, 60601, 81311, 13048, 37220, -10987, 51670, 135754, 124344, 169121, 141451, 139003, 151911, 153921, 163804, 165544, 148006, 138636, 55658, 77206, 124298, 38021, 13900, 35895, 91233, 133364, 170381, 144335, 115279, 149399, 113643, 53323, 145702, 77327, 50674, 56728]
2118E6728q7326q517O1494R379r8153N4931O6229n3102P3549O8226o2435k1096
2106E9907k0181K3096N3285O392L0k1604J678p0115m1528M8341L3569l2934N739
2093D5675K406N6199J7498l8970k344q5733Q2352M2852q0768M9794l7094o2353
2081a0486K2590L5509M9667m0391m8136L3738k9721O0372j2440p4659N8780j3244
2069C1579m1030J0059R2055P946o8095k7372M8364k7305N635l528J01452M421
2057A34181n7313o6553M2468K3869K3099j1456p0171L8195j7260R428O4371r97
2045A11861n8323m0418Q697J03339M1662p6111m8094K8711P8091o0359l4289J0885
2033F5652J5920j7645m2969P35J7267K7193o3448J6562M5496O0601J0724o801
$$ y = [56728, -30598, -39115, 22379, 31758, -66395, -11464, 54765, 1663, 75212, 143438, 81003, 59907, 39726, 62822, 116107, 122499, 122529, 100925, 102603, 32488, -9040, 39301, 72870, 39936, 45675, 48081, 104280, 121778, 82808, 80464, -5269, 77083, 119935, 39167, 88961, 51867, -10486, 12104, 47613, 97280, 56889, 8753, 42491, 12770, 73142, 60702, -13957, 44823, 31579, -9451, 608, 92663, 100609, 32514, 5142, 53506, 26201, 31836, 28308, 129760, 134181, 76868, 10315, 52783, 76652, 99751, 88295, 18124, 56319, 39059, 48487, 112858, 111861, 53538, 13120, 21817, 125156, 166818, 90707, 42613, 71324, 149415, 89056, 54767, 65652, 81572, 63927, 20958, 21693, 38960, 66153, 2705, 19267, 64763, 125364, 136088, 129287]
2021A29287M366J6352r8612j7752M5167K5841j3619m6073J1750N264J039j13905
2009e0895O3546Q7077p5211j4370O6458N8432q0822J1628k0060q7705M7290N7265
1997F2633q948n858l6150l4856o2992P9842P3556m1249K1798J6442L3407K9914
$$ y = [129287, 133653, 150005, 51393, 33641, 78808, 104649, 91030, 44957, 56707, 61971, 63010, -50895, 12651, 99728, 24517, 10147, 76605, 135037, 54215, 65843, 45783, -41922, 5368, 62633, 53685, 47827, 11677, -23179, -86171, -6329, 67227, 25978, 47776, 64218, 97625, 127539]
$$ [...]
##END NTUPLES=NMR SPECTRUM
##END=
